##TITLE=31Pdec_SR134_k
 DMSO-d6, 124 sc
 25.8.2022
##JCAMPDX= 6.0         $$ Bruker NMR JCAMP-DX V2.0
##DATA TYPE= NMR SPECTRUM
##DATA CLASS= NTUPLES
##ORIGIN= UXNMR, Bruker Analytische Messtechnik GmbH
##OWNER= root
$$ XWIN-NMR		Version 3.5
$$ Thu Aug 25 15:09:37 2022 Russian Standard Time (UT+4h)  she@DPX200
##.OBSERVE FREQUENCY= 81.013821
##.OBSERVE NUCLEUS= ^31P
##.ACQUISITION MODE= SIMULTANEOUS
##.ACQUISITION SCHEME= undefined
##.AVERAGES= 124
##.DIGITISER RES= 16
##SPECTROMETER/DATA SYSTEM= spect
##.PULSE SEQUENCE= zgpg30
##.SOLVENT NAME= CDCl3
##.SHIFT REFERENCE= (INTERNAL, CDCl3, 0, 248.564)
##AUDIT TRAIL= $$ (NUMBER, WHEN, WHO, WHERE, WHAT)
$$ ##TITLE= Audit trail, XWIN-NMR		Version 3.5
$$ ##JCAMPDX= 5.01
$$ ##ORIGIN= Bruker BioSpin GmbH
$$ ##OWNER= she
$$ F:/spectra/data/she/nmr/P31/1/pdata/1/auditp.txt
$$ ##AUDIT TRAIL=  $$ (NUMBER, WHEN, WHO, WHERE, WHAT)
(   1,<2022-08-25 15:08:38.46 +0400>,<she>,<DPX200>,
      <continue with go, POWCHK disabled, PULCHK disabled
       configuration hash MD5:
       00 E9 B6 7A A2 85 ED C7 34 08 36 98 17 FE 4E 26
       data hash MD5: 32K
       75 67 5B 33 2F 67 22 19 AA A9 9D A1 28 80 07 EC>)
(   2,<2022-08-25 15:08:40.78 +0400>,<she>,<DPX200>,
      <Start of raw data processing
       efp BC_mod = 2 LB = 1 FT_mod = 6 PKNL = 1 PHC0 = -10243.78 PHC1 = 37.05663 SI = 64K 
       data hash MD5: 64K
       9A 33 0F 2A FA B0 0D 71 2A F2 55 F5 EA A3 6B 5A>)
(   3,<2022-08-25 15:08:58.85 +0400>,<she>,<DPX200>,
      <pk PHC0 = -145.563 PHC1 = 300.4 
       data hash MD5: 64K
       F5 0D 6D 3B 4D 99 3A 18 E8 EB 21 8A 93 B9 39 2D>)
(   4,<2022-08-25 15:09:09.76 +0400>,<she>,<DPX200>,
      <abs ABSG = 5 
       data hash MD5: 64K
       2D AD 57 40 5C 84 52 A9 5B B1 1B E0 05 0F 45 0E>)
$$ ##END=
$$ 
$$ hash MD5
$$ 47 0C 4B A8 6E 86 C3 21 5B 10 4C D3 F7 1F 67 33
##$RELAX= 
##$RELAX= 
##$RELAX= 
##$RELAX= 
##$RELAX= 
##$RELAX= 
##$RELAX= 
##$RELAX= 
$$ Bruker specific parameters
$$ --------------------------
##$DU= <F:/spectra>
##$EXPNO= 1
##$NAME= <P31>
##$PROCNO= 1
##$TYPE= <nmr>
##$USER= <she>
##$AMP= (0..31)
100 100 100 100 100 100 100 100 100 100 100 100 100 100 100 100 100 100 
100 100 100 100 100 100 100 100 100 100 100 100 100 100 
##$AQSEQ= 0
##$AQ_mod= 1
##$AUNM= <au_zg>
##$AUTOPOS= <>
##$BF1= 81.014009
##$BF2= 200.13
##$BF3= 200.13
##$BF4= 200.13
##$BF5= 200.13
##$BF6= 200.13
##$BF7= 200.13
##$BF8= 200.13
##$BYTORDA= 1
##$CFDGTYP= 0
##$CFRGTYP= 5
##$CHEMSTR= <none>
##$CNST= (0..31)
1 1 145 1 1 1 1 1 1 1 1 1 1 1 1 1 1 1 1 1 1 1 1 1 1 1 1 1 1 1 1 1 
##$CPDPRG= <waltz16>
##$CPDPRG1= <>
##$CPDPRG2= <waltz16>
##$CPDPRG3= <>
##$CPDPRG4= <mlev>
##$CPDPRG5= <mlev>
##$CPDPRG6= <mlev>
##$CPDPRG7= <mlev>
##$CPDPRG8= <mlev>
##$CPDPRGB= <>
##$CPDPRGT= <>
##$D= (0..31)
0 1 0 0 0 0 0 0 0 0 0 0.03 2e-05 3e-06 0 0 0 0 0 0 0 0 0 0 0 0 0 0 0 0 
0 0 
##$DATE= 1661425549
##$DBL= (0..7)
120 120 120 11 120 120 24 19 
##$DBP= (0..7)
150 150 150 150 150 150 150 150 
##$DBP07= 0
##$DBPNAM0= <>
##$DBPNAM1= <>
$$ [...]
##$SUBNAM3= <"">
##$SUBNAM4= <"">
##$SUBNAM5= <"">
##$SUBNAM6= <"">
##$SUBNAM7= <"">
##$SUBNAM8= <"">
##$SUBNAM9= <"">
##$SW= 501.771253377433
##$SWIBOX= (0..15)
0 1 3 0 0 0 0 0 0 0 0 0 0 0 0 0 
##$SW_h= 40650.406504065
##$TD= 32768
##$TD0= 1
##$TE= 0
##$TE2= 300
##$TE3= 300
##$TEG= 300
##$TL= (0..7)
0 120 53 12 22 120 120 120 
##$TP= (0..7)
150 150 150 150 150 150 150 150 
##$TP07= 0
##$TPNAME0= <>
##$TPNAME1= <>
##$TPNAME2= <>
##$TPNAME3= <>
##$TPNAME4= <>
##$TPNAME5= <>
##$TPNAME6= <>
##$TPNAME7= <>
##$TPOAL= (0..7)
0.5 0.5 0.5 0.5 0.5 0.5 0.5 0.5 
##$TPOFFS= (0..7)
0 0 0 0 0 0 0 0 
##$TUNHIN= 0
##$TUNHOUT= 0
##$TUNXOUT= 0
##$USERA1= <user>
##$USERA2= <user>
##$USERA3= <user>
##$USERA4= <user>
##$USERA5= <user>
##$V9= 5
##$VALIST= <valist>
##$VCLIST= <CCCCCCCCCCCCCCC>
##$VD= 0
##$VDLIST= <DDDDDDDDDDDDDDD>
##$VPLIST= <PPPPPPPPPPPPPPP>
##$VTLIST= <TTTTTTTTTTTTTTT>
##$WBST= 1024
##$WBSW= 4
##$XGAIN= (0..3)
0 0 0 0 
##$XL= 0
##$YL= 0
##$YMAX_a= 8022
##$YMIN_a= -3943
##$ZGOPTNS= <>
##$ZL1= 120
##$ZL2= 120
##$ZL3= 120
##$ZL4= 120
##$ABSF1= 248.5645
##$ABSF2= -253.2056
##$ABSG= 5
##$ABSL= 3
##$ALPHA= 0
##$AQORDER= 0
##$ASSFAC= 0
##$ASSFACI= 0
##$ASSFACX= 0
##$ASSWID= 0
##$AUNMP= <proc_1d>
##$AZFE= 0.1
##$AZFW= 0.5
##$BCFW= 0
##$BC_mod= 2
##$BYTORDP= 0
##$COROFFS= 0
##$CY= -3
##$DATMOD= 1
##$DC= 0
##$DFILT= <>
##$DTYPP= 0
##$F1P= 0
##$F2P= 0
##$FCOR= 1
##$FTSIZE= 65536
##$FT_mod= 6
##$GAMMA= 0
##$GB= 0
##$INTBC= 1
##$INTSCL= 5.30512e-09
##$ISEN= 30
##$LB= 1
##$LEV0= 0
##$LPBIN= 0
##$MAXI= 10000
##$MC2= 0
##$MEAN= 0
##$ME_mod= 0
##$MI= 50
##$NCOEF= 0
##$NC_proc= -9
##$NLEV= 6
##$NOISF1= 182.463
##$NOISF2= 159.3651
##$NSP= 0
##$NTH_PI= 0
##$NZP= 0
##$OFFSET= 248.5645
##$PC= 4
##$PHC0= -10389.34
##$PHC1= 337.4566
##$PH_mod= 1
##$PKNL= yes
##$PPARMOD= 0
##$PSCAL= 0
##$PSIGN= 0
##$REVERSE= no
##$SF= 81.0140089999908
##$SI= 65536
##$SIGF1= 159.3651
##$SIGF2= -187.1042
##$SINO= 113.3802
##$SIOLD= 16384
##$SREGLST= <1H.CDCl3>
##$SSB= 0
##$STSI= 65536
##$STSR= 0
##$SW_p= 40650.406504065
##$SYMM= 0
##$S_DEV= 0
##$TDeff= 32768
##$TDoff= 0
##$TI= <>
##$TILT= no
##$TM1= 0
##$TM2= 0
##$TOPLEV= 0
##$USERP1= <user>
##$USERP2= <user>
##$USERP3= <user>
##$USERP4= <user>
##$USERP5= <user>
##$WDW= 1
##$XDIM= 65536
##$YMAX_p= 384933408
##$YMIN_p= -149160467
$$ End of Bruker specific parameters
$$ ---------------------------------
##NTUPLES= NMR SPECTRUM
##VAR_NAME=  FREQUENCY,     SPECTRUM/REAL,   SPECTRUM/IMAG
##SYMBOL=    X,             R,               I
##VAR_TYPE=  INDEPENDENT,   DEPENDENT,       DEPENDENT
##VAR_FORM=  AFFN,          ASDF,            ASDF
##VAR_DIM=   65536,         65536,           65536
##UNITS=     HZ,            ARBITRARY UNITS, ARBITRARY UNITS
##FACTOR=    0.620285442955139, 1,           1
##FIRST=     20137.2065510736, 0,            0
##LAST=      -20513.1999529914, 0,           0
##MIN=       -20513.1999529914, -149160467,  0
##MAX=       20137.2065510736, 384933408,    0
$$ Real data points
##PAGE= N=1
##DATA TABLE= (X++(R..R)), XYDATA
$$ [...]
41431C3879084Q241523n109608j4750239j3775387p451267r34780O206004J1408744
41423A7714074P742349l435209q981437j214956Q722310M406780j2457511k2138399
41415i641999j1560678Q746352J6862175M860558j3545076k0538812j3720606
41408c8538086m228030O03851M577630J1555856J5918743J0927422J307374j723791
41400D00969L385657O648839K447616j676114K663223J0317973Q608580m596696
41392B8200047j6718270j5873034m538790N758127R333742J0130047J1507728
41385B7799597R344246n21892j2540309j6212021r942048l034498k007134k000005
41377i114064L337168R282506N523969p484998j5980138r349405N990211J3210233
$$ plain form
41431 33879084 42120607 37010999 22260760 8485373 1034106 99326 6305330 17714074
41423 17714074 25456423 22021214 13039777 11824821 20547131 24953911 12496400 -9641999
41415 -9641999 -21202677 -12456325 4405850 9266408 -4278668 -24817480 -38538086
41408 -38538086 -42766116 -42162265 -37584635 -26028779 -10110036 817386 2124760 400969
41400 400969 3786626 10435465 12883081 11206967 13870190 24188163 32796743 28200047
41392 28200047 11481777 -4391257 -8930047 -3171920 6161822 16291869 27799597
41385 27799597 37143843 36621951 24081642 7869621 -2072427 -5106925 -7114059 -9114064
41377 -9114064 -5776896 3505610 9029579 1544581 -14435557 -23784962 -17794751 -4584518
41369d584518L908834j2702150j9897883j1325894K899756Q540033L224926l306052
41361c3242948l357463O56958L757208O619551J0872806J2044522N463313l567196
41353g53249m666919K291654N750206n14429p224413l225743O354867N935560
41345C947534o403856j1958527L448844K4662046K1969926q120233l2802741k3837192
41337b9094199M759216J7492046P376482L93259R608310J3883751m122749k4209896
41329c913780j7053971R993912K3947520J4924464L974267L324521M0590j2784500
41321B2453023j7734477k752659J3436506P310969j3054446k0580107q872691
41314a9793882M324668Q920044J2557986J6610999P524960j6191683k9262970
$$ plain form
41369 -4584518 -675684 -13377834 -33275717 -44601611 -41701855 -33161822 -29936896 -33242948
41361 -33242948 -36600411 -35943453 -32186245 -25566694 -14693888 -2649366 2813947 -753249
41353 -753249 -5420168 -3128514 2621692 2107263 -5117150 -8342893 -1988026 3947534
41345 3947534 -2456322 -14414849 -10966005 13696041 35665967 27545734 -5257007 -29094199
41337 -29094199 -24334983 -6842937 533545 926804 10535114 24418865 20296116 -3913780
41329 -3913780 -20967751 -10973839 12973681 27898145 31872412 35196933 35237523 22453023
41321 22453023 4718546 1965887 15402393 22713362 9658916 -10921191 -19793882
41314 -19793882 -15469214 -6549170 6008816 22619815 30144775 13953092 -15309878
41307a5309878j1699465J6700112J7929434j0196264k6287825r17288M0196704
41300A0415530M7358042J0916121k8398481l3056129j1045101M305609k39979
41293B55612q866616n735333M031309N012353o296867j5489018o442472J6754025
41285a6777007K8420195R982418k2092677l1325560p387079J9859098K1346179
41278B025567N400546k261963K176599M082187O87352R84631J665984q641984
41270F118919k2458961j8848449J739581J5336266J2061430Q125565J2572714
41263A4647065J1116643l886250j5134695r595207j201719m191620o463574O999469
41255g709888K3362635K0385199J218693j4010570j9075825k0109300j5388320
$$ plain form
41307 -15309878 -27009343 -10309231 7620203 -2576061 -28863886 -29781174 10415530
41300 10415530 57773572 68689693 40291212 7235083 -3810018 495591 255612
41293 255612 -8611004 -14346337 -10315028 -5302675 -11599542 -27088560 -33531032 -16777007
41285 -16777007 11643188 21625606 -467071 -31792631 -39179710 -19320612 2025567
41278 2025567 7426113 5164150 7340749 11422936 12110288 13094919 14760903 6118919
41270 6118919 -16340042 -35188491 -33448910 -18112644 -6051214 2074351 14647065
41263 14647065 25763708 21877458 6742763 -2852444 -4054163 -8245783 -14709357 -7709888
41255 -7709888 15652747 36037946 37256639 23246069 4170244 -15939056 -31327376
41248c1327376k230852O540382k89487q161514K047220J7323307R507802j5487238
41240b2077756k1339821K733880K4672016J8019274l515484j4047838j1193434
41233b6749163o897187m536087k651136m003278n301818N472367K6222379L2493470
41225A4049547J0423802j7128585j8631333K818143J6732953R407473k537056
41218A5134944k717664K646887j8478r528876j3553095o559593N058154J2804591
41210C266870J3742768Q407494k297439j3879801j6220238l147499J5412881K0443137
41202B5728173P452351o651535p524236l175968p931236j7242338j5835930m065480
41194b9246199L786699M150283O229534J0394156O553554m060901p798355l006981
$$ plain form
41248 -31327376 -33558228 -27017846 -27307333 -35468847 -33421627 -16098320 -6590518 -22077756
41240 -22077756 -43417577 -40683697 -16011681 2007593 -1507891 -15555729 -26749163
41233 -26749163 -33646350 -38182437 -40833573 -44836851 -50138669 -44666302 -18443923 14049547
41225 14049547 24473349 7344764 -11286569 -8468426 8264527 17672000 15134944
41218 15134944 12417280 15064167 15045689 5516813 -8036282 -14595875 -9537721 3266870
41210 3266870 17009638 25417132 23119693 9239892 -6980346 -10127845 5285036 25728173
41202 25728173 33180524 26528989 19004753 15828785 7897549 -9344789 -25180719 -29246199
41194 -29246199 -25459500 -21309217 -15079683 -4685527 1868027 -2192874 -9991229 -12998210
41186a2998210k785787q244859l668786J3272203K1830130J0679670m336355q951923
41178D796083j2066138k1444085k2978365o234534J1645285J2077052N130394
41171b9074308P831177J2046339L233067o707575J278666J5324369R959731q204445
41163E687021j0073153N613757J0624825l501721j2778827k980082J0951186J5807977
41155A9350983J6894915J4656699j547847k4058530k5187045j212093J4281213
41148A3178295P62261j6788872r834978Q614272J0499985k05665r53293O631348
41140A1903353L557293p491643n909047P730597J0581924k077390p140303O927792
41132A8082576J8321159M407729k3149316l3015942j4236115J2668950K1428463
$$ plain form
41186 -12998210 -15783997 -24028856 -27697642 -14425439 7404691 18084361 13748006 4796083
41178 4796083 -7270055 -28714140 -51692505 -57927039 -46281754 -34204702 -29074308
41171 -29074308 -21243131 -9196792 -5963725 -12671300 -11392634 3931735 13891466 5687021
41163 5687021 -4386132 1227625 11852450 8350729 -4428098 -7408180 3543006 19350983
41155 19350983 36245898 50902597 49354750 25296220 109175 -1102918 13178295
41148 13178295 13940556 -2848316 -12683294 -4069022 6430963 6225298 5272005 11903353
41140 11903353 15460646 7969003 2059956 9790553 20372477 18295087 11154784 18082576
41132 18082576 36403735 40811464 17662148 -15353794 -29589909 -16920959 4507504
41125D507504P470269j0600647j2860597L23952J0489503N121140p153130j0812007
41117a3514013n374514k019149k471940L991234J9910351K9404792J7439901p734187
41109C9632475k1838259j3601298K219797M893639n743417j1986744n803164m16433
41101a2643404p881539j7682794j1954130N405462J2709912K017275j0628124
41094d0657342q166467R532249L1634916M4184794L2415526m410415l8899865
41087B5633396l9834354j4627626q22701r264245r485871J4110963K9849769J0140005
41079E699336j9066888j7912761M940617J2742637L340541L071021J0619339n8657
41071C375185k3207992k1776624P864481K3750290O727690q605016M736526K0397555
$$ plain form
41125 4507504 11977773 1377126 -11483471 -11159519 -670016 4451124 -2702006 -13514013
41117 -13514013 -18888527 -20907676 -23379616 -19388382 521969 29926761 47366662 39632475
41109 39632475 17794216 4192918 6412715 11306354 5562937 -6423807 -12226971 -12643404
41101 -12643404 -20524943 -38207737 -50161867 -44756405 -32046493 -30029218 -40657342
41094 -40657342 -48823809 -39291560 -7656644 36528150 68943676 64533261 25633396
41087 25633396 -14200958 -28828584 -29651285 -38915530 -48401401 -34290438 -4440669 5699336
41079 5699336 -13367552 -31280313 -26339696 -13597059 -10256518 -7185497 3433842 3375185
41071 3375185 -19832807 -41609431 -33744950 -9994660 -3266970 -11871986 -7135460 13262095
41063A3262095P687496j3558930q650515J1220069J0096858r473494j2037723
41056a454144Q761095J9648835L761631j2942050n371728J1880373R903976j0328802
41048B3859186k1512684r550530R613277J3728273J946214q096948n494193J622248
41040F114843J890027p43688N010718J6522387J8721462O536711r335088k0481076
41032B4236296k7566378k6245525p471885J9698243K7718281P376469j4525715
41025C219786j1372447P697201J7893504J6042974J3320656O830735j1729860
41018D1902549k9127770k3878737k174126R598209N946037M775821R074883J147574
41010A7264440j8243044k1168012J516166J8390652M429893j7955083j3844724
$$ plain form
41063 13262095 20949591 7390661 -1259854 9960215 20057073 10583579 -1454144
41056 -1454144 7306951 26955786 30717417 17775367 12403639 24284012 34187988 23859186
41048 23859186 2346502 -7204028 2409249 16137522 18083736 9986788 4492595 6114843
41040 6114843 8004870 7261182 12271900 28794287 47515749 54052460 44717372 24236296
41032 24236296 -3330082 -29575607 -37047492 -17349249 10369032 17745501 3219786
41025 3219786 -8152661 -455460 17438044 33481018 46801674 53632409 41902549
41018 41902549 12774779 -11103958 -13278084 -3679875 2266162 7041983 16116866 17264440
41010 17264440 -978604 -22146616 -20630450 -2239798 2190095 -15764988 -29609712
41003b9609712Q826295J3241857p007557j8619267j115461K2659775K1397309
40996I773239j265637j5939602q351313P068192J1581153M727901j628076j624711
40988D341146M23479L32339J67024K887894O524885O435249N91512q149200j2137523
40979A416805l396046J4971562K3962770P826865k0228737k7841063o562703J2939922
40971C089375L176913k0377329k4011645o231931N830302L217054M216497J4735409
40963a6355355J4974553k509018j3702897j528044J3703920O701963j1444403
40956a0159281j2715086K085125P834200k104048p993841J573752J4039046J6301245
40948H861112J1212759M696900l589918r440953k524985J4753597K3037650J2064440
$$ plain form
41003 -29609712 -20783417 -7541560 -14549117 -33168384 -34283845 -11624070 9773239
40996 9773239 8507602 -7432000 -15783313 -8715121 2866032 7593933 5965857 4341146
40988 4341146 4764625 5096964 5263988 8151882 14676767 21112016 21703528 13554328 1416805
40979 1416805 -1979241 12992321 36955091 44781956 24553219 -3287844 -9850547 3089375
40971 3089375 6266288 -14111041 -38122686 -44354617 -38524315 -35307261 -31090764 -16355355
40963 -16355355 -1380802 -3889820 -17592717 -19120761 -5416841 1285122 -10159281
40956 -10159281 -22874367 -20789242 -12955042 -15059090 -23052931 -21479179 -7440133 8861112
40948 8861112 20073871 24770771 21180853 11739900 9214915 23968512 47006162 59070602
40940E9070602k977565m307208J056202o633149k6918680l6599254k1600916L148216
40932c5761752J2476651J319824j1737156q566808P935354J9404289J4192248
40925g37350n48142r041442m644042N745435J1999255J0426470L750403l403768
40917A3546819p277563o420688k346522K187289N265198N135869J46928p022947
40909C214383p922530K541087J6371339J8943600O068598j1949571k3888105k7071683
40901b3692882k1833135p490178J0435426J9450545J5433938R727482J0516890
40894A2548086P238651j0757722k8280030j9449000J1912348L0987039J7527749
40887B1727121r517326k3398927k3167153j9798567j0722898P640562J9042974
$$ plain form
40940 59070602 56093037 51785829 52842031 46208882 19290202 -17309052 -38909968 -35761752
40932 -35761752 -23285101 -21965277 -33702433 -42269241 -34333887 -14929598 -737350
40925 -737350 -1285492 -10326934 -14970976 -9225541 2773714 13200184 16950587 13546819
40917 13546819 6269256 -151432 -2497954 -310665 4954533 10090402 10237330 3214383
40909 3214383 -4708147 -2167060 14204279 33147879 39216477 27266906 3378801 -23692882
40901 -23692882 -45526017 -53016195 -42580769 -23130224 -7696286 2031196 12548086
40894 12548086 19786737 9029015 -19251015 -38700015 -26787667 4199372 21727121
40887 21727121 12209795 -11189132 -34356285 -54154852 -64877750 -57237188 -38194214
40880c8194214Q996120l827372Q482334L2999890K8386601q695227l0721748q949727
40872a1523343K2263327J7994752j1268791k1759422m199403J0284512M078848
40865E870480n125127M33231J2162722J2649877j346647k0252844l0494286k0058792
40857d6161386Q541873L0733857K3177348m723996k0707939j1340081N680921
40850a4799403J1593520P326823J019190l543812j244146J0638428J8828139O962054
40842C6780793j3687833j3475911Q037316J5157282q260086k8740874j3590148
40835a7779461J7060919K1690528O34294r985348K445195J2382676J550724j5055686
40827A2943841j7243820p305272J925289O841590Q787465M867559m769708j0375900
$$ plain form
40880 -38194214 -29198094 -33025466 -24543132 8456758 36843359 28148132 -2573616 -11523343
40872 -11523343 10739984 28734736 17465945 -4293477 -8492880 1791632 5870480
40865 5870480 745353 1178584 13341306 25991183 24644536 4391692 -26102594 -46161386
40857 -46161386 -37619513 -6885656 16291692 11567696 -9140243 -20480324 -14799403
40850 -14799403 -3205883 4120940 5140130 1596318 352172 10990600 29818739 36780793
40842 36780793 23092960 9617049 17654365 32811647 24551561 -4189313 -17779461
40835 -17779461 -718542 20971986 21606280 11620932 14066127 26448803 27999527 12943841
40827 12943841 -4299979 -11605251 -9679962 -2838372 5949093 10816652 6046944 -4328956
40819d328956m124252P742936J2520187O841604j660630n945879o506959n995286
40811a457235j937642R465287K2033444K0403225j38833k0822698j9469731j014482
40803G061335Q230022j896930j2640744p642830K988986K901607l451866j518649
40795e969069P652673J0796244M143813m485396j0001258j2697655j1629060p024452
40787b9214160l659645k386827L266466J3118633J5227093N976548N59438Q678062
40779A1565608J5441647N107967j1311104j4329710p991819q189920j0940719
40772b0648050j328151J3939203J4010080P03566k921152Q694229J6063254R422802
40764C7935781K504027M738580N795719k694521j2202647j4044515j2525675j2410517
$$ plain form
40819 -4328956 -8453208 -710272 11809915 18651519 16990889 11045010 4538051 -1457235
40811 -1457235 -3394877 6070410 28103854 48507079 48368246 27545548 8075817 7061335
40803 7061335 15291357 13394427 753683 -6889147 -3900161 -998554 -4450420 -5969069
40795 -5969069 1683604 12479848 16623661 12138265 2137007 -10560648 -22189708 -29214160
40787 -29214160 -32873805 -35260632 -31994166 -18875533 -3648440 2328108 2887546 11565608
40779 11565608 27007255 32115222 20804118 6474408 -1517411 -9707331 -20648050
40772 -20648050 -21976201 -8036998 5973082 6676648 3755496 12449725 28512979 37935781
40764 37935781 40439808 45178388 50974107 48279586 36076939 22032424 9506749 -2903768
40756b903768r079419J076582J2905127J9418021J6374870J939468j6012235j8904098
40748D814548n05850J7518161J3579300p16913r39691Q123085L425359j2107931
40740C3190068j4613683m259252l458225j0661427j557290J9055135J5883869
40733C3579195j4627912l0858418j3270204M727481k260004r663704N456925J8287116
40725h629525K848322j6311799n784023J6711151J3476299q134499j2292115L033385
40717a5082804J0287681N430709Q314191J7826314J2611389o021103j2891670
40710B0474707n20318J3099143J6420164J2270324p07139k1928694l1230872j2115000
40702d237685J3944049J2684319r378890j4884764M959619K1018002J5470951
$$ plain form
40756 -2903768 -11983187 -10906605 1998522 21416543 37791413 39730881 23718646 4814548
40748 4814548 4308698 21826859 35406159 34689246 33749555 41872640 45297999 33190068
40740 33190068 18576385 14317133 10858908 197481 -1359809 17695326 33579195
40733 33579195 18951283 -11907135 -25177339 -20449858 -22709862 -32373566 -26916641 -8629525
40725 -8629525 -5781203 -22093002 -27877025 -11165874 2310425 -5824074 -18116189 -15082804
40717 -15082804 -4795123 635586 8949777 26776091 39387480 33366377 20474707
40710 20474707 19954389 33053532 49473696 61744020 61036881 39108187 7877315 -4237685
40702 -4237685 9706364 22390683 13011793 -1872971 3086648 24104650 39575601
40695C9575601N48172j3090999k6629763k8924868l464149L3632328M2566308
40688D4212630J6352755r232493j1322485o559847j0530454j1204778m71335N052072
40680A6296065m120369r872918J000709J2846802R989065K156122J469976O18851
40672C0384303o462703q175471Q56563N234126k266299l874223R769201J6798229
40664D2263726l19491k1911762k1594450p317856k762753p131863m035969M991083
40656a7819335O365056K361684M660229R135610L591726p094167q253802q29218
40648g882217L357104M032079P465254P253570n475739j9057207j3868328N311112
40640a8864372J4066823M955292l834939J245564J1130767J2082699N313249J300452
$$ plain form
40695 39575601 40123773 27032774 403011 -28521857 -31986006 1646322 44212630
40688 44212630 60565385 51332892 40010407 33450560 22920106 11715328 11243993 16296065
40680 16296065 12175696 2302778 3303487 16150289 26139354 28295476 29765452 30384303
40672 30384303 23921600 15746129 16602692 21836818 19570519 15696296 25465497 42263726
40664 42263726 41944235 20032473 -1561977 -8879833 -11642586 -18774449 -22810418 -17819335
40656 -17819335 -11454279 -9092595 -4432366 4703244 8294970 1200803 -7052999 -7882217
40648 -7882217 -4525113 -493034 6972220 14225790 8750051 -10307156 -24175484 -18864372
40640 -18864372 -4797549 157743 -3677196 -2431632 8699135 20781834 26095083 27395535
40632B7395535M244291P928831L710387p947558j4579909p182032K806036k916817
40624A3458764j7169331j1526503J7192293L1638298O317646k8804228k7445559
40617a6338620O767310K8286076J6107866l987040n369962M474256N247925m890790
40609C0297021j3236554j2497995n552369J155404K715895n09702l511387m845007
40601e984694q459772j1494996j977928J9539909K9912176J3534858r573771r602592
40593A5893190P903145J0856574q617401k2993098j3719680K241562K626732o637976
40585a2446952n411033P951416J5798189P491209p107752j1228738j602720Q208190
40577A651809N315417n510740r773907n852474n096093p461630J813914K1666490
$$ plain form
40632 27395535 31639826 39568657 43279044 35331486 20751577 13569545 16375581 13458764
40624 13458764 -3710567 -15237070 1955223 33593521 39911167 11106939 -16338620
40617 -16338620 -9571310 18714766 34822632 30835592 25465630 29939886 35187811 30297021
40609 30297021 17060467 4562472 -989897 165507 2881402 2371700 -1139687 -5984694
40601 -5984694 -14444466 -25939462 -27917390 -8377481 21534695 35069553 25495782 15893190
40593 15893190 23796335 34652909 26035508 3042410 -10677270 -8435708 -5808976 -12446952
40585 -12446952 -17857985 -9906569 5891620 13382829 6275077 -4953661 -6556381 1651809
40577 1651809 6967226 1456486 -8317421 -14169895 -19265988 -26727618 -24913704 -3247214
40569c247214K5916680L371406j6716237o348036J5240272J1819901j0102737
40562A9934035j3159493P973921K0537268J0457921k90242m23389q343403k8915989
40554G770629l3450616o484508K2257365J9660477m324782j8000698j2399792
40547b4971925M66428J2799802J9760678J1759967q131284j6525098k231433J1988863
40539D915998M241106r604320k866138J4981210J2257424j3350179l0828103k1163197
40531d1416199K259648J8814943K1700492J3744065L606196M587001J7359219
40524D0655365J9321742n927615l5774250l4378747p054761N732972q886717j7532555
40516d3844566K835006K6366733J9843438o123932j7175670p279203J021812j794287
$$ plain form
40569 -3247214 22669466 26040872 9324635 2976599 18216871 30036772 19934035
40562 19934035 6774542 14748463 35285731 45743652 45453410 45030021 36686618 7770629
40554 7770629 -25679987 -32164495 -9907130 9753347 5428565 -12572133 -24971925
40547 -24971925 -24505497 -11705695 8054983 19814950 11683666 -4841432 -7072865 4915998
40539 4915998 9157104 -447216 -3313354 11667856 23925280 10575101 -20253002 -41416199
40531 -41416199 -39156551 -20341608 1358884 15102949 18709145 23296146 40655365
40524 40655365 59977107 54049492 18275242 -16103505 -23158266 -17425294 -26312011 -43844566
40516 -43844566 -41009560 -14642827 5200611 -923321 -18098991 -25378194 -24356382 -26150669
40508b6150669j812736Q260160J6032363J2042721M546309L602006N960143M325220
40500B6805517k21332l283420n089222n610199m24260R816065J3347507J615930
40492C6956586j4830267j6590441r02302J4041224J2439804r63041j0381695q643078
40484A1126790j032762M789978N282875M63515o033081p598339j614049M915755
40476A0300682K933154n690244r963094o015610l144198q341223j2404475k105912
40468c4430920J6288642J9368582j854375k4403660k0100668O495907K3913730
40461a4722762J6925847L291335N07285q42046j2566675j8848381k55814K5199042
40453a312169K2053695m470007j1619577J1968870K4560988p24722k8754483j7851403
$$ plain form
40508 -26150669 -27963405 -19703245 -3670882 8371839 12918148 16520154 22480297 26805517
40500 26805517 26584185 23300765 18211543 12601344 12177084 21993149 35340656 36956586
40492 36956586 22126319 5535878 4633576 18674800 31114604 30151563 19769868 11126790
40484 11126790 10094028 14884006 20166881 20630396 14597315 6998976 5384927 10300682
40476 10300682 13233836 7543592 -2419502 -8435112 -11579310 -19920533 -32325008 -34430920
40468 -34430920 -18142278 1226304 -628071 -25031731 -45132399 -38636492 -14722762
40461 -14722762 2203085 5494420 6001705 5159659 -7407016 -26255397 -26511211 -1312169
40453 -1312169 20741526 16271519 4651942 16620812 41181800 40457078 11702595 -6148808
40445f148808J2504982J4825486r384239j7415809J459705J4485981P337374M591785
40437B2256457J7227651J9235777k505883j8700211o207318J0523089L18285k1662004
40429B0485843k0205216N62533N181141j4424784k7669943j4770611O042820J0468021
40421c4330196J792058j402629N638281J2228011J1179108N905044J031387l242040
40413a200976n339684K86465J2836415J8131862M621501j4230705j1044553J5007403
40405A9067728K8880656P200195k3903931k4089049K753650J8309602R506796
40398C7725647o23697j220190r520569k8365825l0446521n166844J6500357R709243
40390a1408399n234652j230540R064281Q32636j3947756o361858J6503304K0597706
$$ plain form
40445 -6148808 6356174 21181660 11797421 -5618388 -4158683 10327298 17664672 22256457
40437 22256457 39484108 58719885 56214002 37513791 31306473 41829562 42147847 20485843
40429 20485843 280627 843160 6024301 -8400483 -36070426 -50841037 -44798217 -34330196
40421 -34330196 -32538138 -33940767 -28302486 -16074475 -4895367 1009677 2041064 -1200976
40413 -1200976 -6540660 -6254195 6582220 24714082 29335583 15104878 4060325 19067728
40405 19067728 47948384 55148579 31244648 7155599 9909249 28218851 37725647
40398 37725647 37101950 35881760 26361191 -2004634 -32451155 -37617999 -21117642 -11408399
40390 -11408399 -16643051 -17873591 -8809310 -7976674 -21924430 -28286288 -11782984 8814722
40382H814722M41498j3222004k063433J6574811K0104779Q469009m523878q923066
40374B5672438m098719R65833m561443j5488272j1739409R638497K1615499O620577
40366B8625001j1828759n701498R458390J205232k0068681j4571334J8393347
40359E511698L4508770J3244178j3805973j6804337o830370k285591L395930J5055259
40351C1989564J2584340j4326210l6705965k5408855K487349J1478293L884563
40344a4016921Q999760K6301170K2937483q856657l2058302j8037279J1662154
40337c068592J8910962K418185q837889k865145L896279M42658j981163M663136
40329A3578431P210775m965826j6617692q566984R317309J1921320j177519o921435
$$ plain form
40382 8814722 9256220 -3965784 -6029217 10545594 30650373 39119382 34595504 25672438
40374 25672438 21573719 22539552 17978109 2489837 -9249572 388925 22004424 28625001
40366 28625001 16796242 11094744 20553134 21758366 1689685 -12881649 5511698
40359 5511698 40020468 53264646 39458673 22654336 15823966 13538375 16934305 31989564
40351 31989564 44573904 30247694 -6458271 -31867126 -29379777 -17901484 -14016921
40344 -14016921 -5017161 21284009 44221492 35364835 3306533 -14730746 -3068592
40337 -3068592 15842370 18260555 9422666 6557521 10453800 10896458 8915295 13578431
40329 13578431 20789206 15823380 -794312 -9361296 -43987 11877333 10699814 3778379
40321C778379J550221N797346k759355q307296j509037L802736o85893k12810
40313A454291J3295728K0584355P054160r034711o313776L956119L90660j0517087
40305B0869739r909196k229926k612114m438585O090355J7038823Q548822q535975
40297B4821943r257875J310006J57282p398455K653896K2913834K0459082o949235
40289D8710478k5424636j9025554o246988J094589J1280242J9765622Q502656
40282C8656409j3503804j4272600O965100J5672623J975323m924175N060508M388584
40274D0017968j3641668j4659019J1658560K2792109n084582l0660802j5141542
40267d718976J3393895J2242347m109168L77890J3922002L816709j6252220r038762
$$ plain form
40321 3778379 5328600 11125946 8366591 59295 -1449742 2352994 1667101 1454291
40313 1454291 14750019 35334374 42388534 33353823 27040047 30996166 31386826 20869739
40305 20869739 10960543 8730617 6118503 1679918 7770273 24809096 33357918 24821943
40297 24821943 15564068 16874074 17031356 9632901 12286797 35200631 55659713 48710478
40289 48710478 23285842 4260288 -1986700 -892111 10388131 30153753 38656409
40282 38656409 25152605 10880005 17845105 33517728 35493051 30568876 35629384 40017968
40274 40017968 26376300 11717281 23375841 46167950 41083368 10422566 -4718976
40267 -4718976 8674919 20917266 16808098 17185988 31107990 34924699 18672479 9633717
40259I633717J5106128J2713547j6695624k8651062o574183J7318736J7959633
40252B0810892O887255p84738p218412j1846171o338995L429979J277423r631952
40244c414719j0011355J790233Q597893O536124Q003949J2757667O972260p629229
40236B3602823j3472180p227320j844774R11765J0213378J9332909J1118063q235033
40228C4399631j2969556J356373J1864158O831353j130296m631928j1904186k1095713
40220B719836j6251479K065391J2366191P641279N184774J1642104J0282203l797818
40212C1852481q241788Q102301K0513729N516383k0631906k5886796q303568O701357
40204I622193M648443m704902p701854k523388N061644R790269R310641M542293
$$ plain form
40259 9633717 24739845 37453392 20757768 -7893294 -14467477 2851259 20810892
40252 20810892 27698147 26913409 19694997 7848826 1509831 4939810 6217233 -3414719
40244 -3414719 -13426074 -11635841 -3037948 3498176 11502125 24259792 31232052 23602823
40236 23602823 10130643 2903323 1058549 1970314 12183692 31516601 42634664 34399631
40228 34399631 21430075 22786448 34650606 41481959 40351663 35719735 23815549 2719836
40220 2719836 -13531643 -11466252 899939 8541218 13725992 25368096 35650299 31852481
40212 31852481 23610693 31712994 52226723 57743106 37111200 11224404 2920836 9622193
40204 9622193 14270636 9565734 1863880 -659508 4402136 14192405 23503046 28045339
40196B8045339q68708k598050J594399P527752M245641j2165073k4380275j1356440
40188i955415J5166669J7412845j1630086k9255141o135084K4321969J8308417
40181A8234174o362910k621387K2756119K1508189q740485j8384482O165442J7815230
40173E0369890p086268k5971723n185216K0632774Q477821k1042887k1403643
40166a209252N337508K1931292J9097071J7891341K5630842L1792539L6103596
40159A56574937M4208292M5738747K8627837M311231r793168j9118403l5141855
40152B15407618m6318061l6831558j8714825j3098466j4587084p316364k76281
40145G8264979r801756k1645309j1177591R996436J0673551m975702n056636J1204949
$$ plain form
40196 28045339 27176631 24578581 26172980 33700732 37946373 25781300 1401025 -9955415
40188 -9955415 5211254 22624099 10994013 -18261128 -24396212 -74243 18234174
40181 18234174 11871264 9249877 32005996 53514185 44773700 26389218 32554660 50369890
40173 50369890 43283622 17311899 12126683 32759457 41237278 20194391 -1209252
40166 -1209252 4128256 26059548 45156619 63047960 88678802 120471341 156574937
40159 156574937 200783229 246521976 275149813 279461044 269667876 250549473 215407618
40152 215407618 169089557 132257999 113543174 100444708 85857624 78541260 78264979
40145 78264979 68463223 46817914 35640323 45636759 56310310 51334608 46277972 57482921
40137E7482921J1288526j0601431k0862120m948916Q755817J070700o213292N596244
40129D1568449J6227755M315709j2409076q280418N585689L237427r586975p714346
40121C2944214P982117J4202947P495951O851781J4843409J1591046n977680j2004099
40113G7929686O956909K6985711K4194708J4315712K6441442N0232640M3347994
40106B70404802o304572n6335516o1851669k9645767j198355K913669k609427
40099A15373165j614349K376280J977927p08768n709783k0438746m0569983m2672119
40091H013624j3600592K3959434L4656336J3722270j1140080j8442541j3870537
40084B3297914r617511k663026J3510727K7712780K0248157o359167k2348622
$$ plain form
40137 57482921 68771447 58170016 37307896 32358980 41114797 42185497 35972205 41568449
40129 41568449 57796204 62111913 49702837 41422419 47008108 50245535 40658560 32944214
40121 32944214 40926331 55129278 62625229 69477010 84320419 95911465 89933785 77929686
40113 77929686 84886595 111872306 136067014 150382726 176824168 227056808 270404802
40106 270404802 264100230 207764714 145913045 116267278 115068923 117982592 115373165
40099 115373165 113758816 116135096 118113023 117404255 111694472 91255726 50685743 8013624
40091 8013624 -5586968 18372466 53028802 66751072 55610992 37168451 23297914
40084 23297914 13680403 11017377 24528104 52240884 72489041 66129874 43781252
40077D3781252p181690J8657156J6258070j7397863l9509154j8056419K1476444
40070A8027796K9825729J961967k0563620j3196800K019896R95366l807528O878095
40062B2140901J8771173O535694j9615793k5781846p683242L093987q944978j7509561
40054b8993665K974430L3269258L2993366j231332k7766425j4953443J7163224
40047A3455413K6449598P289179o182561M375281J3677957k512403k2929563j3271475
40039B0351426J5164423K1283542K084368k917930J8499440K6891431k481023
40032I8875677l4618710k9009257j696403O490161n007823p058191L660180N595355
40024C7230989k339899p59095R010481N231990j1854443j6299442j59187J3414084
$$ plain form
40077 43781252 36599562 55256718 71514788 54116925 14607771 -3448648 18027796
40070 18027796 47853525 49815492 29251872 16055072 18074968 19070334 15262806 22140901
40062 22140901 40912074 47447768 27831975 2050129 -5633113 -2539126 -11484104 -28993665
40054 -28993665 -26019235 7250023 40243389 39012057 11245632 -3707811 13455413
40047 13455413 39905011 47194190 41011629 45386910 59064867 56552464 33622901 20351426
40039 20351426 35515849 56799391 58883759 55965829 74465269 101356700 98875677
40032 98875677 64256967 35247710 33551307 40041468 35033645 27975454 31635634 37230989
40024 37230989 34891090 34131995 43142476 48374466 36520023 20220581 20061394 33475478
40016C3475478Q546445k068762l432663L46833Q29245K1720J438671K716253K086596
40007D3959816q10985q822658j7983880j2530917J1569584K9153029J7197872
40000F1731861p351880j1448874K670850O217501l297608K59371K2139099L8304584
39992A09224904M0182815M3302969M3991959J5487207l7193971o5564706m4482216
39985A04948961r429777p56540q832674m737754Q337927Q106662p495873k3563999
39977F6576933l0288726k0588911R032691L6935585K8475327q784968k0704087
39970F0653844J4594109M6196474K6237133j6821054k8933825j4855658j3221783
39963G3849240j9883883l709306K2690692K0173349K93257J1345405M7705077
$$ plain form
40016 33475478 42021923 39953161 36520498 36867331 37696576 37718296 39156967 41873220 43959816
40007 43959816 43148831 34326173 16342293 3811376 15380960 44533989 61731861
40000 61731861 54379981 42931107 45601957 51819458 48521850 48781221 70920320 109224904
39992 109224904 149407719 192710688 236702647 252189854 214995883 149431177 104948961
39985 104948961 95519184 94762644 85929970 81192216 89530143 97636805 90140932 66576933
39977 66576933 36288207 15699296 24731987 61667572 90142899 81357931 60653844
39970 60653844 75247953 121444427 147681560 130860506 101926681 87071023 73849240
39963 73849240 53965357 50256051 72946743 93120092 93413349 104758754 152463831
39956A52463831M8323505k698764m6566296m2450347k1749707k0372931k1414009
39949D5535282m327228P086314o837459j4852625J1136676L7300265K0431587
39942I5472812j4716086j3125056J8936814K5948248m194763k5431879j3743587
39935F9146503l50495j0660259k4093244j7740495n837222p776357j1037954M095769
39927d253754K7227572L3283344J8681311r38287j5292702k1896558j6843837
39920A9967089k269646P379288L147071m166061j690033N483569O899426O172232
39912D0922935J0269381J1849098K385018p550503k947434Q701499P852079n298363
39904F6183710j2591947p988688k580800j294247J836230N123156k62401r650108
$$ plain form
39956 152463831 200787336 198088572 151522276 109071929 87322222 66949291 45535282
39949 45535282 41208054 48294368 41456909 26604284 37740960 75041225 95472812
39942 95472812 80756726 67631670 86568484 112516732 108321969 82890090 69146503
39935 69146503 68796008 58135749 34042505 16302010 10464788 2688431 -8349523 -4253754
39927 -4253754 22973818 56257162 74938473 74000186 58707484 36810926 19967089
39920 19967089 17697443 25076731 28223802 24057741 22367708 27851277 34750703 40922935
39912 40922935 51192316 63041414 65426432 57875929 54928495 63629994 71482073 66183710
39904 66183710 53591763 45603075 43022275 41728028 43564258 48687414 48425013 38774905
39896C8774905q367404J953145M970981k00689K360941J2647920J1312406l361389
39888F0090816q328540K564411N884204n305801k687627K3120983L0648251r957916
39880I6028781n7250195n1827235m951874K1904357J0739763l70448O313150L751087
39872B4337386j7181998k1757856P180155L2879771K1186943p553575j6221811
39865B2869015o391884j728041m060041r66422M579127M598953P232568J7382481
39857D3515756J5829804j0208035l4078000k3115661Q687862J8879902j196845
39850A8314783j9949579j7759661q396676n667755l259157L665610N650534q00306
39842b8202207k469979R663663K5219402K8981877J8269953J091636j1594372
$$ plain form
39896 38774905 30407501 32360646 37331627 37130938 39491879 52139799 63452205 60090816
39888 60090816 51762276 54326687 60210891 54905090 52217463 75338446 105986697 96028781
39880 96028781 38778586 -13048649 -18000523 3903834 14643597 14273149 20586299 24337386
39872 24337386 7155388 -14602468 -7422313 25457458 46644401 39090826 22869015
39865 22869015 16477131 14749090 10689049 9722627 14301754 18900707 26133275 43515756
39857 43515756 59345560 49137525 15059525 -8056136 631726 19511628 18314783
39850 18314783 -1634796 -19394457 -27791133 -33458888 -36718045 -33052435 -27401901 -28202207
39842 -28202207 -30672186 -21008523 4210879 33192756 51462709 52554345 40959973
39835D0959973j0469266L174634J3525508P482372p351173j5416419j7469946
39828A4435683k3408288k6625960r922363K2428857M2416740L3522678Q760003
39821F1607350j1162008j9029179j5828647l470611R671626J1647952K453492
39814C5889975n498999n334563j198870M036880J0398793J0698034k003097j6072456
39806C0915697j1761015P282540J5474428L191624r983536p271855L090052P360343
39798C8298278O082357L136372m460406j3974435j3495134k524029K943295l618575
39790A2387723q619440l905050K99427o7177Q157029K5687208K8057083M480276
39782F6477079j7265322j1252296O178053O881210j655074M127297J5863260P034613
$$ plain form
39835 40959973 30490707 33665341 47190849 54673221 47322048 31905629 14435683
39828 14435683 -8972605 -35598565 -45520928 -23092071 19324669 52847347 61607350
39821 61607350 50445342 31416163 15587516 12116905 21788531 33436483 35889975
39814 35889975 30390976 25056413 23857543 27894423 38293216 48991250 46988153 30915697
39806 30915697 19154682 26437222 41911650 45103274 35119738 27847883 30937935 38298278
39798 38298278 44380635 47517007 43056601 29082166 15587032 13063003 16006298 12387723
39790 12387723 3768283 -136767 162660 95483 8252512 33939720 61996803 66477079
39782 66477079 49211757 37959461 44137514 51018724 49363650 53490947 69354207 76388820
39774G6388820j6164830k1529317n242215L286566o182539r587534M559292J3054921
39766C8583164j66668j4503543p504258P906387O366350r003898j4326180k456174
39758D895180J0121918R337140r97970q804777p328230R73210Q117473Q715599
39750B5029543N214124J998837k044679p274866n648405O858433J5752393N473673
39742D5359053j1481679p263800J7546195L0438482J5467190l368370k340144
39735H4356927N789709j719526j7313314j7290668j613830R041694P916751O669873
39727G5837616Q547907K461605j4056407k6449272k2475525o310991R008794J3307927
39719C9871654M955340o175909o224343L736169O221728m122313o047154J4852843
$$ plain form
39774 76388820 60223990 38694673 33452458 36739024 30556485 20968951 25528243 38583164
39766 38583164 38416496 23912953 16408695 24315082 30681432 21677534 7351354 4895180
39758 4895180 15017098 24354238 23356268 14551491 7223261 8196471 16313944 25029543
39750 25029543 30243667 32242504 30197825 22922959 17274554 24132987 39885380 45359053
39742 45359053 33877374 26613574 44159769 74598251 90065441 86697071 84356927
39735 84356927 90146636 88427110 71113796 53823128 52209298 61250992 69167743 75837616
39727 75837616 84385523 86847128 72790721 46341449 23865924 17554933 26563727 39871654
39719 39871654 44826994 38651085 32426742 36162911 42384639 38262326 32215172 47068015
39711D7068015L4151905J9237450j7643560l1673087r679225J3730892J0546929
39704F5739319n239842j0076803o509887o658542o629414j14075L530021k760412
39696C1280365o286686K454136P709985n175108j8216002n720740K1156050K7565237
39688E4767237O716719j4534859k0382078k2133731k5009896j3659581J5255720
39681a8980469L5432936K5752938J412722r644057m172222K532936M881319O254371
39673D3470474J539388j4106922k5006638j0474237J8600413K5352689k395962
39666C6979205l0508825k2922647R953796K7515838J3537806q249257j1630607
39659A4675309Q56848J0840633J1167244Q179583P246932Q076834Q742755M982756
$$ plain form
39711 47068015 81219920 100457370 82813810 51140723 41461498 55192390 65739319
39704 65739319 60499477 50422674 43912787 37254245 30624831 30510756 34040777 31280365
39696 31280365 24993679 27447815 35157800 29982692 11766690 6045950 27202000 54767237
39688 54767237 61483956 46949097 26567019 4433288 -20576608 -34236189 -18980469
39681 -18980469 16452467 42205405 43618127 33974070 29801848 32334784 37216103 43470474
39673 43470474 45009862 30902940 5896302 -4577935 14022478 39375167 36979205
39666 36979205 6470380 -16452267 -6498471 21017367 34555173 26305916 14675309
39659 14675309 15532157 26372790 37540034 45719617 52966549 61043383 69786138 74768894
39651G4768894q353117k5735263k8956166r963340J1739826J1959889l207878
39644B2252845p148955M187758O259102j0665684k1363414n433893J8398389K1350507
39636B7836655P813381J779861N304709K021926p120650n360534N382571M980973
39628D2638892p704480j1089108n91244J432568j2799263j8403650j33996J7559419
39620A0909138Q456381j1860768j0733751J0087110J9873128O922103r892779
39613B3760562j5201126j4405601j3868656q382685L895718J2420610R313490
39606b467688J296150o05114N218492J2126618J3337989O282467n468044j3728006
39598A5992864j3747302r300216n552880j550450L896640N204482j524603q275541
$$ plain form
39651 74768894 66415777 40680514 11724348 1761008 13500834 25460723 22252845
39644 22252845 15103890 19291648 25550750 14885066 -6478348 -11912241 6486148 27836655
39636 27836655 35650036 37429897 42734606 44756532 37635882 32275348 37657919 42638892
39628 42638892 34934412 23845304 23254060 24686628 11887365 -6516285 -6650281 10909138
39620 10909138 19365519 7504751 -3229000 6858110 26731238 33653341 23760562
39613 23760562 8559436 -5846165 -19714821 -28097506 -24201788 -11781178 -2467688
39606 -2467688 -1171538 -1776652 3441840 15568458 28906447 35188914 29720870 15992864
39598 15992864 2245562 -7054654 -12607534 -14157984 -10261344 -5056862 -6581465 -14857006
39590a4857006m712079N217633P869995j09937p083395k489928J0046297J6669851
39582A0551431P199912j2188601j9838828j597718K5346843K7580914R88237j9691254
39574A8350936j0700527N166322k905878k1805466j6537463R843793K0648392
39567B060109O351396l419222N139817P475861j0572707k2897576p917510J1424567
39559a2355265N037157j3638912j1280313Q897104J4009842k511556j0541483
39552b2383426P272103K8314010K4478856Q54373j5497576j2027931q46957K769740
39544A2933192n89463o48822L491600M98742j2869953j9651425n572789J3206028
39536i202890Q598355j3372706j4822860J5723513L9694078K5023600l817131
$$ plain form
39590 -14857006 -19569085 -14351452 -6481457 -6591394 -13674789 -16164717 -6118420 10551431
39582 10551431 17751343 5562742 -14276086 -15873804 9473039 37053953 38042190 18350936
39574 18350936 7650409 12816731 9910853 -11894613 -28432076 -18588283 2060109
39567 2060109 8411505 4992283 10132100 17607961 7035254 -15862322 -23779832 -12355265
39559 -12355265 -7318108 -20957020 -32237333 -23340229 -9330387 -11841943 -22383426
39552 -22383426 -15111323 13202687 37681543 38535916 23038340 11010409 10163452 12933192
39544 12933192 12343729 11694907 15186507 15685249 2815296 -16836129 -22408918 -9202890
39536 -9202890 -604535 -13977241 -28800101 -13076588 26617490 51641090 47823959
39529D7823959n774328J0546113M446013k5024071l4713097q590470J4738088
39522C452207L389127j9361095j5117073J1435465K6410521J9093145P441738
39515C6744035J772097n008484j2606058p358693J2548941K6724670J7169366
39508F9985874r124004k9586151k9740142j2838706O594049J4519553Q187775
39501A7998248j822702l910039R91406L703590J922814J166845J352165m588408
39493A6813919j5118199j6796560m723271O315464L531013j889085P983474K5297283
39485B1414038K3597247j341496k1442020j6421456k394923l950092j5413132
39478a5951834j3207163L940801J4130042Q904646L593433P085827P462072k009580
$$ plain form
39529 47823959 42049631 52595744 57041757 32017686 -2695411 -11285881 3452207
39522 3452207 6841334 -12519761 -27636834 -16201369 10209152 29302297 36744035
39515 36744035 38516132 33507648 20901590 13542897 26091838 52816508 69985874
39508 69985874 60861870 31275719 1535577 -11303129 -4709080 9810473 17998248
39501 17998248 16175546 12265507 13256913 16960503 18883317 20050162 21402327 16813919
39493 16813919 1695720 -15100840 -19824111 -13508647 -9977634 -11866719 -3883245 21414038
39485 21414038 45011285 43669789 22227769 5806313 3411390 -538702 -15951834
39478 -15951834 -29158997 -25218196 -11088154 -2183508 1409925 8495752 15957824 13948244
39470A3948244o541580M376070J4660256N498446j3216586j8080754q612994l626060
39462a1594958o459287j094313J4733325J9480815K030343j5775213q402126J5389838
39454H308424K4070165P334330j1377963q912062P826872J5498224O629629n656432
39446D3721187j1250122j5199248k1895064k2063415p765615R473609J1902675
39439a3075993K226253j041354O301838R339372K575963J30500P866228R062364
39431B3385171n552242j5742539l296689J3266173O001217j3506380r436369J7560529
39423A2678871K5485698l888351l2890774k2150950J2609221K6694991J0362872
39416B8901578n562764o37939J0059447O210089p382095j3570530j0612970j0652018
$$ plain form
39470 13948244 7406664 11782734 26442990 31941436 18724850 644096 -7968898 -11594958
39462 -11594958 -18054245 -19148558 -4415233 15065582 17095925 1320712 -7081414 8308424
39454 8308424 32378589 39712919 28334956 19422894 27249766 42747990 49377619 43721187
39446 43721187 32471065 17271817 -4623247 -26686662 -34452277 -24978668 -13075993
39439 -13075993 -10849740 -11891094 -5589256 3750116 6326079 6456579 14322807 23385171
39431 23385171 17832929 2090390 -1206299 12059874 18061091 4554711 -4881658 12678871
39423 12678871 38164569 34276218 1385444 -20765506 -8156285 18538706 28901578
39416 28901578 23338814 22700875 32760322 38970411 31588316 18017786 7404816 -3247202
39408c247202j5669106j1299151J0137746L1563862K8789653L904807j3721475
39401C0459134n547273J0755288O734138j6107341k9181667j6998525M652077
39394a5234169J3196488N230891p426995j3613471q382196N467289J5307810Q550863
39386C096510j0344556k2681408j8624053o109226N428288J5314131K1528866
39379a2391448J7433806O053489R08650L868815J36055j3709040j6961706K922847
39371a1738532K3982322J8435390n784389j7413837p591165K688415j917609j2590388
39363a1929793j5387396q358144L985797J6385165J9873524Q335838r136501j6119658
39355a2351168j0564378n070090n503831n068296p14635J714758K067195Q525257
$$ plain form
39408 -3247202 -18916308 -30215459 -20077713 11486149 40275802 44180609 30459134
39401 30459134 24911861 35667149 42401287 26293946 -2887721 -19886246 -15234169
39394 -15234169 -2037681 3193210 -4233785 -17847256 -26229452 -20762163 -5454353 3096510
39386 3096510 -7248046 -29929454 -48553507 -54662733 -49234445 -33920314 -12391448
39379 -12391448 5042358 11095847 12004497 15873312 16009367 2300327 -14661379 -11738532
39371 -11738532 12243790 30679180 24894791 7480954 -110211 2578204 660595 -11929793
39363 -11929793 -27317189 -35675333 -31689536 -15304371 4569153 12904991 3768490 -12351168
39355 -12351168 -22915546 -27985636 -33489467 -38557763 -39272398 -37557640 -35490445 -26965188
39347b6965188K0293744K3709907J2496648k427175r894880j1143128r355578
39340c285650k180184P204958P472221k065057n379411N562088J5349106Q919680
39332C1597751m204013p515307n576434j1769119j8405565o868479J5594335J9022864
39324A1876033l775243k2520971j2818126R502785J5707121P084266O914384K0458374
39316C2428623K8797313K0496843N888773l850301j1277909j8862269j8619632
39309C5001441o877000M651071N299066J704012M163069P098504m32531j2329184
39301C8278448j2711607k582514M68933r457261j7366621j1309483J208043P701807
39293e770255P066749L938847k4314j696791L665029J0682018N970827r754823
$$ plain form
39347 -26965188 -6671444 17038463 29535111 27107936 17213056 6069928 -3285650
39340 -3285650 -5465834 1739124 9211345 7146288 1766877 7328965 22678071 31597751
39332 31597751 27393738 19878431 14301997 2532878 -15872687 -22741166 -7146831 11876033
39324 11876033 8100790 -14420181 -27238307 -17735522 -2028401 5055865 11970249 32428623
39316 32428623 61225936 81722779 87611552 83761251 72483342 53621073 35001441
39309 35001441 28124441 32775512 38074578 39778590 43941659 51040163 50607632 38278448
39301 38278448 25566841 22984327 23453260 13995999 -3370622 -14680105 -13472062 -5770255
39293 -5770255 1296494 5235341 5211027 3514236 7179265 17861283 23832110 14077287
39285A4077287j7408523p870222K625118l17419m743291M827143J5918082N699631
39277A2807806j9208414k8745088j2830383P576474J4377806J2500251J1078982
39270b442566P384080j191081p037258m408494J262031L633729M031005M735320
39262E966766M558851M488691O751413O714213j826632j2582516j2295616j269210
39254E05960P027773P547281P393661O942515k187662j6231453j7879564k994073
39246i875562J1572081J4593101J4142217J6282996J2853058J871065l085454
39239E8353502J801140r25992j8776481k9425091j3712859J1652646J8795917
39232B7762782Q908259J809094L16034o029051j2241603l554188J4261199J8374441
$$ plain form
39285 14077287 -3331236 -11201458 -8576340 -8893759 -13637050 -8809907 7108175 12807806
39277 12807806 -6400608 -35145696 -47976079 -40399605 -26021799 -13521548 -2442566
39270 -2442566 4941514 3750433 -3286825 -7695319 -6433288 -2799559 1231446 5966766
39262 5966766 10525617 15014308 21765721 28479934 26653302 14070786 1775170 505960
39254 505960 7533733 15081014 22474675 29417190 27229528 10998075 -6881489 -9875562
39246 -9875562 1696519 16289620 30431837 46714833 59567891 61438956 58353502
39239 58353502 60154642 59228650 40452169 11027078 -2685781 8966865 27762782
39232 27762782 36671041 38480135 38796169 32767118 20525515 16971327 31232526 49606967
39224D9606967L122954j2926556j5694220j0694817p025120m038874K195155J1173243
39216A5718732J7923283J4083456m511091k4281274k1417935N362327K6192675
39209B9070173J9819325K416294l494471n308325j6534710k0821280K32656K1936814
39201B7316476P552229k5756468k5571350J1856143L2547864R490410j9308162
39194A8127142j7488583k819589l918653j0587321l223734O110280O24952m307182
39186a7482688R474524K2996191J0281139j2957274j2499303Q199122J6251016
39179B4262727L165329r169526r711744p938782n950379L570228J2811807N738337
39171A6777997j0138338j0466928O297957J6271244Q808109j938776o111305q601244
$$ plain form
39224 49606967 52729921 39803365 24109145 13414328 6389208 2350334 4545489 15718732
39216 15718732 33642015 47725471 43214380 18933106 -2484829 2877498 29070173
39209 29070173 48889498 51305792 47811321 42502996 25968286 5147006 5379662 27316476
39201 27316476 34868705 9112237 -16459113 -4602970 27944894 37435304 18127142
39194 18127142 638559 -2181030 -6099683 -16687004 -19910738 -13800458 -13175506 -17482688
39186 -17482688 -8008164 14988027 25269166 12311892 -187411 8011711 24262727
39179 24262727 27428056 18258530 8546786 608004 -5342375 -1772147 11039660 16777997
39171 16777997 6639659 -3827269 2470688 18741932 27550041 25611265 19499960 10898716
39163A0898716p482641O546714K3566824J9023728o247557k1177663j0602340
39156A4525781L776849K025526m185999J921204J2767399J4011825Q912195M638102
39148E8392882m681431k0066575k3117517k972974J9556548J9315949L199546
39141D9626428n369420l617763l992417m725177L509466J0816525J103886j2900235
39133C4451293k932440K5498936L3675146Q145794j6448179r063220J4490627
39126H7817957K2383504J5208964J5997211K9366268L9796707M1050923M0110047
39119B91731581L6228158K0516554m859301k8013784m5915028o0981568o2766456
39112A45940156l8787932m238740P689150q053636j9988945q646067N902049K336715
$$ plain form
39163 10898716 3416075 9962789 33529613 52553341 46305784 25128121 14525781
39156 14525781 18302630 20328156 16142157 18063361 30830760 44842585 53754780 58392882
39148 58392882 53711451 33644876 10527359 7554385 27110933 46426882 49626428
39141 49626428 44257008 40639245 36646828 31921651 35431117 46247642 47351528 34451293
39133 34451293 31518853 57017789 90692935 98838729 82390550 73327330 87817957
39126 87817957 110201461 125410425 141407636 170773904 210570611 251621534 291731581
39119 291731581 327959739 348476293 343616992 315603208 269688180 208706612 145940156
39112 145940156 107152224 102913484 110602634 102548998 82560053 73913986 79816035 82152750
39104H2152750n391839L991370J9392241J8576844J0543947J8547140L2291239
39097A80103692J9793778j4961461l0334697j1169867P173246m635914k7436203
39090A18532574l1126015k1158987j7489620j4283829L584919K1931201J3427053
39083G3417296j5021079k6309178n076533K3681818L2013775K0795854Q177821
39076A11679774N841507J3774069K4797030K9476583K6214849K6122135L7636486
39069B75542433M9848271M3677806J5864898k0674198n3938641p5079427p1811148
39062A63429994m0855939l639850J1730546L777864n891266o832477q387067j4520789
39054I8811016j4254820k062129J2568251K0870131K2444001J5360236j993802
$$ plain form
39104 82152750 76760911 80752281 100144522 118721366 129265313 147812453 180103692
39097 180103692 199897470 184936009 154601312 143431445 150604691 145968777 118532574
39090 118532574 87406559 66247572 48757952 34474123 38059042 59990243 73417296
39083 73417296 58396217 32087039 27010506 50692324 82706099 103501953 111679774
39076 111679774 117521281 131295350 156092380 185568963 211783812 237905947 275542433
39069 275542433 325390704 369068510 384933408 364259210 310320569 235241142 163429994
39062 163429994 122574055 118934205 130664751 134442615 128551349 121718872 113331805 98811016
39054 98811016 84556196 82494067 95062318 115932449 138376450 153736686 151742884
39047A51742884j7992431j7864779q054197p958635j6805255j5066382q56383
39040F7144822N411897j787769m244457K246802k868492k2463385k5852232R54075
39032A8541261K4011829J1356091j5810015j7926275R74289O230803q894575j8948570
39024d65162j2382907l217724P35437O486604J2577139Q812771P85098N249477
39016A8580733J8792467J9533539L528965q262534m529553J614927o24723l655988
39008D4977833j173822n85217n420389o237291K11632J968438o920191j4086705
39000A2734288r500485k012993k436402m464832L275145J6535382K0592692J0395668
38992D5118463m537668j2125393r189411l955598p855394k0047930k3854501q175735
$$ plain form
39047 151742884 133750453 115885674 107831477 99872842 83067587 68001205 67144822
39040 67144822 72556719 70768950 66524493 68771295 65902803 43439418 17587186 18541261
39032 18541261 42553090 53909181 38099166 20172891 21147180 27377983 18483408 -465162
39024 -465162 -12848069 -16065793 -15330356 -8843752 3733387 12546158 13331256 18580733
39016 18580733 37373200 56906739 60435704 52173170 47643617 49258544 48633821 44977833
39008 44977833 43804011 43218794 37798405 31561114 31772746 33741184 26820993 12734288
39000 12734288 3233803 1220810 -1215592 -5680424 -2405279 14130103 34722795 45118463
38992 45118463 40580795 28455402 19265991 15310393 7454999 -12592931 -36447432 -44623167
38984d4623167J2984554J7581489P875172N532098J5215750J7410486L237493
38977C5213875q416547j177694J2360037J0949085m178307j5449808j4581685
38970A4718956n996568O068261J7887011J9984822O014060j4010665k1290528
38963B3375349r944593N710028O988259p665858j7811832k995165K6743754L4433573
38955E8833515L919219k9615878k2387856J4010149K7288865K847020j6251467
38948C8643567j052583J7536416M063004k0977062j8416807J722547L18336k0234604
38940A602814k0194398O499880J9750523J363500j4200650J698317K4019064J4689951
38932C5229001j8094659l4492363k0087584K645659J2209415J0473943P752795
$$ plain form
38984 -44623167 -31638613 -14057124 -6181952 -649854 14565896 31976382 35213875
38977 35213875 26797328 25619634 37979671 48928756 44750449 29300641 14718956
38970 14718956 8722388 14790649 32677660 52662482 58676542 44665877 23375349
38963 23375349 13430756 19140784 26129043 18463185 651353 -2343812 24399942 58833515
38955 58833515 62752734 33136856 10749000 24759149 52048014 54895034 38643567
38948 38643567 37590984 55127400 59190404 38213342 19796535 21519082 21837418 1602814
38940 1602814 -18591584 -12091704 7658819 9022319 -5178331 -3480014 20539050 35229001
38932 35229001 17134342 -17358021 -37445605 -34799946 -22590531 -12116588 -4363793
38925d363793O569861M977099L304640K760912L361633M868505O362739N698446
38917C3540042J975790k971145o647449p207628l723913Q33475l28941q100135
38909G370096j1645453k549314Q718715M775049j1248895j7718482p038645K894809
38901b6442120j913574r196176j258910J6494409K4684268J7560698M433388q996004
38893A5365979k2213694k6609730j0684780J8299313L4464972K2793559k387939
38886B9027680j6220696j2514407m942160m039954m986832n58569M526526K053286
38878g655126k271381N200823K0551948K0325325l775804k4868522j5760457Q554560
38870C01366J1107133j0158245j9850092k935649J2718379O207805j897211Q768945
$$ plain form
38925 -4363793 2206068 7183167 10487807 13248719 16610352 21478857 27841596 33540042
38917 33540042 35515832 32544687 25897238 18689610 14965697 15799172 15470231 7370096
38909 7370096 -4275357 -6824671 1894044 6669093 -4579802 -22298284 -29336929 -26442120
38901 -26442120 -28355694 -37551870 -38810780 -22316371 2367897 19928595 24361983 15365979
38893 15365979 -6847715 -33457445 -44142225 -25842912 8622060 31415619 29027680
38886 29027680 12806984 292577 -4649583 -8689537 -13676369 -14234938 -9708412 -7655126
38878 -7655126 -9926507 -4725684 15826264 36151589 32375785 7507263 -8253194 301366
38870 301366 11408499 1250254 -18599838 -21535487 -8817108 -2609303 -4506514 4262431
38862D262431J6434907n246146l3546538k6439650Q875014K6304011J4064789
38855D708818N978411J5649642J3320608j4306786l1922576j2669303J5290076
38848c951110J5502947Q47987K428935J0184503n911662l3755845l1597422K851774
38840d3399893K6610919J7927137J109175l515174p074718j3679308j517788L0894410
38832G354760M1654469N136812l8602047l6599593n74432J5474635l92572q613713
38824a5161681R313588K2286803O993184j2729439q658992N847107L312220j0560218
38816F42572j0756960K014903M060804j0113749j9901602j2321816J625301Q447307
38808c6303240R656524J1677477J3487569J0441840Q80752j2489042j9769935
$$ plain form
38862 4262431 20697338 15451192 -18095346 -44534996 -35659982 -9355971 4708818
38855 4708818 10687229 26336871 39657479 25350693 -6571883 -19241186 -3951110
38848 -3951110 11551837 12399824 14828759 25013262 19101600 -14654245 -46251667 -43399893
38840 -43399893 -16788974 1138163 2247338 -1267836 -8342554 -22021862 -23539650 7354760
38832 7354760 49009229 54146041 15543994 -21055599 -21630031 -6155396 -6547968 -15161681
38824 -15161681 -5848093 16438710 23431894 10702455 2043463 7890570 11202790 642572
38816 642572 -10114388 -8099485 -4038681 -14152430 -34054032 -46375848 -44750547 -36303240
38808 -36303240 -26646716 -14969239 -1481670 8960170 9840922 -2648120 -22418055
38801b2418055p608014K0914123L7023821J7163008k0075269l1891361p523248
38794a4414995J9150076J8756900Q88825j1224084j2648687o883819R131148K7854029
38786C0609393K3323349j1742419m1275747k9930912M425557J7381018M436496
38779b773265K98336J7104521K7275814J3123271p624183j7597807k3567873k9023659
38771b2784845j8917176P588549K1819664P849428q539251l49420J7045180J3444205
38763A7156334o913208j6952047j0784095k348848O347610K0783845K8208931
38756C5498522J2885570r214928q026141J0895755J2382986j0710168k5069519
38749A8642077j0614161J0822269J4849304Q341163M851631k970250k1792460
$$ plain form
38801 -22418055 -30026069 -9111946 27911875 45074883 24999614 -6891747 -14414995
38794 -14414995 4735081 23491981 24380806 13156722 508035 -6375784 2755364 30609393
38786 30609393 53932742 42190323 914576 -29016336 -24590779 -7209761 -2773265
38779 -2773265 -2474929 14629592 41905406 55028677 47404494 29806687 6238814 -22784845
38771 -22784845 -41702021 -34113472 -12293808 -4444380 -12983631 -13333051 3712129 17156334
38763 17156334 10243126 -6708921 -17493016 -19841864 -13494254 7289591 35498522
38756 35498522 48384092 39169164 31143023 42038778 54421764 43711596 18642077
38749 18642077 8027916 18850185 33699489 42040652 46892283 43922033 22129573
38742B2129573l2895528j7325777R767338J6970323K19882j4976819j0782179
38735b6893187L737481J0540155M300268o496216j1031656o392816M66593J764539
38727c0004839p14010N96261O551677J1058257J1384709Q222659r67827j4568933
38719h442046j7882443j759791J3897347K375255k3723463k2056711J4744602
38712d2847250L9959872J8157165k2783025l2748745o757512K0093465K5681901
38705a244129J6351790K776701q406806p684282N336283J1750795m44797j2702555
38697E733000n134075O720070j820746j6198367k733540L0081455L7135554O510601
38689F0293952k2004465j9330749n214862n854446j1902555l730620J1461074
$$ plain form
38742 22129573 -10765955 -28091732 -18324394 -1354071 -1134189 -16111008 -26893187
38735 -26893187 -23155706 -12615551 -8315283 -14811499 -25843155 -32235971 -31769378 -30004839
38727 -30004839 -30718849 -30122588 -23570911 -12512654 -1127945 7094714 6126887 -8442046
38719 -8442046 -26324489 -28084280 -14186933 -11811678 -35535141 -57591852 -42847250
38712 -42847250 -2887378 15269787 -7513238 -40261983 -47019495 -26926030 -1244129
38705 -1244129 15107661 17884362 9477556 1793274 7129557 18880352 18435555 5733000
38697 5733000 598925 7318995 5498249 -10700118 -13433658 16647797 53783351 60293952
38689 60293952 38289487 18958738 13743876 7889430 -4013125 -7743745 3717329
38682C717329J4886995P279521J030689j842655m179305k301988K538393j613494
38674A9515485j5028928j6809001L336268K2436829J5564131o047721j2300124
38667A0666939K008754J4505807Q754820j0343952k8695765l3409887j8389474
38660e4902758N408974J5418762P545574N668691K3052830L3893552J0889963
38653D6975588k5835260l3057333p923271J2263974J0857112R871226K0892298
38646C4044334K1407785j641836k2153336j4708377N019584Q626184N36928L330544
38638C4461810J4383375J1693915n406246j4772914q945749l517605n576008k818527
38630A9502051Q616358J2167228j177305j5124891j2824662j220011M588869N289165
$$ plain form
38682 3717329 18604324 25883845 26914534 25071879 20892574 18590586 21128979 19515485
38674 19515485 4486557 -12322444 -8986176 13450653 29014784 22967063 10666939
38667 10666939 12675693 27181500 35936320 25592368 -3103397 -36513284 -54902758
38660 -54902758 -49493784 -34075022 -26529448 -20860757 2192073 36085625 46975588
38653 46975588 21140328 -11917005 -19840276 -7576302 3280810 13152036 34044334
38646 34044334 55452119 53810283 31656947 16948570 21968154 30594338 31131266 34461810
38638 34461810 48845185 60539100 55132854 40359940 31414191 27896586 22320578 19502051
38630 19502051 28118409 40285637 39108332 23983441 11158779 9938768 14527637 19816802
38622A9816802Q659370J0596773L929227m009393k377653K232855l682811j4799372
38614B0365798j4145404l570284k758073j5143952j8975007p89906K2990270K9436882
38606A7410324J7429927J203511r496059j1286722l176113P380320P273064k667845
38598B4070407n194248N387869J0682065j359905j2990011m813967J0399462Q593276
38590C4774948n036861o996274K598976K862839p086534n890665Q813763J2180600
38582C6220792n693502k1776989j7723008o338136m112269l862708N631265J5377453
38574b277102J2825643M316363N47182l263575j2272641j4425157j210237R886436
38566e873088M88160j3898394m964065J9744957K3271946l609532k4717962j0116509
$$ plain form
38622 19816802 28476172 39072945 43002172 38992779 36615126 38847981 35165170 20365798
38614 20365798 6220394 2650110 -107963 -15251915 -34226922 -35016828 -12026558 17410324
38606 17410324 34840251 36043762 26547703 15260981 12084868 19465188 26738252 24070407
38598 24070407 18876159 24264028 34946093 33586188 20596177 15782210 26181672 34774948
38590 34774948 29738087 22741813 25340789 28203628 21117094 15226429 24040192 36220792
38582 36220792 30527290 8750301 -8972707 -15310843 -19423112 -23285820 -17654555 -2277102
38574 -2277102 10548541 14864904 15412086 12148511 -124130 -14549287 -15759524 -5873088
38566 -5873088 -5384928 -19283322 -24247387 -4502430 18769516 15159984 -9557978 -19674487
38558a9674487K1021842K8371299M392242k1369792k4796681j3005983n046244
38551c0107804l535897K779674J5255960J9157606N041898j5068036k2526005
38544b9002604j5965762q133507l556161M646728J5706592J6754624L507416r569710
38536b5612384q345226L606468J4573356J9848125J8967603R994815l211461q785676
38528B1035620k646421L079461k320591j1882639j3116311o673555j099681K036975
38520a1587142N164887M640358l239028j1552681r584428L386611J8585120K6086588
38512B1900285J7737213p291041l2703808l4194963q777741J7586513K2273870
38505c469672J1825518L748740o82875q669517j5830505j3397924m432837M233964
$$ plain form
38558 -19674487 1347355 29718654 34110896 12741104 -12055577 -25061560 -30107804
38551 -30107804 -33643701 -30864027 -15608067 3549539 8591437 -6476599 -29002604
38544 -29002604 -44968366 -53101873 -56658034 -52011306 -36304714 -19550090 -16042674 -25612384
38536 -25612384 -33957610 -30351142 -15777786 4070339 23037942 33032757 29821296 21035620
38528 21035620 18389199 21468660 19148069 7265430 -5850881 -12524436 -13624117 -11587142
38520 -11587142 -6422255 -1781897 -5020925 -16573606 -26158034 -22771423 -4186303 21900285
38512 21900285 39637498 32346457 -357351 -34552314 -43330055 -25743542 -3469672
38505 -3469672 8355846 12104586 11421711 2752194 -13078311 -26476235 -30909072 -26675108
38497b6675108J4087634K2672416J5396449j0030268k7823973j7261189M442599
38490b5191440R801506M996614J2709164K5208791J5024857j3756637k6839008
38483A953847j3219091K725208O644983J0904401J7291128N189242k5815857l9506799
38475c3832938j3118770K5791433L6971589J8092700m969373j6643195j6769996
38468d478550n446048J2702297K1150562R266321j0894435k0398407j6386971
38461a4485231p848842r30923O06406n963476j2839503n740945J3275745K4391196
38453i535573K0252408J6219319J9470195J3524740r505033k7201141k0062207
38446C162708l383900n55118n788168j837625M588811k421557j3004211n942351
$$ plain form
38497 -26675108 -12587474 10084942 25481391 15451123 -12372850 -29634039 -25191440
38490 -25191440 -15389934 -10393320 2315844 27524635 42549492 28792855 1953847
38483 1953847 -11265244 -8540036 -1895053 9009348 26300476 31489718 5673861 -33832938
38475 -33832938 -46951708 -21160275 15811314 33904014 28934641 12291446 -4478550
38468 -4478550 -9924598 2777699 23928261 33194582 22300147 1901740 -14485231
38461 -14485231 -22334073 -23264996 -22658590 -28622066 -41461569 -47202514 -33926769 -9535573
38453 -9535573 10716835 26936154 46406349 59931089 50426056 23224915 3162708
38446 3162708 -221192 -776310 -6564478 -8402103 -3813292 -6234849 -19239060 -25181411
38438b5181411J1952291J5384805L250150k215555M243730N129636m878862j0435881
38430b751097n337611j368499l353579l156529j798704q878049j6579028n703538
38422d8926634J6435229J8283306m927666j7682016J127754K4469278K2096555
38415A0875806P159094O183438R344159r063568l6478359l2926834N524491L4936413
38407d445360K4502613m111819j4297997m344376K569948J37264L292403J5541502
38399A8844178J7704348k252532k5016376k1414726P112247K6197528J1609368
38392C2784035j8839682k9008388j2059442L931986j671233j4431742j0099142
38385d9393608Q309235J6307634M050487j0970205q024102J2570987L1899646
$$ plain form
38438 -25181411 -13229120 2155685 5405835 3190280 7434010 12563646 7684784 -2751097
38430 -2751097 -8088708 -9457207 -12810786 -15967315 -17766019 -26644068 -43223096 -48926634
38422 -48926634 -32491405 -14208099 -19135765 -36817781 -35690027 -11220749 10875806
38415 10875806 18034900 24218338 33562497 24498929 -11979430 -44906264 -39381773 -4445360
38407 -4445360 20057253 15945434 1647437 -2696939 -126991 10273 3302676 18844178
38399 18844178 36548526 34295994 9279618 -12135108 -5022861 21174667 32784035
38392 32784035 13944353 -15064035 -27123477 -23191491 -24862724 -39294466 -49393608
38385 -49393608 -41084373 -24776739 -20726252 -31696457 -39720559 -27149572 4750074
38378D750074L1552591R770328j5668719k3015181j0995184j843536j0803362
38371a6252989k1406170p956664K3059944L7126276J9076852p788579j7900017
38364G958653j4461781j0260161j623639J5414171K2098404N41419k9570049l0322165
38356d0225148j34608K2473267J4301803l743272m239856Q231755J3367509P765937
38348A7797387J411120j996526k420232M378341J4221833R430772j3629289k8166387
38340A027019j2981179J0199747O452525j6455774j9698535K371990J2487172
38333a6597035o129546j9289114K872928L5752420L7437379J0973184p047554
38326C7972662n297858o232977j9214996k2732966k405881K2484842K5665412
$$ plain form
38378 4750074 36302665 46072993 30404274 7389093 -3606091 -5449627 -16252989
38371 -16252989 -37659159 -45615823 -22555879 14570397 33647249 25858670 7958653
38364 7958653 -6503128 -16763289 -18386928 -2972757 19125647 19667066 -9902983 -40225148
38356 -40225148 -40359756 -17886489 -3584686 -7327958 -11567814 -3336059 10031450 17797387
38348 17797387 19208507 17211981 14791749 19170090 33391923 42822695 29193406 1027019
38340 1027019 -11954160 -1754413 4698112 -11757662 -31456197 -29084207 -16597035
38333 -16597035 -22726581 -42015695 -39142767 -3390347 34047032 45020216 37972662
38326 37972662 32674804 26441827 7226831 -15506135 -17912016 4572826 30238238
38319C0238238P813686j0829777j7779574j4216860m357076O496351R766945K879772
38311A0011705k984732L512917J4978396J2744523o157896k2142327j8078714
38304h116128j234874P309056j222044j5979185k1725611j3379291L153777J7078786
38296c4115514J9457595J0529018J337519K363483R817758R484067m434990k0784216
38288f345280k4122473j0459053J0999299K5448980K1286333N61581j6909839
38281D59548j0826663J3062583K5270484R405220j4992175j8094885J770462K0175248
38273B6229822K0205284P312759o577947j6707887k1096180j6619966m847768
38266a2101883O347013J0099203M668982p693254j9024100j6971477J518873K0440570
$$ plain form
38319 30238238 38051924 27222147 9442573 -4774287 -9131363 -2635012 7131933 10011705
38311 10011705 7026973 10539890 25518286 38262809 32104913 9962586 -8116128
38304 -8116128 -9351002 -2041946 -3263990 -19243175 -40968786 -54348077 -51194300 -34115514
38296 -34115514 -14657919 -4128901 -2791382 -427899 9389859 18873926 14438936 -6345280
38288 -6345280 -30467753 -40926806 -29927507 -4478527 16807806 17369387 459548
38281 459548 -10367115 2695468 27965952 37371172 22378997 4284112 6054574 26229822
38273 26229822 46435106 53747865 47169918 30462031 9365851 -7254115 -12101883
38266 -12101883 -5754870 4344333 9013315 1320061 -17704039 -34675516 -33156643 -12716073
38258a2716073K0649540M850230n394952J583855J3729340J3274345j165011j5027242
38250A9784032j4818614k104899P439143J025867j3909675j6879495k303077J1698648
38242a0068070J0027299J208063j389158k456942j0011902j3380121p61441J3582865
38234a3249407Q414615p308686p840361N408455Q513487K99108L253639J6746648
38226A4237498J2571208j2050222k0823454K597272K2941520Q150061j9822926
38219G800957k2334223l180743O728879K456271L776235J3315529J3149249r04888
38211B0807266j2442925j1426995m100436K579022O426716L209397p567299j4649188
38203a7164442r181458K09104K560692M182248J3661821J9019428M762660j6268860
$$ plain form
38258 -12716073 7933467 12783697 7388745 8972600 22701940 35976285 34811274 19784032
38250 19784032 4965418 2860519 10299662 11325529 -2584146 -19463641 -21766718 -10068070
38242 -10068070 -40771 1167292 -221866 -2678808 -12690710 -26070831 -26832272 -13249407
38234 -13249407 -4834792 -12143478 -19983839 -14575384 -6061897 -5762789 -2509150 14237498
38226 14237498 26808706 14758484 -6064970 -3467698 19473822 27623883 7800957
38219 7800957 -14533266 -17714009 -10985130 -8528859 -4752624 8562905 21712154 20807266
38211 20807266 8364341 -3062654 -7163090 -4584068 1842648 5052045 -2515254 -17164442
38203 -17164442 -26345900 -26136796 -23576104 -19393856 -5732035 13287393 18050053 1781193
38195A781193j6081193N541573J8698734P242990r940703r679476L910321J0785034
38187A2258473M611850k451416p2240N753727K010937j0935806j6092146k445697
38179g362318J6776474K0774414J0061889Q91317m313060j5952807k7382735j7560163
38171b4066989R294672K0146893K905205j3884489r112623j389897r008087j4128476
38163c9243791M53499J2825683j6992j5442286j940482K2001751J6283344j1305894
38155a6385168j7615619L486342J5104483J784154j1003837n588486N800589J3152008
38147a1265534K0529737K1217176K868116j8068644j0073847J9414030K7701283
38140E2322317K656986k0039757j6449028n616713o149128o267494L050265O349172
$$ plain form
38195 1781193 -14300000 -8758427 9940307 17183297 7242594 -2436882 1473439 12258473
38187 12258473 16870323 14418907 14346667 20100394 22111331 11175525 -4916621 -7362318
38179 -7362318 9414156 30188570 40250459 41141776 36828716 20875909 -6506826 -24066989
38171 -24066989 -14772317 5374576 8279781 -5604708 -14717331 -16107228 -25115315 -39243791
38163 -39243791 -38790292 -25964609 -25981601 -41423887 -43364369 -21362618 -5079274 -16385168
38155 -16385168 -34000787 -30514445 -15409962 -13625808 -24629645 -30218131 -24417542 -11265534
38147 -11265534 9264203 30481379 33349495 15280851 5207004 24621034 52322317
38140 52322317 54979303 34939546 18490518 12873805 6724677 457183 3507448 9856620
38132I856620k956628n175234Q073203J4874028K784987q441909n352171m782371
38124H880525j5866265j6430647M886405K0159062P556732r418152k743132J2050235
38116I074763O465740j0387650j2157803l150502m722109j1786614l818100J3357531
38108a7124744J5431921R81015r450795q682692o099406k534840Q048469J7452624
38100a978448J1661075m055396j2249254r297054l252026M169059J1980721R590662
38092F569339m408490q751660Q249517K0369716N61551k9062010k4315553J2170281
38084a8617309L1775749J0657320k0189754k3920745l041825J6571941K0211003
38077A3446380J0080676m000912r729199k307465O440153J881409j1492818j6812933
$$ plain form
38132 9856620 6899992 1724758 9797961 24671989 27456976 19015067 13662896 8880525
38124 8880525 -6985740 -23416387 -18529982 1629080 9185812 -232340 -2975472 9074763
38116 9074763 15540503 5152853 -7004950 -10155452 -14877561 -26664175 -30482275 -17124744
38108 -17124744 -1692823 -711808 -10162603 -18845295 -24944701 -27479541 -19431072 -1978448
38100 -1978448 9682627 5627231 -6622023 -15919077 -19171103 -15002044 -3021323 6569339
38092 6569339 2160849 -6590811 1658706 22028422 22589973 -6472037 -30787590 -18617309
38084 -18617309 13158440 23815760 3626006 -20294739 -23336564 -6764623 13446380
38077 13446380 23527056 19526144 9796945 7489480 13929633 15811042 4318224 -12494709
38069a2494709r967712j104842M275926P377089N010062l869074p508344J672195
38061a6609409Q762995n38477j0040452K734169K2965827J7732135o648194j1175979
38053G182615R222053J4180617j3377870l5072698j8921119R090195R618799q108362
38045b6185770r613935M375217N747104o179756l633822J7104634K4846197M461569
38037A0921438j7351708j3975109K181667M600612m854831m920086O087330R233752
38029h076935J12968l392563N804113R717532k348445j0960540K308104J9774267
38021A2938501J2551214j0968479j5383210N761794K0047613P892337j0785109
38014B2054661j4087494r288775q773755n662856M708539P431688l472170o748624
$$ plain form
38069 -12494709 -22462421 -23567263 -19291337 -11914248 -6904186 -10773260 -18281604 -16609409
38061 -16609409 -7846414 -8384891 -18425343 -15691174 7274653 25006788 18358594 7182615
38053 7182615 16404668 30585285 17207415 -17865283 -36786402 -27696207 -18077408 -26185770
38045 -26185770 -35799705 -31424488 -25677384 -31857140 -35490962 -18386328 6459869 10921438
38037 10921438 -6430270 -20405379 -18223712 -13623100 -18477931 -23398017 -17310687 -8076935
38029 -8076935 -7963967 -11356530 -5552417 4165115 1816670 -9143870 -6835766 12938501
38021 12938501 25489715 14521236 -861974 4899820 24947433 32839770 22054661
38014 22054661 7967167 -1321608 -10095363 -15758219 -11049680 -3617992 -7090162 -13838786
38006a3838786Q970768J8123460K3242k0783806j4060385L285904r74207j4015507
37998c3269317k819112J9007987J0703335j8138867j6058600K1464690L9541552
37991B0431668J4101215j2186109q024620k092102j8434656k5151907M297218
37984b7059293L1183596J0844871k8064868k6481717J0455852K6539020O861544
37977D279005p733863L828650J3711655J163130j4256050j2033518j371671N308615
37969g104047J3527167K2785548J4267585j5362368l5588639k2669453K784192
37962b7360015N808948j0574764j2548492J0682837K9563369J7587650r593277
37955C566256j4699975J0152155L1491622J8479021j5312765k9560528j1296823
$$ plain form
38006 -13838786 -4868018 13255442 13278684 -7505122 -21565507 -18279603 -19253810 -33269317
37998 -33269317 -36088429 -17080442 -6377107 -24515974 -40574574 -19109884 20431668
37991 20431668 34532883 22346774 14322154 12230052 -6204604 -31356511 -27059293
37984 -27059293 4124303 14969174 -13095694 -39577411 -29121559 -2582539 4279005
37977 4279005 -3454858 373792 14085447 15248577 992527 -11040991 -12412662 -7104047
37969 -7104047 6423120 29208668 43476253 28113885 -7474754 -30144207 -27360015
37962 -27360015 -21551067 -32125831 -44674323 -33991486 -4428117 13159533 3566256
37955 3566256 -11133719 -981564 30510058 48989079 33676314 4115786 -7181037
37948g181037R938081O602691r187859r093014P276681J5789903P225807k592431
37940A8778822j607573L208451L471655J692558L5887m856746r467409l816576
37932G439069Q585337J0019178k875504r664718J375640J1245161J55232j7441089
37924H838306j3500061P725521J3512453p825628k8500573k0521932P575366K5333846
37916g362702J7598678m535820k0408139j7562107J97438J5330119J3438194J303631
37908b000708j602363P523050R722029l447563j1867185J630384J8643198R996454
37900B8597296j6518697k4154930k698808J6055372P624770j0018812q769286
37893i883095O044092R348076j520523o154543K713455Q482323n95152j2701793
$$ plain form
37948 -7181037 2757044 9359735 171876 -8921138 -1644457 14145446 21371253 18778822
37940 18778822 17171249 20379700 23851355 25543913 25579800 20723054 11255645 7439069
37932 7439069 16024406 26043584 23168080 13503362 14879002 26124163 26279395 8838306
37924 8838306 -4661755 3063766 16576219 8750591 -19749982 -40271914 -32696548 -7362702
37916 -7362702 10235976 5700156 -14707983 -32270090 -32072652 -16742533 -3304339 -2000708
37908 -2000708 -3603071 3919979 13642008 10194445 -1672740 -42356 18600842 28597296
37900 28597296 12078599 -12076331 -14775139 1280233 8905003 -1113809 -9883095
37893 -9883095 -3839003 5509073 3988550 -2165993 547462 9029785 8434633 -4267160
37885d267160j1142106J588633Q737152K504950o275080k559799J2380301J9982122
37877B0949013P909815j0575396j2160897L008712J0450529r24260j0387444J133678
37869I403750J7463648R845061j7660518l1837929j7317787M879888J0203246
37862a5020641J053692m436552J230023J0635721J5040561J3107901Q588450L589445
37854C3788600m624681j6965148k3554138j2412776Q586396J3928894m203073
37847e455926j9493689q173486J4032888J6273381M65411o438429o3219j712039
37839a0565108j3331422q474685K0296192M0239314K4534340p418060j8376422
37832B6904149k763878J3788628J1313678o343814k1492218j8497194J558429
$$ plain form
37885 -4267160 -15409266 -13820633 -5083481 -2578531 -8853611 -11413410 966891 20949013
37877 20949013 28858828 18283432 6122535 9131247 19581776 18657516 8270072 9403750
37869 9403750 26867398 36712459 19051941 -12785988 -30103775 -25223887 -15020641
37862 -15020641 -13966949 -18403501 -17173478 -6537757 8502804 21610705 30199155 33788600
37854 33788600 29163919 12198771 -11355367 -23768143 -15181747 -1252853 -5455926
37847 -5455926 -24949615 -33123101 -19090213 -2816832 -2351421 -8789850 -8853069 -10565108
37839 -10565108 -23896530 -32371215 -12075023 28164291 52698631 45280571 26904149
37832 26904149 24140271 37928899 49242577 42898763 21406545 2909351 4467780
37825D467780J6002103L925810k1768595k5936311j027044K0151836J3127616
37818H943195m952441q993067m356342n685098l190336J6312065L3605073K0126695
37810E1809744j3580092k9911676j9887994r484495j0288618l134531J9312664
37803a5164998L0120330Q313607k4939608l4072013j6328664J722054M923879
37796d5425413M156908J1995502K2777929K2814919R740039n799593j3819380
37789F440911j4295066j2735508j1102252o574653K448853J3198709K0976329
37782a642677K1263802J1333219m519499j3628422p717623L715947L581191q490475
37774C895463j4771874n384476Q356335J2045327N501299m954923j6139998k0462360
$$ plain form
37825 4467780 20469883 24395693 2627098 -23309213 -24336257 -4184421 8943195
37818 8943195 3990754 -5002313 -9358655 -15043753 -18234089 -1922024 31683049 51809744
37810 51809744 38229652 8317976 -11570018 -21054513 -31343131 -34477662 -15164998
37803 -15164998 14955332 23268939 -1670669 -35742682 -52071346 -50349292 -45425413
37796 -45425413 -41268505 -29273003 -6495074 16319845 26059884 20260291 6440911
37789 6440911 -7854155 -20589663 -31691915 -38266568 -35817715 -22619006 -1642677
37782 -1642677 19621125 30954344 26434845 12806423 5088800 8804747 12385938 3895463
37774 3895463 -10876411 -16260887 -7904552 4140775 9642074 4687151 -11452847 -31915207
37766c1915207n554000K3946465L8937076J8968066j6807963l0782762j3013942
37759a6222267J1733100J9307212J0796825J432960n91335n5008n978800j8340352
37751B082335k3675297j0827440R507735J5241908M971468n91716M669366O82499
37743B060858j9547512k8886466q887780J4374531J0595489l093008P731211L1605562
37735E952885K7453332m785423k2469094j0207184J522877l260633q14475J8488392
37727A1880677K3411439j666365k0453376k761195K1241248R474039k1592560
37720A9533907k5625013l099518N429415q480529j1749117O471475J5467367M9465
37712b002548j0979538M679210K3826904J7312244l107677r365736m380571r339866
$$ plain form
37766 -31915207 -37469207 -13522742 25414334 44382400 27574437 -3208325 -16222267
37759 -16222267 -4489167 14818045 25614870 27047830 26456495 26401487 20422687 2082335
37751 2082335 -21592962 -32420402 -22912667 -7670759 -2699291 -3291007 1378359 2060858
37743 2060858 -17486654 -46373120 -55260900 -40886369 -30290880 -33383888 -25652677 5952885
37735 5952885 33406217 28620794 6151700 -4055484 -2532607 -5793240 -6607715 11880677
37727 11880677 35292116 33625751 13172375 10411180 31652428 41126467 19533907
37720 19533907 -6091106 -9190624 -3761209 -12241738 -23990855 -17519380 -2052013 -2002548
37712 -2002548 -12982086 -8302876 15524028 32836272 29728595 20362859 15982288 6642422
37704F642422j9679817j2237193R139186J3526318o277894j7911133P16996K5020373
37696a060742K0538739m720081j4509553r94323N862039j0922011k5808180r013935
37688d0628047K6180113L8699420J4813625j5830784k2074298q958598k458581
37681a0257150j0013431j3785044j114358J5016562J4040773l202307j5649734
37674b4964689r951784M740361J2422096R472243K028228n681666j0723517p603792
37666c0262520K849707P668308r67783q889185J649134K0883180K1248550j009256
37658A3170135j8480124j3287540m43870J131516k815420O48291N965597J606713
37650a2504702o967376p233339l95878N567077J0517257J2857340K349955j7719716
$$ plain form
37704 6642422 -13037395 -25274588 -16135402 -2609084 -8886978 -26798111 -26081115 -1060742
37696 -1060742 19477997 14757916 248363 -745960 5116079 -5805932 -31614112 -40628047
37688 -40628047 -14447934 24251486 39065111 23234327 1160029 -7798569 -10257150
37681 -10257150 -20270581 -34055625 -35169983 -20153421 -6112648 -9314955 -24964689
37674 -24964689 -34916473 -30176112 -17754016 -8281773 -6253545 -11935211 -22658728 -30262520
37666 -30262520 -27412813 -19744505 -20712288 -29601473 -27952339 -7069159 14179391 13170135
37658 13170135 -5309989 -18597529 -19041399 -17909883 -20725303 -20077012 -14111415 -12504702
37650 -12504702 -19472078 -26705417 -27101295 -21534218 -11016961 1840379 4190334 -13529382
37642a3529382k0663786N252401K8058923J4745305j4258610j3706246J4418977
37635C17582K4170286o12203k4697765k2042256j0308174p450166J323857K6211543
37627a3087296M0408542J9551879j3250564j7556723O233868K1902115J0508300
37620E4710121j0997385j9986922j3097668j464459K796190l776209j1169036
37613b985368o769674M203660L006136j1480309j6014456M24674J5540463P719322
37605f355552r511197j0190530M245275J3459535J2333317R463674K956891j3458657
37597B942756k7343981j9259320N265097K0942772J7893206Q254091R47485n689626
37589C952480q533994k282565L548192m360891j5777347q083891J3793573J8921750
$$ plain form
37642 -13529382 -34193168 -28940767 -881844 13863461 -395149 -14101395 317582
37635 317582 24487868 23875665 -822100 -22864356 -33172530 -40622696 -39298839 -13087296
37627 -13087296 27321246 46873125 33622561 16065838 22299706 44201821 54710121
37620 54710121 43712736 23725814 10628146 9163687 11959877 8183668 -2985368
37613 -2985368 -9755042 -5551382 -2545246 -14025555 -30040011 -29615337 -14074874 -6355552
37605 -6355552 -15866749 -26057279 -21812004 -8352469 3980848 13444522 16401413 2942756
37597 2942756 -24401225 -43660545 -38395448 -17452676 440530 8694621 9642106 3952480
37589 3952480 -4581514 -6864079 -3315887 -7676778 -23454125 -31538016 -17744443 1177307
37581A177307j384632j7214722n195650J6929634J9025102P96941j4930923j6299756
37573a7096699r877440l266302K087777M999779M331126K332222P52550k138653
37565a7875640n561171l824209M736555J3085181J4650828J0814682N674194L34216
37557B2034636m598131p816788j0191922j1593460o194465Q548656K0529072J5317008
37549B6034606q35244p846184k710406k685884j3054761j5526260K25752J6300244
37541i8137J3972361J503900m347283o444437j3971706j6346971J295058K4601384
37533A64169K2236811p299040k8274836j5360850J2582445J8903579m370203l0063926
37525c1481851k9952141m366275K2301126K9388552J9315372R124009P662634
$$ plain form
37581 1177307 -207325 -17422047 -22617697 -5688063 13337039 14133980 -796943 -17096699
37573 -17096699 -26974139 -30240441 -28152664 -23152885 -18821759 -16489537 -15736987 -17875640
37565 -17875640 -23436811 -27261020 -22524465 -9439284 5211544 16026226 21700420 22034636
37557 22034636 17436505 9619717 -572205 -12165665 -18360130 -9811474 10717598 26034606
37549 26034606 25199362 17353178 14642772 11956888 -1097873 -16624133 -16398381 -98137
37541 -98137 13874224 15378124 11030841 4586404 -9385302 -25732273 -24437215 164169
37533 164169 22400980 15101940 -13172896 -28533746 -15951301 2952278 -1417925 -31481851
37525 -31481851 -61433992 -65800267 -43499141 -14110589 5204783 14328792 21991426
37518B1991426Q307409L031967o660549j5410391k0351741j8565888r494236k652188
37510c9804191q175344j6331331o693945J5606889J9442999k199924j2651379
37503e0806226J2203794L8928244K5998598p521043j2507705P796536N468708
37496A9560906k5242665l4021704j014775K6561658J2751033j0331016l860046
37489a5596609J1245524J24555j6540423K21004L0676925K3279637j6780627l3131980
37481a6501994r477287J0354938J632686n722950R094316J7176555m357953k4117349
37473b1919038m784594L4225968M4364933J6591025j5297223k5575361j7543954
37466A0061756l496894O765409L615909j1879452k0748155r319794Q609638J2061940
$$ plain form
37518 21991426 30298835 33330802 26670253 11259862 -9091879 -27657767 -37152003 -39804191
37510 -39804191 -47979535 -64310866 -71004811 -55397922 -35954923 -38154847 -50806226
37503 -50806226 -38602432 325812 26324410 18803367 6295662 14092198 19560906
37496 19560906 -5681759 -39703463 -40718238 -14156580 -1405547 -11736563 -15596609
37489 -15596609 -4351085 -4226530 -20766953 -20545949 10130976 33410613 16629986 -16501994
37481 -16501994 -25979281 -15624343 -13991657 -19714607 -10620291 6556264 2198311 -21919038
37473 -21919038 -26703632 7522336 51887269 68478294 53181071 27605710 10061756
37466 10061756 6564862 13330271 16946180 5066728 -15681427 -25001221 -16391583 -4329643
37458d329643M578812L654353Q573207L961030j0411669j8246966j3061699m081818
37450b9364393K529614P961248Q297482j403107j1284896n525140J1935842J9559139
37442B705789P964821r753762j8636073j5818160l279332J5198395K7218655J9296087
37434B4896420l969824k1750742k1089607p835095N781004J1707491O627240l654724
37426i287837l707158J2115084K5085959J5470418o121241j3953717p819263r644188
37418B138057k1574579k0821970j197643J3784891R700412J389617J194594j400577
37410a6787198j1505866j1544933N868519J6772660L499069j2634372n648571
37403c1980692J1249433R639520m828851m419040J0747535J3168010m477471j7667085
$$ plain form
37458 -4329643 249169 3903522 12476729 16437759 6026090 -12220876 -25282575 -29364393
37450 -29364393 -26834779 -18873531 -10576049 -11979156 -23264052 -28789192 -16853350 2705789
37442 2705789 10670610 916848 -17719225 -33537385 -36816717 -21618322 5600333 24896420
37434 24896420 20926596 -824146 -21913753 -29748848 -23967844 -12260353 -5633113 -9287837
37426 -9287837 -12994995 -879911 24206048 39676466 33555225 19601508 11782245 2138057
37418 2138057 -19436522 -40258492 -41456135 -27671244 -17970832 -16581215 -15386621 -16787198
37410 -16787198 -28293064 -39837997 -33969478 -17196818 -13697749 -26332121 -31980692
37403 -31980692 -20731259 -11091739 -15920590 -20339630 -9592095 3575915 -901556 -18568641
37395a8568641r703599O646369J4063506J3173221J2002994J1171772O934829
37388C5720451k840981j7571601k9189170k3654765k69998J8865097J5619755
37381c321212K177498k07597L049042o234230j8913053r033784J6946590K2092241
37373F555495j438800j5457636L355837K3451878P838189k6459312l4006211p245763
37365d3406323J9879130K5428826K0415269J6783687Q501641o450164j2888757
37358B8263309k667232P016411k681163k1776469k2995969L62700K4579835K5520727
37350C5622149N960750j2284125j4246899k509384J1316137J6555299Q632199
37343D9046126n830143j1039194J21167J1808798K699734k1516617l0990718j3157419
$$ plain form
37395 -18568641 -28272240 -21625871 -7562365 5610856 17613850 28785622 35720451
37388 35720451 32879470 15307869 -13881301 -37536066 -37806064 -18940967 -3321212
37381 -3321212 -1143714 -1351311 1697731 -4536499 -23449552 -32483336 -15536746 6555495
37373 6555495 5116695 -10340941 -6985104 16466774 24304963 -2154349 -36160560 -43406323
37365 -43406323 -23527193 1901633 22316902 39100589 47602230 41152066 28263309
37358 28263309 25596077 32612488 29931325 8154856 -14841113 -14478413 10101422 35622149
37350 35622149 41582899 29298774 15051875 12542491 23858628 40413927 49046126
37343 49046126 43215983 32176789 32297956 44106754 46806488 25289871 -5700847 -18858266
37335a8858266Q349907Q762657l136469m690751K805686J807694o388224l740483
37327a5088249J0148328J4658583K152637j0804682j1878822q412235p318987
37320b6543427l060774N016695N486931m306077j0648648o978477l974250n729177
37312e0737204L96064J6310648K0762387L352365j2747306n163993J2055572J3486189
37304b285278L480515K027816N902350j368941j1717025k370748K0383678K4979115
37296C9031482M879500j0603534l892570N583888l034924j9672446k3137095j1283934
37288b2129633M042160J3901731J1912999l920156j7882382o888354K2425360
37281A461725L1202002J698721l1121300k6815742K819739J5354223K120521o547884
$$ plain form
37335 -18858266 -10508359 -1745702 -4882171 -9572922 -6767236 -4959542 -11347766 -15088249
37327 -15088249 -4939921 9718662 11871299 1066617 -10812205 -19224440 -26543427
37320 -26543427 -29604201 -24587506 -19100575 -23406652 -34055300 -41033777 -45008027 -50737204
37312 -50737204 -50341140 -34030492 -13268105 -9915740 -22663046 -27827039 -15771467 -2285278
37304 -2285278 1195237 3223053 9125403 7756462 -3960563 -6331311 14052367 39031482
37296 39031482 43910982 33307448 29414878 34998766 31963842 12291396 -10845699 -22129633
37288 -22129633 -18087473 -4185742 7727257 3807101 -14075281 -20963635 1461725
37281 1461725 32663727 34362448 3241148 -23574594 -20754855 -5400632 -3280111 -9827995
37273i827995M700728J6113365J2514869P418681J2743097J4050468k775073k2090231
37265C2847909k0638760n179453j600109j2668853j3499267P865269K9017551
37258A6144287K3697704k320785k0725029j7209045l205083N301364N001169n06687
37250F177895q949429j4820460q743560P955246J7529621Q044173o258411l847512
37242b912437J0001693J0388442n440920j0755048N804130J6037371m677329l2454881
37234a4008979k5279143J3518140L8288895K6470145M695984R55663N108710l677561
37226D6071854j7628618j5248116R31677Q567489k810j0615185j1425167m858708
37218d207584K982528Q068726M717935q343827j8841182j2674624N163713J5266388
$$ plain form
37273 -9827995 -5127267 10986098 23500967 30919648 43662745 57713213 54938140 32847909
37265 32847909 12209149 7029696 5429587 -7239266 -20738533 -12873264 16144287
37258 16144287 39841991 37521206 16796177 -412868 -3617951 1683413 6684582 6177895
37250 6177895 -2771534 -17591994 -26335554 -18380308 -850687 7193486 935075 -2912437
37242 -2912437 7089256 17477698 12036778 1281730 7085860 23123231 18445902 -14008979
37234 -14008979 -39288122 -25769982 12518913 38989058 43685042 44640705 49749415 46071854
37226 46071854 28443236 13195120 14126797 22694286 22691476 12076291 651124 -4207584
37218 -4207584 -1225056 6843670 11561605 3217778 -15623404 -28298028 -23134315 -7867927
37210g867927R404876k247663r181768j0764263p256958L232141J4553629J4069020
37202C941087P86403j0257037q064127O76372L913427j37168n818187r055895
37194b4015125p642888r62762N828919N891181K166788M320927J1205412R660222
37186F452674l858824j4971600j2669905m260906J101074Q157298K0274040K3053554
37178B3277405L592492k2571813k6100381l678209J6782142J3309011m560546
37171E0101j2870556k980412J3100755J9396692J1680702m88639n076356j783702
37163B1028585j914034j1134059j8884670j2598211L109653J1973664P879735
37156e39337O2752k926793l707665q067697j4129548j3197016P21544K1716139
$$ plain form
37210 -7867927 1536949 -710714 -9892482 -20656745 -27913703 -24681562 -10127933 3941087
37202 3941087 4727490 -5529547 -13593674 -12917302 -9003875 -9141043 -14959230 -24015125
37194 -24015125 -31658013 -32620775 -26791856 -20900675 -18733887 -14412960 -3207548 6452674
37186 6452674 2593850 -12377750 -25047655 -29308561 -28207487 -20050189 223851 23277405
37178 23277405 26869897 4298084 -21802297 -25480506 -8698364 4610647 50101
37171 50101 -12820455 -15800867 -2700112 16696580 28377282 27888643 22812287 21028585
37163 21028585 19114551 7980492 -10904178 -23502389 -20392736 -8419072 -539337
37156 -539337 -476585 -3403378 -7111043 -15178740 -29308288 -42505304 -41783760 -20067621
37148b0067621L2250625J9388045o225942j7645095m849207J0901540P117791
37141B0870136p878462j0152798K190555Q739984P52158p501415l719577O094081
37133I394662J1057976Q581332L88027q901263p666946R806022K4918865J2318983
37125E9897658j9180923l0159005o640613J5701128L676777k2945695k2496787
37118b2147460N491733K3732072J5761021M103543P052184J1531913J498862j3926455
37110C3097413j8225795j3383663r292292k745871J2374651K4782518J8138539
37103D4745500j214280j0879503n977931l880669j2005819j4560175k180976P475239
37095A521386k331260j6080412p879727J5000749J9714059j676718j9015382r627872
$$ plain form
37148 -20067621 12183004 31571049 25345107 7700012 2850805 13752345 20870136
37141 20870136 12991674 2838876 5029431 13769415 14521573 7020158 3300581 9394662
37133 9394662 20452638 29033970 29421997 20520734 12853788 22659810 47578675 59897658
37125 59897658 40716735 10557730 3917117 19618245 23295022 349327 -22147460
37118 -22147460 -16655727 7076345 22837366 26940909 33993093 45525006 47023868 33097413
37110 33097413 14871618 1487955 -7804337 -10550208 1824443 26606961 44745500
37103 44745500 43531220 32651717 26673786 22793117 10787298 -3772877 -5953853 1521386
37095 1521386 -809874 -16890286 -24770013 -9769264 9944795 8268077 -10747305 -20375177
37087b0375177R819160J2453662K99375n876916j56234O651302Q442070O629459
37079A7886701j037314j4876737k2376761j2095147O229327J4089450J1660717
37072e19764J2747862J6996867J0332846p874927k1310970k1946177j6840762
37065b8415025q493864P512969K1915654J5245005r687509k3745081j1520709
37058c7188560P416262J0584195L917027M738763J2605216J5588621J1227585
37051B8889109M445090l435112r854817p881273J37878N79380q151798q531667
37043c803210N640255J2590136l798124k3384130j7565784P910785K4352933K1881047
37035B3823908J2622394K638229j0297197j7776366q980256N736098P377134J165960
$$ plain form
37087 -20375177 -10556017 1897645 2197020 -3679896 -3836130 2815172 11257242 17886701
37079 17886701 16849387 1972650 -20404111 -32499258 -26269931 -12180481 -519764
37072 -519764 12228098 29224965 39557811 31682884 10371914 -11574263 -28415025
37065 -28415025 -36908889 -29395920 -7480266 7764739 -1922770 -25667851 -37188560
37058 -37188560 -29772298 -19188103 -15271076 -10532313 2072903 17661524 28889109
37051 28889109 33334199 29899087 20044270 12162997 12300875 12880255 4728457 -3803210
37043 -3803210 1837045 14427181 10629057 -12755073 -30320857 -22410072 1942861 23823908
37035 23823908 36446302 39084531 28787334 11010968 2030712 7766810 15143944 16309904
37027A6309904P473839K1868593J7564342q115354k3848602j2265714L663318
37020B2650326j82383j0581361j626495K0807333K6254629L893115k3624889l1067696
37012F522579j8744201n117515j451735j601659M108535J1680455Q314184n382217
37004a671574j0567649L962822K2552818K3013319O737366q103975j4581279j7539666
36996C802182j3672259K921650J8284743J0897654j1312750j6674298R55790J1104574
36988F307286k346471j2902727L592298K5851457J9814989p266391k0086022r631349
36980C333070R25263q41388k421107K630122J188208j2343132k0831610j0047297
36972c8407871Q523816J4687301P095005L66966K080505M769676r39185j2891233
$$ plain form
37027 16309904 23783743 45652336 63216678 55101324 31252722 18987008 22650326
37020 22650326 22467943 11886582 10260087 31067420 57322049 61215164 37590275 6522579
37012 6522579 -12221622 -17339137 -18790872 -20392531 -16283996 -4603541 3710643 -1671574
37004 -1671574 -12239223 -8276401 14276417 37289736 44027102 35923127 21341848 3802182
36996 3802182 -9870077 -6948427 11336316 22233970 10921220 -5753078 -4797288 6307286
36988 6307286 3960815 -8941912 -5349614 20501843 40316832 33050441 12964419 3333070
36980 3333070 4258333 3416945 995838 3625960 4814168 -7528964 -28360574 -38407871
36972 -38407871 -29884055 -15196754 -8101749 -7734783 -5654278 -884602 -1823787 -14715020
36964a4715020j8710154r783738O315839J1992421K244691o011151L222116J9640745
36956e804251J9413252N84724j3012686o255382P922738J1882783P980382O489691
36948B9201251M013616p528442j9557949j4863533N455936K0770290J7169333
36941C4660502K99401j7493488k7048308j9935577M306657K5269443J7943239
36934A8001869r906678j9942015L113659K4586275R658985k2204615k6113284
36927b2805804n58923J3961710K352850l970698J5359583L3049570J8867901j1947764
36919D4308425k4420886j3867633k85785P696125J2307363O578173j2147122k1780804
36911a612144l739838J8587730Q330595k3702255k9426364K798102K9662379J9692281
$$ plain form
36964 -14715020 -33425174 -43208912 -36893073 -24900652 -22655961 -28667112 -25444996 -5804251
36956 -5804251 13609001 14193725 1181039 -5074343 2848395 14731178 22711560 29201251
36948 29201251 33214867 25686425 6128476 -8735057 -3279121 17491169 34660502
36941 34660502 34959903 17466415 -9581893 -29517470 -25210813 58630 18001869
36934 18001869 8095191 -11846824 -8733165 15853110 25512095 3307480 -22805804
36927 -22805804 -23364727 -9403017 -7050167 -11020865 4338718 37388288 56256189 44308425
36919 44308425 19887539 6019906 5734121 13430246 25737609 32315782 20168660 -1612144
36911 -1612144 -5351982 13235748 21566343 -2135912 -31562276 -28764174 898205 20590486
36903B0590486m536358j1230449p267893j2604955j8647030o783215J3092622
36896b7386792J7435403Q661963P195865J3041234P379846j1033290k1171263
36889e877034j3253767j165794L207093N776217J3405772J9583362J5756190M212876
36881D1644915p631676j6247610j9929430j5758314l635342J1000037K0086751
36874I529331J6324301j910129k3261200k7765759q932534J3626916J5959799
36867f429275M95244q937745r82989J0257639Q672296k216986p887493k954410
36859i983719M820600N430845k982538j1654959q948681N107164J4774050O966209
36851C528971r145765j2407791P05110J0692747L649411q481089o266710Q249478
$$ plain form
36903 20590486 16054128 4823679 -2444214 -15049169 -33696199 -40479414 -27386792
36896 -27386792 -9951389 -1289426 5906439 18947673 26327519 15294229 -5877034
36889 -5877034 -19130801 -20296595 -17089502 -11313285 2092487 21675849 37432039 41644915
36881 41644915 34013239 17765629 -2163801 -17922115 -21557457 -10557420 9529331
36874 9529331 25853632 23943503 682303 -27083456 -36015990 -22389074 -6429275
36867 -6429275 -5934031 -14871776 -15854765 -5597126 3075170 858184 -7029309 -9983719
36859 -9983719 -5163119 267726 -2714812 -14369771 -23318452 -18211288 -3437238 3528971
36851 3528971 -5616794 -18024585 -17319475 -6626728 -2977317 -11458406 -17725116 -9475638
36843i475638J4493016K371720j4542004j7824463o570997N819699J1139665J2159942
36835b429060R669983k682530k2166149k7059905p24106L7214573M4974701J1095684
36827D7893191k6069079k5545628M193153K0005812K653386k2573240k4899175
36820b4341580o451608Q329532P835881L431444P793031J5521170J1546281n278627
36812A8385524j6969819j0274072K711688J120899j1808364j2578413K908153
36805b6504404Q253681j1144782k8464619j2558803K2288077L4578410J5247328
$$ plain form
36843 -9475638 5017378 7389098 -7152906 -24977369 -31548366 -25728667 -14589002 -2429060
36835 -2429060 7240923 4558393 -17607756 -44667661 -45391767 -8177194 36797507 47893191
36827 47893191 21824112 -3721516 471637 20477449 23130835 557595 -24341580
36820 -24341580 -30793188 -22463656 -14627775 -11196331 -3403300 12117870 23664151 18385524
36812 18385524 1415705 -8858367 -6146679 -5025780 -16834144 -29412557 -26504404
36805 -26504404 -18250723 -29395505 -57860124 -70418927 -48130850 -13552440 1694888
$$ [...]
##END NTUPLES=NMR SPECTRUM
##END=
