##TITLE=31Pdec_SR133_k
 DMSO-d6+CDCl3, 124 sc
 25.8.2022
##JCAMPDX= 6.0         $$ Bruker NMR JCAMP-DX V2.0
##DATA TYPE= NMR SPECTRUM
##DATA CLASS= NTUPLES
##ORIGIN= UXNMR, Bruker Analytische Messtechnik GmbH
##OWNER= root
$$ XWIN-NMR		Version 3.5
$$ Thu Aug 25 14:53:32 2022 Russian Standard Time (UT+4h)  she@DPX200
##.OBSERVE FREQUENCY= 81.013821
##.OBSERVE NUCLEUS= ^31P
##.ACQUISITION MODE= SIMULTANEOUS
##.ACQUISITION SCHEME= undefined
##.AVERAGES= 124
##.DIGITISER RES= 16
##SPECTROMETER/DATA SYSTEM= spect
##.PULSE SEQUENCE= zgpg30
##.SOLVENT NAME= CDCl3
##.SHIFT REFERENCE= (INTERNAL, CDCl3, 0, 248.564)
##AUDIT TRAIL= $$ (NUMBER, WHEN, WHO, WHERE, WHAT)
$$ ##TITLE= Audit trail, XWIN-NMR		Version 3.5
$$ ##JCAMPDX= 5.01
$$ ##ORIGIN= Bruker BioSpin GmbH
$$ ##OWNER= she
$$ F:/spectra/data/she/nmr/P31/1/pdata/1/auditp.txt
$$ ##AUDIT TRAIL=  $$ (NUMBER, WHEN, WHO, WHERE, WHAT)
(   1,<2022-08-25 14:52:41.60 +0400>,<she>,<DPX200>,
      <continue with go, POWCHK disabled, PULCHK disabled
       configuration hash MD5:
       00 E9 B6 7A A2 85 ED C7 34 08 36 98 17 FE 4E 26
       data hash MD5: 32K
       47 46 5B 97 EF F1 F6 B3 D4 79 8C 55 8B 05 51 24>)
(   2,<2022-08-25 14:52:44.06 +0400>,<she>,<DPX200>,
      <Start of raw data processing
       efp BC_mod = 2 LB = 1 FT_mod = 6 PKNL = 1 PHC0 = -10250.58 PHC1 = 37.05663 SI = 64K 
       data hash MD5: 64K
       82 B8 07 85 2B F1 0C BC 4A BF 05 E1 54 66 5F 0D>)
(   3,<2022-08-25 14:53:04.57 +0400>,<she>,<DPX200>,
      <pk PHC0 = 6.795839 PHC1 = 0 
       data hash MD5: 64K
       FE 89 C9 5E D9 4C 57 E4 F4 FB 02 34 CB CA EA B3>)
$$ ##END=
$$ 
$$ hash MD5
$$ 5B 74 23 3C 61 B5 D2 46 F3 2C E5 5C AE 5F AE 4F
##$RELAX= 
##$RELAX= 
##$RELAX= 
##$RELAX= 
##$RELAX= 
##$RELAX= 
##$RELAX= 
##$RELAX= 
$$ Bruker specific parameters
$$ --------------------------
##$DU= <F:/spectra>
##$EXPNO= 1
##$NAME= <P31>
##$PROCNO= 1
##$TYPE= <nmr>
##$USER= <she>
##$AMP= (0..31)
100 100 100 100 100 100 100 100 100 100 100 100 100 100 100 100 100 100 
100 100 100 100 100 100 100 100 100 100 100 100 100 100 
##$AQSEQ= 0
##$AQ_mod= 1
##$AUNM= <au_zg>
##$AUTOPOS= <>
##$BF1= 81.014009
##$BF2= 200.13
##$BF3= 200.13
##$BF4= 200.13
##$BF5= 200.13
##$BF6= 200.13
##$BF7= 200.13
##$BF8= 200.13
##$BYTORDA= 1
##$CFDGTYP= 0
##$CFRGTYP= 5
##$CHEMSTR= <none>
##$CNST= (0..31)
1 1 145 1 1 1 1 1 1 1 1 1 1 1 1 1 1 1 1 1 1 1 1 1 1 1 1 1 1 1 1 1 
##$CPDPRG= <waltz16>
##$CPDPRG1= <>
##$CPDPRG2= <waltz16>
##$CPDPRG3= <>
##$CPDPRG4= <mlev>
##$CPDPRG5= <mlev>
##$CPDPRG6= <mlev>
##$CPDPRG7= <mlev>
##$CPDPRG8= <mlev>
##$CPDPRGB= <>
##$CPDPRGT= <>
##$D= (0..31)
0 1 0 0 0 0 0 0 0 0 0 0.03 2e-05 3e-06 0 0 0 0 0 0 0 0 0 0 0 0 0 0 0 0 
0 0 
##$DATE= 1661424581
##$DBL= (0..7)
120 120 120 11 120 120 24 19 
##$DBP= (0..7)
150 150 150 150 150 150 150 150 
##$DBP07= 0
##$DBPNAM0= <>
##$DBPNAM1= <>
##$DBPNAM2= <>
##$DBPNAM3= <>
##$DBPNAM4= <>
##$DBPNAM5= <>
##$DBPNAM6= <>
##$DBPNAM7= <>
##$DBPOAL= (0..7)
0.5 0.5 0.5 0.5 0.5 0.5 0.5 0.5 
##$DBPOFFS= (0..7)
$$ [...]
##$SUBNAM2= <"">
##$SUBNAM3= <"">
##$SUBNAM4= <"">
##$SUBNAM5= <"">
##$SUBNAM6= <"">
##$SUBNAM7= <"">
##$SUBNAM8= <"">
##$SUBNAM9= <"">
##$SW= 501.771253377433
##$SWIBOX= (0..15)
0 1 3 0 0 0 0 0 0 0 0 0 0 0 0 0 
##$SW_h= 40650.406504065
##$TD= 32768
##$TD0= 1
##$TE= 0
##$TE2= 300
##$TE3= 300
##$TEG= 300
##$TL= (0..7)
0 120 53 12 22 120 120 120 
##$TP= (0..7)
150 150 150 150 150 150 150 150 
##$TP07= 0
##$TPNAME0= <>
##$TPNAME1= <>
##$TPNAME2= <>
##$TPNAME3= <>
##$TPNAME4= <>
##$TPNAME5= <>
##$TPNAME6= <>
##$TPNAME7= <>
##$TPOAL= (0..7)
0.5 0.5 0.5 0.5 0.5 0.5 0.5 0.5 
##$TPOFFS= (0..7)
0 0 0 0 0 0 0 0 
##$TUNHIN= 0
##$TUNHOUT= 0
##$TUNXOUT= 0
##$USERA1= <user>
##$USERA2= <user>
##$USERA3= <user>
##$USERA4= <user>
##$USERA5= <user>
##$V9= 5
##$VALIST= <valist>
##$VCLIST= <CCCCCCCCCCCCCCC>
##$VD= 0
##$VDLIST= <DDDDDDDDDDDDDDD>
##$VPLIST= <PPPPPPPPPPPPPPP>
##$VTLIST= <TTTTTTTTTTTTTTT>
##$WBST= 1024
##$WBSW= 4
##$XGAIN= (0..3)
0 0 0 0 
##$XL= 0
##$YL= 0
##$YMAX_a= 10874
##$YMIN_a= -16423
##$ZGOPTNS= <>
##$ZL1= 120
##$ZL2= 120
##$ZL3= 120
##$ZL4= 120
##$ABSF1= 0
##$ABSF2= 0
##$ABSG= 0
##$ABSL= 0
##$ALPHA= 0
##$AQORDER= 0
##$ASSFAC= 0
##$ASSFACI= 0
##$ASSFACX= 0
##$ASSWID= 0
##$AUNMP= <proc_1d>
##$AZFE= 0.1
##$AZFW= 0.5
##$BCFW= 0
##$BC_mod= 2
##$BYTORDP= 0
##$COROFFS= 0
##$CY= -3
##$DATMOD= 1
##$DC= 0
##$DFILT= <>
##$DTYPP= 0
##$F1P= 0
##$F2P= 0
##$FCOR= 1
##$FTSIZE= 65536
##$FT_mod= 6
##$GAMMA= 0
##$GB= 0
##$INTBC= 1
##$INTSCL= 5.30512e-09
##$ISEN= 30
##$LB= 1
##$LEV0= 0
##$LPBIN= 0
##$MAXI= 10000
##$MC2= 0
##$MEAN= 0
##$ME_mod= 0
##$MI= 50
##$NCOEF= 0
##$NC_proc= -7
##$NLEV= 6
##$NOISF1= 182.463
##$NOISF2= 159.3651
##$NSP= 0
##$NTH_PI= 0
##$NZP= 0
##$OFFSET= 248.5645
##$PC= 4
##$PHC0= -10243.78
##$PHC1= 37.05663
##$PH_mod= 1
##$PKNL= yes
##$PPARMOD= 0
##$PSCAL= 0
##$PSIGN= 0
##$REVERSE= no
##$SF= 81.0140089999908
##$SI= 65536
##$SIGF1= 159.3651
##$SIGF2= -187.1042
##$SINO= 113.3802
##$SIOLD= 16384
##$SREGLST= <1H.CDCl3>
##$SSB= 0
##$STSI= 65536
##$STSR= 0
##$SW_p= 40650.406504065
##$SYMM= 0
##$S_DEV= 0
##$TDeff= 32768
##$TDoff= 0
##$TI= <>
##$TILT= no
##$TM1= 0
##$TM2= 0
##$TOPLEV= 0
##$USERP1= <user>
##$USERP2= <user>
##$USERP3= <user>
##$USERP4= <user>
##$USERP5= <user>
##$WDW= 1
##$XDIM= 65536
##$YMAX_p= 428981671
##$YMIN_p= -121966003
$$ End of Bruker specific parameters
$$ ---------------------------------
##NTUPLES= NMR SPECTRUM
##VAR_NAME=  FREQUENCY,     SPECTRUM/REAL,   SPECTRUM/IMAG
##SYMBOL=    X,             R,               I
##VAR_TYPE=  INDEPENDENT,   DEPENDENT,       DEPENDENT
##VAR_FORM=  AFFN,          ASDF,            ASDF
##VAR_DIM=   65536,         65536,           65536
##UNITS=     HZ,            ARBITRARY UNITS, ARBITRARY UNITS
##FACTOR=    0.620285442955139, 1,           1
##FIRST=     20137.2065510736, 0,            0
##LAST=      -20513.1999529914, 0,           0
##MIN=       -20513.1999529914, -121966003,  0
##MAX=       20137.2065510736, 428981671,    0
$$ Real data points
##PAGE= N=1
##DATA TABLE= (X++(R..R)), XYDATA
$$ [...]
41889e208334l967135K111882O723063L919296k109527l921818r17039J895436
$$ -5208334 -9175469 -7063587 -340524 3578772 1469245 -2452573 -3369612 -1474176
41881a474176J691604m4226j142381q30257O48940K023869J687284j79348j750704
$$ -1474176 217428 173202 -969179 -1799436 -1150496 873373 2560657 2381309 630605
41872F30605k439571l029041k617164N07321L984718K638090l081905n657175
$$ 630605 -1808966 -4838007 -7455171 -6947850 -2963132 -325042 -3406947 -9064122
41864i064122j278814L783411K917622m08475O88003M043998K074969m332263
$$ -9064122 -10342936 -6559525 -3641903 -4050378 -3362375 681623 2756592 -1575671
41856a575671n886476L80434O153783M606280l38817k004129r12637q38134p37811
$$ -1575671 -7462147 -7081713 -927930 3678350 3339533 1335404 422767 -415367 -1153178
41847a153178K137791M755967J726719n065069p616785l167446K175016K995450
$$ -1153178 984613 5740580 7467299 2402230 -5214555 -8382001 -6206985 -3211535
41839c211535J622611K207899L185982R85877k471730k516359l5185J55768j239361
$$ -3211535 -1588924 618975 3804957 4790834 2319104 -197255 -232440 -76672 -1316033
41830a316033J481775P369195P094938k112641q989747m189942M116952K404190
$$ -1316033 165742 7534937 14629875 12517234 3527487 -662455 3454497 5858687
41822E858687n956004n585691N250662J0677998K432243p240492n830975P32260
$$ 5858687 -97317 -5683008 -432346 10245652 12677895 5437403 -393572 338688
41814C38688R60259k585442o70990M241756K728294l374113l365869L278562N459391
$$ 338688 1298947 -1286495 -1957485 2284271 5012565 1638452 -1727417 1551145 7010536
41805G010536q21755o201951l781495R39666Q83477j866781j918847M54664J716369
$$ 7010536 6188781 -13170 -3794665 -2854999 -1971522 -3838303 -5757150 -5302486 -3586117
41796c586117R62390o96278k199750j654653J874279M604709J861233l642316
$$ -3586117 -2623727 -3320005 -5519755 -7174408 -5300129 -695420 1165813 -2476503
41788b476503m311607N20348L249153L16361k689792j252113J367112J680142
$$ -2476503 -6788110 -6267762 -3018609 -2702248 -5392040 -6644153 -5277041 -3596899
41780c596899J912346L540694K871034j350453l412410J21205L650486J592743
$$ -3596899 -1684553 1856141 4727175 3376722 -35688 85517 3736003 5328746
41772E328746k442886k596600n52595o15887p73150K678210O229305L980902j908793
$$ 5328746 2885860 289260 -263335 -879222 -1652372 1025838 7255143 11236045 9327252
41763I327252m340377k369352q41085j055575k07064J348245O41523r32782N94993
$$ 9327252 4986875 2617523 1776438 720863 513799 1862044 2503567 1570785 2165778
41754B165778L353673J335722m929779p593451l047042L148560N161710L921399
$$ 2165778 5519451 6855173 1925394 -5668057 -8715099 -5566539 -404829 3516570
41746C516570K452510M83736k522138l970325j911056J224789K166552J317766
$$ 3516570 5969080 6452816 3930678 -39647 -1950703 -725914 1440638 2758404
41738B758404O91433j03460k412283m617560l163788K281587O978702N819544
$$ 2758404 3449837 3346377 934094 -3683466 -6847254 -4565667 2413035 8232579
41730H232579m79951n359427l900308P76302J600829k138371l396301J608293
$$ 8232579 7752628 2393201 -1507107 -730805 870024 -1268347 -4664648 -3056355
41722c056355O438822L613971l438692m833033J141648N789460L210454j741109
$$ -3056355 3382467 6996438 3557746 -1275287 -133639 5655821 8866275 7125166
41714G125166j806920K245906M130673J454115k052403k363667L34947K770852
$$ 7125166 5318246 7564152 11694825 13148940 11096537 8732870 9067817 11838669
41706A1838669K119240j408424m364154l150263J631938M887415K568174l064725
$$ 11838669 13957909 12549485 8185331 5035068 6667006 11554421 14122595 11057870
41698A1057870n518086j754008L769868M137165j633355p274149o904740j870310
$$ 11057870 5539784 3785776 7555644 11692809 10059454 2785305 -4119435 -5989745
41690e989745J814473J179628j249602j920808k03749K127593K847350P88988
$$ -5989745 -4175272 -2995644 -4245246 -6166054 -6369803 -4242210 -1394860 -605872
41682f05872k362500k657235R28123L490875N90391m083214l425769J609211K943021
$$ -605872 -2968372 -5625607 -4697484 -1206609 -616218 -4699432 -8125201 -6515990 -3572969
41673c572969j397333l661314Q54879N909811M403508j003782l652586k941321
$$ -3572969 -4970302 -8631616 -7776737 -1866926 2536582 1532800 -2119786 -5061107
41665e061107j785529K69658L826644M490352p08288n588288k285452O127552
$$ -5061107 -6846636 -6576978 -2750334 1740018 1031730 -4556558 -6842010 -714458
41657g14458R206507L894938k601042m151532k130486k39680K47395o20379j856602
$$ -714458 8492049 12386987 9785945 5634413 3503927 3264247 3511642 2891263 1034661
41648A034661q09642L207652N771122K909237k151423l591577j994654j978403
$$ 1034661 225019 3432671 9203793 12113030 9961607 6370030 4375376 2396973
41640B396973l125857j244612K576531K581126j932852n281168m356473j917563
$$ 2396973 -728884 -1973496 603035 3184161 1251309 -4029859 -8386332 -10303895
41632a0303895m82962M82702J110291J001508J977356M907419N694827J425178
$$ -10303895 -10786857 -10304155 -9193864 -8192356 -6215000 -1307581 4387246 5812424
41624E812424k412355L66180M943640K485105l890305l497118K670123K638687
$$ 5812424 3400069 3766249 8709889 11194994 7304689 3807571 6477694 9116381
41616I116381m953061o875412J770194P435916J15537r505826p094950L104377
$$ 9116381 4163320 -2712092 -941898 6494018 6609555 -2896271 -9991221 -6886844
41608f886844O892039K170756j824213j427783q09225p63526J825692M714961
$$ -6886844 5195 2175951 351738 -1076045 -1885270 -2648796 -823104 3891857
41600C891857K054869m543308o686428j822635L333101L304827M78675n66497
$$ 3891857 5946726 1403418 -5283010 -7105645 -3772544 -467717 10958 -555539
41592e55539N26540J244604P7611k294088l419186j062157L322772M962094J915734
$$ -555539 -28999 1215605 1293216 -1000872 -4420058 -5482215 -2159443 2802651 4718385
41583D718385j848434k320474j043773j306157k255499j174142J356996K994909
$$ 4718385 2869951 549477 -494296 -1800453 -4055952 -5230094 -3873098 -878189
41575h78189L671821L964077K341477j614071m127501j927688K452891M222201
$$ -878189 2793632 6757709 9099186 7485115 3357614 1429926 3882817 8105018
41567H105018K590957k37689l120235n070740l880048R5808K398492R06898l84266
$$ 8105018 10695975 10458286 7338051 2267311 -1612737 -1516929 881563 1788461 1404195
41558A404195J545491K957413K08421k922928j628613J058153m00690m020838
$$ 1404195 2949686 5907099 6115520 3192592 1563979 2622132 2221442 -1799396
41550a799396m120988j690425j731194k835892O66193P273398R004301M002180
$$ -1799396 -5920384 -7610809 -9342003 -12177895 -11511702 -4238304 4765997 8768177
41542H768177p44844p01698N68045q24952l106028l301782j715685L38685K322302
$$ 8768177 8023333 7321635 7889680 7064728 3958700 656918 -1058767 -720082 1602220
41533A602220K732603M68256j588760K65324L619263K319699l581331o858372
$$ 1602220 4334823 4803079 3214319 3479643 7098906 9418605 5837274 -1021098
41525a021098l622717J603655L538381K838249K242389J357863j062454l467810
$$ -1021098 -4643815 -3040160 498221 3336470 5578859 6936722 5874268 2406458
41517B406458l519389j352231J284896L105272L424428K333344J103385L79076
$$ 2406458 -1112931 -2465162 -1180266 1925006 5349434 7682778 8786163 9165239
41509I165239j314502m647502o686682m831582j827962j923728l360769o72559
$$ 9165239 7850737 3203235 -3483447 -8315029 -10142991 -12066719 -15427488 -16100047
41501a6100047N774746Q908752M887004j620258m136434k098470K23036m27094
$$ -16100047 -10325301 -1416549 3470455 1850197 -2286237 -4384707 -4161671 -4588765
41493d588765l026882l381142J087224O523852N645656j812589o378338j666150
$$ -4588765 -7615647 -10996789 -9909565 -3385713 2259943 447354 -5930984 -7597134
41485g597134N234092L985098k774798l760417K680869O403950K141248l340951
$$ -7597134 -2363042 1622056 -1152742 -4913159 -2232290 4171660 6312908 2971957
41477B971957l689058j852956j923182j481532K004362M678121K439191j993851
$$ 2971957 -717101 -2570057 -4493239 -5974771 -3970409 707712 3146903 1153052
41469A153052l648171k408514j018442n6014J180057K271574K951443L375193
$$ 1153052 -2495119 -4903633 -5922075 -5978089 -4798032 -2526458 424985 3800178
41461C800178J954942k453718n811369k789884L735602M910234n46236l869676
$$ 3800178 5755120 3301402 -2509967 -5299851 -1564249 3345985 2799749 -1069927
41453a069927n84976K333486q69373m182698P3151P778186Q761224J655072n310005
$$ -1069927 -1654903 678583 -190790 -4373488 -4300337 3477849 12239073 13894145 8584140
41444H584140n830948j163894L742246M394164q37678q050576r958376m288854
$$ 8584140 2753192 1589298 5331544 9725708 8888030 837454 -9120922 -13409776
41436a3409776K973096N650221M506176L176631K057907L85827l92237L11516
$$ -13409776 -10436680 -4786459 -280283 2896348 4954255 5340082 4947845 5259361
41428E259361J45563j514046j686609K33957O23433r54457J55405M108145L798195
$$ 5259361 5404924 3890878 2204269 2438226 3061659 2107202 2262607 6370752 10168947
41419A0168947k593815n789314J0887O124394K863631m601915n515801j216656
$$ 10168947 7575132 1785818 1796705 7921099 10784730 6182815 667014 -549642
41411e49642m25840k811758j533600J955945N75333l299728o53310O904986Q043579
$$ -549642 -975482 -3787240 -5320840 -3364895 -2789562 -6089290 -6742600 162386 8205965
41402H205965J035173l021753P37937L523193n23976m305486j300647L148169
$$ 8205965 9241138 6219385 6957322 10480515 9956539 5651053 4350406 7498575
41394G498575K303133n71333J5904J443372n32871k425657L99312L727925P50118
$$ 7498575 9801708 9230375 9246279 10689651 10156780 7731123 8130435 11858360 12608478
41385A2608478n863922p529170k901902J201447Q98337o29958k58536O87238O10736
$$ 12608478 6744556 -784614 -3686516 -2485069 -1586732 -2216690 -2475226 -1787988 -1177252
41376a177252R44897K950502M484938K478043k453336n613357l159162K787341
$$ -1177252 -232355 2718147 7203085 9681128 7227792 1614435 -1544727 1242614
41368A242614N564547J869499l656009m499805j049960R60037n26998j946252
$$ 1242614 6807161 8676660 5020651 520846 -529114 430923 -96075 -2042327
41360b042327j116156j99323n06205r1240J623776K200386J147257J205495K630506
$$ -2042327 -3158483 -3357806 -3864011 -3955251 -2331475 -131089 1016168 2221663 4852169
41351D852169J839674j819609l873387k181519m75618j093524p17225K413588
$$ 4852169 6691843 4872234 998847 -1182672 -1658290 -2751814 -3469039 -1055451
41343a055451L837804Q85479j246963J823596M946650J479840m834358n178523
$$ -1055451 2782353 3667832 2420869 4244465 9191115 10670955 5836597 658074
41335F58074L23120L338301O01902k652971k427180o87994M67456J765308K540659
$$ 658074 981194 4319495 4921397 2268426 -158754 -846748 -379292 1386016 3926675
41326C926675N20624k658093k350869R87339J342961k875703n220981j118753
$$ 3926675 4447299 1789206 -561663 425676 1768637 -1107066 -6328047 -7446800
41318g446800M782915N780613K533427N9163o94948k336486m419295l473376N69446
$$ -7446800 -2663885 3116728 5650155 5709318 5014370 2677884 -1741411 -5214787 -4645341
41309d645341L066124J058484k460403k539885J310503M601681L488759m07564
$$ -4645341 -1579217 -520733 -2981136 -5521021 -4210518 391163 3879922 3472358
41301C472358j864227J290651N025697M124237q94820m494902l421855k10297
$$ 3472358 1608131 2898782 7924479 12048716 11153896 6658994 3237139 3026842
41293C026842J222042L96297q32356j541754j719682q56095J077996K355045J335014
$$ 3026842 4248884 4645181 3812825 2271071 551389 -304706 773290 3128335 4463349
41284D463349r85722k013032q84280N71596K20892j717770k493383L67822N387506
$$ 4463349 3477627 1464595 580315 1151911 1372803 -344967 -2838350 -2470528 2916978
41275B916978P237773K653166m273279n953923j005916L724323K597673j461234
$$ 2916978 10154751 12807917 8534638 2580715 1574799 5299122 7896795 6435561
41267F435561k525106j007357k049563o153650p559640k938882L476658N971715
$$ 6435561 3910455 2903098 853535 -5300115 -12859755 -15798637 -12321979 -6350264
41259f350264M740851L818733M025150K134925k988042o960041m687846K642487
$$ -6350264 -1609413 2209320 6234470 8369395 5381353 -1578688 -6266534 -3624047
41251c624047P902644O164651N75802k181948j105386j570211o156797r684464
$$ -3624047 4278597 10443248 11019050 8837102 7731716 6161505 4708 -9679756
41243i679756o808767m88729K476137J727324K600360O105282P070727L414514
$$ -9679756 -16488523 -16977252 -14501115 -12773791 -10173431 -4068149 3002578 6417092
41235F417092j2517K52052P33510k009975m737237l212774K37451R15803k87419
$$ 6417092 6404575 6656627 7390137 5380162 642925 -2569849 -2332398 -1416595 -1704014
41226a704014L72175J807099L19498k341122p71524M523310O709383K819019k100938
$$ -1704014 -1331839 475260 794758 -1546364 -2317888 2205422 8914805 11733824 9632886
41217I632886k749502Q9478K769286L327713J157250l047797n531615k630200
$$ 9632886 6883384 6972862 9742148 13069861 14227111 11179314 5647699 3017499
41209C017499K891837M059903j40161k937043n10036K229171M90047k438710j655094
$$ 3017499 5909336 9969239 9829078 6892035 6381999 8611170 9101217 6662507 5007413
41200E007413O12152n36106l680205l705518n63666J592140J981702K868377L024966
$$ 5007413 5619565 5083459 1403254 -2302264 -2865930 -1273790 707912 3576289 6601255
41191F601255r52854o710570o919786J20179O847148O272771O90707k696226j292671
$$ 6601255 5648401 -1062169 -7981955 -7861776 -1014628 5258143 5948850 3252624 1959953
41182A959953J366401J676293J28248n70426M49200J128355n03334l102195l421720
$$ 1959953 3326354 5002647 5130895 4560469 5009669 6138024 5634690 2532495 -889225
41173h89225r54568J236114J099833P6875m48780j589663l343170k484416K023028
$$ -889225 -1843793 -607679 492154 569029 120249 -1469414 -4812584 -7297000 -5273972
41164e273972N139867K386786k510425k549676J972334M358818K040342o62355
$$ -5273972 -134105 2252681 -257744 -2807420 -835086 3523732 5564074 4901719
41156D901719n84240J44905o29707j633098j782639j963917j533662J546081N258888
$$ 4901719 4317479 4462384 3832677 2199579 416940 -1546977 -3080639 -1534558 3724330
41147C724330M111278k060321n717556k003353L763362L918163n95798k979380
$$ 3724330 7835608 5775287 57731 -1945622 1817740 5735903 5140105 2160725
41139B160725j266519K76461o25109j008211J332322L750475L058998M61350p79754
$$ 2160725 894206 1170667 545558 -462653 869669 4620144 7679142 8140492 7360738
41130G360738n35461j297480l031550k234785K319512N919118L460683k719831
$$ 7360738 6825277 5527797 2496247 261462 2580974 8500092 11960775 9240944
41122I240944m953019m98312M829837M891607O07638l426906n185851m484981
$$ 9240944 4287925 3789613 8619450 13511057 14118695 10691789 5505938 1020957
41114A020957m90466N246035P170891K695281k583767k487832M06122k00780l468317
$$ 1020957 530491 5776526 12947417 15642698 13058931 10571099 10977221 10776441 7308124
41105G308124l843857j637836j722192l200677o58138M525008M926900K15074
$$ 7308124 3464267 1826431 104239 -3096438 -3754576 770432 5697332 5912406
41097E912406j569624J869925L084026j315293m339043j485499J096021j875279
$$ 5912406 4342782 6212707 9296733 7981440 3642397 2156898 3252919 1377640
41089A377640n278169l374825J46218L00591K40311L492014N095325N32143m064038
$$ 1377640 -3900529 -7275354 -7129136 -6828545 -6588234 -3096220 1999105 2531248 -1532790
41080a532790j474095L514106K008975l833208n459360k587720q60716M78670
$$ -1532790 -3006885 507221 2516196 -1317012 -6776372 -9364092 -10224808 -9746138
41072i746138N229093Q457744K697981o410592o068261K700987N903880m08015
$$ -9746138 -4517045 3940699 6638680 228088 -5840173 -3139186 2764694 2356679
41064B356679m468252J81277M417513R38916l134178j60626M423446K959332o99301
$$ 2356679 -2111573 -1930296 2487217 3426133 291955 131329 4554775 7514107 6814806
41055F814806L12403K430689j114284o296235m235119K922540M579397j308813
$$ 6814806 7127209 9557898 8443614 2147379 -2087740 834800 5414197 4105384
41047D105384n323010j552361M344435M772409M56693k601511j663527Q11142
$$ 4105384 -1217626 -2769987 1574448 6346857 6803550 4202039 2538512 3349654
41039C349654J541466L05866l27533J197829K478321L1952m762821o160516j943393
$$ 3349654 4891120 5196986 4869453 6067282 8545603 8577555 3814734 -2345782 -4289175
41030d289175L082625L890867J579290j67930r11871j743709j422898R49355K214806
$$ -4289175 -1206550 2684317 4263607 4095677 3183806 1440097 17199 966554 3181360
41021C181360q17365n556739o607524l129800J078166L444849M365686M367227
$$ 3181360 2363995 -3192744 -9800268 -12930068 -11851902 -8407053 -4041367 325860
41013C25860L673884L587022M544204M010079j0477m765523n937022l672825j523516
$$ 325860 3999744 7586766 12130970 16141049 16130572 11365049 5428027 1755202 231686
41004B31686p84755q0075P04492N07638K35872J547009L192995K576107J44392
$$ 231686 -553069 -633144 71348 578986 814858 2361867 5554862 8130969 8275361
40995H275361j557856j987990j865604k28135L127397M382516N46849m237001
$$ 8275361 6717505 4729515 2863911 2635776 5763173 10145689 10692538 6455537
40987F455537l717476N34088J579047j271241j749343J871304L643200O28318
$$ 6455537 2738061 3272149 4851196 3579955 1830612 3701916 7345116 7973434
40979G973434k194451j423768j028041l582095l963896J421889O265276L388372
$$ 7973434 5778983 4355215 3327174 -254921 -4218817 -2796928 3468348 6856720
40971F856720l224072m199558J133437N202213M271590J383441j331552m534150
$$ 6856720 3632648 -566910 566527 5768740 10040330 11423771 10092219 5558069
40963E558069o139957k542912L552696M526199r42827n342973l513526N92010
$$ 5558069 -581888 -3124800 427896 4954095 4011268 -1331705 -4845231 -4253221
40955d253221J517898Q7913n17413n89896j040042K03265L706444M815720J71288
$$ -4253221 -2735323 -2647410 -3164823 -3754719 -4794761 -4591496 -885052 3930668 4101956
40946D101956n589468n773211j596980L44666j088405m35981M430770P969573
$$ 4101956 -1487512 -7260723 -8857703 -8513037 -9601442 -10037423 -5606653 2362920
40938B362920M887322k317602o575956m369354J313964M553195K266662k393569
$$ 2362920 7250242 4932640 -1643316 -6012670 -4698706 -145511 2121151 -272418
40930b72418l092878J633358N550090L187120j655776j469184K862248L248100
$$ -272418 -3365296 -1731938 3818152 7005272 5349496 3880312 6742560 9990660
40922I990660k159031n525964k189594J715395k05740m034730k756050J934940
$$ 9990660 7831629 2305665 116071 1831466 1625726 -2409004 -5165054 -3230114
40914c230114L528862K108041K566525M098234J449964m004202m589850Q46756
$$ -3230114 298748 2406789 4973314 9071548 10521512 6517310 1927460 2774216
40906B774216M011307J64855m630216l716602L51532J730067N80983K27363K20153
$$ 2774216 6785523 6950378 2320162 -1396440 -1044908 685159 1266142 1493505 1713658
40897A713658j183834j748536Q52493L221532J158911k332328j268610K951850
$$ 1713658 529824 -1218712 -366219 2855313 4014224 1681896 413286 3365136
40889C365136L262183j457753m383118j469970L049483M065252K097619l13282
$$ 3365136 6627319 5169566 786448 -683522 2365961 6431213 8528832 8215550
40881H215550k845489m632619k609439L151922O807482M065851j265274k755122
$$ 8215550 5370061 737442 -1871997 1279925 8087407 12153258 10887984 8132862
40873H132862m95084M13826j464200k459480o92534R36301j43961k173644k076603
$$ 8132862 7637778 8051604 6587404 4127924 3435390 4371691 4227730 2054086 -22517
40864b2517K61671K597174L421337K812976J280621q19987k935526m096691l369746
$$ -22517 239154 2836328 6257665 9070641 10351262 9531275 6595749 2499058 -870688
40855h70688r43874J268523J260075l36571o06315J625827L919797L834224K330113
$$ -870688 -1814562 -546039 714036 377465 -228850 1396977 5316774 9150998 11481111
40846A1481111J332898J35604k422786m086964k008799J468802J103850k857081
$$ 11481111 12814009 12949613 10526827 6439863 4431064 5899866 7003716 4146635
40838D146635m209706l55057L376330K095915j292046j696197k03715q93589k703973
$$ 4146635 -63071 -418128 2958202 5054117 3762071 2065874 1862159 968570 -1735403
40829a735403j587425J034241j51585m286275m136535J845841N416354J177729
$$ -1735403 -3322828 -2288587 -2440172 -6726447 -10862982 -9017141 -3600787 -2423058
40821b423058l848640n40984P397840Q034852q05550p712327m025554M111594
$$ -2423058 -6271698 -6812682 585158 8620010 7814460 102133 -3923421 188173
40813A88173N145214j802663o884314l623734L282662N325288Q99381l934813
$$ 188173 5333387 3530724 -3353590 -6977324 -3694662 1630626 2530007 -1404806
40805a404806l398588J782680N922532M774356j49284l535532k191597J777024
$$ -1404806 -4803394 -3020714 2901818 7676174 7526890 3991358 1799761 3576785
40797C576785M096648L412567J631131m9957k594218n714062n964483j157950
$$ 3576785 7673433 11086000 12717131 12667174 10072956 4358894 -1605589 -2763539
40789b763539M793929N234882o64549o141201n193842K66662M046184L849095
$$ -2763539 2030390 7265272 6600723 459522 -4734320 -4467658 -421474 3427621
40781C427621K217755R15422r66044l114873k884362J02209K068123N00414j669409
$$ 3427621 5645376 6560798 5594754 2479881 -404481 -302272 1765851 2266265 596856
40772E96856o51645J941880J611418j684169l403126j602226M47165J41696k36889
$$ 596856 -54789 1887091 3498509 1814340 -1588786 -3191012 -2743847 -2602151 -2839040
40763b839040K095173N030218M308455J42293k734218j671776N70843L53224j552876
$$ -2839040 -743867 4286351 8594806 8737099 6002881 4331105 4901948 5255172 3702296
40754C702296j571142R36637K478844O25227k179891k160164L2177L50114k111638
$$ 3702296 2131154 3067791 5546635 6171862 3991971 1831807 1863984 2214098 102460
40745A02460l480380j316385J457926J686919J448860L934561O536722M020894
$$ 102460 -3377920 -4694305 -3236379 -1549460 -100600 3833961 10370683 14391577
40737A4391577k332799n343876k506998O44304k0770j129468Q00610K176811j247350
$$ 14391577 12058778 6714902 4207904 4852208 4831438 3701970 4502580 6679391 5432041
40728E432041n493560l522516L290417O734342L996456N50470K36484J37602k352180
$$ 5432041 -61519 -3584035 -293618 6440724 10437180 10987650 11224134 11361736 9009556
40719I009556m260930k545856N66537J757353J699795K068985J613140n92597
$$ 9009556 4748626 2202770 2769307 4526660 6226455 8295440 9908580 9315983
40711I315983j798474q2240J297742q81795l419878j339081L523558M970188J972419
$$ 9315983 7517509 7435269 8733011 7851216 4431338 3092257 6615815 11586003 13558422
40702A3558422r13187j865963l345418m987678k590472L675470P051993L644466
$$ 13558422 12645235 10779272 7433854 2446176 -144296 3531174 10583167 14227633
40694A4227633j745552l064477j110336n5737o02440j180754j851068k368858
$$ 14227633 12482081 9417604 8307268 8251531 7649091 6468337 4617269 2248411
40686B248411l49071L769439M210950j779051p148462l921638M204616O558051
$$ 2248411 1899340 5668779 9879729 8100678 952216 -2969422 1235194 7793245
40678G793245J193149l198636j329329J913415J042658j911857k631955j241529
$$ 7793245 8986394 5787758 4458429 6371844 7414502 5502645 2870690 1629161
40670A629161J67522J287301J426058j106637m311260k964510K818186N795660
$$ 1629161 1796683 3083984 4510042 3403405 -907855 -3872365 -1054179 4741481
40662D741481K441225j320175l65939J136322j451966l419770P78589N479983
$$ 4741481 7182706 5862531 5496592 6632914 5180948 1761178 2539767 8019750
40654H019750J989606n398907m789344L527478O711960P4354n883956l286014
$$ 8019750 10009356 4610449 -178895 3348583 10060543 10134897 4250941 964927
40646I64927J427391L57321k897335j856234Q79877J68199r39273K380878N750610
$$ 964927 2392318 2749639 -147696 -2003930 -1124053 -955854 -1895127 485751 6236361
40637F236361K359958l865990l756835J401092K095683k645367l777903J196128
$$ 6236361 8596319 4730329 973494 2374586 4470269 1824902 -1953001 -756873
40629g56873L279361k214914o867954k956830L799334L782095j579893l616006
$$ -756873 2522488 307574 -6560380 -9517210 -5717876 -1935781 -3515674 -7131680
40621g131680k18713L310578M202909M234765L307006n73274m874645l886575
$$ -7131680 -7350393 -4039815 163094 4397859 7704865 7131591 2256946 -1629629
40613a629629K043665N284165J366208m784571o029695k060294K126442L551162
$$ -1629629 414036 5698201 7064409 2279838 -3749857 -5810151 -3683709 -132547
40605a32547L297693K864513J875324m43692l252337m248123k045292J378973
$$ -132547 3165146 6029659 7904983 7461291 4208954 -39169 -2084461 -705488
40597g05488J847424j870075n401581l911045J076131L510508J197653j804391
$$ -705488 1141936 -728139 -6129720 -10040765 -8964634 -5454126 -4256473 -6060864
40589f060864j814871j36241O87104R57739J506580J060066p36220q99586K378987
$$ -6060864 -7875735 -8011976 -7324872 -6367133 -4860553 -3800487 -4536707 -5436293 -3057306
40580c057306N403448L551827j503435l678853q29210L011305L653179J289825
$$ -3057306 2346142 5897969 4394534 715681 -113529 2897776 6550955 7840780
40572G840780j311617k090413p97560Q98075P24033q42689k05122L503061M824039
$$ 7840780 6529163 4438750 3641190 4539265 5263298 4420609 4215487 7718548 12542587
40563A2542587p91851q208555p962572j71682M756658J289611l366921j061376
$$ 12542587 11750736 3542181 -4420391 -4592073 164585 1454196 -1912725 -2974101
40555b974101M685491M758672j411286n663039l407372J074379K133395q5171
$$ -2974101 1711390 6470062 5058776 -604263 -4011635 -2937256 -803861 -889032
40547h89032j683087m99020K318771M363049M468162L659111L282711K361102
$$ -889032 -2572119 -3071139 -752368 3610681 8078843 11737954 15020665 17381767
40539A7381767q62543m321264l141732K592507N766695J850343l935508m471534
$$ 17381767 16519224 12197960 9056228 11648735 17415430 19265773 15330265 10858731
40531A0858731j508064j411375l511861j789768L079894L446973k241885n874050
$$ 10858731 9350667 7939292 4427431 2637663 5717557 9164530 6922645 1048595
40523A048595k582833J680088M59063l174074l180539o58453k59604j446333o69981
$$ 1048595 -1534238 145850 604913 -2569161 -5749700 -6408153 -6667757 -8114090 -8784071
40514h784071J335428J494738P33198J647543K641928J333783Q68305M758037
$$ -8784071 -7448643 -5953905 -5220707 -3573164 -931236 402547 1270852 6028889
40506F028889P873973K316549q372281j1559348l872291L442906J633920l245850
$$ 6028889 13902862 16219411 7847130 -3712218 -7584509 -4141603 -2507683 -5753533
40498e753533j837469L455425M104225K46828m91684L741199O784938N087319
$$ -5753533 -7591002 -4135577 -31352 215476 -276208 3464991 10249929 15337248
40490A5337248J859109k18446k474560m620551l167407J418111K669231k550364
$$ 15337248 17196357 16977911 14503351 9882800 6715393 8133504 10802735 8252371
40482H252371q236445p590160k470889R20109J771470L537938N706814M087873
$$ 8252371 15926 -7574234 -10045123 -9125014 -7353544 -3815606 1891208 5979081
40474E979081j053217m103293k606511o58525j655258l062047j612794Q05350
$$ 5979081 4925864 822571 -1783940 -2442465 -4097723 -7159770 -8772564 -7967214
40466g967214O33995j090897m11805L202294O107560N455533J936110j874054
$$ -7967214 -7333219 -8424116 -8835921 -5633627 473933 5929466 7865576 5991522
40458E991522l460141j518646K402273M342179K449597j08214N03723K993581
$$ 5991522 2531381 1012735 3415008 7757187 10206784 10098570 10602293 13595874
40450A3595874L143070O64182p66516j81170p62590l296872l539064P30307M430195
$$ 13595874 16738944 17403126 16636610 16455440 15692850 12395978 8856914 9587221 14017416
40441A4017416J555245n759601r418811n662385J191740N284988N449446L914563
$$ 14017416 15572661 9813060 394249 -5268136 -4076396 1208592 6658038 10572601
40433A0572601K274151Q68973J40306L23318N25521k82806j655012k233926j825446
$$ 10572601 12846752 13715725 13856031 14179349 14704870 14422064 12767052 10533126 8707680
40424H707680j782492k903807l778168k300069J106909L012330Q77560l177063
$$ 8707680 6925188 4021381 243213 -2056856 -949947 2062383 2939943 -237120
40416b37120m280412p99379L398026L775334O69550j763543j094519J155019K549871
$$ -237120 -4517532 -5316911 -1918885 1856449 2525999 762456 -332063 822956 3372827
40407C372827K564236J760950L21149j265962j622953k90273Q96746R0326j481737
$$ 3372827 5937063 7698013 8019162 6753200 5130247 4839974 5736720 5827046 4345309
40398D345309q34609K234174M099585J869913k608772m875863l127019K13079
$$ 4345309 3510700 5744874 9844459 11714372 9105600 4229737 1102718 1315797
40390A315797J816667Q59019r26051j329970M41936L023047L870551J823766j360260
$$ 1315797 3132464 3991483 3065432 1735462 2177398 5200445 9070996 10894762 9534502
40381I534502k967506k607220k171828k559933k263360N0564L054059L997129
$$ 9534502 6566996 3959776 1787948 -771985 -3035345 -2984781 69278 4066407
40373D066407J696846k289540m771615l264746J337117M443871K278986k841312
$$ 4066407 5763253 3473713 -1297902 -4562648 -3225531 1218340 3497326 656014
40365F56014m418946j48999M629252M096167l23500k802441j500815K28765J00448
$$ 656014 -3762932 -3911931 717321 4813488 4489988 1687547 186732 415497 515945
40356E15945l38077K79770O68315M2443J11940J567039J535375k229323o415336
$$ 515945 177868 457638 1125953 1168396 1280336 2847375 4382750 2153427 -4261909
40347d261909n208470J741283P750253O921998J238661k459501j340767P39621
$$ -4261909 -9470379 -7729096 21157 6943155 8181816 5722315 4381548 5121169
40339E121169j31544k089312j006959K453402L572535J022393r97195M78159K445228
$$ 5121169 4989625 2900313 1893354 4346756 7919291 8941684 7944489 8422648 10867876
40330A0867876R14598k498144k906338M40885L036518J409819k468187l941554
$$ 10867876 11782474 9284330 6377992 6818877 9855395 11265214 8797027 4855473
40322D855473j267281K349293K196051k273553n967304m147614Q24303K179234
$$ 4855473 3588192 5937485 8133536 5859983 -107321 -4254935 -3430632 -1251398
40314a251398j590012m345295j399400L859263N755760M273071K732995J310775
$$ -1251398 -2841410 -7186705 -8586105 -4726842 1028918 5301989 8034984 9345759
40306I345759j725938m860932m928916k402818l22156O53201J790289K653300
$$ 9345759 7619821 2758889 -2170027 -4572845 -4895001 -4241800 -2451511 201789
40298B01789K298433K089193K911080K108442j940887n202217l623363k69141
$$ 201789 2500222 4589415 7500495 9608937 7668050 2465833 -1157530 -1426671
40290a426671l27606k216465j233109J021195k05159k590177K06407O258548O784249
$$ -1426671 -1754277 -3970742 -5203851 -4182656 -4387815 -6977992 -6771585 -513037 6271212
40281F271212K49313n335012n265477k965454p47848L139766O234405K517866
$$ 6271212 6520525 1185513 -4079964 -7045418 -7793266 -4653500 1580905 4098771
40273D098771n209506n708356L118770R036892M038774l670225l852839P21749
$$ 4098771 -1110735 -6819091 -3700321 5336571 9375345 5705120 1852281 2574030
40265B574030K326163J284471J179079m2094m094184n469063n07473M273564K849237
$$ 2574030 4900193 6184664 7363743 7321649 3227465 -2241598 -2749071 1524493 4373730
40256D373730O19456L867195O685345J202540o566130n571653J160881J673878
$$ 4373730 4993186 8860381 15545726 16748266 10182136 4610483 5771364 7445242
40248G445242m261994n500827P21585M894412K080131j490632r55008O64404J180184
$$ 7445242 3183248 -2317579 -1595994 3298418 5378549 3887917 2932909 3597313 4777497
40239D777497K940935M978464K344945l657139m964715K16865L773806O48639
$$ 4777497 7718432 12696896 15041841 11384702 6419987 6636852 10410658 11059297
40231A1059297m018264m604041k837190j602198O55759M503401N862217K658858
$$ 11059297 7041033 2436992 -400198 -2002396 -1346637 3156764 9018981 11677839
40223A1677839r69584j181407M72762J660353L101177M663511L416902j177498
$$ 11677839 10708255 9526848 9999610 11659963 14761140 19424651 22841553 21664055
40215B1664055n227374o085691n144748l396927J16376L903916M195057J261445
$$ 21664055 16436681 10350990 5206242 1809315 1925691 5829607 10024664 11286109
40207A1286109m54880O1356q38507l702355m096405o13321K150874J112971j118845
$$ 11286109 10831229 10892585 10054078 6351723 2255318 1641997 3792871 4905842 3786997
40198C786997j652298p30130J649822N892874Q579436N422148o30450k262678
$$ 3786997 2134699 1404569 3054391 8947265 17526701 22948849 22318399 20055721
40190B0055721M83700N21431l210597l697932O75345K155524k472651n344625
$$ 20055721 20539421 21060852 17850255 14152323 14827668 16983192 14510541 9165916
40182I165916j006920L906504J764737m121478o054679k987709J527662N347335
$$ 9165916 8158996 12065500 13830237 9708759 3654080 666371 2194033 7541368
40174G541368O147476J482173m501573l085665N068330P910240R8555p803358
$$ 7541368 13688844 15171017 10669444 7583779 12652109 20562349 20660904 12857546
40166A2857546n999385p9518P10306j000639J542767N343542M021215K92844j12838
$$ 12857546 6858161 6778643 7488949 6488310 8031077 13374619 17395834 17688678 17575840
40157A7575840K80065k440465l213819K457248O536838P43242o572621k530266
$$ 17575840 17855905 15415440 12201621 14658869 21195707 21938949 15366328 12836062
40149A2836062P311718O787449l631536p487085j4317N023281m51907o644824
$$ 12836062 20147780 26935229 23303693 15816608 15802291 20825572 20373665 13728841
40141A3728841m273854J256945K135837Q41840J867459K178632j282227l866722
$$ 13728841 9454987 10711932 12847769 13689609 15557068 17735700 16453473 12586751
40133A2586751j154978L058494L650430J890349K67831k933580p675250q084760
$$ 12586751 11431773 14490267 18140697 20031046 20298877 17365297 9690047 1605287
40125A605287j163423O652690Q143979M867340K059565n6737l130484m238298
$$ 1605287 441864 7094554 15238533 20105873 22165438 22108701 18978217 14739919
40117A4739919k20094N138395N395360O64585l368557l582125j283214K015377
$$ 14739919 14519825 19658220 25053580 25718165 22349608 18767483 17484269 19499646
40109A9499646N348170O144285K375433l385260n976412l882547o57884l070j544251
$$ 19499646 24847816 30992101 33367534 29982274 24005862 20123315 19465431 19462361 17918110
40100A7918110k019590K90425L060014K750260J5578l27003L426844O127339L354598
$$ 17918110 15898520 16188945 19248959 21999219 22014797 21687794 25114638 31241977 34596575
40091C4596575o77924R52821O387427P248546J716011l261700l758019l851967
$$ 34596575 33918651 34871472 41258899 48507445 50223456 46961756 43203737 39351770
40083C9351770o115257o131840j390556K244829m90366m742279k229419O209556
$$ 39351770 33236513 27104673 25714117 27958946 27468580 22726301 20496882 26706438
40075B6706438J1518778Q124595n08763p007368o996411j871241K683379K054074
$$ 26706438 38225216 46349811 45841048 38833680 31837269 29966028 32649407 34703481
40067C4703481k105912m104623k077643J35135q7679k54794K002759M656592N325113
$$ 34703481 32597569 28492946 26415303 26550438 26462759 26207965 28210724 32867316 38192429
40058C8192429N366526O673052Q085803Q194615Q693910J2543161K1264705L4079950
$$ 38192429 43558955 50232007 58317810 66512425 75206335 87749496 109014201 143094151
40050A43094151M4953513M1350212J4960387k3357674m8423063m6388347k8724917
$$ 143094151 188047664 229397876 244358263 221000589 172577526 126189179 97464262
40043I7464262j5421050j2248296j1884303r539348o912194n012833l087005k500335
$$ 97464262 82043212 69794916 57910613 48371265 41459071 36446238 33359233 30858898
40035C0858898l776671k653636L220519P411088L385325l497454k949263L772771
$$ 30858898 27082227 24428591 27649110 35060198 38445523 34948069 31998806 35771577
40027C5771577N666683n27324o313219n932680l459145k771221j190362K845052
$$ 35771577 41438260 40910936 34597717 28665037 25205892 22434671 21244309 24089361
40019B4089361N366132M749869N200253P553993N542228k792033q607938m872246
$$ 24089361 29455493 34205362 39405615 46959608 52501836 49709803 41101865 36229619
40011C6229619J934245J628509l918193m755335R40634M840241J803051l778014
$$ 36229619 38163864 39792373 35874180 31118845 32059479 36899720 38702771 34924757
40003C4924757n941548m220926j063745K083801M092399L611686Q46605k549008
$$ 34924757 28983209 24762283 23698538 25782339 29874738 33486424 34333029 31784021
39995C1784021n280382n950646k767628K814236M901709P03126l437194j67876
$$ 31784021 26503639 20552993 17785365 20599601 25501310 26204436 22767242 22599366
39987B2599366P000740Q383731L581785K091266P328400J1092644P766024L211563
$$ 22599366 29600106 37983837 41565622 43656888 50985288 62077932 69843956 73055519
39979G3055519L652757O113321P382407J1752453K0155677K3273837J9399246
$$ 73055519 76708276 82821597 90204004 101956457 122112134 145385971 164785217
39972A64785217K7221753N8929571Q6800209O5067920q633294p8820157r3334638
$$ 164785217 192006970 250936541 337736750 402804670 394171376 315351219 222016581
39965B22016581o0206252k6798724j8594633k1593393j6815481o086446k81518
$$ 222016581 161810329 135011605 116416972 94823579 78008098 71921652 71640134
39958G1640134j487374m973376p404232o709066j736901L803138L848269j031181
$$ 71640134 70152760 65179384 57775152 51066086 49329185 53132323 56980592 55949411
39950E5949411l822685j767678L83819p88377k986716m342170o109654p286939
$$ 55949411 52126726 50359048 50742867 49954490 46967774 42625604 36515950 29229011
39942B9229011m496435O19158J983003p68303j347454J624599J789384k820773
$$ 29229011 24732576 25351734 27334737 26566434 25218980 26843579 28632963 25812190
39934B5812190n174523j657223J314484o97120j956284J924730M563507M93983
$$ 25812190 20637667 18980444 20294928 19597808 17641524 19566254 24129761 24623744
39926B4623744l269118J146184P390204M581622l927517n604924R61292N012875
$$ 24623744 21354626 22500810 29891014 34472636 30545119 24940195 25901487 30914362
39918C0914362J712261k214413j685486J39759N48576J898992M969642O681443
$$ 30914362 32626623 30412210 28726724 28866483 29415059 31314051 36283693 42965136
39910D2965136O484010O981819P461725N261295L447952P478931J4737127J8887185
$$ 42965136 49449146 56430965 63892690 69153985 72601937 80080868 94817995 113705180
39902A13705180K4041932L9200074N5728751M8482754R275000l5502250n3929440
$$ 113705180 137747112 176947186 232675937 281158691 290433691 254931441 201002001
39895B01002001m4577106k9984628k3714798k0592654j4533581p998226k757535
$$ 201002001 156424895 126440267 102725469 82132815 67599234 59601008 56843473
39888E6843473L865947R941320P847156l295670j3425560j4318558r005832m396618
$$ 56843473 60709420 70650740 78497896 75202226 61776666 47458108 38452276 34055658
39880C4055658j631443J529372M670184O202934O837617P637663Q058940Q547837
$$ 34055658 32424215 33953587 38623771 44826705 51664322 59301985 67360925 75908762
39872G5908762J1045276J5049463J8777505K6205913M4124373O5923837O7355429
$$ 75908762 86954038 102003501 120781006 146986919 191111292 257035129 324390558
39865C24390558L1081833k6982100o8237336p0562281m7678423k7121550j9611551
$$ 324390558 355472391 328490291 260252955 189690674 142012251 114890701 95279150
39858I5279150j7150698j2562795q610111q957551j0679364r379553n651173k511532
$$ 95279150 78128452 65565657 56955546 47997995 37318631 27939078 22287905 19776373
39850A9776373l51868J679002K014881j271698n859967o782556l045652P40581
$$ 19776373 19424505 21103507 23118388 21846690 15986723 9204167 6158515 6899096
39842F899096O51472j369497p98003K793434N227326L570692k07553k272406j556271
$$ 6899096 7550568 6181071 5383068 8176502 13403828 16974520 16766967 14494561 12938290
39833A2938290J88686J599108K806998L579734K519728q01915m005322l674357
$$ 12938290 13126976 14726084 17533082 21112816 23632544 22830629 18825307 15150950
39825A5150950P90729N843801P074005L911188L20684J66860K763899M633236
$$ 15150950 15941679 21785480 28859485 32770673 33091357 33258217 36022116 40655352
39817D0655352M948029O046226P761302N393471l272077j2101880j2937013o411291
$$ 40655352 45603381 51649607 59410909 64804380 61532303 49430423 36493410 30082119
39809C0082119q66268p65303k439799k343320k433461m096296l523959J409789
$$ 30082119 29215851 28450548 26010749 23667429 21233968 17137672 13613713 15023502
39801A5023502N136839K058547l693807l753234J576743L955983n6722m611630
$$ 15023502 20160341 22218888 18525081 14771847 16348590 20304573 20247851 15636221
39793A5636221m204995p03025J428091J137328l81572k097701k242997P54122
$$ 15636221 11431226 10728201 12156292 13293620 12912048 10814347 8571350 9325472
39785I325472M790852N714189L508651K178473K628277J388535k158582l808262
$$ 9325472 14116324 19830513 23339164 25517637 28145914 29534449 27375867 23567605
39777B3567605k228584j820568m453190n354293j889147N84560k245282n283913
$$ 23567605 21339021 19518453 15065263 9710970 7821823 8406383 6161101 877188
39769H77188k301188K978994K957407q05436n72202L825722M753091L16539k088867
$$ 877188 -1424000 1554994 4512401 3706965 3134763 6960485 11713576 12030115 9941248
39760I941248J895799O654884N862393J475678j077797r48326j94223J433812
$$ 9941248 11837047 18491931 24354324 25830002 24752205 23803879 23609656 25043468
39752B5043468M714597O808883M103783j813988n162519k985850J663258L873072
$$ 25043468 29758065 36566948 40670731 38856743 33694224 30708374 32371632 36244704
39744C6244704K116686j378950m098229n514494n806771m192497p87285Q58598
$$ 36244704 38361390 36982440 32884211 27369717 21562946 17370449 16583164 17441762
39736A7441762k847912q695017q178398Q76902Q978129O666161k195554n942649
$$ 17441762 14593850 5898833 -2279565 -1402663 7575466 14241627 12046073 6103424
39728F103424j645963K413206P87367j791902k5461L116948K309706j306961l003507
$$ 6103424 4457461 6870667 7658034 5866132 5840671 8957619 11267325 9960364 6956857
39719F956857k116663j282809r26751K09370J097808k4563j543898n87709J710713
$$ 6956857 4840194 3557385 2630634 2840004 3937812 3913249 2369351 1781642 3492355
39710C492355J661954o87146j338194J075671K808773P41810k724244k948739
$$ 3492355 5154309 4467163 3128969 4204640 7013413 7755223 5030979 2082240
39702B082240N41130L345016J738107k577535m225295p30741L773427L182888
$$ 2082240 2623370 5968386 7706493 5128958 903663 172922 3946349 7129237
39694G129237k437354o187724l171563K962417N239949K775223O24536J181117
$$ 7129237 4691883 -1495841 -4667404 -1704987 3534962 6310185 6934721 8115838
39686H115838J020900k298656n151238l057951K061119M218317J804141o16365
$$ 8115838 9136738 6838082 1686844 -1371107 690012 4908329 6712470 6096105
39678F096105N96182L111324K645806o23069k523604q14758K024527K282659n15703
$$ 6096105 6692287 9803611 12449417 11826348 9302744 8487986 10512513 12795172 12279469
39669A2279469l541872m151850k416288k29555J272809K512601L632267L274466
$$ 12279469 8737597 4585747 2169459 1939904 3212713 5725314 9357581 12632047
39661A2632047O58391k090568k150565l53950k25811k126735k259620O74137K261663
$$ 12632047 13290438 11199870 9049305 8695355 8469544 6342809 4083189 4757326 7018989
39652G018989o39322l938908k515345J226538J646920q7726J434847M709091K696423
$$ 7018989 6379667 2440759 -74586 1151952 2798872 2711146 4145993 8855084 11551507
39643A1551507l734308m693942K604863P456471K092458n316787l441095M328808
$$ 11551507 7817199 3123257 5728120 13184591 15277049 9960262 6519167 10847975
39635A0847975O163751O66994l001439j395036n38847l125615l829092o7044K797696
$$ 10847975 17011726 17678720 14677281 13282245 12743398 9617783 5788691 5721647 8519343
39626H519343J003102j382674k37504J791829Q54054j785519l379884m248288
$$ 8519343 9522445 8139771 7902267 9694096 10548150 8762631 5382747 1134459
39618A134459m611760k205117K681957M916730J903495j529964n10119K247492
$$ 1134459 -3477301 -5682418 -3000461 1916269 3819764 2289800 1779681 4027173
39610D027173J723710o67874j04623K848147L339156O75934q85460M46245J706533
$$ 4027173 5750883 5083009 4978386 7826533 11165689 11841623 10956163 11402408 13108941
39601A3108941R65020K67225J401048K868013K777202J565335K24303j516439
$$ 13108941 14073961 14341186 15742234 18610247 21387449 22952784 23177087 21660648
39593B1660648l565209m180695k147830J121548L247306L729402L728675L610369
$$ 21660648 18095439 13914744 11766914 12888462 16135768 19865170 23593845 27204214
39585B7204214K270573q92041m514444o497443o081428m010335j343289P65166
$$ 27204214 29474787 28582746 24068302 17570859 11489431 7479096 6135807 6900973
39577F900973R19007q39057j628799J084159M720726L863930j412397m140149
$$ 6900973 7819980 6980923 5352124 6436283 11157009 15020939 13608542 9468393
39569I468393l33659M505180L435975j692161m230606l310609k814968k394946
$$ 9468393 9134734 13639914 17075889 15383728 11153122 7842513 5027545 2632599
39561B632599J395342N870197M060883l032889n940499j223869L244974J623331
$$ 2632599 4027941 9898138 13959021 10926132 4985633 3761764 7006738 8630069
39553H630069j031130Q16127L106793N41260k732341k01712M951589M771214l41910
$$ 8630069 7598939 8415066 11521859 12063119 9330778 9129066 14080655 18851869 18509959
39544A8509959l069700j218621Q97973J400279K163919K204564j301956n463886
$$ 18509959 15440259 14221638 15119611 16519890 18683809 20888373 19586417 14122531
39536A4122531l855868K841102O453582L037207k442798m760477m449600l097901
$$ 14122531 10266663 13107765 19561347 22598554 20155756 15395279 10945679 7847778
39528G847778J47818M310481N145306J458327k278317k524570j034238k76924
$$ 7847778 7995596 12306077 17451383 18909710 16631393 14106823 13072585 12795661
39520A2795661K31480N66110j034183l400414k105935K719481M419107k0561m068671
$$ 12795661 13027141 13593251 12559068 9158654 7052719 9772200 14191307 14170746 10102075
39511A0102075j591669L051522K034930l214484m558840k0117M148707L688285
$$ 10102075 8510406 11561928 13596858 10382374 5823534 5803417 9952124 13640409
39503A3640409J080271n39668j473558k028324q96255J080051O64674k067691
$$ 13640409 14720680 14181012 12707454 10679130 9782875 10862926 11527600 9459909
39495I459909k489741J561393N814327N652738K429880K04746o01831k034402
$$ 9459909 6970168 8531561 14345888 19998626 22428506 22633252 22031421 19997019
39487A9997019l255471j267744L287902N434875K356710k306808k785067J430839
$$ 19997019 16741548 15473804 18761706 24196581 26553291 24246483 21461416 22892255
39479B2892255M588689J472806n891582r757902n370540L157933P349922L994805
$$ 22892255 27480944 28953750 23062168 13304266 7933726 11091659 18441581 22436386
39471B2436386k163353n240359m391893j975731Q94202L982022N575699M192374
$$ 22436386 20273033 15032674 10640781 8665050 9559252 13541274 19116973 23309347
39463B3309347J478029J21639j50900j222487k415587j758503o17348k100478
$$ 23309347 24787376 24909015 24758115 23535628 21120041 19361538 18744190 16643712
39455A6643712m737017l400141K020240M754127R48064m134166l950001Q1248
$$ 16643712 11906695 8506554 10526794 15280921 16228985 12094819 8144818 8226066
39447H226066K467271K717518M092673O020415M865927J165880p73254l00658
$$ 8226066 10693337 13410855 17503528 23523943 28389870 29555750 28782496 28481838
39439B8481838p33775j937537J85949N189465O371120Q35079n199975n400865
$$ 28481838 27748063 25810526 25996475 31185940 37557060 38392139 33192164 27791299
39431B7791299j968023k72573R2821K663586O153995O147376L020455J525267
$$ 27791299 25823276 25550703 25643524 28307110 34461105 40608481 43628936 45154203
39423D5154203K863478L406605J983619K525050P339548J2658486J4075962J2985000
$$ 45154203 48017681 51424286 53407905 55932955 63272503 75930989 90006951 102991951
39415A02991951J3938500J7668003K0668229K1331607K2850876K8634542L7144472
$$ 102991951 116930451 134598454 155266683 176598290 199449166 228083708 265228180
39408B65228180M3399389M4282955L9580551K8267235Q223361j7652637l8501417
$$ 265228180 308627569 352910524 392491075 420758310 428981671 411329034 372827617
39401C72827617m3916466l5067133k3180928j6705722j4407305j1847079q866672
$$ 372827617 328911151 293844018 270663090 253957368 239550063 227702984 218836312
39394B18836312p225710n480207j349073L267846M689456L843922N667065J2155749
$$ 218836312 211610602 206130395 204781322 208049168 212738624 216582546 222249611 234405360
39386B34405360K0039150K6010969L0610205L5016803L6285709K8487609R109753
$$ 234405360 254444510 280455479 311065684 346082487 382368196 410855805 419965558
39379D19965558j6393214l7502661m7134769m6977723m3277969l8536248l0594182
$$ 419965558 403572344 366069683 318934914 271957191 228679222 190142974 159548792
39372A59548792j9727169j1637394j0632078j3518050j3999111j0670894o947868
$$ 159548792 139821623 128184229 117552151 104034101 90034990 79364096 72416228
39365G2416228n149983m789778n380246o712020o913249m215617o15651j37598
$$ 72416228 67266245 62476467 57096221 50384201 43470952 39255335 38639684 38502086
39357C8502086l107886n432405m176788r20418J298993J726872J267674J50044
$$ 38502086 35394200 29961795 25785007 24864589 26163582 27890454 29158128 29308172
39349B9308172j944879m055004l814253j45019M062950L769987j957141p153573
$$ 29308172 27363293 23308289 19494036 19349017 23411967 27181954 25224813 18071240
39341A8071240n821368m97945J046584k382232l612781Q36586M551948J925163
$$ 18071240 12249872 11751927 12798511 10416279 6803498 7640084 12192032 14117195
39333A4117195k081940k01460M728882M584458m67768k897125m98776J644822
$$ 14117195 12035255 11833795 16562677 21147135 20679367 17782242 17283466 18928288
39325A8928288J496793K491314M595481K719654l284526o048707j926239L134244
$$ 18928288 20425081 22916395 27511876 30231530 26947004 20898297 18972058 22106302
39317B2106302L212857O22589j48474K04870k51313K96567K754705L213368l30312
$$ 22106302 25319159 25941748 25793274 25998144 25746831 26043398 28798103 32011471 31681159
39308C1681159k778311O6718L548542J624592k444986j588224K421789J790524
$$ 31681159 28902848 28969566 32518108 34142700 31697714 30109490 32531279 34321803
39300C4321803l203878l532868L699272R512078O249800j330272l783580j43779
$$ 34321803 31117925 27585057 31284329 40796407 47046207 45715935 41932355 41788576
39292D1788576L133997L091343L176478N585545O795496L229176k262135l411333
$$ 41788576 44922573 48013916 51190394 56775939 63571435 66800611 64538476 61127143
39284F1127143P36748L779994K54473o645411q969849m621395J75733k37941m004304
$$ 61127143 61863891 65643885 65898358 59252947 50283098 45661703 45837436 45599495 41595191
39275D1595191o019291n035178k718945Q96749N859736Q465702N096302p43574
$$ 41595191 35575900 30540722 27821777 28718526 34578262 43043964 48140266 47396692
39267D7396692j561935L181574N712540J807226k431137j76225N079348M692218
$$ 47396692 45834757 49016331 54728871 56536097 54104960 53928735 59008083 63700301
39259F3700301j887955o592092n184790k809074m722995p893541o562366j941571
$$ 63700301 61812346 55220254 50035464 47226390 42503395 34609854 28047488 26105917
39251B6105917l26577l221732n384988l151773O10391J725096M97401m66004p19638
$$ 26105917 25779340 22557608 17172620 14020847 14631238 16356334 16853735 16387731 15668093
39242A5668093r64366l58767J430960J681691j695278n399589m254772J131678
$$ 15668093 14703727 14344960 15775920 17457611 15762333 10362744 6107972 7239650
39234G239650M798782L528271j0926k515116l561896k979860n139L039385J615207
$$ 7239650 12038432 15566703 15555777 13040661 9478765 6498905 6493766 9533151 11148358
39225A1148358l537063n114606L39532N754766L046530m507577o480409j10341
$$ 11148358 7611295 2496689 2836221 8590987 11637517 7129940 649531 539190
39217E39190O372588N529399n83184n095096m555738l85447L826027M379814K03258
$$ 539190 6911778 12441177 11857993 6762897 2207159 1821712 5647739 10027553 10230811
39208A0230811m588188l972313K250008O941323L994562m196041r742387p851211
$$ 10230811 5642623 1670310 3920318 10861641 14856203 10660162 917775 -6933436
39200f933436o66560N752233O806023L144860j11139N40591K092350o35047o150823
$$ -6933436 -7599996 -1847763 4958260 8103120 7991981 8532572 10624922 9989875 3839052
39191C839052o995116p53282N448624M926121M81057j466774q18319j257588j651483
$$ 3839052 -3156064 -3909346 1539278 6465399 6946456 5479682 4661363 3403775 1752292
39182A752292J823645O761849O378027M27853l997407l865659m051477p135366
$$ 1752292 3575937 10337786 16715813 17143666 13146259 9280600 5229123 -1906243
39174a906243p774312k066991M641547N477439K040047K59806Q52581P74898N06240
$$ -1906243 -9680555 -11747546 -7105999 -1628560 411487 671293 1523874 2298772 2805012
39165B805012K455258M485912K406373k374484m536779l265726k306725k447442
$$ 2805012 5260270 9746182 12152555 9778071 5241292 1975566 -331159 -2778601
39157b778601j021087J405020J298002m87075P15484M400440M556051L26754j473201
$$ -2778601 -3799688 -2394668 -1096666 -1583741 -868257 3532183 8088234 8414988 6941787
39148F941787J976396L794393j197003o858702m705797K988299O833164L726955
$$ 6941787 8918183 12712576 11515573 4656871 -48926 2939373 9772537 13499492
39140A3499492o69801j157983J458951L323154J533501l775162q170320o067025
$$ 13499492 12829691 11671708 13130659 16453813 17987314 14212152 6041832 -25193
39132b5193J667108O693087L759956j776628k139014J356487J722023j949716
$$ -25193 1641915 8335002 12094958 10318330 8179316 9535803 11257826 9308110
39124I308110m005351k113804M8611J6067l64682K73296P74137R91497K320721
$$ 9308110 5302759 3188955 3237566 3253633 2888951 3162247 3936384 4927881 7248602
39115G248602M200239M514783L336915K097183K09010k842214m176784k067049
$$ 7248602 11448841 15963624 19300539 21397722 21606732 18764518 14587734 12520685
39107A2520685j114000n394827r065138l607365O668758Q058993j951879r619783
$$ 12520685 11406685 6011858 -3053280 -6660645 8113 8067106 6115227 -3504556
39099c504556m980115M295778N975598N25995l343728k876517j501223p9968K681515
$$ -3504556 -8484671 -4188893 1786705 2312700 -1031028 -3907545 -5408768 -5488736 -2807221
39090b807221M343180J833196j691741q17593K904265L013191j597421n376166
$$ -2807221 1535959 3369155 1677414 859821 3764086 6777277 5179856 -196310
39082a96310m713045j635279R87512K296440J608824r64378k278855K67651L408734
$$ -196310 -4909355 -6544634 -5557122 -3260682 -1651858 -2616236 -4895091 -4627440 -1218706
39073a218706J959660k296848k381084K518208M812197K75647m954723l740065
$$ -1218706 740954 -1555894 -3936978 -1418770 3393427 3669074 -1285649 -5025714
39065e025714J382483K958813K41601r91760J193123J938365j697648n201496
$$ -5025714 -3643231 -684418 -442817 -1434577 -241454 1696911 -737 -5202233
39057e202233l211421K390165N274217L369970M10028l43326M52529J300791K176015
$$ -5202233 -8413654 -6023489 -749272 2620698 3030726 2687400 3139929 4440720 6616735
39048F616735K528153Q77728j778954k007176K97912M37519l368636n378228p72447
$$ 6616735 9144888 10022616 8243662 6236486 6534398 6971917 3603281 -1774947 -2547394
39039b547394N242437M028879l004498n884496j015780L890043K045747k958085
$$ -2547394 2695043 6723922 3719424 -2165072 -3180852 709191 2754938 -203147
39031b03147l933398l23696L023238L110406O17261k396088l331770n45879L437097
$$ -203147 -4136545 -4460241 -1437003 1673403 2290664 -105424 -3437194 -3983073 -545976
39022e45976L476567j114269m774209l390400K73169J614512M85773p34415j349250
$$ -545976 2930591 1816322 -2957887 -6348287 -6075118 -4460606 -3974833 -4709248 -6058498
39013f058498j259520N26921L078197L179409Q83959Q70797M731011O964380L124469
$$ -6058498 -7318018 -6791097 -3712900 -533491 350468 1221265 5952276 12916656 16041125
39004A6041125l014128n531259m751782l890658k243289J488223L474023J72345
$$ 16041125 13026997 7495738 2743956 -1146702 -3389991 -1901768 1572255 1744600
38996A744600l889830k039064L247723L671049j546650m589583j491596K902472
$$ 1744600 -2145230 -4184294 -936571 2734478 1187828 -3401755 -4893351 -1990879
38988a990879L823902K666924J917360Q09036j118647j827118r61323j241076
$$ -1990879 1833023 4499947 6417307 7226343 6107696 4280578 3319255 2078179
38980B078179l017457k278783K701347O951848N005365j202577m580220j950456
$$ 2078179 -939278 -3218061 -516714 6435134 11440499 10237922 5657702 3707246
38972C707246K360634K410025j858249m698193k284881J818898J632070k160014
$$ 3707246 6067880 8477905 6619656 1921463 -363418 1455480 3087550 927536
38964I27536l004308J154200M444582K607799m80300k68719P99237q71596k474682
$$ 927536 -2076772 -922572 3522010 6129809 5649509 5380790 6180027 5308431 2833749
38955B833749o06474Q54026k342812m906634J99677P640218N907084l710745p788968
$$ 2833749 2227275 3081301 738489 -4168145 -3968468 3671750 9578834 5868089 -1920879
38946a920879j609347M134841J240421m140558l707626l0372M62163j252812q12650
$$ -1920879 -3530226 604615 1845036 -2295522 -6003148 -6033520 -5571357 -6824169 -7636819
38937g636819R32521J108013J166372L066282M105490K068453M89199K264150
$$ -7636819 -6704298 -5596285 -4429913 -1363631 2741859 4810312 5299511 7563661
38929G563661L261654n23448m566220k816110J252367m1365n083184m916216K004350
$$ 7563661 10825315 10301867 5735647 2919537 4171904 4130539 -952645 -5868861 -3864511
38920c864511O998494M643697J17379k77697J551048M85645k829962l688042j119852
$$ -3864511 3133983 7777680 7895059 7617362 9168410 9654055 6824093 3136051 2016199
38911B016199J363712J901469K398735L824361L478592n14554m688741m165965
$$ 2016199 3379911 5281380 7680115 11504476 14983068 14468514 9779773 5613808
38903E613808k73472N13076l646633o385911k652654L074623L528721k88804j864442
$$ 5613808 5340336 5853412 2206779 -4179132 -6831786 -3757163 -228442 -517246 -2381688
38894b381688k69619k0191j112068J088902N349955M361238k227911n002054L28065
$$ -2381688 -2651307 -2671498 -3783566 -2694664 2655291 7016529 4788618 -213436 114629
38885A14629N399815L009087j334287r2595K944649M87031m176675k849024K633522
$$ 114629 5514444 8523531 7189244 7096649 10041298 10528329 6351654 3502630 6136152
38876F136152L467675q95170k752486o7347J532777N20538J389858L789441J576237
$$ 6136152 9603827 8708657 5956171 5888824 7421601 7942139 9331997 13121438 14697675
38867A4697675m834827o758214j701316J618106k093228n761638k474813K863800
$$ 14697675 9862848 3104634 1403318 3021424 928196 -4833442 -7308255 -4444455
38859d444455K930423O77472K700520O349807M423399j336241k647015J140980
$$ -4444455 -1514032 -836560 1863960 8213767 12637166 11300925 8653910 9794890
38851I794890K092066k700955o506421m275899p1172N07249j395491j478516P52957
$$ 9794890 11886956 9186001 2679580 -1596319 -1667491 -1160242 -2555733 -4034249 -3281292
38842c281292K771008L241534K039924q60101l540520k350608K825674O479334
$$ -3281292 -510284 2731250 4771174 3911073 370553 -1980055 845619 7324953
38834G324953M186833j244522m176268m097881m370202m861170j865676M405315
$$ 7324953 11511786 10267264 6090996 1993115 -2377087 -7238257 -9103933 -4698618
38826d698618Q124418N732352Q71454j379926j273628j816284k710039j605225
$$ -4698618 3425800 9158152 10029606 8649680 7376052 5559768 2849729 1244504
38818A244504L78333l21633l166599l148164J367843M956907K582142k569914
$$ 1244504 1622837 1301204 -1865395 -5013559 -3645716 1311191 3893333 1323419
38810A323419l314661R09376L056721q33463n135733k640247M346512O649065
$$ 1323419 -1991242 -1081866 1974855 1141392 -3994341 -6634588 -2288076 4360989
38802D360989J332965m116785k906361J502536J672995k144370l311300J5776
$$ 4360989 5693954 1577169 -1329192 173344 1846339 -298031 -3609331 -3593555
38794c593555K408032N16102k097400j798782k75952K55037J454511M224435N009841
$$ -3593555 -1185523 -669421 -2766821 -4565603 -4841555 -4586518 -3132007 1092428 6102269
38785F102269J839273q20278R02524L063118O48177k832923j078862K984080J109317
$$ 6102269 7941542 7121264 8023788 11086906 11735083 8902160 7823298 10807378 11916695
38776A1916695n659680p375992j246463L779449J711564j761915m73597J977907
$$ 11916695 6257015 -1118977 -2365440 1414009 3125573 1363658 890061 2867968
38768B867968K90369k366388o94064K476591J377662j822414q73538K698447J450929
$$ 2867968 3158337 791949 97885 2574476 3952138 2129724 1256186 3954633 5405562
38759E405562m956909q024920l205254L489831M563975O17343k613066k378849
$$ 5405562 448653 -7576267 -10781521 -7291690 -2727715 -2110372 -4723438 -7102287
38751g102287m32336R76142J441279J663986K104841K152766N55506k548557m610206
$$ -7102287 -7534623 -6558481 -5117202 -3453216 -1348375 804391 1359897 -1188660 -5798866
38742e798866l120561J219664M931712M963494R96368m097754n675517j598429
$$ -5798866 -8919427 -7699763 -2768051 2195443 3191811 -905943 -6581460 -8179889
38734h179889L965916M195617j256981m630791l92454O782268Q495953L645420
$$ -8179889 -4213973 -18356 -1275337 -5906128 -6298582 483686 8979639 12625059
38726A2625059j990232m342018l702020r45725K862971M256067O88210m352909
$$ 12625059 10634827 6292809 2590789 1645064 4508035 8764102 9452312 5099403
38718E099403m988707j238738J726487J930730K091267K968111J878516j278355
$$ 5099403 110696 -1128042 598445 2529175 4620442 7588553 9467069 8188714
38710H188714k930546k197902k240564l685581l032743L09594J904807K4646r14015
$$ 8188714 5258168 3060266 819702 -2865879 -5898622 -5589028 -3684221 -3659575 -4573590
38701d573590J791444M051164K115302j001558j248662m32334j771308l194381
$$ -4573590 -2782146 1269018 3384320 2382762 1134100 701766 -1069542 -4263923
38693d263923j217558K250739L200045K420541K922545L466230J244997j638419
$$ -4263923 -5481481 -3230742 -30697 2389844 5312389 8778619 10023616 8385197
38685H385197j428725j77332k270955n294377l078318K752955L907438p46053
$$ 8385197 6956472 6779140 4508185 -786192 -3864510 -1111555 2795883 2049830
38677B049830k505563K655677O649724K140919n452816o434993j109104K760570
$$ 2049830 -455733 2199944 8849668 10990587 5537771 -897222 -2006326 754244
38669G54244K404711J312849P58867j203440l336281k104596R36364M44436l230084
$$ 754244 3158955 4471804 5230671 4027231 690950 -1413646 -477282 -32846 -3262930
38660c262930l683991O62288L299647N39343j996260J025325N117012K993245
$$ -3262930 -6946921 -6284633 -2984986 -2445643 -4441903 -3416578 1700434 4693679
38652D693679l281676m935552M44556N635347M052789k124284n718949l182504
$$ 4693679 1412003 -3523549 -3078993 2556354 6609143 4484859 -1234090 -4416594
38644d416594K062690L721541j01480l901745j302888N378906O858545R7316o355302
$$ -4416594 -2353904 1367637 1266157 -2635588 -3938476 1440430 8298975 8396291 2040989
38635B040989m776359K86650K50839l209380j940670L756144N261330L87330l192927
$$ 2040989 -2735370 -2448720 -2197881 -5407261 -7347931 -3591787 1669543 2056873 -1136054
38626a136054r86899K425174L390125M600758O429136L420502m640773q196109
$$ -1136054 -2122953 302221 3692346 8293104 14722240 18142742 13501969 5305860
38618E305860k087339M692429K340653m537177n184432L72200L819194L122729
$$ 5305860 3218521 7910950 10251603 5714426 529994 902194 4721388 7844117
38610G844117K860602L151354J68309l800879k515576K159314J682943m781852
$$ 7844117 10704719 13856073 14024382 10223503 7707927 9867241 11550184 6768332
38602F768332q465067n335598j476539j189236n47605K733987L414766j046162
$$ 6768332 -1696735 -7032333 -8508872 -9698108 -10245713 -7511726 -4096960 -5143122
38594e143122l592408J329311P171829M529196m182978q119546l146328M344294
$$ -5143122 -8735530 -7406219 -234390 4294806 111828 -8007718 -11154046 -6809752
38586f809752P289488M875415K86338k816295j894905J795080K787152k090734
$$ -6809752 479736 5355151 5641489 2825194 930289 2725369 5512521 3421787
38578C421787p794168o432689J789271Q020006O044969l43940l332371j067213
$$ 3421787 -4372381 -10805070 -9015799 -995793 5049176 4705236 1372865 305652
38570C05652J491364L32360k363344j960444J557208L180723O1585m001028l874908
$$ 305652 1797016 2129376 -233968 -2194412 -637204 2543519 2605104 -1395924 -5270832
38561e270832m97352J134130l6882l97723J117917J128418j157857j062287L823691
$$ -5270832 -5768184 -4634054 -4670936 -5068659 -3950742 -2822324 -3980181 -5042468 -1218777
38552a218777Q152159N941145n10118m134165l079173j704920k696564l455225
$$ -1218777 6933382 12874527 12364409 8230244 5151071 3446151 749587 -2705638
38544b705638r44256L648775O312135M408501q54335n133353m818812r92203J934134
$$ -2705638 -3649894 -1119 6311016 10719517 9865182 4731829 -86983 -1079186 854948
38535H54948K030677J526209J711785L55819l192382m789268j661335K085685
$$ 854948 2885625 4411834 6123619 6479438 3287056 -1502212 -3163547 -1077862
38527a077862J464797j148987k01688L005543K110930l129790n548298j808940
$$ -1077862 386935 -762052 -963740 2041803 4152733 1022943 -4525355 -6334295
38519f334295K606731K518952M18344O79780K140312J484115l07278k90865P29457
$$ -6334295 -3727564 -1208612 -790268 -110488 2029824 3513939 3206661 2915796 3645253
38510C645253J32632j138787l70307J426256J203782j0651J479990M618553L760924
$$ 3645253 3777885 2639098 2268791 3695047 4898829 4888178 6368168 10986721 14747645
38501A4747645k290781p268332o242539k306256o42434m82706J773548M676728
$$ 14747645 12456864 5188532 -1054007 -3360263 -4002697 -4485403 -2711855 1964873
38493A964873L403268j731607m728513k588667R21607J807615J191145J559044
$$ 1964873 5368141 3636534 -1091979 -3680646 -2759039 -951424 239721 1798765
38485A798765J915534J49763k651762l638617k050795Q71308L764025M795471
$$ 1798765 3714299 3864062 1212300 -2426317 -4477112 -3605804 158221 4953692
38477D953692K197964k299591l718626o72734J555946j084014m212476j534947
$$ 4953692 7151656 4852065 1133439 460705 2016651 932637 -3279839 -4814786
38469d814786M444223N550058M87217l559851k250375O92623J332945J236430
$$ -4814786 -370563 5179495 5666712 2106861 -143514 549109 1882054 3118484
38461C118484K253942K120209o53047k762295j263752J541155K290195J617224
$$ 3118484 5372426 7492635 6839588 4077293 2813541 4354696 6644891 8262115
38453H262115J219123o6334l012838m542991k104281J528348K256045P20819P4646
$$ 8262115 9481238 9414904 6402066 1859075 -245206 1283142 3539187 4260006 4334652
38444D334652L88102k22537j246280j018343k40496j04010Q04565L417641M531570
$$ 4334652 4722754 4500217 3253937 2235594 1995098 1891088 2695653 6113294 10644864
38435A0644864J152691l663238m569929j854917k61659j189875j593174m4638
$$ 10644864 11797555 8134317 3564388 1709471 1447812 257937 -1335237 -1379875
38427a379875J365974J173274J35890j070027j911340p75690K329971L602536
$$ -1379875 -13901 1159373 1295263 225236 -1686104 -2461794 -131823 3470713
38419C470713O09041k529956p84792L074856K290989k733126m835815j484939
$$ 3470713 4079754 1549798 765006 3839862 6130851 3397725 -1438090 -2923029
38411b923029K121926K154441O65663l45604j788540k620306K18546M815000M966845
$$ -2923029 -801103 1353338 2019001 1673397 -115143 -2735449 -2516903 2298097 7264942
38402G264942L20533k324530o30190m04874l668692l374413L403860P216951N78543
$$ 7264942 7585475 5260945 4630755 4225881 557189 -2817224 586636 7803587 8382130
38393H382130q017391n919983L970519P853723J811734m750368n172071k736492
$$ 8382130 364739 -5555244 -1584725 6268998 8080732 3330364 -1841707 -4578199
38385d578199j014887J549583M841660M738006Q92032j570185j132936k336592
$$ -4578199 -5593086 -4043503 798157 5536163 6428195 4858010 3725074 1388482
38377A388482n930270n500967J232573O256538K980619k988985k552382K849729
$$ 1388482 -4541788 -10042755 -8810182 -2553644 426975 -2562010 -5114392 -2264663
38369b264663M503337M21032k644963k86633M084206N596069L833949J049556
$$ -2264663 2238674 2659706 14743 -271890 3812316 9408385 13242334 14291890
38361A4291890j134992j906649j318677r68664k201137l677108l169618j227416
$$ 14291890 13156898 11250249 9931572 8962908 6761771 3084663 -84955 -1312371
38353a312371k61024n80298l89746P06661J302612R76456M61816n06734k314967
$$ -1312371 -1573395 -2153693 -2543439 -1836778 -534166 442290 904106 397372 -1917595
38344a917595l050255o98412K637786K944334P05917L72047K835504L753316J053334
$$ -1917595 -4967850 -5666262 -3028476 -84142 621775 993822 3829326 7582642 8635976
38335H635976j361212l74269J015996p30473l270761k666757m93923o46717j591976
$$ 8635976 7274764 6900495 7916491 7186018 3915257 1248500 754577 107860 -1484116
38326a484116J276195O509087P200460J729532l064152k169538L26830j456082
$$ -1484116 -207921 6301166 13501626 15231158 12167006 9997468 10324298 8868216
38318H868216n612731n913178j898707P51047p69804k756373j364396K031145
$$ 8868216 3255485 -2657693 -4556400 -3805353 -4575157 -7331530 -8695926 -6664781
38310f664781L833503L094492J042717j529212l698967l310348L46060L825369
$$ -6664781 -2831278 263214 1305931 -223281 -3922248 -7232596 -6886536 -3061167
38302c061167K886755j512332l839113j351231K318316K652417M59811k75912
$$ -3061167 -174412 -1686744 -5525857 -6877088 -4558772 -1906355 -1446544 -1722456
38294a722456J247081K214499J409359P38997R49295n6243k691524l347257M3818
$$ -1722456 -475375 1739124 3148483 3887480 4836775 4780532 2089008 -1258249 -1214431
38285a214431L162513Q09144m321397m174438K727520P771473L799940m514236
$$ -1214431 1948082 2757226 -1564171 -5738609 -3011089 4760384 8560324 4046088
38277D046088o901207j480784L639238K686090j84822J427313N785369N757323
$$ 4046088 -2855119 -4335903 -696665 1989425 1804603 3231916 9017285 14774608
38269A4774608N3691m399804k596260J222369Q3081n113076o755440j721871L968935
$$ 14774608 14828299 10428495 7832235 9054604 9137685 4024609 -2730831 -4452702 -483767
38260d83767L690450q97305l276212j735456n79176k049693k344416J969563P435337
$$ -483767 3206683 2309378 -966834 -2702290 -3281466 -5331159 -7675575 -5706012 1729325
38251A729325P645661K133981k876702k846529k38215K15993j552184j882249
$$ 1729325 9374986 11508967 8632265 5785736 5547521 5763514 4211330 2329081
38243B329081L28653K040189J019408q92269q69734R52214K493737K941064K887456
$$ 2329081 2657734 4697923 5717331 4825062 3955328 4907542 7401279 10342343 13229799
38234A3229799K473066J408429L9602j277146k841798m116110l284636m95603
$$ 13229799 15702865 17111294 17150896 15873750 13031952 8915842 5631206 5135603
38226E135603O14288k060505m617591k221287K855263L985677N04341j465942
$$ 5135603 5749891 3689386 -928205 -3149492 -294229 3691448 4195789 2729847
38218B729847N11133J317344k081840m419803p10040M996910N831123K438348
$$ 2729847 3240980 4558324 2476484 -1943319 -2653359 2343551 8174674 10613022
38210A0613022J60272n07388l019623o482930o006995r59705L716593M488047
$$ 10613022 10773294 10265906 7246283 763353 -5243642 -6203347 -2486754 2001293
38202B001293K037707k194051o520544p035948j562551M977324N694038J659407
$$ 2001293 4039000 1844949 -4675595 -11711543 -13274094 -8296770 -2602732 -943325
38194i43325l11938J019778O89480j817827j187587K621862K333277l678247o525612
$$ -943325 -1255263 -235485 453995 -1363832 -2551419 70443 2403720 -1274527 -7800139
38185g800139p49099O155140N446857K29300j610071n49351j935878m647224l461673
$$ -7800139 -8549238 -2394098 3052759 3282059 1671988 1122637 -813241 -5460465 -8922138
38176h922138N29081J727037L12904J394399M882417N241854J422161j349194
$$ -8922138 -8393057 -6666020 -6353116 -4958717 -76300 5165554 6587715 5238521
38168E238521n69809L56718p09809j284389P6284Q83382m14376j809489j721206
$$ 5238521 4668712 5025430 4315621 3031232 3107516 3990898 3576522 1767033 45827
38159D5827j082314l60799J009121J665848k76520k437514l57993M665875N946844
$$ 45827 -1036487 -1397286 -388165 1277683 1001163 -1436351 -1794344 2871531 8818375
38150H818375J259620l643207l731030j141528J36500N83330K165602L465873
$$ 8818375 10077995 6434788 2703758 1562230 1698730 2282060 4447662 7913535
38142G913535K183475n88393k362210k946285k969601j484517J601254L210360
$$ 7913535 10097010 9508617 7146407 4200122 1230521 -253996 1347258 4557618
38134D557618Q57047l014570l817795q02350K575423L347132J678849m91366j470313
$$ 4557618 5414665 2400095 -1417700 -2220050 355373 3702505 5381354 4889988 3419675
38125C419675q37535L57425Q70710R22720J285166R99185j396459m113646l112729
$$ 3419675 2582140 2939565 3810275 4732995 6018161 7017346 5620887 1507241 -1605488
38116a605488J624617M269617L87457o347999p928383j669885O401865P963886
$$ -1605488 19129 4288746 4676203 -1671796 -9600179 -11270064 -4868199 3095687
38108C095687J163759p055528p694624L76647Q323979P354692m58416n152733
$$ 3095687 4259446 -2796082 -10490706 -10114059 -1790080 5564612 5106196 -46537
38100d6537k174673K502350K005554k016764l256533k73518K497941J740514p97241
$$ -46537 -2221210 281140 2286694 269930 -2986603 -3260121 -762180 978334 181093
38091A81093j445573P55899L214523K904968K02484j163565R04865L446639K648137
$$ 181093 -1264480 -508581 2705942 5610910 5813394 4649829 5554694 9001333 11649470
38082A1649470r3252n40168R00245l54503m767178p074710m700133j542177o40391
$$ 11649470 11556218 11016050 11916295 11561792 6794614 -280096 -4980229 -6522406 -7162797
38073g162797O54928M287368O297090L191788j473401k494942q28416l54223p19638
$$ -7162797 -6507869 -2220501 4076589 7268377 5794976 3300034 2471618 2117395 1397757
38064A397757N35804K009742Q36585j595395k232844j964283k761675k370917
$$ 1397757 1933561 3943303 4779888 3184493 951649 -1012634 -3774309 -6145226
38056f145226J489128M757477K486443j980685j689013K204153K737453j77504
$$ -6145226 -4656098 101379 2587822 607137 -1081876 1122277 3859730 3682226
38048C682226O4222L705463L095337l441104p411060m101025j09606j101663k122140
$$ 3682226 3746448 7451911 10547248 7106144 -304916 -4405941 -4515547 -5617210 -7739350
38039g739350K070922N960532K379408m108890l914336J770749L183104j850721
$$ -7739350 -5668428 292104 2671512 -1437378 -5351714 -3580965 -397861 -2248582
38031b248582n091981j817992K614407K841858J463986K590791M138554K051469
$$ -2248582 -7340563 -9158555 -6544148 -3702290 -2238304 352487 4491041 6542510
38023F542510k038748k966138M2083K328171N71560k812346l087831P18093M578395
$$ 6542510 4503762 1537624 1579707 3907878 4479438 1667092 -1420739 -702646 3875749
38014C875749M203938p2135m159244n317641m360494k630774K30391L874353N529532
$$ 3875749 8079687 8007552 3848308 -1469333 -5829827 -8460601 -8230210 -4355857 1173675
38005A173675L576010P12543L15121J364658O04146j704506k395043j026828m03891
$$ 1173675 4749685 5462228 5777349 7142007 7746153 6041647 3646604 2619776 2215885
37996B215885j356478j390138O32079K466969K386233J527931J014850N9223j606179
$$ 2215885 859407 -530731 101348 2568317 4954550 6482481 7497331 7556554 5950375
37987E950375k524074k189995j969102k095328r89019J112322J480283l67145
$$ 5950375 3426301 1236306 -732796 -2828124 -3817143 -2704821 -1224538 -1591683
37979a591683j034285J360853L938704L925487K923773K971691K177362j399748
$$ -1591683 -2625968 -1265115 2673589 6599076 9522849 12494540 14671902 13272154
37971A3272154m756828l838286j33232J618636N61143m25741n18863j356076k630622
$$ 13272154 8515326 4677040 4543808 6162444 6723587 6297846 5778983 4422907 1792285
37962A792285k529598j891782k677642l049067J50051M477121M240695K21529
$$ 1792285 -737313 -2629095 -5306737 -8355804 -8205753 -3728632 512063 733592
37954G33592m29964M130458O606463J993407m415437n600457l122015k503589
$$ 733592 303628 4434086 11040549 13033956 8618519 3018062 -103953 -2607542
37946b607542l326774j329113K726801L823627J112243j089953n12804N56793
$$ -2607542 -5934316 -7263429 -4536628 -713001 399242 -690711 -1203515 -646722
37938f46722J74680q18392j556835j924951n03146L736947P454065N452564j726498
$$ -646722 -472042 -1290434 -2847269 -4772220 -5275366 -1538419 5915646 11368210 9641712
37929I641712o986215n089742J346616N613009L990813j684302o005349m335158
$$ 9641712 2655497 -2434245 -1087629 4525380 8516193 6831891 826542 -3508616
37921c508616K190147O509472L789491j455383j327309L228790L221854m008514
$$ -3508616 -1318469 5191003 8980494 7525111 6197802 9426592 12648446 8639932
37913H639932r182723m437490M428714O084652j98172m629367j603169L762711
$$ 8639932 -542791 -4980281 -551567 5533085 5334913 705546 -897623 2865088
37905B865088M903437K507288N99661o86173l413914n847663l817163K056780
$$ 2865088 7768525 10275813 10875474 10189301 6775387 927724 -2889439 -832659
37897h32659N386918K126311l812236n806529k927422M26200J602276J814607
$$ -832659 4554259 6680570 2868334 -2938195 -5865617 -5439417 -3837141 -2022534
37889b022534J590686m49367k904993j397478L783768N395347l93029o298026
$$ -2022534 -431848 -881215 -3786208 -5183686 -1399918 3995429 3602400 -2695626
37881b695626l506286M661921P145304J512794l432990j985117J073460L37315
$$ -2695626 -6201912 -1539991 5605313 7118107 3685117 1700000 2773460 3110775
37873C110775j685528p57555J475751J714411J177553J830260J391210j940347
$$ 3110775 1425247 667692 2143443 3857854 5035407 6865667 8256877 6316530
37865F316530m207745j560168K393863J972201r39240j71656L776632M186076
$$ 6316530 2108785 548617 2942480 4914681 3975441 3803785 7580417 11766493
37857A1766493o93482m735882l704132j010769r40721j820728J02101L762190
$$ 11766493 11073011 6337129 2632997 1622228 681507 -1139221 -1037120 2725070
37849B725070M601555J245617k705849l663222k496886k692672m799715m915228
$$ 2725070 7326625 8572242 5866393 2203171 -293715 -2986387 -7786102 -12701330
37841a2701330k99229N341121N866280J543735r80955J410423L956997K211158
$$ -12701330 -13000559 -7659438 -1793158 -249423 -1230378 180045 4137042 6348200
37833F348200j121755j777563j036008j729636j926754Q46518L148166P56569
$$ 6348200 5226445 3448882 2412874 683238 -1243516 -396998 2751168 3507737
37825C507737l094968k633854J37053r94996m551018l068837L633001P247573
$$ 3507737 412769 -2221085 -2084032 -3079028 -7630046 -10698883 -7065882 181691
37817A81691M316655P79418Q13356Q38441j872555l767829k488785j365186k017945
$$ 181691 4498346 5277764 6091120 6929561 5057006 1289177 -1199608 -2564794 -4582739
37808d582739p40264L115617L839903j26932j502464L254829N928827j74200p465895
$$ -4582739 -5323003 -2207386 1632517 1505585 3121 3257950 9186777 9012577 1546682
37799A546682n262664L115294O245989K575113K813P22437n73845m314879m430374
$$ 1546682 -3715982 -600688 5645301 8220414 8223227 8945664 8371819 4056940 -373434
37790c73434j53328J809158j086457l483665k252251p99965q30448P55463L817826
$$ -373434 -526762 1282396 195939 -3287726 -5539977 -6339942 -7170390 -6414927 -2597101
37781b597101L282485r52072j848487K677722M998778N78443l888189k088240
$$ -2597101 685384 -266688 -2115175 562547 5561325 6139768 2251579 163339
37773A63339J119717p88816l615648n7126O182520N581779j162713m080417o2833
$$ 163339 1283056 494240 -3121408 -3178534 3003986 8585765 7423052 3342635 3279802
37764C279802L203579P68094k402428j169519J380617J69359l368587m204986
$$ 3279802 6483381 7251475 4849047 3679528 5060145 5229504 1860917 -2344069
37756b344069j301422K156459L656577L033923R97358j265650k136375j110372
$$ -2344069 -3645491 -1489032 2167545 5201468 6198826 4933176 2796801 1686429
37748A686429M83705J178906P14886n89405k240132l096798k185195k06068J296899
$$ 1686429 2170134 3349040 4063926 3474521 1234389 -1862409 -4047604 -4253672 -2956773
37739b956773K058158K648777K525481Q08077j465256k323606j686536p71491
$$ -2956773 -898615 1750162 4275643 5083720 3618464 1294858 -391678 -1163169
37731a163169M92331K496507L341673R26417k785106l576933j069282R61987M45236
$$ -1163169 -670838 1825669 5167342 6093759 3308653 -268280 -1337562 -375575 69661
37722F9661q94731j435644j337009j97228K302452L371034R8496m323581l661122
$$ 69661 -825070 -2260714 -3597723 -3794951 -1492499 1878535 1977031 -2346550 -6007672
37713f007672J342864L237766k16346k561402r0201K041022L0904j135619K585177
$$ -6007672 -4664808 -1427042 -1643388 -4204790 -4294991 -2253969 -2223065 -3358684 -773507
37704g73507N389095J256004m487330l334979K213352L466788J02027j642609
$$ -773507 4615588 5871592 1384262 -1950717 262635 3729423 3831450 2188841
37696B188841j767507m759100p233336j423131Q876793J0483694J491139m736663
$$ 2188841 421334 -4337766 -11571102 -12994233 -4117440 6366254 7857393 3120730
37688C120730q98439L400324m82841n353104j852432M516069L125511l268388
$$ 3120730 2222291 5622615 5139774 -213330 -2065762 2450307 5575818 2307430
37680B307430l835388J583947L222888j172979l203425J069706M797406K154501
$$ 2307430 -1527958 55989 3278877 2105898 -1097527 -27821 4769585 6924086
37672F924086l026006m375362j698047J095960J506149p23095l766216l293381
$$ 6924086 3898080 -477282 -2175329 -1079369 426780 -296315 -4062531 -7355912
37664g355912L111766R985974Q362124j810761r671153p136189R55453M706090
$$ -7355912 -4244146 5741828 14103952 12293191 2622038 -4514151 -3558698 1147392
37656A147392K326875k71362N3080K97173j811030l439731j462926J976835K105220
$$ 1147392 3474267 3202905 3255985 3553158 1742128 -1697603 -3160529 -1183694 921526
37647I21526j437170l491410l30262M656134M849755p31943n676207m274019J419915
$$ 921526 -515644 -4007054 -4337316 318818 5168573 4436630 -1239577 -5513596 -4093681
37638d093681M726789K632126j534744k760671L45853M458480M679201l05476
$$ -4093681 633108 3265234 1730490 -1030181 -684328 3774152 8453353 8147877
37630H147877n830454o007979j199876K543233K331631J919430L894959M111609
$$ 8147877 2317423 -3690556 -4890432 -2347199 -15568 1903862 5798821 9910430
37622I910430r97551o413465m902244J620351M794158K328274k34285l5781p53920
$$ 9910430 8912879 2499414 -2402830 -782479 4011679 6339953 6105668 6069887 5315967
37613E315967m209290n955518k711288K054558L921129L804380M302585M063645
$$ 5315967 1106677 -4848841 -7560129 -5505571 -1584442 2219938 6522523 10586168
37605A0586168N68638m182099n388745j937993K099891K408793q45949l382363
$$ 10586168 11154806 6972707 1583962 -354031 1745860 4154653 3308704 -73659
37597g3659j745448K044011K467173j560961l909176R12N080716L453487k823342
$$ -73659 -1819107 224904 2692077 1131116 -2778060 -2777148 2303568 5757055 2933713
37588B933713m133612J694539N822483K241148l419801l349776J342684M337635
$$ 2933713 -1199899 494640 6317123 8558271 5138470 1788694 3131378 7469013
37580G469013L292741J06748l262893m496542j017372N075569O904980K123792
$$ 7469013 10761754 10868502 7605609 3109067 2091695 7167264 14072244 16196036
37572A6196036k843139k645935j155290l703150p228000n941639j802389n27813
$$ 16196036 13352897 10706962 9551672 5848522 -1379478 -7321117 -9123506 -9651319
37564i651319r95622J912612O467322O014676P53678k048787J55713K252608J216004
$$ -9651319 -10646941 -8734329 -2267007 3747669 4501347 2452560 2608273 4860881 6076885
37555F076885L7139K11634j261612m726958n371125j159912L243710L624819J472288
$$ 6076885 6114024 6325658 5064046 337088 -5034037 -6193949 -2950239 674580 2146868
37546B146868m51462j902144k214314J94979L067884J740814k308717k072680
$$ 2146868 1695406 -206738 -2421052 -2226073 841811 2582625 273908 -1798772
37538a798772K795387L557255k752711n974869J336956R662298N671063o438324
$$ -1798772 996615 4553870 1801159 -4173710 -2836754 6825544 12496607 6058283
37530F058283j0228032j305092P379532N735819o74748k391703R8236R84409j27745
$$ 6058283 -4169749 -5474841 1904691 7640510 6965762 4574059 4672295 5656704 5528959
37521E528959K20736J642764Q45534k074820l859686l126519r07583K158682N153553
$$ 5528959 5749695 7392459 8237993 6163173 2303487 -823032 -1730615 428067 5581620
37512E581620N166234O47568m633782n274002j296435K427486L224770K740528
$$ 5581620 10747854 11395422 6761640 1487638 191203 2618689 5843459 8583987
37504H583987K145835J70411k833502l430739j17550L679082M228985K286412
$$ 8583987 10729822 10900233 8066731 4635992 4518442 8197524 12426509 14712921
37496A4712921O31415m61203k141094l548648l008454j295391l74363n159J029247
$$ 14712921 15344336 14883133 12742039 9193391 6184937 4889546 4515183 4510024 5539271
37487E539271J406899j080659m829241n539816k302379J358645K926755L240557
$$ 5539271 6946170 5865511 1036270 -4503546 -6805925 -5447280 -2520525 720032
37479G20032K798767N51195k119336j411603K236918K750677k394307o638373
$$ 720032 3518799 4069994 1950658 539055 2775973 5526650 3132343 -3506030
37471c506030l508393K914257L744881j179729l668375m47071K480097N28589
$$ -3506030 -7014423 -4100166 -355285 -1535014 -5203389 -5650460 -3170363 -2641774
37463b641774k336288j096205K122049K606979J134095J564542L374426K721464
$$ -2641774 -4978062 -6074267 -3952218 -1345239 -211144 1353398 4727824 7449288
37455G449288l50928j660436P40P57593j894164m789837l675902P54321M051052
$$ 7449288 7098360 5437924 5438664 6196257 4302093 -487744 -4163646 -3409325 641727
37446F41727L647602R96513j049883r39681J154482L742892M594379K396217j450615
$$ 641727 4289329 5285842 4235959 3296278 4450760 8193652 12788031 15184248 13733633
37437A3733633l685996k713331n82664m04697k299443l439782k131661M5485R82531
$$ 13733633 10047637 7334306 6751642 6346945 4047502 607720 -1523941 -1478456 -495925
37428d95925R76679J228052J110068m04970j616396J67628L650124M037322j02859
$$ -495925 480754 1708806 2818874 2413904 797508 965136 4615260 8652582 8549723
37419H549723l998211l219242l2382M53819j687323j833485J109592K609060j1114
$$ 8549723 4551512 1332270 1299888 1753707 66384 -1767101 -657509 1951551 1940437
37410A940437k823983j330945K442279L504987K333213L928177Q412318Q798572
$$ 1940437 -883546 -2214491 227788 3732775 6065988 9994165 18406483 27205055
37402B7205055J165085p790728q503109j403056L754691J148094m368365n635132
$$ 27205055 28370140 20579412 12076303 10673247 14427938 15576032 11207667 5572535
37394E572535l044232j921866l439661l517154p4026L518277L446186N01045j678628
$$ 5572535 2528303 606437 -2833224 -6350378 -6424404 -2906127 540059 1041104 -637524
37385f37524j184033J090889L363863M192816K766479l84050l279875m179184
$$ -637524 -1821557 -730668 2633195 6826011 9592490 9208440 5928565 1749381
37377A749381l173279j512289P8569J568295K575182K268045N08946j545819k391948
$$ 1749381 -1423898 -2936187 -2857618 -1289323 1285859 3553904 4062850 2517031 125083
37368A25083j653192m35239p4407o33390j041008p14521j86041K96157J560404
$$ 125083 -1528109 -1963348 -2037755 -2671145 -3712153 -4426674 -4612715 -4316558 -2756154
37359b756154L675837M451692J903121k181498l677401j539133Q27397O81995
$$ -2756154 919683 5371375 7274496 5092998 1415597 -123536 703861 1385856
37351A385856l59019P1685L91961k289252o034135n199369J403111P655742P910761
$$ 1385856 1026837 1098522 1490483 -798769 -6832904 -12032273 -10629162 -2973420 4937341
37342D937341M260832K348444K403315j47180n461588p024102j504015M408442
$$ 4937341 9198173 11546617 13949932 13802752 8341164 1317062 -186953 4221489
37334D221489K508117m619437o681646o00199N075751L053887k300636k599722
$$ 4221489 6729606 2110169 -4571477 -5171676 -95925 2957962 657326 -1942396
37326a942396J665263L023762o50733l614710k302576m03395j352905k153254
$$ -1942396 -277133 2746629 2095896 -1518814 -3821390 -4224785 -5577690 -7730944
37318g730944R47046N245276N362248J526677j189034o36764L41398n77999k059044
$$ -7730944 -6783898 -1538622 3823626 5350303 4161269 3524505 3865903 3287904 1228860
37309A228860k171043j045320M20894J636574J552733k46594j369222R48014M588465
$$ 1228860 -942183 -1987503 -1566609 69965 1622698 1376104 6882 954896 5543361
37300E543361M003360j470859n406454l366987M29981P8741k453670j028551L967218
$$ 5543361 9546721 8075862 2669408 -697579 -267598 -188857 -2642527 -3671078 296140
37291B96140O059528L212151K32145k92822j561403m456924l891871K001835O272204
$$ 296140 6355668 9567819 9799964 9507142 7945739 3488815 -403056 1598779 7870983
37282G870983L194545k250928k630686l04672j966428n234269k337338M600534
$$ 7870983 11065528 8814600 6183914 5879242 3912814 -1321455 -3658793 941741
37274I41741M995233k123040m826178K321703Q417692L595654n037689n439109
$$ 941741 5936974 3813934 -1012244 1309459 9727151 13322805 8285116 2846007
37266B846007L66223J951530j074675l53016M512649M966156n53772l418473k76674
$$ 2846007 3212230 5163760 4089085 3736069 8248718 13214874 12661102 9242629 8965955
37257H965955J124710l464674o173430l75541P096508O329847k17804k664524
$$ 8965955 10090665 6625991 452561 77020 7173528 13503375 13285571 10621047
37249A0621047N07104J893788j534997m321731k307778J605176L748562N504908
$$ 10621047 11128151 13021939 11486942 7165211 4857433 6462609 10211171 15716079
37241A5716079R531838J4078937J4348356P944096k690637j2199725j6058644
$$ 15716079 25247917 39326854 53675210 61619306 58928669 46728944 30670300
37234C0670300j3602614p967982k876473r1337O2634j953359l817283k381350
$$ 30670300 17067686 9099704 6223231 6131894 6194528 4241169 423886 -1957464
37226a957464J930738M281601J729768k204368k649372l49366Q31560Q39906K216324
$$ -1957464 -26726 4254875 5984643 3780275 1130903 781537 1613097 2453003 4669327
37217D669327L599580J220092l257170l695701K08143J116933m019092p548921
$$ 4669327 8268907 9488999 6231829 2536128 2744271 3861204 -157888 -7706809
37209g706809k514795N457909N679219j573412n605216j408321L903497L251145
$$ -7706809 -10221604 -4763695 915524 -657888 -6263104 -7671425 -3767928 -516783
37201e16783k3819P21708L980623L145259j975196m603944j900318R37651k96242
$$ -516783 -540602 181106 4161729 7306988 5331792 727848 -1172470 -234819 -531061
37192e31061k039822N38022M947881M914123N1329l746701k920586k5641J450139
$$ -531061 -2570883 -2032861 2915020 7829143 7880472 4133771 1213185 1187544 2637683
37183B637683J308750O06308l82297p00662R54031K927817J631125k308712l322538
$$ 2637683 3946433 4552741 4170444 3469782 4423813 7351630 8982755 6674043 3351505
37174C351505Q91593M812138K646689l326841o570708n262889k300447R32349
$$ 3351505 4243098 9055236 11701925 8375084 1804376 -3458513 -5758960 -4826611
37166d826611M676127O346189K777734l116238m434277q2132L526823K192673
$$ -4826611 -150484 6195705 8973439 5857201 1422924 1340792 4867615 7060288
37158G060288o25225p07019K94704r23473l064784k900729r60739J10238N32216
$$ 7060288 6435063 5728044 6022748 5099275 2034491 -866238 -1826977 -1716739 -1184523
37149a184523K119442L686590K435246p57085j901272M8469J669180M93053j448381
$$ -1184523 934919 4621509 7056755 6299670 4398398 4446867 6116047 6609100 5160719
37140E160719j113000J018363J966047N38592j349247j530759m39133l32865j943677
$$ 5160719 4047719 5066082 7032129 7570721 6221474 4690715 4251582 3918717 1975040
37131A975040l072935j553473J261554K071192O05990J80178K135725K853282
$$ 1975040 -1097895 -2651368 -1389814 681378 1287368 1467546 3603271 6456553
37123F456553r22081o074696o405328j251305L258588K382546j349775k449782
$$ 6456553 5534472 -540224 -6945552 -8196857 -4938269 -2555723 -3905498 -6355280
37115f355280r5247J544142k56270k965476k290948K258625O794493P449401L962991
$$ -6355280 -6450527 -4906385 -5162655 -8128131 -10419079 -8160454 -1365961 6083440 10046431
37106A0046431j063940m843357n540596k431544L010657O782092N462823K07303
$$ 10046431 8982491 4139134 -1401462 -3833006 -822349 5959743 11422566 11629869
37098A1629869l994310l599922J82990L490091L576997L90688l608889m786491
$$ 11629869 7635559 4035637 4218627 7708718 11285715 11676403 8067514 3281023
37090C281023j646806K669009L581131J190893k8383J403719J261282l051690
$$ 3281023 1634217 4303226 7884357 9075250 9046867 10450586 11711868 8660178
37082H660178o825953m440757J599915L907265J157100n39339K285951N277503
$$ 8660178 1834225 -2606532 -1006617 2900648 4057748 3518409 5804360 11081863
37074A1081863L813632P02515J914716P221535R719940M582015m986017j1555804
$$ 11081863 14895495 15598010 17512726 24734261 34454201 39036216 34050199 22494395
37066B2494395j1435403p402813m150260k848593j427442Q60158J870776L67423
$$ 22494395 11058992 3656179 -494081 -3342674 -4770116 -3909958 -2039182 -1671759
37058a671759j202653P5788L209545M647496L058704L22639j621963k522409k714511
$$ -1671759 -2874412 -2798624 410921 5058417 8117121 8439760 6817797 4295388 1580877
37049A580877k395387j853617r49750R22287L113781L607019K271793J768457
$$ 1580877 -814510 -2668127 -3617877 -2695590 418191 4025210 6297003 8065460
37041H065460K720992J217141m782630r667329o663535J781887O746243N211469
$$ 8065460 10786452 12003593 7220963 -2446366 -9109901 -7328014 -581771 4629698
37033D629698K606113K695488K577791k80295l213298l704457l371144l327417
$$ 4629698 7235811 9931299 12509090 12228795 9015497 5311040 1939896 -1387521
37025a387521j463600K166667L161160p1727k744008j526619L0385j214879j617946
$$ -1387521 -2851121 -684454 2476706 2404979 -339029 -1865648 -1835263 -3050142 -4668088
37016d668088K161156N672898L752945l7331N37736L056358N75118n521602o724505
$$ -4668088 -2506932 3165966 6918911 6881580 7419316 10475674 11050792 5529190 -1195315
37007a195315q05457N260257O360714M792921L504238J657796j049455k472768
$$ -1195315 -2000772 3259485 9620199 14413120 17917358 19575154 18525699 16052931
36999A6052931k488149l388737m395436k038473K493547L077345j957806o439212
$$ 16052931 13564782 10176045 5780609 3742136 6235683 9313028 7355222 916010
36991I16010n099825r3403L797507M919268L210880j275991n318058l645110L401298
$$ 916010 -4183815 -4277218 -479711 4439557 7650437 6374446 1056388 -2588722 812576
36982H12576Q449810O642590J493143j926347l809862n520051m570391O77265
$$ 812576 9262386 15904976 17398119 15471772 11661910 6141859 1571468 2248733
36974B248733N755311N352733P98269k578964k716648j198406M96471R81702j454339
$$ 2248733 8004044 13356777 14155046 11576082 8859434 7661028 8157499 9139201 7684862
36965G684862n134671m593187J619858O715885M428645j813733m194711j448679
$$ 7684862 2550191 -2042996 -423138 6292747 10721392 8907659 4712948 3264269
36957C264269J697626K749370K309186m74746n853374q802644m230141M011265
$$ 3264269 4961895 7711265 10020451 9545705 3692331 -5110313 -9340454 -5329189
36949e329189O899340K703377j803608k471397k017360k243479m56219L701613
$$ -5329189 1570151 4273528 2469920 -1477 -2018837 -4262316 -4718535 -1016922
36941a016922N400771K233043j626639k388699j821547j869591l36130L466153
$$ -1016922 4383849 6616892 4990253 2601554 780007 -1089584 -1425714 2040439
36933B040439M703356M71077l747989j759481L108862K891338k422755n235567
$$ 2040439 6743795 7214872 3466883 1707402 4816264 7707602 5284847 49280
36925D9280k579493J10916j237927l292087k101788L55121P46805N34023K348766
$$ 49280 -2530213 -2419297 -3657224 -6949311 -9051099 -8695978 -7949173 -7415150 -5066384
36916e066384L932016J692057j896362j017495L877450N885512K213673j650768
$$ -5066384 -1134368 557689 -1338673 -2356168 1521282 7406794 9620467 7969699
36908G969699j143158K41944k232829n755568m470107M78965K646787O68924l97510
$$ 7969699 6826541 7068485 4835656 -919912 -5390019 -4911054 -2264267 -1595343 -1992853
36899a992853J642075K654021j15016l130383k377850P85458K628754J991347
$$ -1992853 -350778 2303243 2188227 -942156 -3320006 -2534548 94206 2085553
36891B085553k21409k685119k822885J359871O564712O251271o0149m931290l664726
$$ 2085553 1864144 -820975 -3643860 -2283989 4280723 10531994 10471845 5540555 1875829
36882A875829q57600j807305l526366q17885L674870L398544j003849k448743
$$ 1875829 1018229 -789076 -4315442 -5133327 -1458457 1940087 936238 -1512505
36874a512505J674888O218134N955914J118851m729101p806714n622026L95984
$$ -1512505 162383 6380517 12336431 13455282 8726181 919467 -4702559 -4306575
36866d306575M525133K862563j436420k668308k90948J911431J954647N44008
$$ -4306575 218558 3081121 1644701 -1023607 -1314555 596876 2551523 3095531
36858C095531j528668k422012R11578O927456P917423N68814o804127n632289
$$ 3095531 1566863 -855149 56429 6983885 14901308 15470122 8665995 3033706
36850C033706o16880j480337n591309k237999P335135R318170p21361r650065
$$ 3033706 2416826 936489 -4654820 -6892819 442316 9760486 9039125 -610940
36842f10940o225377L506970P570007M517375L23078k684819m933505m103470
$$ -610940 -6836317 -3329347 4240660 8758035 9081113 6396294 1462789 -2640681
36834b640681Q42085M819155L388001J83292N87111K241076m48817n582731n747521
$$ -2640681 -1798596 3020559 6408560 6591852 7178963 9420039 8971222 3388491 -2359030
36825b359030L92787N663314M055019k266604o453038m303242K144581O615378
$$ -2359030 -1966243 3697071 7752090 5485486 -967552 -5270794 -3126213 3489165
36817C489165M950325J33319j321369J674946L609870J351118j132949K4265K031187
$$ 3489165 8439490 8572809 7251440 8926386 12536256 13887374 12754425 12778690 14809877
$$ [...]
##END NTUPLES=NMR SPECTRUM
##END=
