##TITLE=31Pdec_SR130_rm1h
 , 24 sc
 7.7.2022
##JCAMPDX= 6.0         $$ Bruker NMR JCAMP-DX V2.0
##DATA TYPE= NMR SPECTRUM
##DATA CLASS= NTUPLES
##ORIGIN= UXNMR, Bruker Analytische Messtechnik GmbH
##OWNER= root
$$ XWIN-NMR		Version 3.5
$$ Thu Jul  7 15:31:22 2022 Russian Standard Time (UT+4h)  she@DPX200
##.OBSERVE FREQUENCY= 81.013821
##.OBSERVE NUCLEUS= ^31P
##.ACQUISITION MODE= SIMULTANEOUS
##.ACQUISITION SCHEME= undefined
##.AVERAGES= 24
##.DIGITISER RES= 16
##SPECTROMETER/DATA SYSTEM= spect
##.PULSE SEQUENCE= zgpg30
##.SOLVENT NAME= CD2Cl2
##.SHIFT REFERENCE= (INTERNAL, CD2Cl2, 0, 248.564)
##AUDIT TRAIL= $$ (NUMBER, WHEN, WHO, WHERE, WHAT)
$$ ##TITLE= Audit trail, XWIN-NMR		Version 3.5
$$ ##JCAMPDX= 5.01
$$ ##ORIGIN= Bruker BioSpin GmbH
$$ ##OWNER= she
$$ F:/spectra/data/she/nmr/P31/1/pdata/1/auditp.txt
$$ ##AUDIT TRAIL=  $$ (NUMBER, WHEN, WHO, WHERE, WHAT)
(   1,<2022-07-07 15:29:48.90 +0400>,<she>,<DPX200>,
      <created by zg, POWCHK disabled, PULCHK disabled
       configuration hash MD5:
       00 E9 B6 7A A2 85 ED C7 34 08 36 98 17 FE 4E 26
       data hash MD5: 32K
       5B AC 81 2F CB 01 5F BA 21 C5 0F D5 8B 8A FC 50>)
(   2,<2022-07-07 15:30:15.39 +0400>,<she>,<DPX200>,
      <Start of raw data processing
       efp BC_mod = 2 LB = 1 FT_mod = 6 PKNL = 1 PHC0 = -10238.17 PHC1 = 831.8564 SI = 64K 
       data hash MD5: 64K
       CD 57 FC 8A 16 25 A4 7D 37 79 32 1B C3 B0 AA 32>)
(   3,<2022-07-07 15:30:50.34 +0400>,<she>,<DPX200>,
      <pk PHC0 = 319.8888 PHC1 = -773.3997 
       data hash MD5: 64K
       03 15 48 F6 95 47 C8 51 87 64 89 E4 0F 00 DC A6>)
$$ ##END=
$$ 
$$ hash MD5
$$ E2 64 82 31 DB 2D 08 A9 D6 8A 0B 80 81 B2 4E 1E
##$RELAX= 
##$RELAX= 
##$RELAX= 
##$RELAX= 
##$RELAX= 
##$RELAX= 
##$RELAX= 
##$RELAX= 
$$ Bruker specific parameters
$$ --------------------------
##$DU= <F:/spectra>
##$EXPNO= 1
##$NAME= <P31>
##$PROCNO= 1
##$TYPE= <nmr>
##$USER= <she>
##$AMP= (0..31)
100 100 100 100 100 100 100 100 100 100 100 100 100 100 100 100 100 100 
100 100 100 100 100 100 100 100 100 100 100 100 100 100 
##$AQSEQ= 0
##$AQ_mod= 1
##$AUNM= <au_zg>
##$AUTOPOS= <>
##$BF1= 81.014009
##$BF2= 200.13
##$BF3= 200.13
##$BF4= 200.13
##$BF5= 200.13
##$BF6= 200.13
##$BF7= 200.13
##$BF8= 200.13
##$BYTORDA= 1
##$CFDGTYP= 0
##$CFRGTYP= 5
##$CHEMSTR= <none>
##$CNST= (0..31)
1 1 145 1 1 1 1 1 1 1 1 1 1 1 1 1 1 1 1 1 1 1 1 1 1 1 1 1 1 1 1 1 
##$CPDPRG= <waltz16>
##$CPDPRG1= <>
##$CPDPRG2= <waltz16>
##$CPDPRG3= <>
##$CPDPRG4= <mlev>
##$CPDPRG5= <mlev>
##$CPDPRG6= <mlev>
##$CPDPRG7= <mlev>
##$CPDPRG8= <mlev>
##$CPDPRGB= <>
##$CPDPRGT= <>
##$D= (0..31)
0 1 0 0 0 0 0 0 0 0 0 0.03 2e-05 3e-06 0 0 0 0 0 0 0 0 0 0 0 0 0 0 0 0 
0 0 
##$DATE= 1657193388
##$DBL= (0..7)
120 120 120 11 120 120 24 19 
##$DBP= (0..7)
150 150 150 150 150 150 150 150 
##$DBP07= 0
##$DBPNAM0= <>
##$DBPNAM1= <>
##$DBPNAM2= <>
##$DBPNAM3= <>
##$DBPNAM4= <>
##$DBPNAM5= <>
##$DBPNAM6= <>
##$DBPNAM7= <>
##$DBPOAL= (0..7)
0.5 0.5 0.5 0.5 0.5 0.5 0.5 0.5 
##$DBPOFFS= (0..7)
$$ [...]
##$SUBNAM2= <"">
##$SUBNAM3= <"">
##$SUBNAM4= <"">
##$SUBNAM5= <"">
##$SUBNAM6= <"">
##$SUBNAM7= <"">
##$SUBNAM8= <"">
##$SUBNAM9= <"">
##$SW= 501.771253377433
##$SWIBOX= (0..15)
0 1 3 0 0 0 0 0 0 0 0 0 0 0 0 0 
##$SW_h= 40650.406504065
##$TD= 32768
##$TD0= 1
##$TE= 0
##$TE2= 300
##$TE3= 300
##$TEG= 300
##$TL= (0..7)
0 120 53 12 22 120 120 120 
##$TP= (0..7)
150 150 150 150 150 150 150 150 
##$TP07= 0
##$TPNAME0= <>
##$TPNAME1= <>
##$TPNAME2= <>
##$TPNAME3= <>
##$TPNAME4= <>
##$TPNAME5= <>
##$TPNAME6= <>
##$TPNAME7= <>
##$TPOAL= (0..7)
0.5 0.5 0.5 0.5 0.5 0.5 0.5 0.5 
##$TPOFFS= (0..7)
0 0 0 0 0 0 0 0 
##$TUNHIN= 0
##$TUNHOUT= 0
##$TUNXOUT= 0
##$USERA1= <user>
##$USERA2= <user>
##$USERA3= <user>
##$USERA4= <user>
##$USERA5= <user>
##$V9= 5
##$VALIST= <valist>
##$VCLIST= <CCCCCCCCCCCCCCC>
##$VD= 0
##$VDLIST= <DDDDDDDDDDDDDDD>
##$VPLIST= <PPPPPPPPPPPPPPP>
##$VTLIST= <TTTTTTTTTTTTTTT>
##$WBST= 1024
##$WBSW= 4
##$XGAIN= (0..3)
0 0 0 0 
##$XL= 0
##$YL= 0
##$YMAX_a= 22444
##$YMIN_a= -28747
##$ZGOPTNS= <>
##$ZL1= 120
##$ZL2= 120
##$ZL3= 120
##$ZL4= 120
##$ABSF1= 0
##$ABSF2= 0
##$ABSG= 0
##$ABSL= 0
##$ALPHA= 0
##$AQORDER= 0
##$ASSFAC= 0
##$ASSFACI= 0
##$ASSFACX= 0
##$ASSWID= 0
##$AUNMP= <proc_1d>
##$AZFE= 0.1
##$AZFW= 0.5
##$BCFW= 0
##$BC_mod= 2
##$BYTORDP= 0
##$COROFFS= 0
##$CY= -3
##$DATMOD= 1
##$DC= 0
##$DFILT= <>
##$DTYPP= 0
##$F1P= 0
##$F2P= 0
##$FCOR= 1
##$FTSIZE= 65536
##$FT_mod= 6
##$GAMMA= 0
##$GB= 0
##$INTBC= 1
##$INTSCL= 5.30512e-09
##$ISEN= 30
##$LB= 1
##$LEV0= 0
##$LPBIN= 0
##$MAXI= 10000
##$MC2= 0
##$MEAN= 0
##$ME_mod= 0
##$MI= 50
##$NCOEF= 0
##$NC_proc= -5
##$NLEV= 6
##$NOISF1= 182.463
##$NOISF2= 159.3651
##$NSP= 0
##$NTH_PI= 0
##$NZP= 0
##$OFFSET= 248.5645
##$PC= 4
##$PHC0= -9918.281
##$PHC1= 58.45667
##$PH_mod= 1
##$PKNL= yes
##$PPARMOD= 0
##$PSCAL= 0
##$PSIGN= 0
##$REVERSE= no
##$SF= 81.014009
##$SI= 65536
##$SIGF1= 159.3651
##$SIGF2= -187.1042
##$SINO= 113.3802
##$SIOLD= 16384
##$SREGLST= <1H.CDCl3>
##$SSB= 0
##$STSI= 65536
##$STSR= 0
##$SW_p= 40650.406504065
##$SYMM= 0
##$S_DEV= 0
##$TDeff= 32768
##$TDoff= 0
##$TI= <>
##$TILT= no
##$TM1= 0
##$TM2= 0
##$TOPLEV= 0
##$USERP1= <user>
##$USERP2= <user>
##$USERP3= <user>
##$USERP4= <user>
##$USERP5= <user>
##$WDW= 1
##$XDIM= 65536
##$YMAX_p= 447041273
##$YMIN_p= -30475451
$$ End of Bruker specific parameters
$$ ---------------------------------
##NTUPLES= NMR SPECTRUM
##VAR_NAME=  FREQUENCY,     SPECTRUM/REAL,   SPECTRUM/IMAG
##SYMBOL=    X,             R,               I
##VAR_TYPE=  INDEPENDENT,   DEPENDENT,       DEPENDENT
##VAR_FORM=  AFFN,          ASDF,            ASDF
##VAR_DIM=   65536,         65536,           65536
##UNITS=     HZ,            ARBITRARY UNITS, ARBITRARY UNITS
##FACTOR=    0.620285442955139, 1,           1
##FIRST=     20137.2065510759, 0,            0
##LAST=      -20513.1999529892, 0,           0
##MIN=       -20513.1999529892, -30475451,   0
##MAX=       20137.2065510759, 447041273,    0
$$ Real data points
##PAGE= N=1
##DATA TABLE= (X++(R..R)), XYDATA
$$ [...]
40984I42955n27052k25351J77636K00390j45799l60582j55299K10459M33940N30747
40974A082044M53904m8599p73856q94433q0216P63082O44075r0714l65204l5808
40964F54275Q1653l21152o34590m67264j95227j31875k3456K82692M16004J42079
40954a96861j55552p0724K14585K86095Q5895j67611l27008l29893j50701O9401
40944g42374J08455j230q02J78766L51744M38680M92926L65788j45536p32991
40934C13426p32334o7078M89452L15840k45648m61712k18590N547l5194m6700
40924f82991K64850O84404P01907J61340m59733n55559j37415J89315Q1235q1315
40914A66038J25300M14494K32721k93224m77839p3926M44963O02187L62302j48749
$$ plain form
40984 942955 415903 190552 368188 568578 422779 62197 -93102 117357 551297 1082044
40974 1082044 1535948 1487349 713493 -180940 -261156 501926 1146001 1055287 690083 654275
40964 654275 735928 414776 -219814 -687078 -882305 -1014180 -1037636 -754944 -338940 -196861
40954 -196861 -352413 -423137 -208552 77543 163438 -4173 -331181 -661074 -811775 -742374
40944 -742374 -633919 -635149 -635951 -457185 -105441 333239 826165 1191953 1046417 313426
40934 313426 -418908 -485986 3466 319306 73658 -388054 -606644 -601097 -636291 -682991
40924 -682991 -418141 266263 968170 1129510 669777 114218 -23197 166118 247353 166038
40914 166038 291338 705832 938553 645329 167490 93564 538527 1140714 1503016 1354267
40904A354267p71084j092922p23527N9324M96142L35471P2447N4974J4886k39348
40894d39370l41773j9513L37336K61501p2047k05830j05680j4030P6183K86104
40884b37119M35141K63197r6487l04942l20384l00188j78643J81795N25292M00408
40874C68070j46481n18406l28671J24435K99060P8873j80691j44993J23012K70680
40864e5112P4685k90645m44900k39069R8978K69358K20987J12667P8906J25451
40854d8694J77045J48255R005j78805l10120l05709j16418K40279N74143N97801
40844G86782K59527j25043k33536q5545J22567L02192L72381J74206j87074k50869
40834A135588J01529K38067l02494q47234m34756N85128Q87039J53411m67993
$$ plain form
40904 1354267 583183 -509739 -1233266 -1173942 -677800 -342329 -269882 -214908 -200022 -439370
40894 -439370 -781143 -800656 -463320 -201819 -273866 -479696 -585376 -599406 -523223 -237119
40884 -237119 198022 461219 364732 59790 -260594 -560782 -739425 -557630 -32338 368070
40874 368070 221589 -296817 -625488 -501053 -201993 -123120 -303811 -448804 -325792 -55112
40864 -55112 19573 -271072 -715972 -955041 -856063 -586705 -365718 -253051 -174145 -48694
40854 -48694 128351 276606 285611 106806 -203314 -509023 -625441 -385162 188981 786782
40844 786782 1046309 921266 687730 602185 724752 1026944 1399325 1573531 1386457 1135588
40834 1135588 1237117 1475184 1172690 325456 -109300 475828 1362867 1516278 1048285
40825A048285k23195J52958j33204n44356k59614K72491P0971o21490o36353K46742
40815f26765R65747Q07458K74980M8287K3851j69101m19400m08864j69649L8133
40805C64677P5916q9434l95144n11860j10097N10927N79184p7050o51227m66019
40795g70127O1637J31219k04083k59285N8000J06152l42454o31712k48028L28464
40785a770217L28476j73300m48108k37216l5413k01946l74733o0233N71701Q63594
40775a537395M90809k05891o63292o30058k58981J29875L12069K93464K41715
40766a827685K62314K69708J20125j82155m69195n49735l29644J14712N23243
40757b068312O19947L83744O9341r8611j34098j41306j29358p1177K2946J82618
$$ plain form
40825 1048285 825090 978048 844844 300488 40874 313365 384336 -237154 -873507 -626765
40815 -626765 338982 1146440 1421420 1469707 1493558 1324457 905057 496193 326544 364677
40805 364677 440593 351159 -43985 -555845 -665942 -155015 424169 347119 -304108 -770127
40795 -770127 -708490 -577271 -781354 -1040639 -982639 -876487 -1218941 -1850653 -2098681 -1770217
40785 -1770217 -1441741 -1615041 -2063149 -2300365 -2335778 -2537724 -2912457 -2972690 -2400989 -1537395
40775 -1537395 -1046586 -1252477 -1915769 -2545827 -2804808 -2674933 -2362864 -2069400 -1827685
40766 -1827685 -1565371 -1295663 -1175538 -1357693 -1826888 -2376623 -2706267 -2591555 -2068312
40757 -2068312 -1448365 -1064621 -995280 -1093891 -1227989 -1369295 -1498653 -1569830 -1546884 -1364266
40747a364266M26283N51428K72712k74344n22950k33296J04444k791k78694j40291
40737a461765L44717N76176L59009R0514K9446j3903j81670l10350k91700k16537
40727a076063n7377L18144P08408O42987N7983n19854o28825l38830M0491L18501
40717e34435L94208K64928J41302J85886J71528j49102m54331k59055J89810K12521
40707A63260j23541n7043N08589P43846L07034o7535R0201J39788m51935j047714
40697B04950q86048l22931o3775M5588M03244N79222P4082m66136j21728O59105
40687A05573O72658q0509m70582j27403J99430J76587L02161N97796L62486l77103
40677A361094n75668J18212O62186K94884l20011l91450k54713m02406l72524
$$ plain form
40747 -1364266 -937983 -386555 -113843 -388187 -911137 -1144433 -1039989 -1042780 -1321474 -1461765
40737 -1461765 -1117048 -540872 -181863 -91349 -61903 -75806 -257476 -567826 -859526 -1076063
40727 -1076063 -1133440 -815296 -106888 536099 594082 74228 -554597 -893427 -852936 -534435
40717 -534435 -140227 124701 266003 451889 623417 474315 19984 -239071 -49261 163260
40707 163260 39719 -17324 491265 1235111 1542145 1474610 1564811 1704599 1252664 204950
40697 204950 -681098 -1004029 -1067804 -1022216 -618972 -39750 34332 -431804 -553532 105573
40687 105573 778231 697722 227140 99737 299167 475754 777915 1375711 1738197 1361094
40677 1361094 785426 903638 1565824 1860708 1540697 1149247 894534 492128 119604
40668A19604K68366P63681K67928n88885n88189J05709K71112l01612n09594J79266
40658a2614Q62930O48070q7443m44315k56261K048M5227m5125j66135k62822k18333
40647F5227J0846K59629L38731K32186J2547k55530m21747k72235J84564N86249
40637G40467N37964L6898m99481o29401l18824K4247K4823j65593n7340M33753
40627A27513P39514L69608l76460p62253n04943K8145L71644L56826P0045k24530
40617A95109k16137O9440J75960j23787l22250J24567Q05069P84540j9617o88736
40607G84158o25734k02031J33352M90670Q55965O70587k14448r11057o56484N55
40597C25533J01536j64374P3530O84773O38822j95029o80891k17227L08145J7546
$$ plain form
40668 119604 387970 1151651 1419579 830694 242505 348214 619326 317714 -191880 -12614
40658 -12614 850316 1498386 1410943 966628 710367 712415 757642 712517 546382 283560 65227
40647 65227 76073 335702 674433 906619 919166 663636 241889 -30346 154218 740467
40637 740467 1278431 1315329 815848 186447 -132377 -108130 -83307 -248900 -306240 127513
40627 127513 867027 1236635 860175 97922 -407021 -378876 -7232 349594 419639 195109
40617 195109 -21028 48412 224372 100585 -221665 -97098 707971 1492511 1472894 784158
40607 784158 158424 -43607 89745 580415 1436380 2106967 1892519 981462 324978 325533
40597 325533 427069 262695 336225 1020998 1659820 1464791 783900 566673 874818 892364
40587H92364n30867l24049M33769O75635J22446m22723l37251J17888M24942M38467
40577A490621K33844j10258l81503l14823J8112K32107J50847j8005j02839j89601
40567A008502k96526k06851J52740M62586L91817L3265k56722k95709j66060q063
40557H18979Q9113P6890j5821p5614j7925J37401L17230M23267L24491p614l42561
40546A727836l72682r6739J84255K86735K92060K14074j16907o35809q64191m93702
40536A24930J03081L32850J67037L9912J05157J16433K2949R2976K99513J81570
40526A586408l51666o28701j51144N09537M47134j91214l79811K10201O85696
40517A736440K97635m48724o09982j35213L09754M23134L98376K42392j94146
$$ plain form
40587 892364 361497 37448 471217 1146852 1269298 846575 509324 627212 1052154 1490621
40577 1490621 1724465 1614207 1232704 917881 935993 1168100 1318947 1300942 1198103 1008502
40567 1008502 711976 505125 657865 1120451 1512268 1545533 1288811 993102 827042 818979
40557 818979 908092 984982 969161 893547 875622 1013023 1330253 1753520 2078011 2070397 1727836
40546 1727836 1355154 1258415 1442670 1729405 2021465 2235539 2118632 1482823 618632 124930
40536 124930 228011 560861 727898 767810 872967 989400 1012349 1105325 1404838 1586408
40526 1586408 1234742 606041 454897 964434 1411568 1220354 840543 1050744 1736440
40517 1736440 2034075 1585351 975369 840156 1149910 1573044 1971420 2213812 2019666
40508B019666n85891l79997K41954M54239L1748k78621O2806N89078O34351K66798
40498C056131q7565l42865n14094l40655K14114N58781K33048l26893m35430j81889
40488A832683j17137k83479l12110j93175j81522j79203L9421K40053J20936j3837
40478I52630K04023L65329k9753m23756L1896Q16918N96952n63679j104470l68630
40468D77460M72612M45781J78046M27042O29788O0761o95370o89972j85271n4915
40458A065962k83792k63790m0390q4604k39367j9676L64402L43974N7889O2255
40448I62863K52840J06651k40270k00541J55604K27108j6874p8975L5925j28861
40438A075470m62289l71448J05335L13926J61309K19829N47155M88865j08309
$$ plain form
40508 2019666 1433775 1053778 1295732 1749971 1781719 1503098 1565904 2154982 2789333 3056131
40498 3056131 2968566 2625701 2111607 1770952 1985066 2543847 2776895 2450002 2014572 1832683
40488 1832683 1715546 1432067 1119957 926782 745260 566057 605478 845531 966467 952630
40478 952630 1156653 1521982 1492229 1068473 1100369 1917287 2514239 1950560 846090 477460
40468 477460 950072 1395853 1573899 2000941 2630729 2691490 1996120 1306148 1120877 1065962
40458 1065962 782170 518380 477990 393386 154019 134343 498745 842719 900608 962863
40448 962863 1215703 1322354 1082084 881543 1037147 1264255 1247381 1168406 1204331 1075470
40438 1075470 613181 241733 347068 660994 822303 1042132 1589287 2078152 1969843
40429A969843n19271k94894J36358L26537L71673L34825K9923l18821j69239K52009
40419B118943R029r45126j360124n51826M22160L61475k60490k03508N31268Q61526
40409I83327M11618r7883j74409j68944m03248n62663k83267K38046N28815L93267
40399H64659K212l26469l62876j72952q6790k99677n86067n71840j68290M06468
40389a301622Q51720Q92584M42646j38816k64679J38348M28827J16287m08885
40380G56410m43584n12K45736p9876o22009q15875m77006J31744N53307M88724
40370b62941J00665j28016P056J88542J23752K004P3489J26002j21094l79067
40360b69608j67036L15714L82045n4753k81210J17750N91178M44169j44552m33945
$$ plain form
40429 1969843 1450572 1155678 1292036 1618573 1990246 2325071 2354994 2036173 1866934 2118943
40419 2118943 2127972 1182846 -177278 -729104 -306944 54531 -205959 -409467 121801 983327
40409 983327 1394945 1297062 1122653 953709 550461 -12202 -295469 -57423 471392 864659
40399 864659 866871 540402 177526 4574 -82216 -381893 -967960 -1539800 -1708090 -1301622
40389 -1301622 -449902 442682 885328 746512 481833 620181 1049008 1165295 756410
40380 756410 312826 312314 558050 478174 -143835 -959710 -1436716 -1304972 -751665 -262941
40370 -262941 -162276 -290292 -283236 -94694 29058 31062 104551 230553 109459 -269608
40360 -269608 -436644 -120930 261115 206362 -74848 42902 634080 1078249 933697 499752
40350D99752j92181P0886q8387m52226n07182j31558L13417M79240L82937K19817
40340E94515L0197k46736m77825l86819K0758L44546K85591N2632K6264J75824
40330D18947J40700j62755l88324k96283j00698q0048j16877O4421L61548L80983
40320B21614O0423j78652m3393K09181K25873J34750K68171N06100M19375L2336
40310A855778j36090P6441J66510k04519o17518n63051k25818o3742n171K84509
40300E67329O21412N14876L0741k63835j83105q1021j30691j25430m7962j55425
40290G46889l96842m10790k04331j41087j64474J59965O66715N84403j61182o06568
40280G2698k21430K47167Q6512j85523J35872N59343K37839m32928l94471K43625
$$ plain form
40350 499752 307571 378457 290070 -162156 -669338 -800896 -487479 -8239 374698 594515
40340 594515 624712 377976 -99849 -486668 -465910 -121364 164227 216859 243123 418947
40330 418947 559647 396892 8568 -287715 -388413 -468461 -585338 -520917 -159369 221614
40320 221614 282037 103385 59992 269173 495046 629796 897967 1404067 1823442 1855778
40310 1855778 1719688 1796129 1962639 1758120 1140602 577551 351733 287991 282820 567329
40300 567329 1188741 1703617 1734358 1470523 1287418 1206397 1075706 950276 902314 746889
40290 746889 350047 -60743 -265074 -406161 -570635 -410670 256045 840448 679266 72698
40280 72698 -148732 98435 184947 -576 135296 694639 932478 499550 105079 348704
40270C48704L60867k49660n34346k503M45336O4744n07847l68184K01926L25654
40260H4691j3398r3900K44136L63767q2805n89768n33011L3252N49913O02931
40250E65808K24687k13932k86231J02567N15604L99804k03004o37662m93691j59471
40240a85521j95565m40399k74094L16406N86626J39538m22653l71929R5002K58761
40230d93828J6070p9124J83551L46650R4872k23761j68885J45315K92303J33113
40220B46276r5963j17160J29921M24629M26309P8469k16792j05665J58323O5663
40210I94010l53443o01423n08667l48626j86732J66522M89769K56595l81030n57929
40200a030954J4915N64757M97510K56070L56037M34885N1946l26175q8487L57765
$$ plain form
40270 348704 709571 459911 -74435 -76938 368398 433142 -74705 -442889 -240963 84691
40260 84691 71293 -22607 221529 585296 502491 -87277 -620288 -587036 -37123 565808
40250 565808 790495 576563 290332 392899 908503 1308307 1105303 467641 -26050 -185521
40240 -185521 -381086 -821485 -1095579 -779173 -192547 -53009 -475662 -847591 -752589 -493828
40230 -493828 -477758 -556882 -373331 -26681 68191 -155570 -324455 -179140 113163 246276
40220 246276 150313 33153 163074 587703 1014012 1092481 875689 770024 928347 994010
40210 994010 640567 39144 -469523 -818149 -1004881 -838359 -348590 -91995 -473025 -1030954
40200 -1030954 -1016039 -451282 46228 302298 658335 1093220 1145166 818991 730504 1088269
40190A088269K04691l85404n55949j57702J19528p7398l53358l31795p8640K43394
40180b84364N00155M28847l5407m00002j92041K83891M01197J83388R9504J42455
40170A127623n4618l67990l35911m5400K3436o6509J26047M04985J37685n05122
40160D44226o24241o5862L04855Q1409p8609K35034L97026p5704n45587k65662
40150a93115L91672N55855J44668k58717l79912l64253k35028P4187L38700K60720
40140C34777m0462j59425Q0029M87112P07898M41622k41703p16523l81559M54133
40130I65899Q08258L29313k57170k74434J4719N8088r2680q5955M8990R0980R9425
40119A705433J97060K30431O6832j28385k45085m14884n48138k73415K88832L89106
$$ plain form
40190 1088269 1292960 907556 351607 193905 313433 236035 -117323 -449118 -527758 -284364
40180 -284364 215791 644638 609231 209229 17188 301079 702276 885664 985168 1127623
40170 1127623 1073005 705015 369104 323704 347140 280631 406678 811663 949348 444226
40160 444226 -180015 -245877 58978 140387 61778 296812 693838 618134 72547 -193115
40150 -193115 198557 754412 899080 640363 260451 -103802 -338830 -264643 74057 334777
40140 334777 294315 134890 214919 702031 1409929 1851551 1609848 893325 511766 965899
40130 965899 1774157 2103470 1846300 1571866 1586585 1644673 1551993 1466038 1515028 1606008 1705433
40119 1705433 1902493 2132924 2199756 2071371 1826286 1411402 863264 589849 878681 1267787
40109A267787j97003o07898j70774M60635K88397m93290q92667o18783k16906
40100a180502j4445J26444K27073K36923M17813Q23454P39024l25170j395559
40091c44945j059615L66900J077158L46660n31954l34303M25325O59520L78757
40082I83503K10197J34636j90175m41343q4891N20221N24258o2390l97047j58635
40072A038334O7635j05078k62691k1556K87341K41302O0759J60053L55943J37284
40062A959326m61845q41891o73524k59937M075R5738J41868J24578M1084N2629
40052A82101K10678K79736J08622n1923O6628K44131N7536m26034o78833m45639
40042d52997m2308J57863J70497J94651K57744K35089M7349k42126l96986j49314
$$ plain form
40109 1267787 1070784 462886 292112 752747 1041144 547854 -344813 -963596 -1180502
40100 -1180502 -1194947 -1068503 -841430 -604507 -186694 636760 1375784 1050614 -344945
40091 -344945 -1404560 -1037660 39498 386158 -145796 -480099 -54774 604746 983503
40082 983503 1193700 1328336 1138161 696818 611927 1132148 1656406 1594016 1196969 1038334
40072 1038334 1105969 1000891 738200 716644 1003985 1245287 1306046 1466099 1822042 1959326
40062 1959326 1497481 655590 -17934 -277871 -273796 -178058 -36190 88388 129472 182101
40052 182101 392779 672515 781137 729214 795842 1039973 1097509 671475 -7358 -452997
40042 -452997 -495305 -337442 -166945 27706 285450 520539 567888 325762 -71224 -220538
40032b20538L96435O48998K09418m52879n16993M3850M50289L00711N1298R7907
40022A008496J32660j59046m35699l05964n1537j05168k46900j8051L80514L34763
40012E34068j93656n93144m71624m5573L10830M19648K33710j39645l68965k21616
40002e35967J04306K78262K95234K90774J62546j51868k73478J46893P06274O34940
39992A657916j25889q22870q90752n05920r7372J52300K09850P8917o7603j4154
39982d25577J54922J70400L3927j5647L0934n4977k62530k73556O0487N02408
39972g9209P11351M91262j14685o84658o28258M6560M91769R9673n25219m15339
39962f06753K59964N07970J58229N2259M92652O95659J78665m03735m01963j98485
$$ plain form
40032 -220538 175897 824895 1034313 581434 64441 108291 558580 859291 910589 1008496
40022 1008496 1141156 982110 546411 240447 188910 83742 -163158 -181209 199305 534068
40012 534068 340412 -252732 -724356 -769929 -459099 -39451 194259 54614 -314351 -535967
40002 -535967 -431661 -153399 141835 432609 595155 443287 169809 316702 1022976 1657916
39992 1657916 1532027 709157 -181595 -687515 -784887 -632587 -422737 -343820 -411423 -425577
39982 -425577 -270655 -100255 -66328 -81975 -51041 -106018 -368548 -642104 -581617 -79209
39972 -79209 632142 1123404 1008719 324061 -304197 -257637 234132 333805 -191414 -606753
39962 -606753 -346789 161181 319410 371669 864321 1559980 1738645 1334910 932947 734462
39952G34462l70518o26758m07083O6311J92531J5003J6949J88254Q5534l12730
39942d18045m95637j55241M55116Q79909Q52525M39433L7978J5932J73329m8038
39932A737261o05182p01114j6941N71744K09367n84122o85320r8320J57414k44889
39922b60102m74563K4027O51737O49215J81727j16754r8802k0767P6355K95824
39912I07897M32945J80820k74263l78281p777K84412K7468m73955n29624j1922
39902A57720M69133M04640L1650j19123k5380p9699l23454l31830L0330K66725
39892D80712m0639n76981p17959l38733J53053L89456L17516P2869j11543j4906
39882c87155K84252L96828J50140r9492J4797K86142K57766o8798k91558k49046
$$ plain form
39952 734462 363944 -262814 -669897 -603586 -411055 -396052 -379103 -190849 -105315 -418045
39942 -418045 -913682 -1068923 -613807 266102 1118627 1558060 1596038 1611970 1785299 1737261
39932 1737261 1132079 430965 414024 985768 1195135 611013 -74307 -172627 -15213 -260102
39922 -260102 -734665 -710638 -58901 590314 772041 655287 556485 535718 612073 907897
39912 907897 1340842 1521662 1247399 869118 861341 1145753 1173221 699266 169642 157720
39902 157720 626853 1031493 1063143 944020 918640 838941 515487 183657 213987 480712
39892 480712 440073 -136908 -854867 -1193600 -1040547 -651091 -333575 -260706 -372249 -387155
39882 -387155 -102903 293925 444065 344573 359370 645512 903278 834480 542922 293876
39872B93876j50182j15201k4821J45601K14616Q9290r6042j75447r9387O9879
39862A52182J53337j4784k79439k27806J97357M62926J78429k75759l22592n8912
39852c5061L2761n6395J274R9924j07839l61137n2048O19925P25226N7568m59466
39841D64732k16034J68269m2285n06050m82581n3309J70751R1086L7260p833k55280
39830f31274m23974o6919N19954N54955k9456m18831q8322N45951Q48866P23358
39820A534308L91631l0546m22796n54817l99438k18942j29152M7413L01412K84121
39810H03194n3057j51638L48052Q87243O79052j07833n16280j16866M80435N62198
39800B814500J84466j71130l35653m21332l66152l2105L28016K10828l98293q16301
$$ plain form
39872 293876 143694 28493 3672 149273 363889 453179 357137 181690 82303 152182
39862 152182 305519 290735 11296 -216510 -19153 443773 622202 346443 23851 -35061
39852 -35061 -2300 -58695 -57421 42503 -65336 -426473 -478521 141404 866630 924198 464732
39841 464732 248698 416967 374682 -131368 -613949 -667258 -496507 -405421 -368161 -375994 -631274
39830 -631274 -1055248 -1122167 -602213 -47258 -76714 -495545 -583867 -37916 810950 1534308
39820 1534308 1925939 1895393 1472597 917780 518342 299400 170248 217661 519073 803194
39810 803194 750137 598499 946551 1833794 2512846 2405013 1888733 1771867 2252302 2814500
39800 2814500 2998966 2827836 2492183 2070851 1704699 1672594 2000610 2211438 1813145 996844
39790I96844m70396L10112O53895K46694k82583k02075L85144P36201M70172k74
39780B843734j07776J41436L08059J55093j64654m34504n62272m86363k19482
39771A473271N879l9719j90224q0186K23255K54940l8051r5913L03717N01726
39761B318695m2488p28788o24594M2619K06785l18232n59765l1414M70131K34487
39751I67436k11077j00947K43907N9087m79958n75787j65056R5910K6890O5544
39741g4051K50084J04259l32619l71486J42143M45774P9846l60689k31376J46657
39731b01458J19382k37518l74566j67759Q3230K37173L05358J48463k52022m77512
39721h17229k02005J90292J18331k49543k21490L18224P11350N09729N0468j57692
$$ plain form
39790 996844 526448 836560 1490455 1737149 1454566 1252491 1637635 2373836 2844008 2843734
39780 2843734 2735958 2877394 3185453 3340546 3175892 2741388 2179116 1692753 1473271
39771 1473271 1479150 1439431 1249207 1169021 1392276 1647216 1609165 1513252 1816969 2318695
39761 2318695 2276207 1547419 922825 965444 1172229 853997 294232 262818 732949 967436
39751 967436 756359 655412 899319 958406 478448 -97339 -262395 -166485 -139595 -74051
39741 -74051 176033 280292 -52327 -423813 -281670 164104 243950 -116739 -348115 -201458
39731 -201458 -82076 -319594 -694160 -861919 -778689 -541516 -236158 -87695 -339717 -817229
39721 -817229 -1019234 -828942 -710611 -960154 -1181644 -863420 -152070 357659 408127 250435
39711B50435j27704j72837l21989k95527M5432M62319N81116K97293j19979l63850
39701B34709m34468m79720m09756l9609M00555M10179J2917j66882J09712K75524
39691h6839m5751l21128n3531K27815j47157o49732k67515P21545R90299J99954
39681E67960n04686l21638J31293R1478j25173P3478M31933L75089L796k32781
39671D90749l26369m44746l84839q842K59510R8135n2960K29013M38410n3685
39661B44376p33140n86675K40172O04649J51642k38282L3933M35166L57630O0193
39651E69664J8704J07262N462j75568k19606k60207m03744l53198P5224M55420
39641a80587L07680j53328l45796j65375q102j05388k86378l17197j15463K85799
$$ plain form
39711 250435 122731 -50106 -372095 -667622 -622190 -159871 421245 718538 598559 234709
39701 234709 -199759 -679479 -1089235 -1128844 -728289 -318110 -305193 -472075 -362363 -86839
39691 -86839 -132590 -453718 -507249 -279434 -426591 -1076323 -1343838 -622293 368006 567960
39681 567960 63274 -258364 -127071 -35593 -160766 -87288 344645 719734 723530 490749
39671 490749 164380 -280366 -665205 -674047 -414537 -316402 -369362 -140349 298061 244376
39661 244376 -488764 -1075439 -835267 -230618 -78976 -317258 -283325 151841 509471 569664
39651 569664 588368 695630 701092 525524 305918 45711 -358033 -711231 -636007 -180587
39641 -180587 127093 -26235 -372031 -537406 -545508 -650896 -937274 -1254471 -1369934 -1084135
39631a084135O80127P09993K59421k74933m02906j47333N0311m1746j98495j11666
39621e61362K14941M78619L85685k7381l55345k39770J53297K91754k8427m29986
39611a17975n01749k72987K1906K92916M67739L69545K6996k05570j39527k8024
39601h6730l9719J08826N42150P04664J09924p17020q25037k05463K41449R2410
39591g4546j02182J12795L55629J42199k84436l76544j00331J69602K79864L50122
39581D72172L68028J60613k56976n88616n48136j49532K52825K33358k27405n81612
39571h65281l17529L04336N24518J38033k36728j26085J28084N0602j25502J14203
39561d11349O17895P15586K24185l06003m05806k24674j04961o7731K1895R4376
$$ plain form
39631 -1084135 -404008 305985 565406 290473 -112433 -259766 -209455 -251201 -449696 -561362
39621 -561362 -346421 132198 517883 490502 135157 -104613 48684 340438 312011 -117975
39611 -117975 -619724 -892711 -870805 -577889 -110150 259395 286391 80821 -58706 -86730
39601 -86730 -126449 -17623 524527 1229191 1339115 622095 -202942 -408405 -166956 -74546
39591 -74546 -176728 -63933 291696 433895 149459 -227085 -327416 -157814 122050 472172
39581 472172 840200 1000813 743837 155221 -392915 -542447 -289622 -56264 -283669 -865281
39571 -865281 -1182810 -878474 -353956 -215923 -452651 -578736 -450652 -400050 -525552 -411349
39561 -411349 206546 922132 1146317 840314 434508 209834 104873 37142 59037 153413
39551A53413k887j68031j14147K20438N18826M27728j8401m16951m54332k38145
39541i2489q1664n9404K8976K82201N20020N31013K93994q7113m38891m81518
39531D15125o0110M81176N26090m746m41801k62018J66565J52769l04737o01310
39521F7003m59048k07415j43693j41475o923J98989L41259L86746K87200j1896
39511C10747l49997m36002k50840p9480n7025N053K26411M11167L58201J46937
39501B85172m4683j53983j27442J16141M44649N13114K06339j69264l20517l14189
39491D35337k84547j25858K18247M58788L34762M9401o4442r6399l11783n31603
39481H1903l30703J82914L86608N6309k91419j90597J40890K70208K09198J95549
$$ plain form
39551 153413 150526 -17505 -131652 88786 607612 1035340 1016939 599988 145656 -92489
39541 -92489 -174153 -233557 -204581 77620 597640 1128653 1422647 1335534 896643 415125
39531 415125 355015 836191 1362281 1357535 915734 653716 820281 973050 668313 67003
39521 67003 -392045 -599460 -743153 -884628 -891551 -692562 -351303 35443 322643 310747
39511 310747 -39250 -475252 -726092 -805572 -862597 -857544 -631133 -219966 138235 285172
39501 285172 240489 86506 -40936 75205 519854 1032968 1239307 1070043 749526 435337
39491 435337 150790 24932 243179 701967 1036729 1086130 1021688 925289 613506 81903
39481 81903 -248800 -65886 320722 377031 85612 -104985 35905 306113 515311 710860
39471G10860J62243q5637l76064l54248o4996J24367J43971K70191N08943M53552
39461A493182l9672m90023m23787k7186J87407J10418M2716J46523K87808L44422
39451A631808L12578J65003n5687q2755K33380M93427J69429m97145o07616J44973
39441A907395R02778P47081o4290n12503j90553L46728M98851K78418k2729l01923
39431C589253n49378o24264l92374M5443L96257L90183r411m82726n57449j58419
39421A647115J89172J9182l74283l50601O8486K15056j38978m00968j47075J62175
39411H89281m8104n01612n14644p5869K07004R4706k6150J03662K14928L2651
39401C75853k67372l55941j97688r890K5010r5600j78975J8349M30928N82565
$$ plain form
39471 710860 873103 787466 411402 57154 -7842 116525 260496 530687 1039630 1493182
39461 1493182 1453510 963487 539700 512514 699921 810339 853055 999578 1287386 1631808
39451 1631808 1944386 2109389 2053702 1970947 2204327 2697754 2867183 2370038 1762422 1907395
39441 1907395 2810173 3557254 3492964 2980461 2789908 3136636 3635487 3913905 3891176 3589253
39431 3589253 3039875 2415611 2023237 2068680 2464937 2855120 2845709 2362983 1805534 1647115
39421 1647115 1836287 1855469 1481186 1130585 1199071 1414127 1275149 874181 727106 889281
39411 889281 841177 339565 -175079 -250948 -43944 50762 24612 128274 343202 375853
39401 375853 108481 -247460 -445148 -455038 -430028 -525628 -704603 -686254 -255326 327239
39391C27239J69266l86137m34103p4991p788l43042l38875L43956Q98588N27883
39381F81996k56816l53076K59583N36865J4499n41898l98680P7926J28364k34545
39371h5782m05563j91104J0639o3227j73695j6205L35166N40060L61308j22298
39361A89299n46119n32067o6461M42186O03641M50422K62403J35909l1305k19102
39351F88806k41559l8285K20711L54584L17193J20623j93582m81039n62299m03797
39341b18644j29700J10113J80086l824k84888k71088J70994N56145L11848l75938
39331D5104p01283k84704L66788N85769L02333j23702m20289m86133l03634n3694
39321a073445k9563k02657j94852J03706L08025K12132J85486M63471N72555J02018
$$ plain form
39391 327239 496505 110368 -323735 -398726 -406514 -749556 -1088431 -744475 154113 681996
39381 681996 425180 72104 331687 868552 883051 341153 -57527 20399 148763 -85782
39371 -85782 -491345 -682449 -671810 -735037 -908732 -924937 -589771 -49711 311597 189299
39361 189299 -356820 -888887 -955348 -513162 90479 540901 803304 939213 907908 688806
39351 688806 447247 408962 629673 984257 1301450 1422073 1228491 747452 185153 -218644
39341 -218644 -348344 -238231 -58145 -61969 -346857 -617945 -446951 109194 421042 45104
39331 45104 -656179 -940883 -574095 11674 314007 190305 -229984 -716117 -1019751 -1073445
39321 -1073445 -1103008 -1305665 -1500517 -1396811 -1088786 -876654 -691168 -227697 344858 446876
39311D46876m03605j58726N24588N65978k38323q63087n62210J45160L91368J26456
39301b5525j41139j89995j12973P3628L07262K92039o5330l20440q5726L08133
39291C9934K78760j00450k54658m8347O9972j03696j86482Q9729L59785J71890
39281C16437k88466m44264j55027J09459k3485k76848j25986L83241N80465Q2225
39271A57751n47797m43972L64331R12940N80648j17429l55669j59772j80222n61716
39261c50907p21401k87265L41113N83236L90515J08403m0253m5744P6091K60559
39251C14347L10600R1480k46378m17473l26060j10182P2349J69659J93536J65101
39241B16979R0235m6173k00785j95035J14821N36262O25157K25246k65430l77553
$$ plain form
39311 446876 43271 -115455 409133 975111 736788 -126299 -688509 -543349 -151981 -25525
39301 -25525 -166664 -356659 -469632 -396004 -88742 203297 137967 -182473 -268199 39934
39291 39934 318694 218244 -36414 -84761 -14789 -118485 -304967 -215238 144547 316437
39281 316437 27971 -416293 -571320 -461861 -485346 -762194 -888180 -504939 75526 157751
39271 157751 -390046 -834018 -469687 443253 1023901 906472 550803 391031 210809 -350907
39261 -350907 -1072308 -1359573 -1018460 -435224 -44709 63694 23441 -22303 53788 314347
39251 314347 624947 716427 470049 52576 -273484 -383666 -311317 -141658 51878 216979
39241 216979 307214 261041 60256 -134779 -19958 516304 1141461 1366707 1101277 723724
39231G23724j58893j0668n6412k7315K17164M08641K48507j82092n49413o27220
39221a3977m04785j4450L13668L90407K85649K34632K40194N3397k89137l05160
39211D90438J89263N50197J06701p33720r13736k43592L12157Q0601l88962l12340
39201h62993J09681J63714j56638k23809J36827M23709L20885R9422M8888Q2095
39191A41781P1067J02823K18491K74844K08676J14918j1265k64588n19079n09520
39181a71852k70720j00152n6611N6195J85100M6670k62466k67549R9904L26001
39171d15480J56876j5427Q1650J15528j48177l16857q4857J53567M5827J2555
39161d14795M35850O95201O0551q30220o37050N60949J098810O8084j297431j300806
$$ plain form
39231 723724 564831 554163 497751 470436 687600 1096241 1344748 1162656 613243 -13977
39221 -13977 -418762 -433212 -119544 270863 556512 791144 1031338 1084735 795598 490438
39211 490438 679701 1229898 1336599 602879 -310857 -554449 -242292 -161691 -550653 -862993
39201 -862993 -753312 -589598 -746236 -970045 -833218 -409509 -88624 10798 59686 141781
39191 141781 212848 315671 534162 809006 1017682 1132600 1121335 856747 337668 -171852
39181 -171852 -442572 -542724 -599335 -543140 -358040 -311370 -573836 -841385 -741481 -415480
39171 -415480 -258604 -274031 -192381 -76853 -225030 -541887 -626744 -473177 -427350 -414795
39161 -414795 21055 716256 776807 -53413 -690463 -129514 969296 1037380 -260051 -1560857
39151a560857l9468R21155O90121q1559m06887j76357J13323K27790K89802K96480
39141B73543R2961j87373j60322J65061K48712j43073m16263j7529N51048L89151
39131G95916l08812m20969L25186Q29210L13686m95592o06897k57742k18216l52266
39121c96496k4136N61827O52185L02487K35774M71036L18474k20685k84364L72721
39111A988823Q65049N37503j36175m48586l75080j59265J83015M77565K94130
39102C226979k73795m60511O0376O32542O53114L89144K38255q256m98114o92629
39092C267105k13864L32616K30285k09273k48487M2188R3850l1701J55680M91763
39082C910162L14734l47278o91876l35323K02583L36638Q1183k31013l28861m7100
$$ plain form
39151 -1560857 -1600325 -679170 10951 -70608 -477495 -653852 -540529 -312739 -22937 273543
39141 273543 366504 179131 18809 183870 432582 289509 -126754 -144283 406765 795916
39131 795916 487104 66135 391321 1220531 1534217 1038625 431728 173986 -44230 -396496
39121 -396496 -420632 141195 793380 1095867 1331641 1802677 2121151 1900466 1616102 1988823
39111 1988823 2853872 3391375 3255200 2806614 2431534 2272269 2455284 2932849 3226979
39102 3226979 2953184 2492673 2553049 3185591 3838705 4227849 4466104 4457848 3959734 3267105
39092 3267105 3053241 3385857 3616142 3406869 3158382 3200570 3294420 3262719 3418399 3910162
39082 3910162 4224896 3877618 3185742 2850419 3053002 3389640 3470823 3239810 2910949 2863849
39072B863849M90353P39321L02282m34861p58932n82158l30035q2757L62445O86904
39062C256411K94464n27475p11929j3242M77352l8660q17326p20557Q6405N13502
39052A798945J90624k36858k89021j96636j95017q9077K19189M05115K51749J5405
39042A874418o1818j48528l56039l26650J78767O38481L91914k94826n58956k86400
39032A050363k18948n39452l98359N73134J283797P05168l96162n33714J67192
39023A693019K36452o34916j031138j65925P89145N85609k17948l85455J1244
39014H80087M3919l35299l76273J7105J96873J142m7598K40143M71560M50435
39004A542094L57202J88037j66762l65957M061N65792N49471k328l39814k48107
$$ plain form
39072 2863849 3354202 4093523 4395805 3960944 3202012 2619854 2289819 2207062 2569507 3256411
39062 3256411 3550875 3023400 2311471 2298229 2775581 2736921 1919595 1199038 1285443 1798945
39052 1798945 1989569 1752711 1463690 1267054 1072037 982960 1202149 1607264 1859013 1874418
39042 1874418 1812600 1664072 1308033 981383 1160150 1798631 2190545 1895719 1336763 1050363
39032 1050363 831415 291963 -106396 466738 1750535 2455703 2059541 1525827 1693019
39023 1693019 1929471 1294555 263417 97492 886637 1472246 1254298 868843 880087
39014 880087 924006 588707 212434 229539 426412 427554 379956 620099 1091659 1542094
39004 1542094 1899296 2087333 1920571 1554614 1558675 2124467 2673938 2671610 2331796 2083689
38994B083689j84113k03862J20599O14097N27489q5478k38365L26037N78731p1807
38984C467017o92265l19504M88638O31855J89757L8067K99476L19046j01511m68344
38974C852232m83311l27767j29692J35712K90278J53937J9822K98334P56528P46832
38964E312905J90844k65552j52262K86859N66975N40737L59311J76672M9606k5784
38954G040311m3718P9853L94757P02876P08575M66296L35546L69792K15062j68444
38944A0100906k65992J16514L48078o5586n75024m08199J54003K39450j75962
38935I468188l26710o8594j26740p41263j115843o80020l2045L863m05049n47159
38925E428628l64637l96979p19212p35273j54102M45627L57480k96943p40341
$$ plain form
38994 2083689 1899576 1695714 1816313 2430410 2957899 2872421 2634056 2960093 3538824 3467017
38984 3467017 2774752 2455248 2943886 3575741 3765498 3803565 4103041 4422087 4320576 3852232
38974 3852232 3368921 3041154 2911462 3047174 3337452 3491389 3511211 3809545 4566073 5312905
38964 5312905 5503749 5238197 5085935 5372794 5939769 6480506 6839817 7016489 7066095 7040311
38954 7040311 6996593 7076446 7471203 8174079 8882654 9348950 9684496 10054288 10269350 10100906
38944 10100906 9834914 9951428 10299506 10233920 9658896 9250697 9404700 9644150 9468188
38935 9468188 9141478 9072884 8946144 8204881 7089038 6409018 6376973 6380836 5975787 5428628
38925 5428628 5063991 4667012 3947800 3212527 3058425 3504052 3861532 3564589 2824248
38916B824248n46384j02076J2559k08278l18187j37031M2109j1303j18969o5374
38906A371314K5760k9636r2828M8906K39957J54714j55606k99209j17588J16324
38896A262108J22795l0382p2751J40141M73025N86138K37840l70098o92415m52343
38886A204058J4290K19238J10406n2641j62804k54513k46216j06017r3495l80357
38876B51949n91687k57800L79042O08712K91374R736R2275J64628p3739k78361
38866E96129q9664J93135R8346k25262k67474R830J58669j4987k13684j85095
38856E9943m8269K8995R3568J69481R1624j59433k21852J74991O35991M64629
38846A289668l19602p98801l10705N74314P45955O0373m84831j80902M33671M29943
$$ plain form
38916 2824248 2277864 2175788 2188347 1980069 1661882 1524851 1566960 1555657 1436688 1371314
38906 1371314 1397074 1367438 1274610 1323516 1563473 1718187 1562581 1263372 1145784 1262108
38896 1262108 1384903 1354521 1281770 1421911 1894936 2481074 2718914 2348816 1656401 1204058
38886 1204058 1218348 1437586 1547992 1495351 1332547 1078034 831818 725801 632306 251949
38876 251949 -339738 -597538 -218496 390216 681590 691326 783601 948229 874490 596129
38866 596129 506465 699600 797946 572684 305210 315040 473709 458722 245038 59943
38856 59943 11674 40669 134237 303718 395342 235909 14057 189048 825039 1289668
38846 1289668 970066 171265 -139440 434874 1180829 1241202 756371 575469 1009140 1439083
38836A439083j87507n90047l30146J57006K70318q864k37857j05518K51690M24615
38826A082773J75969k74254n04344m34313l61350l86008k03921K94520O62424
38817E1496N46041K86825L30735M05943p237o46671p46179k60623O8661n5563
38807b6572j03117K03040L58352P8424n1092M06992Q20281M32652l25729m55737
38797A337494J1387J03862m45927p31575j39810O53496P17494K02027p8472L7906
38787A667882k6260m79522p58208m26756J22398K47355l7880j74372Q9150L75446
38777E99233K45880j96302m02063L702P47322J088159O01449k34546n11525l5040
38767A906269M08335J79868l06903l24187j6708n8802m00118l39639J64839L21913
$$ plain form
38836 1439083 1251576 661529 331383 488389 758707 749843 511986 406468 658158 1082773
38826 1082773 1258742 984488 480144 45831 -315519 -701527 -905448 -610928 51496
38817 51496 597537 884362 1215097 1621040 1613803 967132 220953 -39670 28991 -26572
38807 -26572 -129689 73351 431703 510127 459035 866027 1686308 2118960 1793231 1337494
38797 1337494 1348881 1452743 1006816 275241 135431 788927 1506421 1708448 1629976 1667882
38787 1667882 1641622 1162100 403892 -22864 99534 346889 309009 134637 223787 599233
38777 599233 845113 648811 246748 250450 997772 2085931 2687380 2452834 1941309 1906269
38767 1906269 2314604 2494472 2187569 1863382 1846674 1787872 1387754 1048115 1212954 1534867
38757A534867j32568m60157k28806l9815l17351m13722J90469P28161L14391m63100
38747G12369m10811L20901N48710N7857j54396L31818P16990M28542j6290o5153
38737B470537k3692l27248p15199o99036k94277J33114L04967R9906l37319m89020
38727A22733n0177M09385J19729n94336o44340J27714O77578M22459K2729P0807
38717F84281J56207j25392k98909O1218M38573K54734j32469j38676M2164m1924
38707H99807k32303k10335j79174l13597j95799L81468P40816L40940k17707j73364
38697H40752J08294q3956m03823q8297N31132N35829P9045R6543N38310L80412
38687B534241n28874j067939n87624J94017M42698K55108J6572k82086n65276
$$ plain form
38757 1534867 1402299 942142 713336 673521 356170 -57552 132917 861078 1175469 712369
38747 712369 301558 622459 1171169 1229026 1074630 1406448 2123438 2551980 2535690 2470537
38737 2470537 2446845 2119597 1404398 705362 411085 544199 849166 949072 611753 122733
38727 122733 72556 481941 601670 7334 -637006 -509292 168286 590745 613474 684281
38717 684281 840488 715096 416187 477405 915978 1170712 1038243 899567 941731 899807
38707 899807 667504 457169 277995 -35602 -231401 150067 890883 1231823 1014116 840752
38697 840752 949046 865090 461267 372970 904102 1439931 1518976 1615519 2153829 2534241
38687 2534241 2005367 937428 349804 543821 986519 1241627 1258199 976113 410837
38678D10837l76239L58635R28174P28056O4491l28811j61892K89398N40243K30200
38668B683092m95600r19312n44414J22380K00166k66771m30500k3721L08765J90765
38658H24850O0319K36025L46427J09969j16914k9756R1981j5243j24700n9302
38648A323656n4802j81294p4496L28716M76879J04839k29901l4502L53133M39584
38638B451812L59164L67536K01106l45475p75040n91532j65985j18365k71396
38629A111825n5852M00463M86490J86832M7889J55670K0848m59387p21228m09590
38619G63960J05641L27442K48868J36562Q5486K8174n8248j28581j24604j2551
38609A372149J32538J54625N9172P5019K86970L95397J01536m19412o96624n01447
$$ plain form
38678 410837 34598 393233 1321407 2049463 2113954 1785143 1623251 1912649 2452892 2683092
38668 2683092 2187492 1268180 723766 846146 1046312 779541 349041 325320 634085 824850
38658 824850 885169 1121194 1467621 1577590 1460676 1430920 1522901 1507658 1382958 1323656
38648 1323656 1268854 1087560 1013064 1341780 1818659 1923498 1693597 1659095 2012228 2451812
38638 2451812 2810976 3178512 3379618 3034143 2259103 1667571 1501586 1383221 1111825
38629 1111825 1055973 1456436 1942926 2129758 2177647 2333317 2354165 1894778 1173550 763960
38619 763960 869601 1197043 1445911 1582473 1667959 1696133 1637885 1509304 1384700 1372149
38609 1372149 1504687 1659312 1718484 1793503 2080473 2475870 2577406 2157994 1461370 959923
38599I59923r78M69075N99228K91880j41753k22120N6723J58599j65351m05935
38589A599291o8852M85978N37246N0486l71553m09130k86500k00378q4438M3100
38579A295250K2068r8987q9456M7549Q2133n012J8131K16318L84925L75348K04911
38568B453178j04557m57789n53102k20098J94862K18459m6798q8407J92317L53646
38558A941711J49552j29704j67148j2123J58592K60955J87419j21450m04381k95595
38548A567828J06424L16493J76176J2773J522q6701l33976m29358k27391l0211
38538A073579j8881P8483L94506N08388Q4096m97183o43150l57818n4664J27721
38528F95077K90705L12473J0189l71235l98088j15899M2083l3180n4505J7192
$$ plain form
38599 959923 958945 1428020 2027248 2319128 2177375 1955255 2011978 2170577 2005226 1599291
38589 1599291 1530439 2016417 2553663 2604149 2232596 1823466 1536966 1336588 1252150 1295250
38579 1295250 1317318 1218331 1128875 1176424 1258557 1253545 1271676 1487994 1872919 2248267 2453178
38568 2453178 2348621 1890832 1337730 1117632 1312494 1530953 1484155 1395748 1588065 1941711
38558 1941711 2091263 1961559 1794411 1782288 1940880 2201835 2389254 2267804 1863423 1567828
38548 1567828 1674252 1990745 2166921 2179694 2181216 2094515 1760539 1331181 1103790 1073579
38538 1073579 1054698 1133181 1527687 2036075 2120171 1622988 979838 622020 567356 695077
38528 695077 985782 1298255 1308444 937209 539121 423222 465305 432125 377620 394812
38518C94812j36729n09326n67861n6109M86015M41959J8436q7472K53659M45198
38508F82582J17563k81470j40720M09172O69620L46392r6009j60692j5113j58503
38498A372822o13726q51028n09282J46931N89327N91998L14036K5624j04966j00641
38488H61095j61636m23439o73698n30552J226M25917L88741J36405Q8028K12119
38478C24206J94657K8997j4397O8477k0903l18310m32887j17505L33312M59187
38468E04834J73360k32008m15828k14733K26354M52998J15644m84902n99040J9080
38458d54241P01125O92343P2112m96135o23587l76394J10024O35537P33226J04685
38448A098695p57347r91345m79266M5380R0491m1320Q085M9474j31102k49821
$$ plain form
38518 394812 258083 -251243 -819104 -875213 -389198 52761 71197 -16275 237384 682582
38508 682582 800145 518675 377955 787127 1456747 1803139 1707130 1546438 1531325 1372822
38498 1372822 759096 -91932 -601214 -454283 135044 727042 1041078 1066702 961736 861095
38488 861095 699459 276020 -397678 -928230 -927004 -501087 -112346 24059 112087 324206
38478 324206 518863 547860 533463 601940 581037 262727 -170160 -287665 45647 504834
38468 504834 678194 446186 30358 -184375 41979 494977 610621 125719 -473321 -454241
38458 -454241 246884 939227 1011339 515204 -108383 -484777 -374753 260784 994010 1098695
38448 1098695 341348 -649997 -1129263 -1083883 -993392 -1034712 -1026627 -977153 -1108255 -1358076
38438a358076k6050K73768L10565K60803L83310M14802L7720l89960k81009K36946
38428a37181N28068M15328K25968M7657k61511m38778q8974M14872K66376m13969
38418E57856n74004J24244P07458M41203m5633P9298M71254L32883j64519k40585
38408A689455J44870L47949K01737J23030J68541n4644n04237o09393k03788K07131
38398A510651K79282K42399K97467K55805J8251j53174q7978M2909J02394J46618
38388B654624J08115j43040l25895K8964P14094Q97456L20020k70240k71015q7214
38378C625869k94870o27774n29173j79690j30591k66284k6164N11185O61917K62223
38368C006648q0218o253R8541j00286k92206j27360J49721J52427P843M1904J23544
$$ plain form
38438 -1358076 -1384126 -1110358 -799793 -538990 -155680 259122 296842 -93118 -374127 -137181
38428 -137181 390887 806215 1032183 1079840 818329 379551 290577 705449 971825 557856
38418 557856 -16148 108096 815554 1256757 1211124 1290422 1761676 2094559 1930040 1689455
38408 1689455 1834325 2182274 2384011 2507041 2675582 2620938 2116701 1507308 1303520 1510651
38398 1510651 1789933 2032332 2329799 2585604 2603855 2450681 2362703 2405612 2508006 2654624
38388 2654624 2762739 2619699 2293804 2322768 3036862 3934318 4254338 3984098 3713083 3625869
38378 3625869 3330999 2703225 2174052 1994362 1863771 1597487 1571323 2082508 2744425 3006648
38368 3006648 2926430 2920177 3018718 2918432 2626226 2498866 2648587 2801014 2808857 2850761 2974305
38357B974305j09852n28110n75579q4347M52006N43446K72551J7762r8151k24808
38347B639223m07723m69213k72445O1937K68577K15423L2139l9675Q5813K62490
38337B376546L33278L46092M29454N07499L48436m9312l34342k25215R3911K09749
38327D036096L0155j37052n3739J28756J10408j48277l81950l32581k7934K45754
38317C469636K34743j4883k15382j75971L863J27452J56158J57844J33979O6251
38307C943690K2712K5559p1582l45119n55947m23870n7847J98350K66423L21802
38297C324171L59439K13785m04L5829K58780K29830j23737l04376r440M08653
38287D392530N32441M34938L14111P0812l38501n91417n04268m18037n86091o12687
$$ plain form
38357 2974305 2864453 2336343 1760764 1676417 2128423 2671869 2944420 2962182 2864031 2639223
38347 2639223 2231500 1762287 1489842 1551779 1820356 2035779 2067918 2028243 2114056 2376546
38337 2376546 2709824 3055916 3485370 3992869 4341305 4291993 3957651 3732436 3826347 4036096
38327 4036096 4066251 3929199 3875460 4004216 4114624 3966347 3584397 3251816 3223882 3469636
38317 3469636 3704379 3689496 3474114 3298143 3302006 3429458 3585616 3743460 3877439 3943690
38307 3943690 3966402 3991961 3920379 3575260 3019313 2595443 2537596 2735946 3002369 3324171
38297 3324171 3683610 3897395 3896991 3932820 4191600 4421430 4297693 3993317 3983877 4392530
38287 4392530 4924971 5359909 5674020 5744832 5406331 4814914 4310646 3892609 3306518 2693831
38277B693831r4074N61459O38126J81734j21006K8157K81957L18133J60130r9532
38267D548915l42576k83429J82250O08188N04674M8375k52776l42177m21848l06321
38257C943275K00215N64272J66690m81428l09863N44777Q16964J43186l50497
38248E237591L8947M56393N5079n30043l38562K63145L02852j28048j93504J61997
38238E325847K75148R6105K05443N43702L42467m73496r09699l48595N03600O56605
38228F217127J66959j73361m2526J56986Q4834p2117k4655J13903K7212k37612
38218F216750k55472J11630L84400J60789j39374J62932Q05554P79163q0583o09936
38208G535853J2527R28708Q07453j85145o84276j40127N64948N71112J21063j11857
$$ plain form
38277 2693831 2599757 3161216 3799342 3981076 3860070 3888227 4170184 4488317 4648447 4548915
38267 4548915 4206339 3922910 4105160 4713348 5218022 5266397 5013621 4671444 4249596 3943275
38257 3943275 4143490 4707762 4874452 4393024 4083161 4627938 5444902 5588088 5237591
38248 5237591 5276538 5732931 5788010 5257967 4919405 5182550 5485402 5357354 5163850 5325847
38238 5325847 5600995 5697100 5902543 6446245 6788712 6315216 5405517 5056922 5560522 6217127
38228 6217127 6384086 6210725 6168199 6325185 6410019 6337902 6313247 6427150 6454362 6216750
38218 6216750 5961278 6072908 6457308 6618097 6478723 6641655 7447209 8226372 8145789 7535853
38208 7535853 7548380 8477088 9284541 9099396 8415120 8274993 8839941 9411053 9532116 9420259
38198I420259J0585K05006K82142J65660j76218m91717l17231L86934R82855Q62192
38188A1330467J93241l14367k39107J86429M46483L13378O6989J64378O46510
38179A2794401R96342P73529K44277N0264L23767N47633L47676K005k3693K89498
38169A6345699N95296O67806N47015L40682J34555N6527K10817M88879N84618
38160A9971894L34840J3333R5976O31290J056644Q98049M56205L56624N42390
38151B4357245L75935j68390k23997O31891J516609J420190O68393L48994O80565
38142B9607435R39191Q24994Q43976J233775J491515J295965J101920J384371
38134C8723142J889843K080930J899001J706589J770486K064472K356143K386051
$$ plain form
38198 9420259 9430844 9635850 9917992 10083652 9907434 9415717 9098486 9485420 10468275 11330467
38188 11330467 11523708 11209341 10970234 11156663 11603146 11916524 11983513 12147891 12794401
38179 12794401 13790743 14564272 14808549 14858813 15182580 15730213 16077889 16079894 16056201 16345699
38169 16345699 16940995 17608801 18155816 18496498 18631053 18687580 18898397 19387276 19971894
38160 19971894 20306734 20320067 20416043 21047333 22103977 23002026 23458231 23814855 24357245
38151 24357245 24733180 24564790 24340793 24972684 26489293 27909483 28577876 28926870 29607435
38142 29607435 30546626 31371620 32215596 33449371 34940886 36236851 37338771 38723142
38134 38723142 40612985 42693915 44592916 46299505 48069991 50134463 52490606 54876657
38126E4876657K210648K307720K958368L672736L805821L610704L912956M770177
38118H2125787N376970N433827N586877O179046O650254O753805P296167Q809511
38110A34212244J0413065J1060794J1205271J2031483J3551438J4758506J5416186
38103B22648987J6357088J7963502J9571775K0613910K1266619K1642335K1340699
38096C61404915K0235269J8786088J7050774J4248596R960252N002602L52777
38089D47041273m118810q913152j3433642j6423857j7751544j8611317j9725366
38082C48063585k0351780j9589697j7862153j6340098j5359009j4248838j2609415
38075B31702595j0963262r964475r560630r276952q928081q641540q407381q046435
$$ plain form
38126 54876657 57087305 59395025 62353393 66026129 69831950 73442654 77355610 82125787
38118 82125787 87502757 92936584 98523461 104702507 111352761 118106566 125402733 134212244
38110 134212244 144625309 155686103 166891374 178922857 192474295 207232801 222648987
38103 222648987 239006075 256969577 276541352 297155262 318421881 340064216 361404915
38096 361404915 381640184 400426272 417477046 431725642 441685894 446688496 447041273
38089 447041273 442922463 434009311 420575669 404151812 386400268 367788951 348063585
38082 348063585 327711805 308122108 290259955 273919857 258560848 244312010 231702595
38075 231702595 220739333 210774858 201214228 191937276 183009195 174367655 165960274 157913839
38067A57913839p597962p381753p571977p912269p955754p494729o730447o100650
38059I9168298n904796n984579n834348n185748m405739m068453m159669m040906
38051E9584060l323721k458845k171664k492875k712444k310349j605048j282118
38043D1226996j476735j650847j399913j032503j084270j485967j652690j370121
38035C0073950j090993j181322j358461j221383r22024q33591q72303p16402m78748
38026B1398723n25857p48562p07410m88115o45913j152414j197970m13877M15811
38017A5934416M03301k26825n86789l96170j40472j86738l93575n43943o03903
38008A3259302n18668k26328M4288r4574o13502r50513o72073m2045K75184j2441
$$ plain form
38067 157913839 150315877 142934124 135362147 127449878 119494124 111999395 105268948 99168298
38059 99168298 93263502 87278923 81444575 76258827 71853088 67784635 63624966 59584060
38051 59584060 56260339 53801494 51629830 49136955 46424511 44114162 42509114 41226996
38043 41226996 39750261 38099414 36699501 35666998 34582728 33096761 31444071 30073950
38035 30073950 28982957 27801635 26443174 25221791 24299767 23466176 22593873 21877471 21398723
38026 21398723 20872866 20124304 19416894 18928779 18282866 17130452 15932482 15518605 15934416
38017 15934416 16337717 16110892 15524103 15127933 14987461 14800723 14407148 13863205 13259302
38008 13259302 12740634 12514306 12558594 12464020 11850518 10900005 10227932 10185887 10461071 10448630
37998A0448630n32384p48889o12034n33820p21080q08516l92395K81361N70911
37989F951784L17029j150m6390m9983k56940m37526l04900l8832K2492n3869L5331
37978F137046K61442K70734q0223m85988n08268k5649N61218N89417j53840r93278
37968E572611j043239l66604Q8683j40968m25176j67320K13759R1979k22315m4639
37958C556771M07237L25848k74683n17217r8031K52133L4863k16891O7714M52392
37948C990136J76811n46670p23181j262P80930P19620N5214k09719K36523N36726
37938E015128o3693r61924r22580J01699P88367L26285m45363l85831K60737M38365
37928D151190j4319l18748j68371p4660k86047l87022j67187Q110m4913j5173
$$ plain form
37998 10448630 9916246 9167357 8555323 8021503 7300423 6491907 6099512 6380873 6951784
37989 6951784 7268813 7267663 7221273 7171290 6914350 6476824 6171924 6133092 6155584 6101715 6137046
37978 6137046 6398488 6669222 6588999 6103011 5594743 5569094 6130312 6719729 6565889 5572611
37968 5572611 4529372 4162768 4251451 4110483 3685307 3517987 3731746 3823725 3601410 3556771
37958 3556771 3964008 4289856 4015173 3497956 3399925 3652058 3686921 3470030 3537744 3990136
37948 3990136 4166947 3620277 2897096 2895834 3676764 4396384 4451598 4241879 4478402 5015128
37938 5015128 4951435 3989511 3066931 3168630 3956997 4283282 3837919 3452088 3712825 4151190
37928 4151190 4136871 3818123 3649752 3575092 3289045 2902023 2734836 2742946 2698033 2682860
37918B682860J71867J02095k97355m47374p4338K48368M4996k44336l0314L95686
37908B552155L36488j75592m66861k62635M0670J01501N0383J10557K36318K54424
37898B777408J07233j16355k46022j56447M5726O2601k15776m90250l86481P7034
37888A458671N09241N70727K74135o3377j00492K04168N13699M63893Q5280k58003
37878C657942k99984o8278K59064M50254K84972j65280m34773k11680J42099Q2589
37868C696925k39934k10130J91159K93293j61054n69367m25972m7950M3755j27629
37858B443096k83235l76583l67902n5467M12780M22385j82570o19537k51371L70173
37848A511769L16843k64130m00337J88250P13776N18171r8982m44583k79369J17169
$$ plain form
37918 2682860 2854727 2956822 2659467 2212093 2137755 2386123 2431119 2186783 2156469 2552155
37908 2552155 2888643 2713051 2246190 1983555 2024225 2125726 2176109 2286666 2522984 2777408
37898 2777408 2884641 2768286 2522264 2365817 2411543 2474144 2258368 1768118 1381637 1458671
37888 1458671 1967912 2538639 2812774 2749397 2648905 2853073 3366772 3830665 3915945 3657942
37878 3657942 3357958 3289680 3548744 3998998 4283970 4118690 3683917 3472237 3614336 3696925
37868 3696925 3456991 3246861 3438020 3731313 3570259 3000892 2574920 2526970 2570725 2443096
37858 2443096 2159861 1783278 1415376 1359909 1772689 2195074 2012504 1392967 1141596 1511769
37848 1511769 1828612 1564482 1164145 1352395 2066171 2584342 2485360 2040777 1761408 1878577
37838A878577L63278K80141j2666k42993l15176l58738l58203p7382M06332N29439
37828B092609L6544m61691k97483K27529L09970j00209k95641O378K75856Q6302
37818A880164k77499l60653j36166J73138M07728M00978L9095l90267l41037K26612
37808A622093O12930K58376m36153n89414j6503N11161K91285l59558n24824L2940
37798A402333M96889J64871m60203l75049L69353P01036J94798k92935q8449J90374
37788B303018k19678q00382n53990K98271O26098J77070j39874K07792O50673
37779B548998N55933O7182l88409o55228o29863j95466L39920L82970r6585m45512
37769A483940k74241P0330J77889R8833k4250k29935m08499k96607j0404K1887
$$ plain form
37838 1878577 2241855 2521996 2509330 2266337 1951161 1592423 1234220 1156838 1563170 2092609
37828 2092609 2129153 1667462 1369979 1597508 1907478 1807269 1511628 1518006 1793862 1880164
37818 1880164 1602665 1242012 1105846 1278984 1686712 2087690 2126785 1736518 1395481 1622093
37808 1622093 2235023 2493399 2057246 1467832 1451329 1962490 2253775 1894217 1369393 1402333
37798 1402333 1899222 2064093 1603890 1228841 1598194 2299230 2494028 2201093 2112644 2303018
37788 2303018 2083340 1282958 728968 1027239 1653337 1830407 1690533 1898325 2548998
37779 2548998 3104931 3172113 2783704 2128476 1498613 1303147 1643067 2026037 1929452 1483940
37769 1483940 1209699 1280029 1457918 1556751 1532501 1302566 894067 597460 587056 608943
37759F08943j80358j46902J25466O1903m23646o27925k19035J78452N8355j73766
37749g38513q0045K996k29851k70054K86628P56918L29345n35940p37159j79976
37739a395651K66684K02434K3284l8110j52000j92431J89565P00633N72012k08608
37729c2188p17402m33770M6300Q061l77883n03790k24658J57424M09706M60812
37719a207388K80440O304n4152J84407M14565L61038J40720J7691M2050J12876
37709B98551J66991J24854j28658n11987o76365l74556J92328N40297L80383j01933
37699i0095l98735j70310L26149M42065n5619n93367n20609k3327J70902j00367
37689a013313k27379J69810O34414N77486J24776j50665m4628J46132J53230L1364
$$ plain form
37759 608943 428585 281683 407149 469052 45406 -582519 -801554 -623102 -564747 -738513
37749 -738513 -818558 -815562 -1045413 -1315467 -1028839 -271921 57424 -478516 -1215675 -1395651
37739 -1395651 -1128967 -926533 -903249 -941359 -1093359 -1285790 -1096225 -395592 176420 -32188
37729 -32188 -749590 -1183360 -1137060 -1128999 -1506882 -2010672 -2235330 -2077906 -1668200 -1207388
37719 -1207388 -926948 -920644 -974796 -790389 -375824 -14786 125934 143625 185675 298551
37709 298551 465542 590396 461738 -50249 -726614 -1101170 -908842 -368545 11838 -90095
37699 -90095 -488830 -659140 -332991 109074 53455 -539912 -1060521 -1083848 -912946 -1013313
37689 -1013313 -1240692 -1070882 -436468 141018 265794 115129 70501 216633 369863 401227
37679D01227l6415K8441J60139K02495N1350j70182j92902M2974K57616J87220
37669I31963o9230k10795j24445M4661J21511N1840r9828j74176k5404K60518
37659G06615L57328Q9573k41493j65540K98497N49366J45248n30892o55373l4241
37649E19088N53623L39021l69292n72164Q562N10251J87639m79772n15320Q7568
37639B69204M10122O0840k55830R9374O89769O89605J03779l45116l14370j70726
37629A236651k40555l25050j40529J90953L45855K32245J3329j07348J7023L67477
37619A590051O00463K86141m52405q44130m06302K69792K22250m90483p91817
37610a6440j36289O59605N92228j08179m20177m3922L31947J87645j97773m01399
$$ plain form
37679 401227 364812 393253 553392 755887 807237 637055 444153 487127 744743 931963
37669 931963 862733 651938 527493 572154 693665 745505 645677 471501 446097 706615
37659 706615 1063943 1153516 912023 746483 1044980 1594346 1739594 1208702 553329 519088
37649 519088 1072711 1411732 1042440 470276 478838 989089 1176728 696956 181636 269204
37639 269204 679326 740166 484336 583710 1273479 1963084 2066863 1721747 1407377 1236651
37629 1236651 996096 671046 530517 721470 1067325 1299570 1312899 1205551 1222574 1590051
37619 1590051 2190514 2476655 2024250 1180120 773818 1043610 1265860 775377 -16440
37610 -16440 -152729 506876 1099104 990925 570748 526826 858773 1046418 848645 447246
37600D47246m30375l70787p7880M11813O60203M29071Q7617J5762J1796k29848
37590I54618m32945j35457M60993O75754L15422j26770k65835k78814m23856n62876
37580A80234m23049o5792J66109R1457p4192K3164L76181M96640K8904n86485
37570B13171n14912K90040Q70337N69298l7938j00191J68936l3248o18124o63566
37560A43803L2617N11115R8386n94016o50369j44903J94700J52973J43914L54540
37550B42760M27587Q5957l58607l53549J70285O21874M13763k55970n68582j65835
37540B59683L19613K02244j78690o293O12608P06812j5454o39966m40954P4699
37530H94302J22000j10329L0689M36930M61522J02267Q662L15672L73015j22449
$$ plain form
37600 447246 16871 -353916 -431796 -19983 640220 1069291 1156908 1172670 1184466 954618
37590 954618 521673 386216 847209 1522963 1838385 1711615 1445780 1166966 743110 180234
37580 180234 -242815 -308607 -142498 -51041 -125233 -102069 274112 770752 799656 213171
37570 213171 -301741 -11701 858636 1427934 1389996 1289805 1458741 1425493 807369 143803
37560 143803 176420 687535 785921 191905 -458464 -603367 -408667 -255694 -111780 242760
37550 242760 670347 756304 397697 44148 214433 836307 1250070 994100 425518 259683
37540 259683 579296 781540 602850 596557 1209165 1915977 1900523 1260557 819603 894302
37530 894302 1016302 905973 936662 1373592 1835114 1937381 1946043 2261715 2634730 2512281
37520B512281m97043o9592P78051J082201N96321K2293m5731J40531M7943k52412
37510D314843k46948J25391L08418k8506n11018o98688o99114p16030m83172K00731
37500A565907P61106N08345j93857l47343J39353L41003j16395m62137j47889
37491B048093K33781K2574m18921m40570j69163l3222R0321L90035M26822r9058
37481B050692m70077M4472P78301N38576l95748n72796L08967Q46115J09861r37831
37471B300532r40419m8257N61591L88181o7639k98429l02920k36409j58635j22454
37461A075142j36910q5832P2726J56174K8034j48454j55652n7754n8035j46664
37451E42775j13062J44703M58033N10206J23252m69858p09626k87438M14735P38183
$$ plain form
37520 2512281 2015238 1945646 2723697 3805898 4402219 4424512 4378781 4519312 4567255 4314843
37510 4314843 4067895 4193286 4501704 4473198 3962180 3263492 2564378 1848348 1365176 1565907
37500 1565907 2327013 2835358 2641501 2294158 2433511 2774514 2658119 2195982 2048093
37491 2048093 2281874 2304448 1885527 1444957 1275794 1242572 1332893 1722928 2149750 2050692
37481 2050692 1580615 1625087 2403388 2941964 2546216 1973420 2282387 3128502 3238363 2300532
37471 2300532 1360113 1311856 1873447 2261628 2193989 1895560 1592640 1356231 1197596 1075142
37461 1075142 938232 852400 925126 1081300 1109334 960880 805228 747474 689439 542775
37451 542775 429713 574416 1032449 1542655 1665907 1196049 486423 198985 613720 1351903
37441A351903N45377K53851J18184m6057l32281m38964j52200K41342L10536L71
37431A852062m06483o13832m60081k4001K85050O1521n16693p73280l66199L04752
37421f57184O87987O86304M63335Q6414l05827l65034L2102M82993N56373L42738
37411B010201J75272Q1059j01906l01328l18673j85448l9687J66199M53480N19015
37401B458184J09388m31589m71031P1362O06537O35366K73148m2126p3720O6115
37391C201634J04686j04121l97738m78288l25255k30216l00238k23828K31680
37382A478316P87870J032187R51325P48380M31719J1875j80770J00369M97672
37373E858943M72262J00891q4368Q2358L02229M22099N44409N96825M09327J89904
$$ plain form
37441 1351903 1897280 2151131 2269315 2223258 1890977 1452013 1299813 1541155 1851691 1852062
37431 1852062 1445579 831747 371666 347665 632715 694236 177543 -595737 -961936 -657184
37421 -657184 30803 717107 1180442 1266856 961029 595995 628097 1111090 1667463 2010201
37411 2010201 2185473 2266532 2164626 1863298 1544625 1359177 1319490 1485689 1939169 2458184
37401 2458184 2567572 2135983 1664952 1736314 2342851 2978217 3251365 3209239 3135519 3201634
37391 3201634 3306320 3202199 2804461 2326173 2000918 1770702 1470464 1246636 1478316
37382 1478316 2266186 3298373 4249698 4998078 5429797 5441672 5260902 5361271 5858943
37373 5858943 6331205 6432096 6347728 6430086 6732315 7154414 7698823 8295648 8704975 8894879
37363H894879L04228O06528O38963M68327N94696J012195J174760J001680J048670
37354A5744926J472308J731719J638226J765131K360744K790850K662532K606006
37346C2772442L201230L945405M120805L936611L890391L704921K943559K055481
37338F0570845J642520J197959j50622k007449l156030l408138l615061l959498
37330D7114526l758026l057458k829559l202361l064384k051572j421194k049649
37322B5680323k906911k651172j636938j091319j176492j193596j047500j139303
37314A2837092j226417p30029K6526J19131n05470r68391q55272o21934n53763
37305G521473l48308P6831K67544n15l46223l82095j12761L16001O79781N69654
$$ plain form
37363 8894879 9199107 9805635 10444598 10912925 11507621 12519816 13694576 14696256 15744926
37354 15744926 17217234 18948953 20587179 22352310 24713054 27503904 30166436 32772442
37346 32772442 35973672 39919077 44039882 47976493 51866884 55571805 58515364 60570845
37338 60570845 62213365 63411324 63260702 61253253 58097223 54689085 51074024 47114526
37330 47114526 43356500 40299042 37469483 34267122 31202738 29151166 27729972 25680323
37322 25680323 22773412 20122240 18485302 17393983 16217491 15023895 13976395 12837092
37314 12837092 11610675 10880646 10907172 11026303 10520833 9552442 8697170 8075236 7521473
37305 7521473 7173165 7249996 7517540 7517025 7170802 6788707 6675946 6991947 7671728 8241382
37295H241382q2910n22439n3701P41451P02727o2991k73695M50652R90718O67557
37285A0798751L74498R38874J597543J259291L70595K30039J009572J729273J901932
37276B0210368J998912K344707K629377K662489K754898L141735L674314M241082
37268D3657882M932734N655529O078641O084784N829917N265207M049311K095093
37260H3649098j47148k112207l577823m600492n223312n397547n133972m668610
37252E2787987m380410m378288m265063l670074k972457k928278l463631l560540
37244B3169246k713759j755748j612352j917082j717691j043814p31387r38288
37236A0739125r32108m06437j8447l30416r69559j203097q45870l06522o5008
$$ plain form
37295 8241382 8158472 7636033 7582332 8323783 9026510 8963519 8689824 9140476 10131194 10798751
37285 10798751 11173249 12112123 13709666 14968957 15339552 15569591 16579163 18308436 20210368
37276 20210368 22209280 24553987 27183364 29845853 32600751 35742486 39416800 43657882
37268 43657882 48590616 54246145 60324786 66409570 72239487 77504694 81554005 83649098
37260 83649098 83501950 81389743 77811920 73211428 67988116 62590569 57456597 52787987
37252 52787987 48407577 44029289 39764226 36094152 33121695 30193417 26729786 23169246
37244 23169246 20455487 18699739 17087387 15170305 13452614 12408800 11677413 10739125
37236 10739125 9807017 9400580 9382133 9051717 8082158 6879061 6033191 5726669 5661661
37227E661661k58135n52744m63154p631K08715j07793l98310j61940J06836k69651
37217C757854q46072o56769J24270L76224j37588m56099j43173L4900l75716o23343
37207A054488r7516N54129N20945R7240o8195j56058n82273q96885m04405N35263
37197E56733R06448N15809J07460J22335K31520J07300j10401k17458k38597k32436
37187A748713k10228k29535k55338r1362K33931L01959p8806m35040l00982J6792
37177G00104o8322m63296n78167k61411R5763K53989L14340L12256J82908M0889
37167E29053N918r0216l47440m12297q446M49391M25190J35245J01271J53292
37157I40961j95934o17581l12673N25605P56636K3319o64520m81410R2948K59457
$$ plain form
37227 5661661 5403526 4850782 4387628 4379997 4588712 4480919 4082609 3920669 4027505 3757854
37217 3757854 2911782 2255013 2379283 2755507 2617919 2161820 2018647 2053547 1677831 1054488
37207 1054488 956972 1511101 2032046 2129286 2061091 1905033 1322760 425875 21470 556733
37197 556733 1463181 1978990 2086450 2208785 2440305 2547605 2437204 2219746 1981149 1748713
37187 1748713 1538485 1308950 1053612 962250 1196181 1498140 1419334 984294 683312 700104
37177 700104 631782 168486 -409681 -671092 -575329 -321340 -7000 305256 488164 529053
37167 529053 534971 444755 97315 -314982 -323428 125963 551153 686398 787669 940961
37157 940961 745027 127446 -185227 340378 1097014 1120333 455813 -25597 67351 326808
37147C26808J08518J45028L13220K54414M1248m8930j19565l77402n82521l83519
37137c22701L8878K28653J60689J51021K14397O2747k98511m73358k40925J55527
37127c23583L79290L89159L58325L83506L76847J91169j76569n09093n41102k09717
37117C18232K98956O81462O51481J49708m15723m22421J53440M96609K9547n83957
37107A357334k72203P65404J182986M26972m68036m52747J13690L00043P7487
37098C030930O9008L44799M15823J75366j6758p5618k31682l68545q8430M66431
37088C721324N70000n5063p20224o42288K4439M06917L0060o09757o88605j20880
37078A915923L11241M8428l72363p1137P30882Q71627K0390o85254l39533L10396
$$ plain form
37147 326808 435326 580354 893574 1147988 1189236 1140306 1020741 643339 60818 -322701
37137 -322701 -283823 -55170 105519 256540 470937 533684 235173 -238185 -479110 -323583
37127 -323583 55707 444866 803191 1186697 1563544 1754713 1578144 1069051 527949 318232
37117 318232 617188 1298650 1950131 2099839 1684116 1261695 1415135 1911744 1941291 1357334
37107 1357334 1085131 1850535 3033521 3460493 2992457 2539710 2653400 2953443 3030930
37098 3030930 3099938 3444737 3860560 4035926 4019168 3943550 3711868 3343323 3254893 3721324
37088 3721324 4291324 4236261 3516037 2873749 2898188 3305105 3335165 2725408 2036803 1915923
37078 1915923 2227164 2275592 1903229 1832092 2562974 3434601 3454991 2769737 2430204 2740600
37068B740600P0697p75899r54128k40097K80910k01m05779k40813J67816J71490
37058H14596k38894o33076p17046l81421K61620O60855K90772m38626m78709L47145
37048e12784R50194N46550k17937l59215j1260L8416l04159m71755k69634j5703
37038f27287J48944L21517L63304Q1317k36101j50976J54534J15954k75488m53456
37028e57738j79811J90687L68453M16514L45694O2512k09441r3993K50551K46194
37018H39622j75934m24119k08837K5621q8306k60758j50674M2612L3767j5607
37008c82613J17915K44735J34909l2141l8432n1187k11088k14638J40236L75059
36998H2755m1855p49035q73029k40197M46083N99660L06519j21811n27286p17840
$$ plain form
37068 2740600 2811297 2035398 1081270 841173 1122083 1121882 716103 475290 643106 814596
37058 814596 575702 -57374 -774420 -1155841 -894221 -233366 57406 -381220 -859929 -512784
37048 -512784 437410 983960 766023 406808 395548 433964 129805 -341950 -611584 -627287
37038 -627287 -478343 -156826 206478 287795 51694 -99282 55252 171206 -104282 -557738
37028 -557738 -737549 -546862 -178409 238105 583799 646311 436870 342877 593428 839622
37018 839622 663688 239569 30732 56353 -31953 -292711 -443385 -400773 -367006 -382613
37008 -382613 -264698 -19963 114946 82805 44373 -6814 -217902 -432540 -292304 82755
36998 82755 40900 -708135 -1581164 -1821361 -1375278 -775618 -469099 -590910 -1118196 -1836036
36988a836036m55492J50967O32601O93414M32250j6n26784q50435n49059K85393
36978b023197R24730Q21675K40049j98065k94684k95011l59631l68822j71937
36969a724893K04522N54828O00001K34214k49098l87076j18883J24836N2566q8002
36959g96985J13J10562r5812l91858k15754M08321P40903L24456l32583m17332
36949f65969J17074N56697M04527o8421l33876l04963k64433l05673k07719J23512
36939i49244M04595L25856l4471l33972l86355k61230m3759K59167N44292N69282
36929I4161K34531j84897k53681J29357N36881M47355r8235m58847j98153K51272
36919D99744J20228n44182q18241k12968N39334N08963r5197l41145n0618L3260
$$ plain form
36988 -1836036 -2291528 -2140561 -1507960 -814546 -382296 -382312 -909096 -1759531 -2308590 -2023197
36978 -2023197 -1098467 -276792 -36743 -234808 -529492 -824503 -1184134 -1552956 -1724893
36969 -1724893 -1520371 -965543 -365542 -131328 -380426 -767502 -886385 -761549 -708983 -796985
36959 -796985 -796872 -686310 -782122 -1173980 -1389734 -981413 -240510 83946 -248637 -665969
36949 -665969 -548895 7802 412329 343908 10032 -294931 -559364 -865037 -1072756 -949244
36939 -949244 -544649 -218793 -253264 -587236 -973591 -1234821 -1278580 -1019413 -475121 94161
36929 94161 328692 143795 -109886 19471 556352 1003707 905472 446625 248472 499744
36919 499744 619972 75790 -742451 -955419 -416085 92878 -2319 -343464 -394082 -360822
36909c60822m24348p78171m96548k2567K7920r0119K43433Q27201Q01125k5687
36899b98583p60507n93439J51356N20512J88258k46182j79185J99761K62830j36703
36889h91882m84886l61579J9434K33443K60018L13190L30272J25942r7390L1679
36879e21759L54463L14340j34156l91522j78784L1343j23684k70233k8890K31272
36869g17610K3000l43246k35849K08526K88322r4918k92590P437L19314K10651
36859f26963l8008J0925K28387J93305j04556k75752j35794O6287N8797o6634
36849f90006k4972K08002L17574J09528j42171o8459J79847J03720l13065m55769
36839g75771j1096M62022L38162j26760k43012L1966J63541K3697J9274K11442
$$ plain form
36909 -360822 -785170 -1563341 -2059889 -2082456 -2054536 -2144655 -1901222 -1074021 -272896 -298583
36899 -298583 -1059090 -1652529 -1501173 -980661 -792403 -1038585 -1217770 -1018009 -755179 -891882
36889 -891882 -1376768 -1738347 -1718913 -1485470 -1225452 -912262 -581990 -456048 -553438 -521759
36879 -521759 -167296 147044 12888 -378634 -557418 -526075 -649759 -919992 -948882 -717610
36869 -717610 -694610 -1037856 -1273705 -1065179 -776857 -871775 -1164365 -1156928 -837614 -626963
36859 -626963 -664971 -654046 -425659 -232354 -336910 -612662 -748456 -682169 -623372 -690006
36849 -690006 -714978 -506976 -189402 -79874 -222045 -290504 -110657 -6937 -320002 -775771
36839 -775771 -786867 -324845 13317 -113443 -356455 -324489 -160948 -137251 -117977 93465
36829I3465J12258l91571o38401j54261N47552O72057K49385o7550p2305j95908
36819A54721o21056q53236m67624J64953L44809J9417k06002j9588J67603k6693
36809a342696k52754M1648O65283Q75592M47218o3317j90955r9520p4034o9567
36799f3102l7465j36616k90107r8983M08702N41480l2998o14296m47000J65592
36789f04793M46147L32788K37119O3934n11558j066324q32512p993M10514J57091
36779a375587j1194K77404M08005k7419m41053k28713K63447L83909J73438J01603
36769d76160K61898L77450K84320J1200l11510l65567J14266P75216Q35831J44557
36759A651501m86506l70236J69218M27466L15753J99328J65217L1423j76660k63942
$$ plain form
36829 93465 205723 -185848 -824249 -978510 -430958 241099 490484 422934 350629 154721
36819 154721 -466335 -1319571 -1787195 -1622242 -1277433 -1258016 -1464018 -1483606 -1316003 -1342696
36809 -1342696 -1595450 -1553802 -888519 -12927 434291 370974 180019 80499 6465 -63102
36799 -63102 -100567 -237183 -527290 -626273 -217571 323909 290911 -323385 -770385 -604793
36789 -604793 -158646 174142 411261 475195 -36363 -1102687 -1935199 -1943192 -1532678 -1375587
36779 -1375587 -1386781 -1109377 -701372 -728791 -1169844 -1398557 -1135110 -751201 -577763 -476160
36769 -476160 -214262 163188 447508 458708 147198 -218369 -104103 671113 1506944 1651501
36759 1651501 1164995 794759 963977 1391443 1707196 1906524 2071741 2103164 1926504 1662562
36749A662562k06678q1228J48355M48132N43952K50485k15206m92434m56981j88340
36739A412619J73784L98063K88625l3066k69198l77499m69048l75516O2045L50171
36729A160980j45478r55442q07798M73031J431402R49196k33079p46282m62301
36720F64229j92316k39910l07041l46186m87071m51936M2646N86190N93650K13337
36710G5592m8674k09870m87353n40219o138N76161M30994j39950j92859K97749
36700b44567M49613j0288l72988j95970J07969J20683l5760j81610l16106k70112
36690i49136J13690M39580K05390k61118k23425J73666J01600m39919n02230K05747
36680a136155P86601O06081J42414p4535k59107n39341m22359J93346M65236j01575
$$ plain form
36749 1662562 1455884 1374656 1523011 1971143 2515095 2765580 2550374 2057940 1600959 1412619
36739 1412619 1586403 1984466 2273091 2240025 1970827 1593328 1124280 748764 810809 1160980
36729 1160980 1015502 60060 -747738 -274707 1156695 2105891 1872812 1126530 664229
36720 664229 471913 232003 -75038 -421224 -908295 -1360231 -1317585 -731395 -137745 75592
36710 75592 26918 -182952 -670305 -1210524 -1216662 -640501 -209507 -349457 -542316 -244567
36700 -244567 205046 194758 -178230 -374200 -266231 -145548 -181308 -362918 -679024 -949136
36690 -949136 -835446 -395866 -190476 -451594 -675019 -501353 -399753 -839672 -1341902 -1136155
36680 -1136155 -349554 256527 398941 324406 65299 -474042 -896401 -703055 -237819 -339394
36670c39394o76461l30193M86710O70928J25746k94560j52864J76483L07942K60486
36660B34823J31190n6636k08856k51093k49708j99960K5765K97275K22744j89486
36650b43942l68167l0755L45422L10624J07856O1141o2146m45700n90073o0404
36640i76144O19742O55862J87421m1546Q9116P0530j99866k90394j13495q7391
36630h6165l29498m22553j43992J81907K33860R9283j3568n2575p159J23089J82883
36619b34488M196k77883l33408o2761K97836M30763J61896l65455o23616j84836
36609a187756N39575N77039k59849r40110o33616J30579M36798L96261N98720
36600c42359P62583J98194p10100q44309j18170M14176L00266K07734M55580L98294
$$ plain form
36670 -339394 -1015855 -1346048 -859338 -188410 -62664 -357224 -510088 -333605 -25663 234823
36660 234823 366013 309377 100521 -150572 -400280 -600240 -574475 -277200 -54456 -243942
36650 -243942 -612109 -642864 -297442 13182 121038 182179 120033 -325667 -915740 -976144
36640 -976144 -356402 299460 486881 445335 534451 604981 405115 114721 1226 -86165
36630 -86165 -415663 -838216 -982208 -800301 -566441 -467158 -480726 -533301 -540460 -417371 -234488
36619 -234488 -230292 -508175 -841583 -904344 -606508 -175745 -13849 -379304 -1002920 -1187756
36609 -1187756 -648181 -71142 -330991 -1271101 -1904717 -1774138 -1337340 -941079 -342359
36600 -342359 420224 618418 -91682 -935991 -1054161 -639985 -339719 -131985 323595 721889
36590G21889k19876n81338j85513K08378j09554n35765k06843M75068M96406j09306
36580d6454l91780k5392L15760J01869l82273o12308m37690j0831M24948N94025
36570d70126L76655k2627k92433l07268p8765L09203N41475K54623l35358m59609
36560d84230J37404O47642K72639n89758r10846m55907J01960K88558K73150K60667
36550d58721J70549O64q3388j11389k63444m26383k82191J29883M05433L55948
36540e63039J75278M9023J5896J37437L61880L63555K2742j57053K35423O27332
36530A268474J62891q09500j003813r8308P15253M84536k23341m11655j28928
36521d4391m5978k31961k50827o8504k1549j10009m9839J09286M9457k15939l38210
$$ plain form
36590 721889 502013 -79325 -264838 -56460 -166014 -701779 -908622 -433554 62852 -46454
36580 -46454 -438234 -463626 -147866 -45997 -428270 -1040578 -1478268 -1489099 -1064151 -470126
36570 -470126 -93471 -116098 -408531 -715799 -794564 -485361 56114 310737 -24621 -484230
36560 -484230 -346826 300816 573455 -16303 -927149 -1383056 -1281096 -992538 -719388 -458721
36550 -458721 -288172 -287508 -370896 -482285 -745729 -1172112 -1454303 -1324420 -918987 -563039
36540 -563039 -387761 -338738 -322842 -185405 176475 540030 562772 405719 641142 1268474
36530 1268474 1431365 621865 -381948 -480256 234997 719533 496192 84537 -44391
36521 -44391 -90369 -322330 -573157 -641661 -663210 -773219 -823058 -713772 -664315 -880254 -1218464
36510a218464j67657J31123L94937N19905L52778j04460n17575n58874k68210
36501a436497J27743M57822M78653j2697o36676n99459J48012N95468J43932l56501
36491a090200N0551P47772M59214n91301r07248n3766P16560M69244j42384j79412
36481e20970J74817K59589P8447j9906j32540m88011q14395p06305k79927O7305
36471b381896K17101K37651J27314K6521K32693O33280O38460Q0616l88320k62906
36461h39486N7128K8488j31658J5360K43001R9732j97631j26638K07220K87978
36451c56506P8402o1647j00198k30862k90801m9523J58150r8853m63542k59346
36441a674726L14021M07630r4814l93039n1713M55275O31716N19815K13294l07127
$$ plain form
36510 -1218464 -1386121 -1254998 -860061 -340156 12622 -91838 -609413 -1168287 -1436497
36501 -1436497 -1308754 -850932 -372279 -384976 -1021652 -1621111 -1473099 -877631 -733699 -1090200
36491 -1090200 -1039649 -291877 167337 -423964 -1331212 -1384978 -668418 -199174 -341558 -520970
36481 -520970 -346153 -86564 -8117 -28023 -160563 -648574 -1462969 -2169274 -2449201 -2381896
36471 -2381896 -2164795 -1927144 -1799830 -1773309 -1540616 -907336 -268876 -188260 -576580 -839486
36461 -839486 -782358 -753870 -885528 -870168 -627167 -527435 -725066 -851704 -644484 -356506
36451 -356506 -278104 -339751 -439949 -670811 -961612 -1011135 -852985 -951838 -1415380 -1674726
36441 -1674726 -1360705 -953075 -1047889 -1440928 -1492641 -1037366 -405650 114165 327459 20332
36431B0332o55304k81514M86722N96218j52024o47290j34947O23245O07503J07035
36421E69976O3726M70263N20241N4284k20563M9885L54751K17411j26783k54756
36411A698435k03943k18728k21711K3605L69452L41724j46847m76238o3448O96733
36401A799034P52877j72753j033822q12797O0948L92730m8j80246K77207O53617
36391A736747L92474j7148l7290l1469m40166p76137l88624L15560M26427l3078
36381A147296k38206M6108K19335n046j79397l9216K9717k29607m27418k03336
36371A20230J54718K14710Q1231J14745K87138K72706J0678k19338k32901j58534
36361F45383j96330l32404l58203j47930J17601J17442j41966k17011J76363O28708
$$ plain form
36431 20332 -634972 -916486 -429764 166454 14430 -632860 -767807 -144562 462941 569976
36421 569976 633702 1103965 1624206 1678490 1457927 1507812 1862563 2079974 1953191 1698435
36411 1698435 1494492 1275764 1054053 1077658 1447110 1788834 1641987 1165749 1102301 1799034
36401 1799034 2551911 2379158 1345336 532539 593487 986217 986169 805923 1083130 1736747
36391 1736747 2129221 2112073 2074783 2043314 1603148 827011 438387 753947 1180374 1147296
36381 1147296 909090 955198 1174533 1169487 990090 950874 980591 750984 323566 120230
36371 120230 274948 489658 570889 685634 972772 1245478 1256156 1036818 803917 645383
36361 645383 449053 116649 -241554 -389484 -271883 -154441 -296407 -513418 -337055 291653
36351B91653M94901j65635n76233k74530K99782M81964K40273L97q1597k04499
36341E06476m02631m18346j68609L4409p9180l18291k89549L9179K86499J82635
36331f27408p0864r1156J72762M06306L68632J55821k5513j42514k47295k58187
36321c59416n6117K47040L66750K16842L0155P528O561k39404o60968q32700m82389
36310a756118J39923N40581N31168L20017J17716q3522k80878l01714p3339J65244
36300f80922J83207J24594K42610L91326J81107l62797p08484n06992l4861K25010
36290i46202J70362N4870Q8848K51613L62463K32641j07897l17837j20666K27602
36280a04203K14521j33180k28163J12057K73770j43280m98811k3653Q06970P51444
$$ plain form
36351 291653 786554 620919 44686 -229844 69938 551902 792175 792572 710975 506476
36341 506476 103845 -314501 -483110 -448701 -527881 -846172 -1135721 -1096542 -810043 -627408
36331 -627408 -698272 -789428 -616666 -210360 158272 314093 288580 146066 -101229 -359416
36321 -359416 -415533 -168493 198257 415099 445254 452782 459343 219939 -441029 -1273729 -1756118
36310 -1756118 -1616195 -1075614 -544446 -224429 -106713 -190235 -471113 -772827 -846166 -680922
36300 -680922 -497715 -373121 -130511 260815 441922 79125 -629359 -1136351 -1171212 -946202
36290 -946202 -775840 -720970 -632122 -380509 -18046 214595 106698 -211139 -331805 -104203
36280 -104203 110318 -22862 -251025 -138968 134802 -8478 -507289 -530942 276028 1027472
36270A027472l54907j184686o96486M55463Q93053L54137k11814j52225J24834
36261B54841K8082k96733l53773j42134n3627j31994k0166L39730N05874K36138
36251C66238p7178j0063K11016P3870l82817n92465k80299J87462L45734J58042
36241d60j17992k95742l26909k02163M6143L01970L94396J95892j96576l80178
36231e81619l0076N22041N07717j89746o59830k07876N06300L76447m32534p02789
36221h91965m3398N62444L36837k20568l22522m3316J49034K54207M27998M03319
36211F12070n7759n71842o35265l41713n8159J82497M18254L75277k7113k62113
36201c65866L1311L19066k6473o17907o00422J0165M31276L46026J43755N9525
$$ plain form
36270 1027472 672565 -512121 -1208607 -753144 139909 494046 282232 130007 254841
36261 254841 282923 -13810 -367583 -509717 -563344 -695338 -715504 -375774 130100 366238
36251 366238 289060 278997 490013 563883 181066 -411399 -691698 -504236 -158502 -460
36241 -460 -118452 -414194 -741103 -943266 -897123 -595153 -200757 -4865 -201441 -581619
36231 -581619 -611695 -89654 418063 228317 -431513 -639389 -133089 243358 -189176 -891965
36221 -891965 -935363 -372919 -36082 -256650 -579172 -622488 -473454 -219247 208751 612070
36211 612070 554311 -17531 -652796 -994509 -1052668 -870171 -451917 -76640 -103753 -365866
36201 -365866 -334555 -15489 -41962 -659869 -1260291 -1250126 -818850 -472824 -329069 -269544
36191b69544n0935j39275j1808R0885j97073n23282k09068M86189N24435k66049
36181e65525p52330j69642O98763O91865q2128n55969k38730L28444M94353K32819
36171H1920q7515k30241k38261k43522k49465j17823K01263M93966M77192J43345
36161B30859k22007l35166j34246J92866L13541O5200k49801j75357J90187K53883
36151A29959r7442k09478K26610M91149j0513n84802k59260N38411N48216k97332
36141D75518p50066k21120M21119L46191j24638l71518m02219l72101r4352L81199
36131g11987N06717J23286j49715M9577J96351j22521m05254j48120K05390N1700
36121d04576k97236k01606J96209L37790K51165K92185L00724o1228m70377l79356
$$ plain form
36191 -269544 -320479 -459754 -471562 -380677 -577750 -1101032 -1310100 -823911 -299476 -565525
36181 -565525 -1317855 -1487497 -788734 -96869 -178997 -734966 -973696 -645252 -150899 81920
36171 81920 -5595 -235836 -474097 -717619 -967084 -1084907 -883644 -389678 87514 230859
36161 230859 8852 -326314 -460560 -267694 45847 111047 -138754 -314111 -123924 129959
36151 129959 32517 -176961 49649 540798 530285 -54517 -313777 224634 772850 475518
36141 475518 -274548 -495668 -74549 271642 147004 -224514 -626733 -998834 -1093186 -711987
36131 -711987 -205270 -81984 -231699 -182122 14229 -108292 -513546 -661666 -456276 -404576
36121 -404576 -701812 -903418 -707209 -369419 -118254 173931 474655 413427 -56950 -436306
36111d36306k0733k8228k83478j46948K96082K99347j93385l36205K31489P50903
36101A32538N00454k00371n96173m75957j14509K36879L90338K00877j34825j75315
36091b36064Q0129R5576k84974m16987J29783O93541M02119m35965p04990j29082
36081h06914L91317K49911J4988L45913P97424N05024l75461q34856n05375p5699
36071b93728p0762j12523J86535M05125Q2001l13613p1742M70322L44889m40733
36061A85771p87878k06160L91081J05634n77470n94083R3679N60324L36670o0042
36051e52474m5739K51769L50817J09319k13227l54281k71052m7329K40336N04987
36041b6874N72311K88230j95557m12163j05569L38366L23711j37851m56660l43666
$$ plain form
36111 -436306 -457039 -485267 -768745 -915693 -619611 -320264 -513649 -849854 -618365 132538
36101 132538 632992 432621 -163552 -639509 -754018 -517139 -126801 74076 -60749 -236064
36091 -236064 -155935 -60359 -345333 -762320 -632537 61004 463123 27158 -677832 -806914
36081 -806914 -415597 -165686 -150698 195215 992639 1497663 1122202 287346 -218029 -293728
36071 -293728 -364490 -477013 -290478 114647 196648 -116965 -188707 281615 626504 185771
36061 185771 -602107 -808267 -417186 -311552 -889022 -1483105 -1389426 -829102 -492432 -552474
36051 -552474 -598213 -346444 4373 113692 -99535 -453816 -724868 -772197 -531861 -26874
36041 -26874 545437 833667 638110 225947 120378 458744 782455 644604 187944 -155722
36031a55722j61883k26347k67394N3898M96656N54846J88015j70272j99001L8970
36021A51766K90764L06044l2402n18428o96265l57154J73240M43716L97557K73388
36011D32226J95676J32834R9266J25340J32186M6342o8772j32472j27543K6603
36001H61686L85758O39904K90701n43524r56453l62476N78595P32929k5849p37261
35991H64010o79992j35083K60964L33163K84616K30277J42158K8526q2414j91087
35981A055138k06181L3899M35047N42914O2301o04692o97920n8147N91769N54022
35971A708150M1194k45752j93636l07305o84318p39566k45825J31858r2833l31443
35961i59476J06356P45916O72138Q4845o3743K56418J83300l41926l67451K89727
$$ plain form
36031 -155722 -317605 -543952 -811346 -757448 -260792 294054 482069 311797 112796 151766
36021 151766 442530 748574 716172 197744 -498521 -855675 -682435 -238719 158838 432226
36011 432226 627902 760736 860002 985342 1117528 1163870 1095098 962626 835083 861686
36001 861686 1247444 1887348 2178049 1634525 678072 315596 894191 1627120 1601271 864010
35991 864010 184018 48935 309899 643062 927678 1157955 1300113 1328639 1246225 1055138
35981 1055138 848957 882856 1317903 1860817 1923118 1318426 620506 562359 1154128 1708150
35971 1708150 1749344 1503592 1309956 1002651 318333 -421233 -667058 -535200 -628033 -959476
35961 -959476 -853120 -107204 564934 649779 586036 842454 1025754 683828 316377 606104
35951F06104N27770j77960p71863l22038M90917N97515J90708L4165M5919k02683
35941A018554l54970N6135M32740k5591p78788o84609P6265L05581j54215k24018
35931c32916M49377Q47990K95461m90082o16811k37880M1210J07026J05108l4916
35921A33567k95794l42304l3817K89922L37337K24186J10552j2265l4072J95999
35911E73311L86911P1414m97833m86371K24777O84805K37020n09703o29005j78089
35901a22763Q9887j17385l95011l33849L6217L69357K94603k23950o64111m11046
35891a478051L94181Q87962N79672m2761k80816j23729P48m3290p9781n4411n9054
35880b99330q6920q1493q1770r4510j3156J49818J84544J8047j32178j17367q7730
$$ plain form
35951 606104 1133874 955914 184051 -137987 352930 950445 1141153 1175318 1221237 1018554
35941 1018554 663584 719719 1152459 1126868 348080 -336529 -260264 45317 -108898 -332916
35931 -332916 116461 964451 1259912 769830 153019 -84861 -43651 63375 168483 133567
35921 133567 -162227 -504531 -538348 -248426 88911 313097 423649 411384 377312 573311
35911 573311 960222 1031636 533803 47432 272209 957014 1194034 684331 55326 -122763
35901 -122763 -32876 -150261 -545272 -879121 -842904 -473547 -178944 -402894 -1067005 -1478051
35891 -1478051 -1083870 -195908 383764 341003 60187 -63542 -62794 -106084 -185865 -240276 -299330
35880 -299330 -386250 -467743 -549513 -644023 -657179 -507361 -322817 -304770 -436948 -554315 -642045
35869f42045j71542k16093o4829J74454L40256M34996M55937K97377Q705j44420
35859D72796p2379k5486j80439l65582l78905k52149j9933L83565P62248O33475
35849I57211o9495o60415n24120J9657J83119j72930m60205l24195p5345l0754
35839a157472K1182L49664O54812M18871k27923n22753r4306M81158M73549r431
35829C87351l02026j98721p0993p7822Q427J41577k9942l50767j98418L34180
35819c57154K96798n13701q91735o0785Q72010N44718m42884m84548M40452Q70161
35809B73332L29406j07871J39337K91804j68924n65000l46300k4961r3765j60930
35799d33872J50683M60194M06545K27137O5116k98210o05275j87261O66917P28176
$$ plain form
35869 -642045 -813587 -1029680 -1094509 -920055 -579799 -144803 311134 608511 617216 472796
35859 472796 400417 374931 194492 -171090 -549995 -802144 -822077 -438512 323736 957211
35849 957211 887716 227301 -296819 -277162 -94043 -266973 -727178 -1051373 -1126718 -1157472
35839 -1157472 -1136290 -786626 -131814 287057 59134 -463619 -557925 -76767 396782 387351
35829 387351 85325 -113396 -184389 -262211 -253784 -112207 -142149 -492916 -691334 -357154
35819 -357154 -60356 -574057 -1465792 -1526577 -654567 -109849 -552733 -1037281 -596829 273332
35809 273332 602738 494867 634204 926008 757084 192084 -154216 -179177 -272942 -433872
35799 -433872 -283189 177005 583550 810687 875803 577593 -27682 -214943 451974 1180150
35789A180150j90398p09743j17777M21236o4672o49095k49523L75724N3115n99341
35779e50324k78195O20784P14566Q1585k9621M45160L52277m61953q33300l10701
35769b49722K40508K81325K24253J82311k95929r11779o36182M73794R94024K73464
35759E76067n62152m51945Q4833J17784j86129j81946N8501J18424Q2277J70147
35749a74139J39363j97632m04199n7333N08681O79123L60297j36409n38702n85997
35739d06947j22544M45425M26386r6741k39724K73514N69918N4875n47286l66837
35729i961K15395K92143q7517j78770J44326L25643J33078j33763k71022k83891
35719A45661p7724L06685M17769J7175l40276o9765M43654M25472k1195j60864
$$ plain form
35789 1180150 989752 280009 162232 583468 518796 -130299 -379822 -4098 49017 -550324
35779 -550324 -828519 -207735 506831 588416 558795 1003955 1356232 894279 60979 -249722
35769 -249722 -9214 272111 496364 678675 382746 -529033 -1165215 -691421 302603 576067
35759 576067 13915 -438030 -353197 -235413 -421542 -603488 -544987 -426563 -344286 -174139
35749 -174139 -34776 -232408 -636607 -693940 -185259 493864 854161 717752 179050 -406947
35739 -406947 -529491 -84066 342320 245579 5855 279369 849287 904162 356876 -9961
35729 -9961 205434 497577 410060 231290 375616 701259 834337 700574 429552 145661
35719 145661 67937 374622 792391 809566 469290 399525 843179 1268651 1247456 1086592
35709A086592P4953N7217l14811l93301O5333M64941L40677m3802l23691m95088
35699E19020m99716j28077L54904K75005l66590o47935o3209O34806N49993o0214
35689E67987l42759j68236n9456j63047j49528M1226J47058J88270L94318N81964
35679A037797L41548j58154l08336p3593p4908m79557o31191j40110M32109M76084
35669D21689K33183J84047J60274j81737m92233k13866L55362M00644j16672m09369
35659C41322j49183R5326p6706k40178L5982M00276K94772j42771k99336M2758
35649C02262M85961N37854R7430m50579n38288l9293M28580K27302l15345k73559
35639D62325M33874P73729J18607p76071q97178l61156N6435J72193L11589M21131
$$ plain form
35709 1086592 1161545 1218762 903951 510650 575983 1040924 1381601 1337799 1014108 519020
35699 519020 19304 -108773 246131 521136 154546 -493389 -556598 78208 628201 567987
35689 567987 225228 56992 -2464 -165511 -315039 -273813 -126755 61515 455833 1037797
35679 1037797 1379345 1221191 912855 839262 764354 284797 -346394 -486504 -54395 421689
35669 421689 654872 838919 999193 817456 325223 111357 466719 867363 750691 341322
35659 341322 192139 287465 210759 -29419 6563 406839 701611 558840 259504 302262
35649 302262 788223 1326077 1423507 972928 434640 395347 823927 1051229 735884 462325
35639 462325 896199 1669928 1788535 1012464 115286 -245870 -189435 -17242 294347 715478
35629G15478J93800j75566k27650m5310j6189j5716K89182N33352Q1838p05745
35619F27474p53287O5544O42732L03133l06946m22896k38154k06274j93912k3657
35609e06243m7012m04566m50803K10243P67199L01673o34634o93240K41218Q77460
35599c38705M39729l51152n48558k62312j06082r7605J56071N74344O30145J67016
35589B62891l63910n16762k96466O3666M05237N90734M51006J8310l63817m00501
35579a49612k18283j52281k35264j80738J13026L46495K32337j14833l61377l32215
35569a052745n8987L33266O08077N07273P6346k98651l74802l14801k51840K4818
35559h02046N65391Q35923L80844l67905o20232l84505l25443n41386l88274L07301
$$ plain form
35629 715478 909278 733712 506062 460752 444563 428847 718029 1251381 1333219 627474
35619 627474 -125813 -60269 582463 885596 578650 155754 -82400 -288674 -482586 -506243
35609 -506243 -553255 -957821 -1408624 -1198381 -431182 -129509 -764143 -1457383 -1216165 -338705
35599 -338705 101024 -250128 -798686 -1060998 -1167080 -1264685 -1108614 -534270 95875 262891
35589 262891 -101019 -617781 -914247 -850581 -445344 145390 596396 614706 250889 -149612
35579 -149612 -367895 -520176 -755440 -936178 -823152 -476657 -244320 -359153 -720530 -1052745
35569 -1052745 -1111732 -778466 -170389 336884 413230 114579 -260223 -575024 -826864 -802046
35559 -802046 -236655 599268 980112 612207 -8025 -392530 -717973 -1259359 -1647633 -1340332
35549a340332P71819M57070p3916k6604M35044N46505J10816l55447m40840k19237
35539a35122Q7942L26108L15268l3870m84204o56488m61567j32110J23370K78156
35529g72517L54781L50711K86230J94672R5903L1333K0006l7805k25695l69911
35519g2292k18789Q6019R4957k43057l80593L8142N73724N81352J22039j78792
35509D02710l4866J97712J14744k11154m01666k64614j2684j9343l40522n47518
35499a117201k33360L51107N03218j3406o31770p29110l36097J26935M35284N68214
35489a076186M80198K38614J17783J97675J39251k61025n78537k99619L42704
35480f99142N95627J93584l31179l86569L375L49187K65941j89748o02113n82885
$$ plain form
35549 -1340332 -568513 -111443 -185359 -211963 223081 769586 880402 524955 84115 -135122
35539 -135122 -47180 278928 594196 560326 76122 -580366 -1041933 -1174043 -1050673 -772517
35529 -772517 -417736 -67025 219205 413877 509780 541113 561119 523314 297619 -72292
35519 -72292 -291081 -205062 -110105 -353162 -733755 -695613 -121889 459463 581502 402710
35509 402710 367844 565556 680300 469146 67480 -197134 -209818 -229161 -569683 -1117201
35499 -1117201 -1350561 -999454 -496236 -509642 -1141412 -1870522 -2206619 -2079684 -1644400 -1076186
35489 -1076186 -595988 -357374 -239591 -41916 97335 -163690 -742227 -1041846 -699142
35480 -699142 -103515 90069 -241110 -627679 -624304 -275117 -9176 -198924 -801037 -1383922
35470a383922j50887L00131M20214J87817j70823l40713q8169M03439M93249j32718
35460d62382p62166m57485M69735P36984L7014m35372O2624N51850j6257q97560
35450a173015o89923L86552Q65665L48431r4551J80638N30061L12863j78616m54661
35440C3444n00922l78548k4828K88455J39848k20936j29088K93215K21512l99202
35430f77050o32407j45072J96829j39389m39204q3727L35875J40100k19453o8547
35420a732045K43338Q0899k50885j43470R9049j49149n57413l56692K57362M33234
35410b075772Q9470j29076r0637k06527l93088j94598J49365k5802m85317k98551
35400c660533N28790R14705M47500j1834J17050K45148j19772m04937o8651L49204
$$ plain form
35470 -1383922 -1534809 -1234678 -814464 -626647 -797470 -1138183 -1226352 -822913 -329664 -462382
35460 -462382 -1224548 -1682033 -1212298 -475314 -438300 -873672 -811048 -259198 -275455 -1173015
35450 -1173015 -1862938 -1476386 -610721 -262290 -356841 -176203 353858 666721 488105 33444
35440 33444 -467478 -846026 -870854 -582399 -442551 -663487 -792575 -499360 -277848 -677050
35430 -677050 -1309457 -1454529 -1257700 -1397089 -1836293 -1920020 -1584145 -1444045 -1663498 -1732045
35420 -1732045 -1488707 -1407808 -1658693 -1802163 -1703114 -1852263 -2409676 -2766368 -2509006 -2075772
35410 -2075772 -1986302 -2115378 -2206015 -2412542 -2805630 -3000228 -2850863 -2876665 -3361982 -3660533
35400 -3660533 -3131743 -2217038 -1769538 -1781372 -1664322 -1419174 -1538946 -1943883 -2012534 -1663330
35390a663330J83419j83434o6267K89205K29098p9802J3944M28925M94240J33682
35380b20320n4646J36600K54480M4096k02153k81286l71372n12763m22298m7026
35370a676688K39516K31710J94610L23146L70270J35299r0680K7987K77095J96738
35360B29003j74055l11674K3373M22681L87326j5267k86723j70432P2337Q2425
35350B58994j38624l39531m18464m65556m69772k70437J35529M79260N38437L94668
35340b95496K49599J43610L532j47276j80361k5542K28649L73185K45584n9518
35330E35966k33562j50001o2035j62517j74191J82852N19050K30517m30462n54267
35320b98650J0602L41461q6884n48278l13527J29038j4381m43238l45515J56006
$$ plain form
35390 -1663330 -1479911 -1663345 -1729612 -1440407 -1211309 -1291111 -1277167 -848242 -354002 -220320
35380 -220320 -274966 -138366 116114 160210 -41943 -323229 -694601 -1207364 -1629662 -1676688
35370 -1676688 -1437172 -1205462 -1010852 -687706 -317436 -182137 -272817 -244830 32265 229003
35360 229003 54948 -256726 -233353 189328 576654 561387 274664 104232 176569 258994
35350 258994 120370 -219161 -637625 -1103181 -1572953 -1843390 -1707861 -1228601 -690164 -295496
35340 -295496 -45897 97713 101245 -46031 -226392 -251934 -23285 349900 595484 535966
35330 535966 302404 152403 90368 -72149 -246340 -63488 455562 686079 255617 -298650
35320 -298650 -288048 53413 -33471 -581749 -895276 -766238 -780619 -1223857 -1569372 -1413366
35310a413366L10977J31763K34739M99074K10012m64162n06433K18738O07536
35301a71122J02683m42585k71479J17313P8385k1239L13411O00913K15391m04918
35291A16753m41258j3162K08158J90480K96401L02455k06828p74078n58451K51136
35281f28394O19749K25893k23664k68856k23435k76898j01978L35645M81281Q7089
35271B6432l51794m17520l38472l86841l59386m9704L15822M74448M78250L77246
35261b31519O5207l00893k77535J69031M66748K43625j71057l33770k55149j00695
35251g26007J22633K73064M9425l94388m21509J02877M49344J40753k45462m1327
35241f90597L73154K21577l45567n10329j23793J47215k8183j98773K4074L76207
$$ plain form
35310 -1413366 -1102389 -970626 -735887 -236813 -26801 -490963 -997396 -778658 -171122
35301 -171122 -68439 -511024 -782503 -665190 -586805 -608044 -294633 306280 521671 116753
35291 116753 -324505 -337667 -129509 60971 357372 659827 452999 -321079 -879530 -628394
35281 -628394 -8645 217248 -6416 -275272 -498707 -775605 -877583 -541938 -60657 26432
35271 26432 -325362 -742882 -1081354 -1468195 -1827581 -1877285 -1561463 -1087015 -608765 -231519
35261 -231519 -166312 -467205 -744740 -575709 -108961 134664 -36393 -370163 -625312 -726007
35251 -726007 -603374 -330310 -280885 -675273 -1096782 -993905 -544561 -403808 -649270 -690597
35241 -690597 -317443 -95866 -441433 -951762 -1075555 -928340 -956523 -1155296 -1131222 -755015
35231g55015M40053K25444L133q9136p2283N705R1387J48437J77789J34175n0396
35220B59293k44878j60897J83771L37979M2283l31450l32172r7392r671p09K18967
35209a34876M67687L04730j55540l19756l5466K01305O9636j35306p8766R3727
35199B77375M7322k91114p22619r09369n14019L73180R75464N79436l84607o94724
$$ plain form
35231 -755015 -314962 -89518 -86385 -175521 -247804 -242099 -150712 -2275 175514 309689 259293
35220 259293 14415 -146482 37289 375268 417551 86101 -246071 -343463 -353134 -353843 -134876
35209 -134876 332811 637541 482001 162245 126779 328084 397720 262414 183648 277375
35199 277375 324697 33583 -689036 -1598405 -2112424 -1739244 -763780 -184344 -568951 -1263675
$$ [...]
##END NTUPLES=NMR SPECTRUM
##END=
