##TITLE=31Pdec_SR130_1d
 , 124 sc
 8.7.2022
##JCAMPDX= 6.0         $$ Bruker NMR JCAMP-DX V2.0
##DATA TYPE= NMR SPECTRUM
##DATA CLASS= NTUPLES
##ORIGIN= UXNMR, Bruker Analytische Messtechnik GmbH
##OWNER= root
$$ XWIN-NMR		Version 3.5
$$ Fri Jul  8 14:21:18 2022 Russian Standard Time (UT+4h)  she@DPX200
##.OBSERVE FREQUENCY= 81.013821
##.OBSERVE NUCLEUS= ^31P
##.ACQUISITION MODE= SIMULTANEOUS
##.ACQUISITION SCHEME= undefined
##.AVERAGES= 124
##.DIGITISER RES= 16
##SPECTROMETER/DATA SYSTEM= spect
##.PULSE SEQUENCE= zgpg30
##.SOLVENT NAME= CD2Cl2
##.SHIFT REFERENCE= (INTERNAL, CD2Cl2, 0, 248.564)
##AUDIT TRAIL= $$ (NUMBER, WHEN, WHO, WHERE, WHAT)
$$ ##TITLE= Audit trail, XWIN-NMR		Version 3.5
$$ ##JCAMPDX= 5.01
$$ ##ORIGIN= Bruker BioSpin GmbH
$$ ##OWNER= she
$$ F:/spectra/data/she/nmr/P31/1/pdata/1/auditp.txt
$$ ##AUDIT TRAIL=  $$ (NUMBER, WHEN, WHO, WHERE, WHAT)
(   1,<2022-07-08 14:20:08.42 +0400>,<she>,<DPX200>,
      <continue with go, POWCHK disabled, PULCHK disabled
       configuration hash MD5:
       00 E9 B6 7A A2 85 ED C7 34 08 36 98 17 FE 4E 26
       data hash MD5: 32K
       5A 14 90 1F 59 1B C4 AE 6D 4D A3 A1 31 89 7D C7>)
(   2,<2022-07-08 14:20:10.85 +0400>,<she>,<DPX200>,
      <Start of raw data processing
       efp BC_mod = 2 LB = 1 FT_mod = 6 PKNL = 1 PHC0 = -9918.281 PHC1 = 58.45667 SI = 64K 
       data hash MD5: 64K
       B5 4F E0 A2 93 DB A8 95 7E 65 E7 21 56 87 A4 7D>)
(   3,<2022-07-08 14:20:50.32 +0400>,<she>,<DPX200>,
      <pk PHC0 = 14.39873 PHC1 = -32 
       data hash MD5: 64K
       7F A4 85 AE AF 4F 81 C8 95 C3 94 57 E1 52 EB F0>)
$$ ##END=
$$ 
$$ hash MD5
$$ 03 21 53 58 70 EF 62 40 95 80 22 CC 7E 8A 8D E5
##$RELAX= 
##$RELAX= 
##$RELAX= 
##$RELAX= 
##$RELAX= 
##$RELAX= 
##$RELAX= 
##$RELAX= 
$$ Bruker specific parameters
$$ --------------------------
##$DU= <F:/spectra>
##$EXPNO= 1
##$NAME= <P31>
##$PROCNO= 1
##$TYPE= <nmr>
##$USER= <she>
##$AMP= (0..31)
100 100 100 100 100 100 100 100 100 100 100 100 100 100 100 100 100 100 
100 100 100 100 100 100 100 100 100 100 100 100 100 100 
##$AQSEQ= 0
##$AQ_mod= 1
##$AUNM= <au_zg>
##$AUTOPOS= <>
##$BF1= 81.014009
##$BF2= 200.13
##$BF3= 200.13
##$BF4= 200.13
##$BF5= 200.13
##$BF6= 200.13
##$BF7= 200.13
##$BF8= 200.13
##$BYTORDA= 1
##$CFDGTYP= 0
##$CFRGTYP= 5
##$CHEMSTR= <none>
##$CNST= (0..31)
1 1 145 1 1 1 1 1 1 1 1 1 1 1 1 1 1 1 1 1 1 1 1 1 1 1 1 1 1 1 1 1 
##$CPDPRG= <waltz16>
##$CPDPRG1= <>
##$CPDPRG2= <waltz16>
##$CPDPRG3= <>
##$CPDPRG4= <mlev>
##$CPDPRG5= <mlev>
##$CPDPRG6= <mlev>
##$CPDPRG7= <mlev>
##$CPDPRG8= <mlev>
##$CPDPRGB= <>
##$CPDPRGT= <>
##$D= (0..31)
0 1 0 0 0 0 0 0 0 0 0 0.03 2e-05 3e-06 0 0 0 0 0 0 0 0 0 0 0 0 0 0 0 0 
0 0 
##$DATE= 1657275421
##$DBL= (0..7)
120 120 120 11 120 120 24 19 
##$DBP= (0..7)
150 150 150 150 150 150 150 150 
##$DBP07= 0
##$DBPNAM0= <>
##$DBPNAM1= <>
##$DBPNAM2= <>
##$DBPNAM3= <>
##$DBPNAM4= <>
##$DBPNAM5= <>
##$DBPNAM6= <>
##$DBPNAM7= <>
##$DBPOAL= (0..7)
0.5 0.5 0.5 0.5 0.5 0.5 0.5 0.5 
##$DBPOFFS= (0..7)
0 0 0 0 0 0 0 0 
$$ [...]
##$SUBNAM2= <"">
##$SUBNAM3= <"">
##$SUBNAM4= <"">
##$SUBNAM5= <"">
##$SUBNAM6= <"">
##$SUBNAM7= <"">
##$SUBNAM8= <"">
##$SUBNAM9= <"">
##$SW= 501.771253377433
##$SWIBOX= (0..15)
0 1 3 0 0 0 0 0 0 0 0 0 0 0 0 0 
##$SW_h= 40650.406504065
##$TD= 32768
##$TD0= 1
##$TE= 0
##$TE2= 300
##$TE3= 300
##$TEG= 300
##$TL= (0..7)
0 120 53 12 22 120 120 120 
##$TP= (0..7)
150 150 150 150 150 150 150 150 
##$TP07= 0
##$TPNAME0= <>
##$TPNAME1= <>
##$TPNAME2= <>
##$TPNAME3= <>
##$TPNAME4= <>
##$TPNAME5= <>
##$TPNAME6= <>
##$TPNAME7= <>
##$TPOAL= (0..7)
0.5 0.5 0.5 0.5 0.5 0.5 0.5 0.5 
##$TPOFFS= (0..7)
0 0 0 0 0 0 0 0 
##$TUNHIN= 0
##$TUNHOUT= 0
##$TUNXOUT= 0
##$USERA1= <user>
##$USERA2= <user>
##$USERA3= <user>
##$USERA4= <user>
##$USERA5= <user>
##$V9= 5
##$VALIST= <valist>
##$VCLIST= <CCCCCCCCCCCCCCC>
##$VD= 0
##$VDLIST= <DDDDDDDDDDDDDDD>
##$VPLIST= <PPPPPPPPPPPPPPP>
##$VTLIST= <TTTTTTTTTTTTTTT>
##$WBST= 1024
##$WBSW= 4
##$XGAIN= (0..3)
0 0 0 0 
##$XL= 0
##$YL= 0
##$YMAX_a= 43826
##$YMIN_a= -68978
##$ZGOPTNS= <>
##$ZL1= 120
##$ZL2= 120
##$ZL3= 120
##$ZL4= 120
##$ABSF1= 0
##$ABSF2= 0
##$ABSG= 0
##$ABSL= 0
##$ALPHA= 0
##$AQORDER= 0
##$ASSFAC= 0
##$ASSFACI= 0
##$ASSFACX= 0
##$ASSWID= 0
##$AUNMP= <proc_1d>
##$AZFE= 0.1
##$AZFW= 0.5
##$BCFW= 0
##$BC_mod= 2
##$BYTORDP= 0
##$COROFFS= 0
##$CY= -3
##$DATMOD= 1
##$DC= 0
##$DFILT= <>
##$DTYPP= 0
##$F1P= 0
##$F2P= 0
##$FCOR= 1
##$FTSIZE= 65536
##$FT_mod= 6
##$GAMMA= 0
##$GB= 0
##$INTBC= 1
##$INTSCL= 5.30512e-09
##$ISEN= 30
##$LB= 1
##$LEV0= 0
##$LPBIN= 0
##$MAXI= 10000
##$MC2= 0
##$MEAN= 0
##$ME_mod= 0
##$MI= 50
##$NCOEF= 0
##$NC_proc= -7
##$NLEV= 6
##$NOISF1= 182.463
##$NOISF2= 159.3651
##$NSP= 0
##$NTH_PI= 0
##$NZP= 0
##$OFFSET= 248.5645
##$PC= 4
##$PHC0= -9903.883
##$PHC1= 26.45667
##$PH_mod= 1
##$PKNL= yes
##$PPARMOD= 0
##$PSCAL= 0
##$PSIGN= 0
##$REVERSE= no
##$SF= 81.014009
##$SI= 65536
##$SIGF1= 159.3651
##$SIGF2= -187.1042
##$SINO= 113.3802
##$SIOLD= 16384
##$SREGLST= <1H.CDCl3>
##$SSB= 0
##$STSI= 65536
##$STSR= 0
##$SW_p= 40650.406504065
##$SYMM= 0
##$S_DEV= 0
##$TDeff= 32768
##$TDoff= 0
##$TI= <>
##$TILT= no
##$TM1= 0
##$TM2= 0
##$TOPLEV= 0
##$USERP1= <user>
##$USERP2= <user>
##$USERP3= <user>
##$USERP4= <user>
##$USERP5= <user>
##$WDW= 1
##$XDIM= 65536
##$YMAX_p= 532707248
##$YMIN_p= -28832865
$$ End of Bruker specific parameters
$$ ---------------------------------
##NTUPLES= NMR SPECTRUM
##VAR_NAME=  FREQUENCY,     SPECTRUM/REAL,   SPECTRUM/IMAG
##SYMBOL=    X,             R,               I
##VAR_TYPE=  INDEPENDENT,   DEPENDENT,       DEPENDENT
##VAR_FORM=  AFFN,          ASDF,            ASDF
##VAR_DIM=   65536,         65536,           65536
##UNITS=     HZ,            ARBITRARY UNITS, ARBITRARY UNITS
##FACTOR=    0.620285442955139, 1,           1
##FIRST=     20137.2065510759, 0,            0
##LAST=      -20513.1999529892, 0,           0
##MIN=       -20513.1999529892, -28832865,   0
##MAX=       20137.2065510759, 532707248,    0
$$ Real data points
##PAGE= N=1
##DATA TABLE= (X++(R..R)), XYDATA
$$ [...]
14959 -11953160 -14341399 -13487116 -11203646 -9110296 -8069062 -7877826 -7741527 -7684424 -8611534
14950 -8611534 -10107539 -9801980 -6828860 -4345756 -5781308 -9712682 -11980424 -12216031
14942 -12216031 -13890979 -17496559 -18512602 -14062153 -7395656 -3147959 -1654631 -742455
14934 -742455 156657 756922 1683715 2268911 -213590 -5444346 -7654074 -3161255 2597028
14925 2597028 1406369 -6179091 -11879076 -11392467 -8443800 -6923943 -5939183 -4564826
14917 -4564826 -5079968 -8114754 -9785517 -7646711 -5343145 -7001612 -10279046 -9802013
14909 -9802013 -5461131 -2361968 -3199625 -5177777 -5090950 -3881742 -4604907 -7978263 -11539483
14900 -11539483 -12357541 -9670971 -5352104 -2402818 -2769384 -6072129 -10154454 -12917422
14892 -12917422 -13878777 -13908083 -13218435 -10419262 -5083987 -663972 -1645159 -6749788 -8773134
14883 -8773134 -4124556 1096022 -658313 -6846143 -8217012 -2941988 320605 -4547251
14875 -4547251 -12143183 -13836539 -9613246 -6184964 -6709595 -8134445 -7383851 -5275629
14867 -5275629 -4289274 -5731084 -9070631 -11844172 -10900608 -5868224 -552329 984739
14859 984739 -1318678 -4708131 -7284064 -8541972 -8193558 -6839669 -6199128 -6565155 -5954123
14850 -5954123 -3703193 -2102531 -1963798 -255990 3956239 5184807 -946423 -8725840
14842 -8725840 -8405038 -374408 4600866 396071 -6913844 -9406536 -8155735 -8828786
14834 -8828786 -11744199 -12376648 -8907747 -3647978 1613455 6576771 9249450 6648047
14826 6648047 -333970 -6308643 -7132506 -3955085 -414900 1957436 3800434 5019030
14818 5019030 4297342 1448307 -1709168 -3576785 -4525924 -5400810 -5628891 -4649798 -4169461
14809 -4169461 -6109336 -8417360 -6517004 -179403 4716490 3754908 -89364 -1571984
14801 -1571984 -1043622 -2290035 -4725569 -3934323 198589 2008279 -1814870 -7691845
14793 -7691845 -10866271 -11359926 -11802469 -12921706 -13781832 -13788359 -12446735 -9589370 -7078289
14784 -7078289 -7320203 -9210220 -9294746 -7781444 -8424730 -10874125 -9280222 -1860613 4382350
14775 4382350 3563829 -67814 612754 4170923 4211703 1051180 1089290 5830431 9914959
14766 9914959 10143084 8676833 6591116 2010757 -3605972 -4741641 -208101 4067819
14758 4067819 3620962 1026572 -20762 -303664 -1197841 -821461 1685393 2936993 717004
14749 717004 -1871972 -1960225 -1986097 -4511313 -6708466 -5635761 -4635421 -7958607 -12604492
14740 -12604492 -12593455 -8592738 -5880172 -4962578 -2352970 585837 -1554469 -8211666
14732 -8211666 -12343387 -11558549 -11296101 -14132451 -14389591 -8087751 -903442 -40327 -3717100
14723 -3717100 -5340231 -4015891 -4034012 -6487139 -8158263 -7776562 -7617862 -9042716 -11074914
14714 -11074914 -13188432 -15347987 -15684911 -12379124 -7695930 -5934379 -7297497 -8101842
14706 -8101842 -7327148 -8013204 -10799842 -11271004 -6937013 -2722145 -4860169 -11561128 -14874685
14697 -14874685 -11594323 -7330518 -7923991 -10964890 -9829108 -4115927 -916480 -4850494
14689 -4850494 -11423644 -13246327 -9598318 -5744756 -4811268 -5211017 -5399679 -5961440 -6416749
14680 -6416749 -4943335 -2486623 -2255183 -3650697 -2184377 2309582 3574006 -1252302
14672 -1252302 -6095423 -5605970 -4204866 -8144225 -13668522 -12249202 -4473620 1184006
14664 1184006 2105295 3847538 8401343 10408019 7322720 3781006 2434499 -501521
14656 -501521 -6091991 -7842911 -2101638 4217711 3374302 -1814444 -3727251 -2020413
14648 -2020413 -2081451 -5097532 -7489999 -7871552 -7532184 -6096460 -3371319 -3207674 -8276744
14639 -8276744 -12952838 -9483185 -449973 3359545 -1842978 -8005976 -7626894 -3353631
14631 -3353631 -1761959 -3884443 -6352185 -7509749 -8073374 -8465938 -8747542 -9254955 -9479448
14622 -9479448 -8542604 -7650818 -8797727 -10142595 -7011390 594896 6030973 4666031
14614 4666031 629415 944988 5673572 8165950 3912744 -4280468 -9494797 -6960512
14606 -6960512 2005258 10658370 12515998 7593022 1570424 -1608120 -3254123 -4974499
14598 -4974499 -4646691 -826635 2401857 -22632 -6384779 -9798026 -7080019 -1762558
14590 -1762558 1757898 2878323 2699754 1006409 -2673215 -7099917 -10109004 -10445192
14582 -10445192 -8425465 -5993679 -5921586 -8965842 -11678020 -9379624 -2108570 4543986
14574 4543986 5763885 2850917 645502 1150665 1988912 752899 -1506178 -2113203 -661261
14565 -661261 632260 284547 -524202 -391257 -583563 -3213216 -6892447 -7222318 -2960788
14556 -2960788 831375 -1641592 -9570977 -16472424 -17695716 -14147627 -8846739 -3266851
14548 -3266851 1761554 4517753 4078112 2075226 913318 1202298 2290544 3945237
14540 3945237 5671876 5630841 2697136 -976072 -2107388 -1067567 -1733342 -5677301 -9157750
14531 -9157750 -7774160 -2195563 3070727 5284410 5091303 3235909 -871082 -6318208
14523 -6318208 -9396771 -7561697 -3339297 -1836423 -4553652 -7618578 -6545292 -1319288
14515 -1319288 3903342 5197951 2305818 -1549414 -2402868 1422192 7875108 12543926
14507 12543926 12352115 8511212 5245915 4904249 5013832 1568101 -5029723 -9435681
14499 -9435681 -7767421 -2614879 395630 -142378 -354896 2700461 6528713 6277501 726112
14490 726112 -6373696 -10386649 -10186719 -8587478 -8880108 -11092320 -12000300 -8964592 -2931148
14481 -2931148 2768418 5286839 3308326 -2483159 -8219006 -8776747 -3973318 -364551
14473 -364551 -2790029 -6735066 -4982482 210117 -175956 -6899313 -9785736 -3354206
14465 -3354206 4293350 4257804 203631 515551 3636179 1719415 -4667503 -6602929 -1132680
14456 -1132680 4442537 4085013 401458 -1812217 -2200729 -2244111 -2112033 -2895459 -6605249
14447 -6605249 -11303923 -11357477 -5442745 334771 411167 -3186636 -4874838 -3150529 -1078642
14438 -1078642 -1679553 -5319435 -9755701 -11350374 -8355253 -3671735 -1829075 -3182274
14430 -3182274 -4384367 -4348020 -5396454 -8228416 -10436867 -10734040 -10077619 -8200745 -4087597
14421 -4087597 -139586 -9260 -1957980 -1191610 640943 -3236041 -11829279 -14308211
14413 -14308211 -5493777 5250311 6807002 583426 -4716429 -5849766 -5100397 -3330096
14405 -3330096 -789917 -318730 -2515163 -2241055 2993300 6225959 617396 -9049361
14397 -9049361 -13378610 -12513874 -13332634 -15926776 -13977367 -7298641 -3203031 -4926293
14389 -4926293 -8102281 -9424023 -10041650 -9665929 -5966993 -935001 398507 -1331474
14381 -1331474 -453908 3553630 5064758 2736471 1991683 5018361 7174007 6080053
14373 6080053 5562261 7279048 7119180 3838855 2639669 5348767 5359798 -1830185 -10492881
14364 -10492881 -13394494 -12038149 -11592943 -11583906 -8879020 -5327513 -5247274 -8363264 -11004959
14355 -11004959 -11419826 -9363853 -4276465 1660213 3269715 76315 -904092 4412049
14347 4412049 9729291 8238886 4071081 4982037 8280371 4718811 -5763367 -13135026
14339 -13135026 -12352930 -9343070 -10101609 -12704402 -13126184 -11455049 -8833018 -4658905
14331 -4658905 -495950 -970955 -6610788 -10628155 -7337810 4919 4187779 3677378
14323 3677378 2452481 2403280 1344658 -1466862 -2648294 502106 5255052 6047271 1062672
14314 1062672 -5742088 -9333724 -8672001 -6205199 -3879547 -1800412 -309561 -715542
14306 -715542 -3280889 -6572276 -9525427 -12125773 -13555395 -12355496 -9373785 -7553723
14298 -7553723 -7461311 -6388355 -3735918 -3374128 -7649228 -12765957 -14099013 -12926031 -13272767
14289 -13272767 -14693906 -13507043 -9606821 -6574388 -5534544 -3944660 -651468 2144323
14281 2144323 2253517 -637870 -5969919 -11576041 -13119709 -8837315 -4013874 -5569058
14273 -5569058 -12414350 -16560354 -13997854 -8822806 -5866735 -5294806 -6094567 -8679857
14265 -8679857 -11178855 -8862592 -1229758 4822808 3035557 -4469840 -11121592 -14117653
14257 -14117653 -14745479 -13636257 -10447374 -6653848 -4535709 -4098758 -3837950 -3444893 -3311404
14248 -3311404 -2847893 -1791341 -1621727 -3245393 -4965037 -5143219 -4844764 -5137742 -4138313
14239 -4138313 -317852 3196740 1882843 -3573216 -8053375 -8981139 -8442085 -8197200 -6785566
14230 -6785566 -3017048 864537 1574358 -1310693 -5203948 -7178098 -6069142 -2973297
14222 -2973297 -285974 303375 -971176 -2787775 -3878153 -2974711 602997 5076455
14214 5076455 6858999 4924915 2597913 2835917 4155624 4294937 5109646 9008379 12556225
14205 12556225 10019902 3025917 -325428 2394188 3768197 -1809901 -8784445 -8616913
14197 -8616913 -2661874 260085 -3289085 -8323768 -10657777 -11762169 -12866228 -10895182
14189 -10895182 -3979693 3604905 6332066 4550166 2932722 3852878 6031360 8209858
14181 8209858 10008711 9708991 5509180 -299302 -2265376 1434786 6203836 7090500
14173 7090500 4953698 3842305 4507163 4340910 2788218 2460328 4153270 4753843 2205087
14164 2205087 -619300 -106083 2148117 1430216 -2710723 -5188180 -2410385 2737180
14156 2737180 4944259 3208206 960298 676028 1110412 -8146 -2684930 -4945776
14148 -4945776 -5270108 -3871708 -2058482 -940864 -627858 -357370 617053 2201498 3435633
14139 3435633 3166746 883038 -2759961 -6267421 -8554634 -9752017 -10257767 -9464029 -6723691
14130 -6723691 -3488739 -2652462 -5120737 -8804887 -11851761 -14567469 -16506164 -14502740
14122 -14502740 -7153807 521360 1621434 -3478494 -7290297 -5727098 -3527254 -6274280
14114 -6274280 -11420605 -12136607 -7564065 -3543833 -3567855 -4572110 -3195347 -1418162 -2795672
14105 -2795672 -6220823 -7417869 -5454436 -4087404 -6398203 -10971525 -14386099 -15331109
14097 -15331109 -14751697 -13347716 -10809370 -7153517 -3392343 -864896 -680180 -3179291
14089 -3179291 -6652531 -7473903 -3963027 -16729 -1677377 -8862978 -13866644 -10754862
14081 -10754862 -3441474 -641016 -4860067 -11114984 -15406378 -18603695 -21222661 -20450692
14073 -20450692 -15331195 -10204896 -9156492 -10357230 -9659159 -6987445 -5203158 -4863051
14065 -4863051 -4223643 -2915591 -1837867 -796960 133631 -1420656 -6602511 -11133438
14057 -11133438 -9508274 -3003362 1154714 -1153489 -6933999 -11378327 -12826413 -11791537
14049 -11791537 -9405761 -8184154 -10545224 -15018416 -17052361 -14745700 -10797836 -8150704
14041 -8150704 -7179626 -7804855 -10252935 -12508018 -11219739 -6810434 -3579467 -3020826 -1692299
14032 -1692299 1756719 2445231 -3626770 -12013662 -14258004 -8028181 1112123 6682484
14024 6682484 6727751 3528155 910396 1220313 3142584 3590673 2534854 3272554 6575207
14015 6575207 8190619 4730093 -1249242 -4924602 -4844508 -2153309 1964090 4548452
14007 4548452 885555 -8739496 -15894470 -13387345 -5039523 -35891 -56259 838491 4918088
13998 4918088 7386992 5003001 868178 -1458537 -2670561 -4053201 -4182211 -2106271
13990 -2106271 93847 433636 -394112 -1255165 -2279689 -3137620 -2986820 -3028087 -5150259
13981 -5150259 -7102545 -3917638 3894409 8697249 5505246 -1075773 -3635811 -1817711
13973 -1817711 -726717 -2487320 -4709664 -5865836 -7057128 -8661352 -9529214 -9732195
13965 -9732195 -10327516 -10061684 -6269404 -191142 2518056 -956605 -5844765 -5722358 -1361193
13956 -1361193 556876 -2691613 -6052224 -4717705 -1583864 -2289919 -5610400 -5028892
13948 -5028892 367776 3430165 -221258 -5257719 -5166067 -2481368 -3960742 -8887483
13940 -8887483 -9962956 -5077752 -602684 -1560708 -4916385 -5236731 -2023484 1613125
13932 1613125 3833263 4688487 4557570 4300861 4930741 5753297 5053684 3357348 3140162
13923 3140162 4536350 4620444 1991408 -1239869 -3011268 -3359316 -2166009 903981 3143862
13914 3143862 497808 -5450344 -7390316 -2229645 3834388 3980212 -163828 -2673824
13906 -2673824 -2356362 -2163697 -2724323 -2308201 -1457270 -2253327 -3913520 -3710664 -1511046
13897 -1511046 581383 2064402 3651171 4248918 2360985 -425709 -1151419 226208
13889 226208 1644523 2568739 3246645 2297594 -840963 -3266146 -3107774 -4039063 -9284705
13880 -9284705 -13624584 -9287969 1042804 5944813 1086870 -5447993 -6436764 -5442422
13872 -5442422 -8627329 -14186330 -16475178 -15167893 -13452402 -11197347 -6822062 -2920299
13864 -2920299 -2995973 -4635016 -2965777 358236 -862259 -6386611 -8412811 -3618129
13856 -3618129 895114 -1992901 -8548143 -9526029 -3417905 1819574 31000 -5366508
13848 -5366508 -6796546 -2441237 2245585 2018299 -1988371 -4716258 -4213935 -3750866 -6535006
13839 -6535006 -10684527 -11449211 -7228976 -1129972 2849356 2927443 -483316 -4935237 -6276018
13830 -6276018 -2477083 2171312 740027 -6761843 -11848032 -8666807 -2334661 -1361952
13822 -1361952 -5323472 -6702687 -3251708 -787982 -3003783 -6031464 -5863283 -4523428
13814 -4523428 -4834380 -4873676 -2834789 -2542937 -7787009 -14473804 -15180795 -9683646 -4441089
13805 -4441089 -2696605 -1791788 -201746 -313468 -2725870 -3860288 -1648617 1225598
13797 1225598 1966021 1093684 -762695 -4685694 -9295268 -9397937 -2733819 5200625 6949682
13788 6949682 1565200 -5701966 -9978151 -10240803 -8326347 -7258687 -9009538 -11908333
13780 -11908333 -12003532 -8270157 -3906103 -1400983 -10834 365394 -2324917 -7014532
13772 -7014532 -7918365 -2731170 2140769 91130 -5802218 -7792858 -5261357 -4103133
13764 -4103133 -6062813 -6730980 -4438226 -3413677 -5876286 -7361412 -3368520 3688245
13756 3688245 7560486 5574514 604528 -2467795 -900462 3582736 5999984 3347478
13748 3347478 -1551268 -3505589 -1501277 970796 1210682 -469972 -3057572 -5510793
13740 -5510793 -5645980 -2481108 649848 -333813 -3988033 -5569450 -5187762 -7652698 -13400235
13731 -13400235 -16239963 -12625719 -7088206 -4937136 -4923344 -3437026 -1467041 -2339209
13723 -2339209 -5567445 -7821061 -8203468 -8416401 -8711457 -6947893 -1272727 7796647 16643484
13714 16643484 19332347 12294985 -186681 -8697232 -9122638 -6917575 -8621741 -13215571
13706 -13215571 -15307696 -13002711 -8287765 -2777338 2288614 4349521 2538073 452495
13698 452495 1585951 3980013 3795937 1959650 2124269 3783970 3138762 57775 -1477556
13689 -1477556 16943 1646792 1396795 525864 -110991 -1758081 -4654758 -7014186 -8178128
13680 -8178128 -9526088 -11510452 -12837716 -12921963 -12141856 -9998627 -6640892 -5532934 -9813911
13671 -9813911 -16036502 -16973485 -11538269 -6281933 -5409175 -5327778 -2103977 1411716 414369
13662 414369 -4203934 -7846576 -8698185 -7676366 -4734606 -123444 2711587 556631
13654 556631 -4294940 -6747204 -6094747 -5945533 -7316056 -6728035 -2194270 3079231 4864578
13645 4864578 2926111 120067 -1400079 -1571570 -1627843 -3128932 -6553092 -10131669 -11367628
13636 -11367628 -10124972 -8595643 -7756782 -5959759 -2179215 1329445 1538381 -1346580
13628 -1346580 -4320038 -5356688 -4869684 -3787279 -2419112 -1711821 -3504570 -8085225
13620 -8085225 -12810613 -14829385 -14301552 -13079296 -11071401 -6769404 -1421368 941461
13612 941461 -701063 -2015244 175069 2130125 -1324830 -7485924 -8156587 -1606506
13604 -1606506 4418256 4066597 1560343 3464832 7888994 7917436 2961572 -599501 378279
13595 378279 1974518 1013318 389593 3306566 6975856 6533850 2554277 189593 1742957
13586 1742957 3810604 2063860 -3724862 -10072639 -13487904 -13001834 -9950577 -6158618
13578 -6158618 -2629428 48579 942601 -278134 -1998378 -2123702 -1158973 -1763064 -4467102
13569 -4467102 -6143606 -4402996 -1561731 -1825290 -5537039 -8618441 -7467139 -2560541
13561 -2560541 2629043 4685982 2421458 -2343286 -6000324 -6326118 -4450817 -2931377
13553 -2931377 -2576896 -2405035 -1908466 -1632192 -1993764 -3227775 -5925107 -9685465 -11880546
13544 -11880546 -10301470 -6872424 -5905911 -8220455 -9780883 -7137957 -1691152 2601098
13536 2601098 3345838 389124 -4888038 -9171995 -8778247 -4038704 -31817 -555060 -3574669
13527 -3574669 -5366785 -6516375 -9627612 -12920121 -11500530 -5133060 279182 343990
13519 343990 -2892000 -5471673 -7047667 -9220500 -11529914 -12335876 -11710912 -10570666 -8423087
13510 -8423087 -4548105 -106437 3183751 4974884 4768714 761553 -6533150 -11601869
13502 -11601869 -9346993 -2325059 2005137 990565 -1232760 -1779713 -2999651 -6091799
13494 -6091799 -6738721 -1895790 3380282 2004106 -4471389 -7727840 -4882027 -2353752
13486 -2353752 -5693327 -11057851 -10768827 -4263296 903450 -1614019 -9820374 -16164924
13478 -16164924 -15657251 -10230432 -5524340 -4268898 -3917031 -1156041 2959811 4504558
13470 4504558 2400407 -406338 -1757617 -3024230 -5660167 -7920309 -7211840 -3626057
13462 -3626057 991960 5464251 8470855 7595495 2455584 -2802629 -3864699 -2271998
13454 -2271998 -3233871 -7679747 -10594732 -7943327 -1450712 4652106 7952265 7336126
13446 7336126 2080987 -5611917 -10192335 -8490688 -4152035 -3049444 -5639181 -7409250
13438 -7409250 -6127127 -4630823 -5795035 -8168892 -8350004 -5563157 -2058060 -68157
13430 -68157 199613 112474 1123925 3422225 5533100 5603787 3394250 661125 -553681
13421 -553681 311466 2072838 2671111 602164 -3469172 -6502536 -5661703 -1529712 2138881
13412 2138881 2246254 -956716 -5243079 -9017886 -11525402 -11758699 -9086842 -4739895
13404 -4739895 -932144 1759861 4560783 7490580 8015303 4272820 -1525437 -5071158
13396 -5071158 -5129778 -4654823 -6359999 -9247431 -10651679 -10020845 -9006774 -8899788 -9727747
13387 -9727747 -11186002 -12658809 -12694094 -10222957 -6245654 -2864881 -906951 -18295 -529488
13378 -529488 -2937504 -5640798 -5922316 -3951783 -3259193 -5859583 -9141268 -9489765 -7281333
13369 -7281333 -5968545 -7066726 -8285632 -6685896 -2197529 2329476 3838795 1648841
13361 1648841 -2418455 -6373924 -9948813 -13448729 -15619791 -14544596 -10575440 -6406452
13353 -6406452 -3979469 -3150044 -3369201 -4252878 -4343615 -2278639 279418 224748 -1682295
13344 -1682295 -1161420 2354661 3555500 -705224 -5899052 -6782455 -5784709 -8684391 -14699212
13335 -14699212 -17375406 -14248342 -9477081 -6944555 -6264281 -5986454 -5669276 -4245451
13327 -4245451 -1123785 738657 -2102347 -7051201 -7571930 -2770192 1022855 -39853
13319 -39853 -2098390 -782530 2177438 3149306 2255802 844995 -1885671 -5294292 -4912506
13310 -4912506 1040140 6517418 4789008 -2057002 -6487556 -6162921 -5230920 -6453503
13302 -6453503 -8189307 -8945516 -9336315 -9028694 -6513214 -2613258 -199066 9263 -368604
13293 -368604 -1328557 -4487695 -8900956 -11087853 -9899851 -7590697 -5680316 -3726708
13285 -3726708 -2439527 -3446870 -5272394 -4356687 -1177922 -236317 -2326814 -2406253 2180228
13276 2180228 6976799 7718299 6942307 8137694 8007557 1372392 -8951761 -14378308
13268 -14378308 -11913774 -6880393 -4201666 -3207810 -2325215 -3007520 -6223122 -9402432
13260 -9402432 -9951521 -8711954 -7418599 -5741932 -3539759 -3044374 -5310380 -6744705
13252 -6744705 -3286279 2968229 5380787 1160545 -5355795 -8564176 -7565670 -4823762
13244 -4823762 -1715476 1861107 4826978 4931525 1851341 -1662216 -2657028 -925441
13236 -925441 1696094 3896300 5389925 5421608 2810432 -1715050 -4843326 -4122229 -1473052
13227 -1473052 -1304955 -4952457 -8897634 -9297156 -6445385 -3330661 -1468229 -531315 -1091164
13218 -1091164 -4418076 -9001025 -10495348 -7255882 -3637599 -4704248 -8788549 -9149565
13210 -9149565 -3554656 1776725 386406 -5263668 -7190207 -3464697 -1200306 -6255752
13202 -6255752 -14393944 -16615573 -10846010 -3711031 -1439013 -3632798 -6605308 -8284497
13194 -8284497 -7852715 -4555624 41758 1673873 -1168974 -3702690 -693394 5842906
13186 5842906 9117905 6786374 2978674 1188793 112767 -2207146 -4722852 -6186613
13178 -6186613 -7865390 -10596699 -11987196 -9608265 -5118660 -2557933 -3800693 -7423490
13170 -7423490 -10330086 -9081480 -2347018 5668510 7151370 -583881 -10456238 -13405545
13162 -13405545 -9104402 -4904195 -5418742 -7838146 -7590365 -4261739 -744637 351563
13154 351563 -1583969 -4649746 -5329037 -2386879 341715 -1734459 -6956590 -8827186
13146 -8827186 -5304411 -2216155 -5075863 -11427523 -14866668 -13861260 -12236408 -12106796
13138 -12106796 -10868323 -6076112 16145 2851468 1021613 -2524722 -4211923 -3140196
13130 -3140196 -540183 2326541 4473229 4608736 2340906 -333580 -928986 61670 -17116
13121 -17116 -1625349 -2800648 -3970770 -8563914 -16489767 -21587209 -19530551 -14336461
13113 -14336461 -12140063 -12182207 -10051058 -6631096 -6106653 -6910659 -3539553 2481034 2619503
13104 2619503 -5519565 -13584696 -14406833 -10690942 -7619386 -4537841 301268 3584183
13096 3584183 2432967 674931 2532107 4643348 1843370 -3065605 -3547475 -516084
13088 -516084 -522131 -4075275 -4659172 129628 4611685 3949756 110471 -3250077 -5605204
13079 -5605204 -6648757 -4248966 1319430 5484786 4956926 1755388 -880485 -3045520
13071 -3045520 -5928711 -8451296 -9295018 -9504210 -9917225 -8463777 -3500262 1907458 2676812
13062 2676812 -1927747 -7540936 -10067771 -9414301 -8020972 -8049161 -10425232 -14611025 -18215548
13053 -18215548 -18082192 -13205501 -6417314 -2190915 -2502025 -5447313 -8012381 -8948792
13045 -8948792 -8089112 -4591277 1501624 6681991 6565253 1816667 -2134601 -2994811 -5305425
13036 -5305425 -13049874 -22045547 -24489265 -19153501 -11948150 -7248514 -4159482 -1688926
13028 -1688926 -1757564 -4655963 -6228149 -3351907 623699 -103223 -5537557 -9263396 -6303880
13019 -6303880 1051946 6386921 6470222 3673161 1575711 584947 -565694 -919159 1614874
13010 1614874 5438882 5724602 1418855 -2067763 -172900 4149896 5004086 1945244
13002 1945244 -1181000 -3796623 -8848776 -15628792 -18493765 -14657264 -8557075 -6001036
12994 -6001036 -7471508 -9613908 -10409608 -10210257 -9569067 -8470693 -6917699 -5024836 -3132088
12985 -3132088 -1955729 -1546391 -675560 897789 480618 -4338726 -11056049 -14375373 -13102636
12976 -13102636 -11152708 -11001435 -10219670 -6315017 -1448998 334494 -1665118 -4682102
12968 -4682102 -6088115 -5371563 -3674632 -2616312 -2818010 -3230375 -2725991 -1683904 -492368
12959 -492368 2106490 6479452 9340430 7296607 2218940 -1271673 -2978736 -6553043
12951 -6553043 -11773036 -13520305 -9904382 -5507241 -4202785 -4335108 -3907608 -4925336
12943 -4925336 -8602070 -11176983 -9163471 -4959948 -2874134 -3045888 -3523000 -4776547
12935 -4776547 -7526791 -9412223 -8727302 -8339162 -10603745 -11445282 -5821452 2925955 6070907
12926 6070907 1416274 -4248476 -5222377 -3448893 -3303320 -5046155 -6406718 -7185937 -8968271
12917 -8968271 -11691114 -12968992 -10893450 -6692109 -4204363 -6085250 -10541429 -13185172
12909 -13185172 -12204929 -9436401 -6035154 -767154 5767065 9367231 7792369 4357363
12901 4357363 2266422 -737898 -7124975 -12678256 -11540318 -6044928 -4139103 -7449068
12893 -7449068 -9357496 -6027249 -2064420 -2344439 -4434982 -3481362 -207188 875059
12885 875059 -1179108 -2800893 -1737624 -281467 -1895943 -6424799 -9844753 -8797164
12877 -8797164 -4792837 -2770806 -5182422 -9263988 -11265527 -11034955 -10094415 -7571860
12869 -7571860 -1885287 4709895 7417283 4714982 -524416 -5480462 -9324363 -10854034
12861 -10854034 -8464105 -3588088 -638202 -1915193 -5027724 -6481878 -5746271 -4958118
12853 -4958118 -6186497 -9072998 -10002059 -5107648 3738925 8432550 4007770 -3817633
12845 -3817633 -5700079 -1346939 1534802 -42211 -899660 1964941 4273945 3068371
12837 3068371 2369601 5128201 6473501 1494518 -5685118 -7804901 -5478410 -4896463
12829 -4896463 -7306437 -8505302 -7473809 -7687173 -9358425 -7570103 -411448 6471128
12821 6471128 6462051 -300366 -8100867 -11962847 -11007055 -7735203 -5670484 -6221451 -6840639
12812 -6840639 -3720381 2930702 7825958 5873126 -2278101 -10578678 -13065947 -8978796
12804 -8978796 -2863533 365928 116655 -1006916 -2036624 -4294270 -6818286 -5418621
12796 -5418621 896294 6083916 3824807 -4136038 -10727859 -12814947 -12917592 -13079449
12788 -13079449 -12732437 -12545012 -14468903 -16807297 -14840000 -8409699 -3685118 -4605211
12780 -4605211 -7379503 -6906920 -4132589 -2709670 -2288437 -419313 1632248 686535 -2264007
12771 -2264007 -3286593 -1978626 -1229889 -990438 1626784 5437553 4985276 -466573 -4094999
12762 -4094999 -1628998 1345887 -2163589 -9129750 -10666952 -5448535 -1186903 -2462665
12754 -2462665 -4542680 -1871810 3461019 5792652 3993572 1037691 -1386618 -3182541
12746 -3182541 -2849388 1051905 6265537 8733458 7627206 4963700 1265607 -3911575
12738 -3911575 -7711543 -5854347 93888 2873042 -466987 -3801574 -1076470 4227648
12730 4227648 4324862 -976099 -4207293 -1655287 1622599 11418 -4752847 -7301379
12722 -7301379 -6658001 -6364150 -8278497 -10317733 -10341487 -9111821 -8578174 -9449971 -11484699
12713 -11484699 -14425304 -17299113 -17990470 -15166656 -10295796 -6429126 -4937320 -4479836
12705 -4479836 -3351936 -1799465 -1404300 -2822944 -4921433 -6067121 -5748544 -4671959
12697 -4671959 -3368140 -1171217 2672446 6779458 7779236 3915837 -2261515 -6428812
12689 -6428812 -7238341 -6601871 -5719612 -3888766 -1873585 -2833054 -7530390 -11393309 -9499344
12680 -9499344 -2748310 3924061 7812973 9554643 9548569 7509336 4972311 3917253 2871247
12671 2871247 -1351971 -7741468 -11482591 -11026790 -9904720 -10119629 -9032977 -5256966
12663 -5256966 -2270943 -2514246 -2836396 -441339 1180728 -2001166 -6573216 -6129072 -1303597
12654 -1303597 1680645 1056988 597638 993418 -1711721 -7511211 -10127632 -6683427 -2866311
12645 -2866311 -3959946 -6585038 -4951050 -721005 -135363 -4079114 -7581170 -8089862
12637 -8089862 -8150760 -9576336 -10114556 -7181621 -1287349 5177476 9650734 9725385 5187591
12628 5187591 188598 -244560 3113503 4008270 -829391 -7029873 -8658298 -5889064
12620 -5889064 -3557195 -4187142 -5995873 -6942489 -7284771 -7592884 -6764023 -3436984 1506185
12611 1506185 4887558 4001956 -338400 -3882222 -3212451 -15803 659540 -2903607 -6360573
12602 -6360573 -5051926 -452306 2026223 549467 -1340769 -560461 1379622 1442749 -455052
12593 -455052 -2050006 -2016182 -637568 1443933 3018212 1844997 -3042520 -8600623 -9702064
12584 -9702064 -4727552 2194548 5492431 3728486 -38355 -2602372 -3877559 -5771874
12576 -5771874 -9085129 -12478694 -14156046 -13557603 -11157953 -7522569 -3422283 -369355
12568 -369355 199474 -1491396 -3610677 -4551900 -3902108 -1586017 2426496 6704233 8158624
12559 8158624 5133962 127492 -2549928 -1866517 -818163 -1603673 -2509967 -1475225 -699761
12550 -699761 -4175298 -10818586 -14068509 -10307821 -4474774 -3725109 -7477567 -8571927
12542 -8571927 -4124974 330829 -326866 -3153082 -2843043 -1167758 -4174468 -11336649
12534 -11336649 -14610422 -9671002 -1999977 1017915 -1062544 -4474157 -8175083 -12815580
12526 -12815580 -15735509 -13064688 -6215201 -1165103 -878451 -2638513 -3460726 -3933047
12518 -3933047 -5236415 -6060498 -4836354 -2607407 -1414399 -1380976 -1243139 -598074 -60472
12509 -60472 -44038 -628304 -1917910 -3514235 -4210422 -3064351 -513132 1878727 2458361
12500 2458361 507642 -3017262 -6102077 -7930114 -9847021 -12754856 -14546216 -12394314
12492 -12394314 -7096031 -2508058 -722920 -549782 -828370 -1946199 -3443999 -3768290
12484 -3768290 -3796057 -6858664 -13017312 -16867251 -14097968 -7236063 -1485325 2157928
12476 2157928 5337924 6542223 2732219 -3857943 -6434112 -2410760 3177577 4724237
12468 4724237 2406711 -606500 -3362365 -6321384 -8211889 -7492026 -5585727 -5261431
12460 -5261431 -6362053 -6192006 -4153689 -3168883 -5664203 -10241886 -13502831 -13710106 -11371859
12451 -11371859 -7400158 -2687058 611551 -327410 -5468420 -10200969 -9741947 -5485736
12443 -5485736 -4136208 -8933013 -14576546 -14175309 -9202224 -7553159 -11831248 -15356019
12435 -15356019 -12210767 -6024471 -4193844 -7001493 -8339544 -5669905 -3096374 -4118362
12427 -4118362 -6846649 -8134563 -7917567 -7197816 -5637184 -3807232 -4375858 -7959194 -10667655
12418 -10667655 -9073595 -5162283 -2955821 -2651933 -2118343 -2067292 -4764949 -8518497 -8615275
12409 -8615275 -4104674 869334 3213778 4057243 4716409 3882581 838597 -2193302 -3276978
12400 -3276978 -3432409 -4020330 -4320930 -3894776 -4531375 -7248652 -9679268 -9096031 -6205069
12391 -6205069 -3570400 -1978546 -581660 909863 2164265 2975938 2775153 1217371
12383 1217371 36544 1496501 4192892 4330197 2448818 3622903 8333878 9288941
12375 9288941 2054434 -7012391 -9874849 -8576374 -9815274 -12068481 -8084006 1779933
12367 1779933 9115503 10350757 10018785 10101926 6573946 -424635 -3000162 2897648 10547210
12358 10547210 12384655 9461494 5800552 1019420 -5039741 -7590523 -4410096 -1862882
12350 -1862882 -5332698 -9376301 -6569190 -1157477 -3110286 -11574761 -15808310 -11958051
12342 -11958051 -7513807 -7574664 -7586808 -3538562 65119 -1983419 -6857450 -8724916 -7387191
12333 -7387191 -6206315 -5271556 -2242987 2338262 5420500 5779146 4318135 1372598
12325 1372598 -2991308 -7081018 -9014615 -9414734 -10265073 -11671902 -11793094 -9505065 -5555673
12316 -5555673 -1583283 859808 1080264 52263 -335622 558794 1807802 2893288 4042618
12307 4042618 4217154 1599891 -2566299 -3641911 473442 5538652 6098768 2442479
12299 2442479 -1002633 -2595840 -4380932 -6453708 -5457366 -385958 4330404 4663462
12291 4663462 2979050 4261439 8049008 8890315 4948467 1174599 1729438 3635277
12283 3635277 2071912 -1171568 -321174 4430592 6278392 2459010 -1016976 1015574
12275 1015574 4197146 1379196 -5816229 -9198531 -6108795 -2120412 -1526729 -2184024
12267 -2184024 -1666314 -2024587 -4859026 -6863823 -4881289 -1791251 -2494304 -6269039 -7955190
12258 -7955190 -5741978 -3256715 -3721529 -5859590 -6753787 -5996568 -5285805 -5384600 -5217049
12249 -5217049 -3800926 -1984703 -1627697 -3275501 -5540668 -7077664 -7819885 -7275037 -3629386
12240 -3629386 2782224 6667551 2606783 -7265049 -14646098 -15070389 -12274800 -11097525
12232 -11097525 -10834462 -8693641 -5609207 -4492537 -5706890 -8142311 -11857159 -15677243
12224 -15677243 -15528685 -10165190 -5339018 -6103304 -7806267 -2613922 6484340 7670036
12216 7670036 -2451011 -13110975 -14676255 -10888177 -9844911 -10581700 -7375720 -2299227
12208 -2299227 -3098792 -9899142 -13793264 -10168511 -5203804 -5939075 -10615601 -13227017
12200 -13227017 -12418927 -10658904 -8273584 -4164953 -548255 -997686 -3840853 -3030816
12192 -3030816 2835296 7051015 3361177 -5261258 -10266972 -8365719 -4633876 -4824680
12184 -4824680 -8422980 -10870650 -9755773 -6273535 -2328793 832276 1778325 -203821
12176 -203821 -2865947 -2331958 2084869 6457601 7089740 4892920 3043329 2018122 -311630
12167 -311630 -4534752 -8623416 -10882435 -11079491 -8444461 -2042456 5434999 7749430
12159 7749430 2127838 -5803108 -7614481 -1874675 4876750 6764475 4774291 3447097
12151 3447097 4433912 5330862 3240561 -2256745 -8660133 -11938283 -9649051 -3926315
12143 -3926315 -66194 -761778 -3098944 -2898179 -481602 292127 -2377803 -6607590 -10445132
12134 -10445132 -13817329 -16249690 -15859197 -12337471 -8578900 -7323264 -7862342 -7941975 -7227605
12125 -7227605 -6595657 -5489425 -2979713 -787457 -1950027 -6071280 -8913940 -7929829
12117 -7929829 -5660517 -5821242 -7998126 -8709031 -6762132 -4906572 -5838906 -8461425 -9067454
12108 -9067454 -5484449 543142 4793413 4322449 188837 -3624345 -4298157 -2676814
12100 -2676814 -1047312 606209 4211673 9437430 12273067 9419713 2883395 -1725063
12092 -1725063 -1147115 2847380 6489156 7741086 6541133 3398835 -597438 -3407288
12084 -3407288 -3454784 -1223272 1722077 4718321 7387649 7648846 3184570 -4143717 -8055466
12075 -8055466 -4550858 2468429 5059954 413857 -6500466 -9759064 -9081806 -8073296
12067 -8073296 -8187456 -7263633 -3608042 1042280 3721976 4184736 5060807 7734241 9277360
12058 9277360 5362466 -3415794 -10415792 -10287939 -5821868 -4109191 -6580241 -7428152
12050 -7428152 -3033303 1972696 1317273 -4066370 -8163852 -8209766 -6052407 -2992633 1251800
12041 1251800 4877680 4753038 1646017 24324 1507394 2747870 958730 -2684203
12033 -2684203 -6309109 -9431852 -10315275 -6394293 212790 2716455 -1497815 -6720125
12025 -6720125 -7275804 -5205882 -5098439 -6130366 -5209598 -4052847 -6092714 -8870911 -6847516
12016 -6847516 -634441 3531648 3119726 1502953 957746 261007 -172987 2291140 6351695
12007 6351695 6548850 1581846 -2974691 -2884717 -675881 46944 282303 1947151 3282931
11998 3282931 2141066 98525 -681790 -1354581 -3233554 -3806289 -136231 5948244 9906972
11989 9906972 10083783 8124736 5621715 3380236 2386444 2666309 2563189 1349239 808154
11980 808154 2243680 4042782 4195987 2888313 735150 -2672988 -6373054 -7447028
11972 -7447028 -5318682 -3243935 -2912807 -1488926 2791896 6424044 6145243 4276119
11964 4276119 3537144 912304 -6824548 -14882195 -15353286 -8716063 -3105233 -2730940 -4091469
11955 -4091469 -3842249 -3447844 -4661886 -6302140 -7190984 -7501577 -6253029 -2353241 1268406
11946 1268406 24544 -4850728 -6868169 -3762541 -477537 -564988 -817049 2003255 4647092
11937 4647092 2364590 -3532202 -7835191 -8336165 -6185835 -1803627 4735790 10283115
11929 10283115 10132119 3615372 -4580334 -9459192 -10467016 -10598302 -11707975 -11813855
11921 -11813855 -8032636 -2026495 89692 -4520335 -10166996 -9158541 -2273986 2329737
11913 2329737 530598 -3230736 -4192673 -3961924 -5619417 -7340966 -5817699 -2695332
11905 -2695332 -2388606 -5187748 -7318704 -7203518 -7271417 -9042971 -9981179 -6874290 -545532
11896 -545532 4407539 4267006 -185403 -4944390 -7152351 -7018732 -5462486 -2484962 487003
11887 487003 -187340 -5179141 -8907507 -6547133 -2197410 -3319730 -8152347 -7408290 205443
11878 205443 3988513 -2646471 -11178060 -10555409 -3568201 -1215003 -5428809 -7941487
11870 -7941487 -4659974 -909005 -1358030 -3514542 -3844480 -3351712 -3814382 -3927994 -2534499
11861 -2534499 -1527919 -2604110 -4506358 -5915988 -7877906 -11010352 -13205186 -12473457
11853 -12473457 -9781003 -7179059 -5295539 -4152466 -4093045 -4470445 -3817003 -2536382 -2720223
11844 -2720223 -4101002 -3465299 177775 3312414 3089703 1297296 346222 -1024817 -4133234
11835 -4133234 -5737246 -2135673 4100681 6803261 4611048 1532418 -257632 -2428885
11827 -2428885 -4845708 -3872549 1635656 7586403 10209907 9877674 7238919 959176
11819 959176 -7134822 -10151874 -4833137 2127189 2804633 -314157 1150639 7522729
11811 7522729 10355249 5768265 -253767 -2100544 -1965476 -3159026 -3183726 968298 5922878
11802 5922878 6391716 3078844 787112 1451838 3865210 7427969 11076479 11079024 5338319
11793 5338319 -2018246 -5454346 -5507230 -6350533 -8214557 -8365078 -7836545 -10170008 -14018599
11784 -14018599 -14116581 -10034491 -7045780 -7108312 -5830439 -628189 4327382 4321035 199471
11775 199471 -4500058 -7918089 -8800982 -5682629 -143008 3012135 1553884 -1628989
11767 -1628989 -3680937 -5338434 -7320120 -7852037 -6605736 -6687209 -9527893 -11869823 -11104803
11758 -11104803 -9699066 -10851333 -13345635 -14146925 -12812209 -10273212 -6755884 -3809333
11750 -3809333 -4431512 -8065098 -9756098 -7568459 -5881007 -7351935 -7307590 -1773352 4234449
11741 4234449 3622937 -1648464 -4243356 -3292845 -3998802 -6898799 -6551583 -1614587 1969592
11732 1969592 156204 -3506086 -4335575 -3370970 -4429831 -8090353 -11654185 -12619711 -10027977
11723 -10027977 -4384786 2095971 6674881 8434035 8203738 6249607 2060999 -3374784
11715 -3374784 -7153549 -7074358 -3833833 -703333 -1334160 -6471867 -12051581 -12604986 -7764601
11706 -7764601 -2841656 -1487672 -1232238 1261335 4400934 4845915 3051933 1328684
11698 1328684 -602312 -3521651 -5137832 -3569044 -1536642 -1843264 -1862738 1348511 3766040
11689 3766040 -247316 -7817670 -11192490 -9843739 -9885711 -12385838 -12464884 -10477231 -12898227
11680 -12898227 -19468746 -20738388 -13208072 -6185061 -6841163 -8521130 -2952587 4515661
11672 4515661 3248040 -4880338 -8461404 -4629827 -1646835 -3335159 -3248621 2261154
11664 2261154 6095892 1936556 -4503518 -4071545 1011450 170297 -9225995 -17527888
11656 -17527888 -16560107 -10296573 -7522301 -9212939 -9410090 -6014692 -3596136 -4920747
11648 -4920747 -6116594 -3316002 593445 179014 -4347399 -7625569 -6559655 -3231991
11640 -3231991 -839555 -203260 -506106 -808540 -519860 -150052 -1207777 -3789053 -5481709
11631 -5481709 -4670259 -3290831 -3701596 -4607734 -3381682 -830264 165747 -451710 -418997
11622 -418997 411448 325297 -410058 -446992 -1378247 -5822719 -11698070 -13789530 -11561116
11613 -11561116 -10026071 -11708851 -13039576 -10545076 -5719447 -1493708 1732313 4052932
11605 4052932 3904458 532131 -4290589 -8647865 -11652634 -11567388 -6892508 -476293 2023721
11596 2023721 -507512 -3269303 -3089459 -2194587 -2297781 -815461 3219083 4806247 -270749
11587 -270749 -7999119 -10640084 -6497730 -1012455 79363 -4606332 -12111324 -16767895
11579 -16767895 -14283078 -7135852 -3147871 -5754437 -9122662 -6640602 -594564 1633884
11571 1633884 -1753163 -5904902 -7654513 -9161138 -12817366 -17026931 -18353807 -15305328
11563 -15305328 -9426046 -4341216 -3360755 -6430899 -10154123 -11879182 -12046529 -11374993
11555 -11374993 -8758358 -4353628 -1601820 -2651355 -4371469 -2993032 -587365 -2220082
11547 -2220082 -7816454 -11701437 -10217457 -5589584 -1731877 56358 236926 -982426
11539 -982426 -3218894 -5219481 -5801792 -4872861 -3457084 -3172333 -4838007 -6851550 -6233047
11530 -6233047 -2255780 2568367 6151871 9163885 11936578 11621823 5442956 -4645228
11522 -4645228 -13359257 -17381951 -17246727 -15095237 -12640545 -10413355 -7401008 -2540033
11514 -2540033 2471114 4043207 1770378 -124348 1519475 4483725 5016504 3033844
11506 3033844 427673 -2933379 -7702285 -11698868 -11976514 -8955750 -5427839 -2942990
11498 -2942990 -1729478 -1908419 -2043049 594825 5082520 5728865 177001 -5059232 -2797857
11489 -2797857 3993322 6057330 688271 -5986409 -8594709 -7631766 -5151614 -2113417
11481 -2113417 -903595 -4312897 -10375601 -13320561 -10989332 -6691204 -3061279 583801
11473 583801 3743350 3373189 -819765 -4676040 -5406128 -4647899 -3831919 -1423115 2655735
11464 2655735 4611581 2147153 -1546171 -2350323 -449301 1845768 3889975 4909190
11456 4909190 1776815 -7019966 -16960197 -20964708 -16706773 -7978634 116494 4832210
11448 4832210 5635947 3257665 -654367 -4266932 -6494514 -7338085 -7739522 -8631770 -9301362
11439 -9301362 -7761080 -4181250 -2202507 -4260290 -7484828 -7908069 -6825167 -7846951
11431 -7846951 -9003508 -4623990 4442188 9849267 7415618 2927447 2687964 4648825
11423 4648825 3759403 520014 -1674817 -3298556 -6415553 -8826193 -6870947 -1952716
11415 -1952716 1627677 3418337 5459751 6111267 2208286 -3260043 -3021725 3719345
11407 3719345 8985537 6877998 1184362 -1003188 1186864 3029802 1444407 -2024699
11399 -2024699 -4089468 -3084757 -283447 884941 -1820424 -6176762 -7480616 -4556507
11391 -4556507 -1288144 -889902 -1496487 280004 3890792 6116230 6228462 6187565 5951921
11382 5951921 2435203 -5258956 -12212150 -12119795 -4829256 2919936 4970530 2123203
11374 2123203 -511951 -940756 -1728918 -3831849 -3380276 2029911 6935521 3510197 -6825146
11365 -6825146 -13208514 -8973837 -458972 1777215 -3241475 -7262704 -5047502 -175543
11357 -175543 1825428 622474 -1034582 -2558892 -5275429 -8911796 -11241844 -10557426
11349 -10557426 -7031573 -2692594 -944129 -4059320 -9506957 -10937618 -5333293 2368100
11341 2368100 4537154 -224836 -6060762 -7003494 -2466428 3875499 7829156 7224872
11333 7224872 3127850 -1174442 -3831133 -6190746 -9146091 -9911035 -6150892 -1512278
11325 -1512278 -1621812 -4914693 -3670653 4382301 11717880 11353077 6021681 2700914
11317 2700914 2572209 1815727 -714931 -2350196 -1646215 407288 3406636 7468809 10745503
11308 10745503 10824996 8126506 4732913 1043721 -2980464 -4976913 -3016381 1135
11300 1135 -300100 -2839182 -2850827 -292772 -416978 -4845379 -7977461 -4826744 2242387
11291 2242387 7370523 7947201 4943410 173270 -3928551 -4906883 -3461043 -3376346 -5961371
11282 -5961371 -7565526 -5267628 -1836055 -1550265 -3658437 -3938446 -1176602 1699340
11274 1699340 2133699 329218 -2405735 -4912311 -6068281 -5683562 -5134859 -5292808 -4735669
11265 -4735669 -2128714 679446 618414 -1975321 -3311598 -925438 3536230 6601266
11257 6601266 6423441 3607977 -204676 -4055114 -8053368 -11704118 -12516716 -8586878
11249 -8586878 -2924989 -1851958 -6999535 -12040121 -10626345 -4931475 -2071119 -3985088
11241 -3985088 -6032766 -4941961 -2657202 -1676450 -1824440 -3192315 -7235105 -12457668
11233 -12457668 -13663292 -8988205 -3894773 -4161253 -7944493 -9206568 -6646829 -4318744
11225 -4318744 -4713575 -6219703 -7104981 -7339726 -6207879 -2590245 1538793 2081713 -1447228
11216 -1447228 -4941054 -5724876 -5591080 -6185026 -5707387 -2891159 -236360 192775 663648
11207 663648 3414232 5528449 3071692 -1852947 -3567895 -1271078 320905 -1424591
11199 -1424591 -4040297 -5207820 -6110505 -7959842 -9168878 -7878391 -4409674 -41723
11191 -41723 3885504 5138047 2225048 -2495106 -4885380 -4694141 -5086665 -6123791 -4051026
11182 -4051026 1289851 4117410 914863 -4163462 -5893148 -5230449 -5553411 -6158218 -4896204
11173 -4896204 -3691632 -5501036 -8308622 -8062116 -5793816 -5994645 -9066408 -11030993
11165 -11030993 -10110239 -8314244 -6951755 -5682032 -5608800 -8044070 -10346310 -8429271
11157 -8429271 -3740157 -2330391 -6194128 -10793027 -12322530 -12197325 -12604921 -12549071 -10658816
11148 -10658816 -7913635 -5515091 -3626464 -3568462 -6974010 -11054268 -9466905 -709971
11140 -709971 8373837 10484759 5805766 -653515 -5898532 -9740050 -12007434 -12808980
11132 -12808980 -13336327 -13288731 -9986646 -3248903 1670689 137578 -4997514 -7087945
11124 -7087945 -4875583 -3195759 -4896627 -7032857 -6331592 -4296313 -4346652 -6378678 -7012518
11115 -7012518 -4414723 -581680 1359163 497045 -1969488 -4894880 -7496761 -7905958
11107 -7905958 -4027847 2841828 7566395 6814405 3531741 2690028 3908536 2563990
11099 2563990 -1961163 -4241531 -825639 4150940 4548419 286366 -3738511 -4635180
11091 -4635180 -3586994 -2005022 534078 4059125 6618935 6033876 2181838 -2664643
11083 -2664643 -5102284 -2948805 2174150 5070908 1726334 -5777699 -10702874 -8896007
11075 -8896007 -3375913 -384072 -1794488 -3678286 -2493646 339080 2023904 3638783
11067 3638783 7626058 11544008 10022158 3549410 -838937 -82051 32992 -5072594
11059 -5072594 -10017948 -7719169 -1776181 -1806481 -8539492 -12832950 -9721053 -4624653
11051 -4624653 -3602232 -5230549 -5370394 -3618652 -1522503 513732 1563195 845
11043 845 -2742139 -2963606 -950536 -1040817 -3792488 -4561231 -2222846 -1997722 -5994941
11034 -5994941 -8603542 -6350386 -4781053 -8852302 -13340968 -11064874 -5282200 -4756573
11026 -4756573 -9982890 -13417348 -11393424 -7292138 -4035681 -1428771 -330046 -1938097
11018 -1938097 -3354001 -1115203 1495002 -1419884 -7163806 -6372762 2317465 8577984
11010 8577984 4959882 -2787171 -4999994 -1244751 1845062 1209957 -736277 -2430344
11002 -2430344 -5125904 -8608616 -9600062 -5848213 474981 4767353 4768766 2642132 1882692
10993 1882692 2478626 966991 -3813997 -7809356 -7297903 -4638053 -4075603 -3926635 935075
10984 935075 9199240 12650104 7352965 -906029 -5197245 -5729265 -5851300 -5295610 -2668382
10975 -2668382 -504388 -1778994 -3937802 -2328795 1996127 3713800 1579215 -577556
10967 -577556 -1181164 -3092803 -7101635 -9036937 -6216109 -2154290 -1373943 -3137500 -4104151
10958 -4104151 -4210973 -5479864 -6871018 -5091551 -121217 4146932 4995294 3223421
10950 3223421 353358 -2841836 -4496351 -2208009 3055730 6723843 5850040 1925158
10942 1925158 -2426958 -6015313 -7059656 -3111167 4218129 8636607 6926397 3522305
10934 3522305 3368928 4467228 2886573 978533 3217019 6665314 4258024 -3241614
10926 -3241614 -7433233 -5091007 -1951426 -1864120 -1284474 1842535 2648586 -1622663 -4921388
10917 -4921388 -1751620 2984970 1344644 -5007460 -7632625 -3941563 721685 1896835
10909 1896835 -164649 -4359298 -9662619 -12606396 -10034636 -4558681 -1997270 -3499568
10901 -3499568 -5255182 -5552620 -6484633 -8474097 -8791485 -6564449 -4374935 -3794026 -3722752
10892 -3722752 -3944499 -5797027 -8386442 -8702081 -6749692 -6191658 -8437365 -10326218 -9351356
10883 -9351356 -7151841 -5949323 -5361670 -4908919 -6189239 -10093140 -14488371 -16666515
10875 -16666515 -15938603 -12844259 -8614028 -6125949 -7714704 -10837763 -9956343 -4368727
10867 -4368727 189470 -74263 -1869287 -1294921 -433977 -2593320 -5214533 -3916846 -935438
10858 -935438 -2295920 -7319340 -8362263 -2372152 4095901 4549576 1563783 1461434 4111971
10849 4111971 3973427 -385010 -3816862 -2318211 1622230 3315059 1887363 -499624
10841 -499624 -2656409 -4437309 -4561775 -1908277 1501779 2094195 -320861 -2043747 -728032
10832 -728032 1535611 1837918 878694 1529901 4140929 5582903 3043813 -2573097 -7391927
10823 -7391927 -8243656 -5559229 -2627688 -1808761 -1999377 -652755 2422807 4897192 5176095
10814 5176095 3793627 1545082 -1427236 -4211212 -5295354 -5140207 -6063545 -8120370
10806 -8120370 -7713711 -2677458 3303217 4482948 512372 -2860301 -875109 4718328
10798 4718328 8233097 6753485 2825898 637844 901965 739062 -1776221 -4865004
10790 -4865004 -5678968 -4002385 -1825182 -573848 -468476 -1365104 -2459448 -2553931 -2307926
10781 -2307926 -4039157 -7105312 -6706964 -1052803 3660742 994997 -5576189 -7110652
10773 -7110652 -2341498 1456179 691601 30927 2810494 4996164 2372512 -2866656
10765 -2866656 -6677267 -8791729 -10251364 -10482698 -9966767 -10677928 -11311590 -7992592 -2281352
10756 -2281352 -1442808 -7251441 -12001523 -10080912 -5785249 -4260223 -2776226 2016571
10748 2016571 5751619 3588073 -628157 -1149327 -456503 -3371308 -6411964 -3333563
10740 -3333563 2779160 3705916 -320927 -1867530 485008 704675 -3292626 -6721944
10732 -6721944 -7001605 -6833184 -7234976 -5559928 -1643916 1151908 1823980 2209374 1711360
10723 1711360 -1626813 -5139947 -4035370 63364 546296 -3720404 -6681861 -4677371
10715 -4677371 -761206 1558747 2384410 2357943 1680954 2670139 7170948 11349039 9461808
10706 9461808 2740689 -2152296 -3234883 -4507583 -7272404 -8082643 -6122227 -4879222
10698 -4879222 -5229742 -4259060 -2244685 -3379165 -7908686 -10635711 -8896801 -5315008
10690 -5315008 -1515875 3619514 8148162 7272711 1516929 -2496741 -1751751 -623945
10682 -623945 -2911310 -6664214 -8958813 -9578681 -8473875 -5782877 -4956115 -8757027 -12033697
10673 -12033697 -7071691 3124436 6715381 277894 -6100721 -4602806 -408090 -1357781
10665 -1357781 -6005916 -8416304 -7476663 -5100546 -1484177 1883837 315604 -7002273
10657 -7002273 -12990119 -11283596 -4631911 17826 559595 -660586 -2186639 -3738821
10649 -3738821 -4086917 -2371554 395799 2774627 3365144 92069 -6743789 -11575565
10641 -11575565 -9725690 -5726494 -8037138 -15637102 -18673791 -13396725 -6852721 -4470799
10633 -4470799 -2928871 813345 2855210 -194437 -5112997 -8268986 -10707773 -12914727
10625 -12914727 -11945149 -7784142 -5032076 -4521975 -1312866 5176133 7802386 2956777
10617 2956777 -3590502 -6819880 -9314751 -12815335 -12594580 -6703882 -1686290 -2108584
10609 -2108584 -3182769 -1000213 -994624 -7739923 -14752889 -13977327 -8455136 -6071771 -6762614
10600 -6762614 -5445640 -2549628 -2162036 -3485468 -2683490 -266630 600177 206282 483217
10591 483217 348829 -1550078 -2935285 -1685104 263304 941409 1671494 2598359 525493
10582 525493 -4682810 -7558086 -5186674 -1780553 -1050291 -732540 1089630 1385929 -1525292
10573 -1525292 -4051368 -3904186 -3564359 -3878222 -2257856 -42896 -2026729 -5724476 -2487949
10564 -2487949 6827378 10101415 3115471 -3188495 -1392415 839881 -3300032 -6633242
10556 -6633242 -1869886 4364927 3514037 -407926 -465376 -139116 -4632836 -8881517 -6547730
10547 -6547730 -1796552 -728573 -569484 1804544 1091688 -5457410 -9370531 -5036684
10539 -5036684 -1050663 -5250885 -10350876 -7634761 -2862812 -4291927 -6561316 -1494085
10531 -1494085 5915102 7043970 4614555 4232399 2375620 -3407889 -4847356 2260968
10523 2260968 6913852 1038566 -5683548 -4062877 -2401350 -9024588 -14971007 -11622945
10515 -11622945 -7641797 -10150869 -8844616 1695128 6045792 -3977526 -9669065 1692113
10507 1692113 11010498 2392551 -5131479 6316129 16507867 4521886 -8703244 954624
10499 954624 12646014 1124903 -9823613 6864078 20309899 -2739240 -21062705
10492 -21062705 12915963 47479017 13529055 -10785524 127453412 392823576 532707248
10485 532707248 392864885 128495678 -8543487 16108254 50169343 16701059 -15930474
10478 -15930474 1653793 20922138 2737575 -16164179 -3267043 12163593 1870551
10471 1870551 -10786482 -1247435 11464034 5359060 -5585998 -4140035 -1481590 -8629199
10463 -8629199 -11845866 -1637209 5725241 -1627735 -8936191 -3391315 2971426 -1508929
10455 -1508929 -6551701 -2708807 -873153 -10144905 -18792055 -15293539 -7880111 -6849289
10447 -6849289 -7101867 -3276641 -2771974 -9190871 -11836202 -5573761 -2228570 -8684013
10439 -8684013 -12938923 -6010353 1598185 210559 -1234559 6144627 12659996 7631945
10431 7631945 -491000 686518 6343817 5905567 2774818 5181214 8798945 5764883
10423 5764883 971215 2529522 5030096 -906850 -10071166 -10354603 -3241957 -819294
10415 -819294 -6324319 -11999561 -13508914 -13728919 -14105523 -13155261 -12003736 -12514456 -12086789
10406 -12086789 -7938349 -3553799 -3798596 -6965846 -8069804 -6338626 -3908726 -1614654
10398 -1614654 -1058397 -5141662 -11432233 -11782501 -4369537 1253934 -2169832 -8544638
10390 -8544638 -8936497 -5726962 -6787211 -11450519 -12573909 -8873560 -5584800 -4945656
10382 -4945656 -4405439 -3141208 -3290814 -5149037 -6452660 -5996970 -4387353 -2361224 -703130
10373 -703130 143874 1446217 3794644 3286768 -4205660 -14299464 -17012789 -10489662
10365 -10489662 -4018847 -4423935 -7613169 -7466913 -4678966 -1898720 1709756 5468079
10357 5468079 4573230 -1504085 -5472963 -3209137 -724461 -3539434 -6901544 -4549189
10349 -4549189 -215465 -1414072 -7159463 -10756983 -10652875 -10158231 -9749965 -7488639 -4626904
10340 -4626904 -4102835 -5607016 -7296573 -9225097 -10408152 -6996176 1137596 6750057
10332 6750057 4412685 -1055516 -1864851 1229867 1750700 -1675130 -4722077 -5380863 -5740354
10323 -5740354 -6961728 -8023268 -8520481 -8475743 -6711190 -2725614 1591816 4338406 5015788
10314 5015788 2600374 -3024106 -6701730 -2037554 7879962 11926505 6761911 2122090
10306 2122090 5056177 8821856 5302073 -1074140 -2099153 -382691 -3068902 -6929898
10298 -6929898 -3093824 6387030 9890196 3848072 -2671761 -2367981 1273762 1732848
10290 1732848 -1761365 -5818684 -7303255 -4370766 2053831 6939475 5572565 -483133
10282 -483133 -5610144 -7527183 -8530772 -10607380 -13410439 -15857971 -16113640 -11874680
10274 -11874680 -4222631 1384905 1657089 -76396 402791 2146150 3068864 5108394
10266 5108394 9633422 12392837 9635277 5111288 4209807 5343434 4411051 3354164
10258 3354164 5833417 8276186 4624140 -2646599 -5632199 -3285215 -1571887 -3006026
10250 -3006026 -5055664 -7427323 -11517870 -13800576 -9608403 -2946525 -2469346 -7700589
10242 -7700589 -9714359 -6289576 -5298079 -10456854 -14338651 -10012731 -1021414 4867903
10234 4867903 4859960 326584 -6538879 -11728638 -11203385 -6799836 -4799839 -6641551 -7351047
10225 -7351047 -4783203 -2899836 -3503515 -2739021 826250 2613113 639854 -85437 3333651
10216 3333651 5755237 3009380 -135463 2184906 6919118 7156522 2750638 -996226
10208 -996226 -1594644 123647 4226481 9756589 11647348 6587903 -95744 -311463 5280722
10199 5280722 8228825 4218467 -2375865 -6166040 -6865460 -6329840 -4782467 -2469074
10191 -2469074 -1418624 -2943869 -5380184 -6024104 -4123092 -1312258 -279149 -2809451
10183 -2809451 -7379580 -9062728 -4376610 3487787 7002687 3022696 -3175405 -4431222
10175 -4431222 -537815 2108436 -765296 -5841253 -6787442 -2371727 2359490 2526594
10167 2526594 -1424000 -5648706 -7802386 -8370156 -8430819 -8072393 -6876605 -4869894 -3022553
10158 -3022553 -2880264 -4618833 -5388893 -1789559 4957906 8724484 5351433 -2129599
10150 -2129599 -7315867 -7565982 -4856049 -1485808 1812446 4519479 6016235 6109623 4205356
10141 4205356 -184871 -4301642 -2982332 3765587 7807374 3021203 -4724492 -4982487
10133 -4982487 1673089 4252204 -1852531 -8040610 -6152995 -769714 -1657930 -9390948
10125 -9390948 -15439106 -13890231 -7028366 -457189 2273219 514838 -3802886 -6838086
10117 -6838086 -5894746 -2166951 1152334 2845575 3917791 4635829 3509556 -677561
10109 -677561 -7044306 -12806045 -15046745 -13336749 -10864308 -11218301 -13500879 -13054942 -8258383
10100 -8258383 -3664058 -3864808 -6748984 -6513601 -2001483 2158344 2679040 1599635 1630209
10091 1630209 1305293 -1914548 -5842445 -5236204 425216 4816498 2750846 -2454365
10083 -2454365 -3250014 1691134 5749638 3865159 -609106 -1286930 2244836 4664931
10075 4664931 2526019 -2287715 -6190408 -7377731 -5499512 -1201016 2991088 3865220
10067 3865220 962940 -2663894 -3941847 -2846067 -1600343 -1967677 -3639744 -4561142
10059 -4561142 -3095264 -492543 -126071 -3145143 -6467940 -6932478 -5617669 -5305239 -5407595
10050 -5407595 -3315888 84149 814532 -1856192 -3926395 -3001857 -2071968 -4390701 -7704290
10041 -7704290 -6967160 -1342764 4579618 6310321 3944562 765609 -999222 -1858115
10033 -1858115 -2879142 -3260670 -1320243 2506904 5386335 5133533 1863714 -3633249
10025 -3633249 -10574345 -16257881 -16678541 -11468420 -5680025 -3996697 -5540674 -7082348
10017 -7082348 -8320890 -10102399 -10233987 -6158607 -178703 3054214 3204817 3446066 3986189
10008 3986189 1938460 -2519336 -5384891 -4857757 -3258304 -2368923 -1612837 -1401538 -3384590
9999 -3384590 -6519725 -7539038 -6025966 -4429176 -2854311 689091 4425898 3563608
9991 3563608 -1600862 -4677138 -2557529 324049 -112478 -1441053 21619 3152756
9983 3152756 4866488 4318262 1227727 -4793332 -10131981 -8425721 -130837 5108319
9975 5108319 755330 -7551366 -10936157 -9697454 -9715592 -11210718 -9602792 -5062440 -2835409
9966 -2835409 -4677288 -7078562 -7988778 -9028632 -10725047 -11241789 -10479835 -10465699 -11049028
9957 -11049028 -9768474 -6640821 -4855291 -5904017 -7710865 -8251901 -7661848 -6264327
9949 -6264327 -3795897 -1174389 -58989 -55476 1002634 3484722 5097145 4221054 2223122
9940 2223122 1729659 3507903 5211697 3263227 -2882812 -8658168 -9068270 -5361044 -3197354
9931 -3197354 -3853098 -2776083 1353381 2989470 -715725 -3506319 583339 7321160
9923 7321160 9333238 7959653 9143774 11513765 8861043 2340197 -595175 914705
9915 914705 -89062 -5727439 -9741068 -8831328 -7632219 -9003719 -8714036 -4274337 -681298
9906 -681298 -2117603 -5036091 -4665095 -2068105 40869 2216055 4204221 2361713 -3462390
9897 -3462390 -6407081 -1689774 5909585 8799386 5668023 -672856 -8315337 -14102917
9889 -14102917 -13329816 -7367174 -4415712 -6819638 -6638574 -1149784 -1038506 -11011299 -14088790
9880 -14088790 6202730 35313309 41576344 19522972 -3104359 -5285791 2515731 2268458
9872 2268458 -3807814 -4131878 -692638 -3223295 -10028624 -11746616 -8536316 -7953749 -9482072
9863 -9482072 -6031086 1182043 3487988 87017 -864378 2787663 4029794 360543
9855 360543 -1897854 -222793 -774719 -5887435 -8000527 -2582665 2736736 -385652 -8489837
9846 -8489837 -13216274 -13901765 -14864771 -15601388 -12507004 -6808927 -2841260 -1092031 170072
9837 170072 -541215 -4585332 -7470259 -4293928 1397377 2203009 -1539700 -3247778 -1844414
9828 -1844414 -2514142 -5541517 -4445080 2366681 7393162 5422932 941340 -569249
9820 -569249 -1164399 -4273094 -6466480 -2759885 4064032 6695398 3407896 -1421325 -4976210
9811 -4976210 -7930800 -9781579 -8417857 -4690265 -2457139 -3401048 -5674060 -7777753
9803 -7777753 -9697889 -9942709 -5932407 1363523 6999212 8059737 7107406 7896840 10339100
9794 10339100 11735372 10834040 8400212 5139694 1159151 -3133370 -6996097 -9715674
9786 -9715674 -10244148 -7569592 -2500822 2128636 4536068 6245147 9293775 11844550
9778 11844550 9423515 1456460 -5937821 -6091212 315325 6098916 6164904 2362577 -1084602
9769 -1084602 -3695957 -7432687 -11442736 -12248726 -9135031 -5710451 -5112076 -6545198 -7730776
9760 -7730776 -7929719 -6972618 -4210518 -785516 -313839 -4098519 -7530290 -5051132 2059663
9751 2059663 6650074 4620829 -586503 -3247095 -1870491 1091101 3249140 3624172
9743 3624172 1849927 -1229720 -2911879 -1002617 3323207 7065802 9586900 12635863
9735 12635863 15684843 14582288 7478050 -267143 -1262544 4211895 8156769 5799599
9727 5799599 2056603 3633249 8282724 7561271 -604906 -8005790 -6652088 1062027
9719 1062027 5736380 2156434 -5807471 -10434943 -7926427 -1125878 3934601 3710514
9711 3710514 -383780 -4733209 -7366481 -8026197 -6280869 -2382839 949451 1052700 -623574
9702 -623574 -611843 600899 -712822 -4322844 -5270655 -2504330 -2207240 -8073114 -13511639
9693 -13511639 -10044184 -380129 4151920 -1330440 -9294261 -10131049 -3448880 3073312
9685 3073312 2832669 -3702438 -10361345 -11537554 -7953667 -5718389 -8519915 -12603247
9677 -12603247 -12094494 -7353073 -3942721 -4248564 -4965407 -3529508 -2463207 -5166241 -10405619
9668 -10405619 -13445283 -11435278 -6443490 -3753845 -6937578 -13466671 -16193028 -11064649
9660 -11064649 -2103299 3747558 5002383 5246187 5983367 5057097 2178364 592636 1673565
9651 1673565 2400160 315147 -2772888 -4160760 -3994202 -3576973 -2970164 -2241397 -2306110
9642 -2306110 -2847156 -2282064 -1189590 -2317111 -5536658 -6792859 -4507594 -2967898 -5952201
9633 -5952201 -10490710 -10939291 -6623710 -1546290 1314819 1671334 -1499 -2141136 -1631694
9624 -1631694 2365202 5633564 3976418 -348668 -1680386 548744 1298315 -1991269
9616 -1991269 -5642390 -5482459 -2531644 -957271 -2898273 -7116874 -11008652 -12377172
9608 -12377172 -10353366 -5964251 -1668191 169972 -1201955 -4062888 -5001575 -2290014
9600 -2290014 1185770 740469 -3572680 -6349665 -4310117 -624529 851112 1373914 3057867
9591 3057867 2952399 -2325844 -8643175 -8252388 -807107 6495749 9585618 10945126 11672350
9582 11672350 8312694 547304 -5265059 -4532404 -587519 1807218 3419174 6162245
9574 6162245 7296916 4156437 317504 431418 2298469 1021557 -1748273 -551253
9566 -551253 3357668 2678180 -4149639 -9829822 -9140866 -5872701 -5311263 -5971243 -3806497
9557 -3806497 -215312 26373 -3244375 -5070950 -2682465 900636 1484394 -911269 -2751781
9548 -2751781 -1760402 331982 -75002 -3864296 -7474279 -6721149 -1983397 2120508 2526479
9539 2526479 1220441 1850835 4643557 6593782 5764398 3257411 853377 -1552033 -5206781
9530 -5206781 -9892796 -13198091 -12976823 -10184070 -8161845 -8596146 -9355573 -7623504 -4135237
9521 -4135237 -2131502 -2445724 -2378676 -216734 1872264 1424572 148828 1905469 6773355
9512 6773355 10035345 7971414 2632762 -815511 -489967 521803 -1056220 -4387502
9504 -4387502 -6436863 -6520266 -6304972 -5905012 -3521489 75266 407575 -4700812 -10851035
9495 -10851035 -12457120 -10475467 -10491477 -14028120 -16391299 -13513081 -6787290 -162404
9487 -162404 3927854 4714956 2752720 710659 1250416 3005418 2054555 -1729717 -3932824
9478 -3932824 -2528575 -906389 -1896480 -3706887 -4690654 -6910874 -10855359 -11733519 -6594732
9469 -6594732 -924287 -1677767 -6837271 -8798473 -5955428 -3507811 -3773313 -3445367 -1122416
9460 -1122416 -414607 -3586115 -7793451 -9637437 -8695727 -5190312 795483 6167012 6010658
9451 6010658 226344 -5289121 -5984396 -3097120 578506 4514542 8117349 9445656
9443 9445656 8664298 8381150 8574734 6105384 1266272 -1056944 351713 61665 -4506797
9434 -4506797 -7126491 -2225680 5269513 6604313 1462412 -3827765 -6928784 -10232009
9426 -10232009 -12982354 -11089242 -4809282 526680 2044010 1525507 -8954 -3489021
9418 -3489021 -6929518 -6041971 -1572738 -154129 -5265757 -12127412 -14191895 -10769957
9410 -10769957 -5855904 -2843452 -2632252 -4193025 -5277906 -4672557 -4111196 -5343899 -6021462
9401 -6021462 -2686377 2525610 3441573 -1334153 -6615575 -8623885 -8888113 -8649753 -6004887
9392 -6004887 -1550411 -417954 -4550351 -8594239 -7855656 -4806533 -2897275 129167
9384 129167 6477011 11311846 9241715 3735222 1899821 2995285 936974 -3969243
9376 -3969243 -5559931 -3559782 -4619344 -10084620 -12570025 -8178865 -3174068 -3409832
9368 -3409832 -4869160 -1188469 5402418 7889129 5198937 2025621 440364 -1551650
9360 -1551650 -4195677 -4823877 -2595885 291010 2260946 3395980 3129770 738740 -2135430
9351 -2135430 -3241501 -3742003 -6549943 -10772488 -12196006 -9932280 -8151959 -9629676
9343 -9629676 -11476360 -9550707 -4085535 1397977 4325795 3994035 517027 -4548256
9335 -4548256 -8008427 -7942885 -6080040 -5472191 -6509101 -6806742 -4484122 -256361 3295114
9326 3295114 3759223 1003632 -2057927 -1887412 1684897 5044527 5143646 2847926 954936
9317 954936 532144 797125 1273860 2057207 2518557 1501168 -1158984 -4187033 -5823730
9308 -5823730 -5061274 -2697587 -1111514 -1658759 -2569163 -1629413 -614585 -3326342 -8445068
9299 -8445068 -9154325 -2704620 4272987 4512141 212983 -1638902 -1092254 -4441674 -12102192
9290 -12102192 -15918570 -11331606 -4878430 -4717134 -9186169 -10881166 -8472833 -7313575
9282 -7313575 -9265745 -9084527 -2961633 4725663 6998015 3491435 -186685 -925601 -1248770
9273 -1248770 -3449528 -5290110 -4364858 -3060559 -4579182 -6207963 -2432883 5537055
9265 5537055 9855399 7267247 3671192 4072767 4525781 -310703 -7111680 -8776612 -5673025
9256 -5673025 -4005544 -5310422 -5924527 -5632891 -7960748 -11690628 -10901154 -4825366 543614
9247 543614 2205947 3016358 3070005 -1984478 -10557175 -13212305 -6690663 -353180 -1860628
9238 -1860628 -5724548 -4606724 -3048868 -8779003 -17166648 -17162699 -8919369 -2867002 -3149262
9229 -3149262 -4340547 -4156763 -6849237 -12277987 -13478929 -8626496 -4941984 -6397628
9221 -6397628 -7363561 -3904089 -2115153 -7877963 -15694696 -16206556 -9933567 -5203678 -5543901
9212 -5543901 -7278326 -8238274 -10923579 -16089059 -19561629 -17861371 -12829441 -8217019
9204 -8217019 -4680083 -974731 1722107 278639 -5085430 -8904953 -6496733 -673638
9196 -673638 1142774 -2991434 -6431734 -3367136 2424935 2589739 -4373068 -11784017 -14052300
9187 -14052300 -12344024 -10835850 -11667408 -14256504 -16093258 -13981966 -7809705 -2632163
9179 -2632163 -3172894 -6980240 -7654669 -4217586 -1766699 -2867629 -4405485 -3859772 -2584040
9170 -2584040 -1455684 546111 1687668 -2005912 -9058503 -11970545 -7573135 -1502000
9162 -1502000 1233707 3183546 7269965 9805792 7128976 3115057 2680401 2863245 -1514525
9153 -1514525 -7359087 -7401693 -2352198 23720 -2920618 -5979223 -5746339 -4963520 -5863214
9144 -5863214 -6303023 -4688608 -2859331 -1992786 -883411 -148557 -2856981 -8631784 -12067572
9135 -12067572 -9885405 -5450616 -3253312 -2835265 -1645043 -633512 -2878092 -8311009
9127 -8311009 -13328313 -14895695 -12440792 -6383571 2465406 11587621 16704513 14545805
9119 14545805 6069071 -3359544 -7945394 -6379243 -2335867 218213 881123 1200497
9111 1200497 1295393 263346 -1471761 -2767074 -3859537 -5540145 -7145513 -7665104 -7636311
9102 -7636311 -7354851 -4790030 1285093 7438899 8956028 6247154 3547831 1947658
9094 1947658 -1044729 -4897026 -5006454 -9891 5211573 6307657 4441660 1885823
9086 1885823 -2192770 -7685507 -10026940 -5982434 193564 1738114 -1494870 -3894979
9078 -3894979 -2494879 615793 3293139 5410748 5892992 2753667 -2841334 -6586453
9070 -6586453 -6137406 -2818198 1922347 7374343 10351704 6698868 -1547647 -5768458
9062 -5768458 -1548437 4396776 3073282 -4262802 -8403021 -5228502 108826 2050217
9054 2050217 1106743 -412916 -3216570 -7798602 -10592095 -7972788 -2020676 1677071
9046 1677071 817625 -2246129 -4778885 -5903326 -5130774 -2099240 1745066 3713612 2782480
9037 2782480 374423 -1774904 -3023209 -3336998 -2873152 -1757511 588697 4553428 7659109
9028 7659109 5444696 -2294312 -8829817 -8087448 -2820819 -475268 -2791631 -5474723
9020 -5474723 -6904839 -9595847 -12462131 -9992749 -1966597 3857779 3105493 1536563
9012 1536563 4825587 8633011 6511599 1909451 2724035 7378201 6867642 -47210 -4111948
9003 -4111948 60030 6084057 6073564 1324404 -2215621 -3367120 -4850317 -6717123 -6395932
8994 -6395932 -3628493 -761306 1042197 2110707 1345690 -3246132 -10423419 -15006708
8986 -15006708 -13084084 -6845358 -2649036 -4101477 -8138787 -9058720 -5821865 -3128229
8978 -3128229 -4686635 -8336365 -10098642 -10296691 -11694871 -13294541 -11200317 -5753358
8970 -5753358 -2481954 -4223031 -6926648 -5933043 -2373023 100761 1441491 3587856
8962 3587856 5119994 2932327 -1250451 -1463024 3783573 7742429 3587634 -6232843
8954 -6232843 -12628023 -11082107 -6368970 -5064672 -6828214 -6151066 -981002 4442865
8946 4442865 5719615 3550608 1042021 -1233592 -4395038 -7241792 -6844875 -3175019
8938 -3175019 -92070 -742283 -3937127 -6162317 -5906162 -4934834 -5738747 -8389514 -10293769
8929 -10293769 -9481393 -7602646 -7910523 -10109766 -9945541 -5412186 -484977 147036 -2325671
8920 -2325671 -3246116 -1783957 -1239261 -2593328 -2656451 399194 3878199 4644091 3046051
8911 3046051 1065031 -444495 -827510 1115299 4539903 5604187 1899808 -3657806
8903 -3657806 -6060985 -4465492 -2647641 -3459006 -5387557 -5564154 -4327797 -4659824 -7184566
8894 -7184566 -8139459 -4342558 1178463 2005449 -2844875 -6878345 -4950725 -234491 1290865
8885 1290865 -34749 819944 4713887 7102729 5531015 2685875 1080509 -72003
8877 -72003 -1126031 -91779 3225714 5434722 4552814 3119628 3537166 3621537 -19414
8868 -19414 -6647141 -12395974 -14705211 -13266887 -8500110 -1822663 3727579 5478244 3419565
8859 3419565 -263201 -2934108 -2672519 310435 3097044 3086955 1606526 1756852 2949342
8850 2949342 1520107 -2813750 -5689510 -4679321 -2725412 -3170933 -5613727 -8628826
8842 -8628826 -12121276 -14725112 -13573493 -9329164 -6703005 -7218714 -6779719 -3635369 -2504313
8833 -2504313 -6091745 -9019563 -6770282 -4782859 -10129236 -18202690 -17334507 -5360754
8825 -5360754 7110299 10186641 4329746 -3715015 -8121738 -6737360 -2426349 -1824724
8817 -1824724 -7692265 -13624930 -12190141 -6380638 -5313093 -9814498 -11536106 -6883570
8809 -6883570 -2048847 -1846742 -3064603 -2734683 -3927421 -7974000 -9137069 -3741489 2083508
8800 2083508 1043923 -4294222 -6478354 -4690783 -3587651 -4117111 -3723217 -3746084 -8264974
8791 -8264974 -15502115 -17716276 -11271090 -1439147 4440597 4456828 1572132 -742389 -876387
8782 -876387 355296 540699 -1368688 -3268498 -2852012 -1171323 -783071 -1679024 -2063890
8773 -2063890 -1921830 -2376452 -2513186 -588768 2109188 2197607 -1281566 -6308989 -10855101
8764 -10855101 -13033068 -10099686 -2240165 3824354 1049921 -7911384 -12924385 -9443133
8756 -9443133 -3061412 454605 2352784 4574376 3443289 -4093567 -12705790 -14014368
8748 -14014368 -7199211 1460056 7379661 10200581 9503764 4713158 -970013 -2701014
8740 -2701014 -832625 -407540 -3101212 -5010095 -3722344 -2084756 -2601779 -3146392 -1463580
8731 -1463580 376431 -198410 -1528935 -880669 607597 497634 96409 1915051 3679580
8722 3679580 547412 -6689627 -11080663 -8651893 -3452982 -1211869 -1960328 -2254520 -1709016
8713 -1709016 -3006011 -6508141 -9008631 -8383205 -6362280 -5506785 -5927972 -6746006 -8755714
8704 -8755714 -12929620 -17114993 -17354975 -13128566 -8601075 -7278505 -7862349 -7454011 -6257456
8695 -6257456 -5617693 -3560758 2367638 8263917 6392555 -3296229 -10468865 -7670080
8687 -7670080 -999351 -1270511 -8403640 -12608405 -9486952 -5063762 -4592087 -4879869 -1559146
8678 -1559146 2942762 4058974 2751461 2699740 3187415 710204 -4240478 -7559700 -7848349
8669 -7848349 -7469044 -7644138 -6997052 -5164301 -3956021 -4514115 -6510645 -10035239 -14886683
8660 -14886683 -18325439 -17469783 -13924543 -11820011 -11102316 -7755012 -1625421 1736947
8652 1736947 -294553 -2483770 251965 4415069 3206085 -2731438 -6334280 -4870366
8644 -4870366 -3150444 -5075519 -7773804 -6736601 -2465364 1281598 2887110 3063717
8636 3063717 1659849 -1951926 -5901409 -6635395 -3353529 604680 1638861 -336750
8628 -336750 -2659576 -3159224 -1761930 294973 1945244 3191308 4762167 6548192 6669491
8619 6669491 3339665 -1991604 -4807893 -2103585 3901008 7829833 6534558 1412046
8611 1412046 -3918706 -6618581 -5735774 -2572839 -462390 -2031042 -5532875 -5849825 -850980
8602 -850980 4953174 5453127 428215 -4839876 -6747256 -6622998 -6401853 -4993776 -1209499
8593 -1209499 2633679 3233113 937863 -1086721 -1406042 -1246846 -1693644 -3053854 -6495715
8584 -6495715 -12600612 -17961430 -17317671 -10695867 -4757545 -4601289 -7430571 -7476677 -4345269
8575 -4345269 -2308604 -3125745 -4398132 -4758681 -6031798 -9177313 -11829376 -11532691 -8762600
8566 -8762600 -5378867 -2476807 -974012 -1879582 -4518957 -6605269 -7335971 -8137831 -9005698
8557 -9005698 -6897746 -250057 6891893 8228577 2219408 -6136425 -10271514 -7844652
8549 -7844652 -2234898 1098095 370982 -771523 1245776 3913384 1693762 -5255911
8541 -5255911 -10271912 -9199586 -5076488 -1797689 1140197 4139800 3816035 -795509
8533 -795509 -3594663 301251 5865131 5340208 673568 38360 4091577 5486496 1935261
8524 1935261 -268562 2269654 4404037 1923797 -1430474 -1006776 1472887 2508055
8516 2508055 2847886 3957008 3606293 94220 -3538014 -4417418 -4862316 -7606749 -10005940
8507 -10005940 -8381998 -4784103 -3803826 -5180309 -5014885 -2516227 -516174 -615009 -2172915
8498 -2172915 -4743874 -7463355 -7470762 -2918406 3585023 7777757 8441603 6652410 3155317
8489 3155317 -161319 348744 4654039 6239510 234976 -8313110 -10457932 -5757019
8481 -5757019 -2086875 -4045841 -8348315 -10919344 -11914854 -12287091 -11180357 -8954553 -8206431
8472 -8206431 -9482818 -9543572 -5928689 -509189 3025567 3035221 500682 -2193710 -2740740
8463 -2740740 -1076327 222793 -500201 -1302326 46151 1934951 1565441 16761 432836
8454 432836 2291277 1955791 -1625791 -5942204 -9002093 -10334953 -8900679 -4497946 -378910
8445 -378910 167906 -1172301 -948309 -520114 -3427007 -7559297 -7211444 -2726972 -418322
8436 -418322 -2116249 -2779939 -351309 190128 -4043705 -8198559 -7632814 -5126552 -5227669
8427 -5227669 -6857065 -6697685 -5363822 -4958321 -4168128 -845369 3341045 5291054 5153955
8418 5153955 4834606 4119021 1762162 -1563647 -4240733 -5643293 -5166364 -2105656 1633257
8409 1633257 2081391 -1419072 -4878789 -5671674 -5868044 -7423485 -8624438 -8086066 -7634256
8400 -7634256 -8100586 -7042786 -4051344 -3128346 -5630323 -6199750 -1001679 4810061 4027825
8391 4027825 -1915108 -5512012 -3802710 -497258 574405 -1133842 -4420558 -6882027
8383 -6882027 -5781326 -1997037 -377179 -2764010 -4606524 -2506636 -167289 -1481749
8375 -1481749 -2970897 -55380 3845415 2684718 -1378516 -1398062 2544352 4013885 1361464
8366 1361464 -727926 -366230 -690338 -2904793 -4899639 -6656613 -9291330 -9311172 -2532389
8357 -2532389 6271459 6923586 -1886814 -10842682 -13691352 -13322426 -12640319 -9853393 -6090581
8348 -6090581 -7136925 -12545816 -12801470 -3547058 6243977 7300975 2988673 1171507
8340 1171507 658176 -4481331 -12222447 -14338271 -8449490 38699 6253618 8810382
8332 8810382 6413362 -945406 -8281945 -9901577 -6984135 -5128008 -5390596 -4050030
8324 -4050030 -581116 1015186 -413827 -702658 2886301 7261987 7810615 3563818 -3208092
8315 -3208092 -9403411 -12235798 -11028218 -8637777 -8477925 -9950804 -9669164 -7037962 -5072587
8306 -5072587 -5264626 -5315143 -3171070 -147306 1619430 2372427 3517914 4664166 3493540
8297 3493540 -1689221 -9558275 -15666696 -15658292 -9688458 -2625725 1442778 3362686 5723067
8288 5723067 7628849 6049075 1261437 -2961961 -4638512 -5438945 -6593493 -6251599 -2494948
8279 -2494948 3151033 6770299 5765425 1143161 -3171035 -3875870 -2189963 -2827541 -7386048
8270 -7386048 -10897451 -8170828 -1711447 1299304 -720024 -1791986 2313822 7820613
8262 7820613 8460221 3546610 -2309103 -5090071 -4597978 -3652284 -5753722 -11620611 -16847995
8253 -16847995 -15520461 -7616206 -66791 1393466 -1369088 -2802614 -1035042 1665973
8245 1665973 3375334 3948542 3478360 2587021 3244175 6366575 9428693 9038438 4981484
8236 4981484 -489849 -5679100 -8985329 -7739010 -1863933 2723934 -319857 -8739905
8228 -8739905 -13374025 -9807028 -3218066 168683 1107753 3346238 6145819 5829551 2401255
8219 2401255 -380760 -818082 -1056792 -3024316 -5762452 -7055024 -5422952 -861516 4113733
8210 4113733 5031792 123714 -6086131 -7241100 -3130226 411522 -199998 -2374397 -2926298
8201 -2926298 -2901924 -3898409 -3495243 1253732 7921449 10817542 8292389 4024227 1166023
8192 1166023 -964508 -3615921 -5506137 -4859691 -2425687 -600840 -639612 -2033345 -3808688
8183 -3808688 -5283417 -6004450 -5894290 -5467151 -5460164 -6013616 -6050997 -3748533 1434465 6974865
8173 6974865 8871833 5847821 703779 -3410957 -6265048 -8540427 -8850552 -5783283
8165 -5783283 -1516838 153141 -1162610 -2863345 -4306221 -7171687 -10628855 -10840487
8157 -10840487 -6933774 -3234936 -3104560 -4167465 -2589975 944604 2749176 1277381
8149 1277381 -2232169 -6134316 -8588068 -7628092 -3994911 -1657163 -2511260 -3223462 -880700
8140 -880700 1396609 -576682 -4257106 -3885119 -214793 453514 -3129302 -5109111 -2580779
8131 -2580779 -151707 -1307311 -2310299 457901 3165342 839793 -3469714 -3035373
8123 -3035373 1559516 3087420 -1222634 -5845458 -5144836 -189300 3952376 3685833 -1274837
8114 -1274837 -7774489 -10244909 -5839726 686505 1504069 -3861958 -7500861 -4373116
8106 -4373116 840948 1659312 -637900 -820326 768761 -565827 -4756650 -6359940 -3620689
8097 -3620689 -1407090 -2850951 -4089900 -1255452 2048526 -429041 -7889308 -13059694
8089 -13059694 -11665458 -6532332 -2173300 138411 832247 -143273 -1659684 -782709 3323215
8080 3323215 7019968 6581920 3353719 1581944 2362598 3153021 2748749 2922119 4500759
8071 4500759 5428271 4297858 2702940 1856764 -370321 -5885979 -11641819 -12172977 -6516127
8062 -6516127 574686 4490297 4968440 3961573 2300552 -17679 -2304606 -3660064
8054 -3660064 -3909398 -3184938 -1783803 -900554 -1763290 -3487818 -3930402 -3375744 -4582517
8045 -4582517 -7816527 -9175285 -6379208 -2950308 -2901575 -4059284 -1545014 3892716 6646184
8036 6646184 4738886 1673029 -522812 -3738514 -7644597 -7748652 -3120609 -184622
8028 -184622 -3878145 -9778103 -10766459 -7672629 -6587544 -8202129 -7358455 -2493048 1909995
8019 1909995 3188280 4070759 6477068 7894229 6716715 5735089 6891108 7453193 5404428
8010 5404428 4139815 6887832 10178545 8698039 4122682 2625695 4664107 4248942
8002 4248942 -688651 -4055754 -1033439 3618905 1802307 -6294695 -12291844 -10634383
7994 -10634383 -4491807 244932 2282415 3485549 3482439 241470 -4673945 -5933979 -1193650
7985 -1193650 4927374 6022214 1398180 -3908389 -5475511 -3431250 -675185 361313
7977 361313 -836473 -2671402 -2674793 -613540 120176 -3661164 -10246178 -14776075 -15347599
7968 -15347599 -14251613 -13135788 -10737414 -6466026 -2540274 -695058 158710 1118383
7960 1118383 1207172 203833 378209 2710618 4221594 2089982 -2018446 -4759528 -5823992
7951 -5823992 -6602380 -6541096 -4552578 -2125706 -1300886 -1310016 -887067 -1810538 -5821590 -9932751
7941 -9932751 -9762686 -6209311 -3696707 -2955246 -1244803 895301 -476703 -5448110 -8892036
7932 -8892036 -7684198 -3899740 236500 4682176 7340319 4012061 -4438615 -10688047
7924 -10688047 -10276391 -7196440 -6681378 -7782938 -7406906 -6554776 -7216401 -7217608 -3837111
7915 -3837111 557040 1801711 202362 -1380429 -2882923 -5461734 -7444493 -7233779
7907 -7233779 -7524775 -10899732 -13806147 -11159766 -4729004 -383303 918323 2172213
7899 2172213 2244012 -2742053 -10312537 -12780390 -8606546 -4340301 -3547672 -2265351 1875433
7890 1875433 4595736 3103935 1321558 1991301 993184 -4532820 -9235533 -7718906 -3800952
7881 -3800952 -3888237 -6110785 -4787468 -1962596 -4609087 -11749241 -14265879 -8593560 -1912375
7872 -1912375 -1100338 -3786566 -4086796 -1517907 283247 29726 -385206 276296 1330400
7863 1330400 2221668 3702085 6599354 9805858 9945897 4628109 -3182890 -6642094 -3239992
7854 -3239992 1194316 396891 -3138006 -2304327 2947611 4874150 -812848 -9621971 -15721918
7845 -15721918 -18188440 -17340718 -11597802 -2414370 3298575 1377837 -2906507 -2076019
7837 -2076019 2810763 4796243 2158711 -24585 900384 1138665 -2627953 -7615504 -9163299
7828 -9163299 -7270499 -6104055 -8721948 -14069130 -17910298 -15845350 -7227787 2734758
7820 2734758 6536294 1641974 -6780342 -11545985 -10760714 -8072340 -6709952 -5677387
7812 -5677387 -2524732 1928212 3771735 1015696 -3469104 -5414882 -4432830 -3789298 -5353877
7803 -5353877 -7314584 -7417575 -5912186 -4030904 -1948352 -113714 -446466 -3663547 -6894872
7794 -6894872 -6663665 -3329856 -38179 1898614 3727585 5806416 6490736 4908948 2392708
7785 2392708 472332 -698335 -1523741 -2276388 -3404982 -4874769 -5299690 -3610219 -1329973
7776 -1329973 -873779 -1683350 -828657 2115826 3700595 1217173 -3745760 -7548778 -8082776
7767 -8082776 -5012437 1020550 7659642 11348537 10633576 7751875 5665280 5018895 5026804
7758 5026804 5158729 4405906 1273772 -3328399 -5499911 -3417682 -939009 -2664645 -6839457
7749 -6839457 -7287603 -2110412 3721699 5262743 3278540 1325753 414678 -618257 -1426451
7740 -1426451 -216130 2674107 3929693 1103050 -3934138 -6592632 -4427122 405132
7732 405132 3724346 3637554 1598393 -174200 -776282 55205 2743265 6568040 8886314
7723 8886314 7729932 4863755 4370585 7901225 12658901 14374220 11239434 4911081
7715 4911081 -1059970 -3579872 -2208312 331284 772659 -1078103 -2245099 -526848
7707 -526848 2543996 3574807 1466760 -1413995 -2252588 -1159287 -872388 -3186581 -6674432
7698 -6674432 -8965301 -10506841 -13748032 -18138117 -18916072 -13210678 -5122694 -1325916
7690 -1325916 -2798976 -4777575 -4442648 -4102539 -5880536 -7862491 -7807012 -6823912 -6461592
7681 -6461592 -5471816 -2811137 -821403 -1508675 -2398716 -735295 610806 -2771574 -8257055
7672 -8257055 -8532560 -2786736 1677273 1014853 597048 4923302 8681742 4978929 -2116291
7663 -2116291 -2187070 5603633 10252338 4720473 -3720580 -3956116 3114243 5797783 -2396839
7654 -2396839 -13809199 -15830534 -6055690 4941307 5802124 -3273181 -12279988 -14080233
7646 -14080233 -11600006 -11260784 -13234489 -12300803 -6410467 636374 4974922 6298357
7638 6298357 4798108 -430351 -7408334 -10210505 -5889643 430905 1511127 -2888107
7630 -2888107 -6844057 -6736778 -4495566 -2930580 -2245656 -1894320 -2284623 -3362947 -4142568
7621 -4142568 -4706851 -6373729 -8905061 -9820482 -7762899 -4691960 -3329655 -3799256 -4188335
7612 -4188335 -3574072 -3156303 -4455923 -7102620 -8987272 -9063019 -9336346 -12197202 -15741704
7603 -15741704 -14937702 -9028810 -4060226 -4638967 -6747846 -4054972 1339217 1653723 -3824920
7594 -3824920 -6937721 -3359817 841228 -727071 -5153867 -6253737 -4646481 -5104033
7586 -5104033 -7672306 -8545187 -7613912 -8283209 -10691160 -11409307 -9714308 -8401695 -8186355
7577 -8186355 -6837391 -4424391 -3877428 -5131659 -4114815 394543 3721911 1764804
7569 1764804 -3413613 -7143955 -7903610 -6800735 -4435651 -1452884 -27860 -1725813
7561 -1725813 -5050610 -7218008 -7211465 -5660336 -3365676 -1513591 -1655507 -3759706 -5594534
7552 -5594534 -5372756 -3743051 -2316708 -1803101 -2174792 -2721326 -1678559 1515459 3434808
7543 3434808 -8103 -6547692 -8642627 -3855720 828301 -1100103 -5995741 -5613724
7535 -5613724 892240 6638640 7017596 3972728 682001 -2316181 -4856318 -5666442 -4578891
7526 -4578891 -3111796 -2247614 -2189887 -3723847 -6600582 -7678097 -4855157 -1784333 -3443015
7517 -3443015 -7594045 -7003841 -814106 3308941 756982 -3098155 -1562081 3713866
7509 3713866 6837494 6656950 5790746 4231744 181935 -4797763 -7368125 -8019846 -9820776
7500 -9820776 -12363254 -12060689 -8118484 -3393718 550116 4558207 8109144 9302869
7492 9302869 8982811 9964251 11502911 9744992 4905384 2379310 4380491 6069090 3612451
7483 3612451 937013 3426318 8947041 11277858 9993340 10138206 12592683 11673417 4286525
7474 4286525 -4018320 -5661893 -426681 5268864 6610011 4648627 3120834 3829787
7466 3829787 5409790 4939631 645687 -5738209 -9560224 -7825973 -3252085 -1975351
7458 -1975351 -6662008 -13577665 -17352461 -16730988 -13952798 -10404309 -5995703 -2100010
7450 -2100010 -1312434 -3387178 -4760454 -3865593 -3870141 -7559538 -12231654 -13256355 -10787816
7441 -10787816 -8660935 -7591421 -4377064 1624795 5999674 5231417 1463785 -1119675
7433 -1119675 -1727980 -2052599 -2211925 -717277 2467225 5182506 5096903 1446071 -4312713
7424 -4312713 -8972281 -10180356 -8969430 -7791301 -6372186 -3083371 -405462 -3332294
7416 -3332294 -10271290 -12127483 -5097661 1972851 69012 -5712385 -4186544 3035927
7408 3035927 3031634 -7490642 -15519870 -10846423 -704060 2504023 -711372 -1140889 2763789
7399 2763789 4159053 1113337 -439068 2269963 4528601 3354069 2653888 5302088
7391 5302088 7135632 4019965 -537190 -759668 2196181 2708406 129906 -786264 1518105
7382 1518105 2702985 -101333 -3539732 -3531105 -1589493 -1938539 -4758371 -6306664 -4696169
7373 -4696169 -1773672 514766 1901362 1433566 -2733677 -9345880 -13274672 -11606235
7365 -11606235 -7901923 -7013435 -7894063 -5979790 -1417807 472825 -2617414 -6690275
7357 -6690275 -8167031 -8962499 -11731966 -14304176 -13129215 -9379615 -7097303 -7123180 -7212938
7348 -7212938 -6795870 -7141984 -7586864 -6062048 -3191021 -1697201 -1818518 -1463004 -765649
7339 -765649 -1754287 -3222054 -1340726 3342112 5115425 1664652 -2019717 -1635731 -281631
7330 -281631 -2671813 -7159649 -9083796 -8633132 -9152938 -9890735 -7161711 -1967734 196186
7321 196186 -2162093 -4113460 -1964224 1681736 2590213 516917 -1958023 -2844955 -1318617
7312 -1318617 1798316 2714611 -2367778 -11072679 -15520324 -11761630 -5095296 -3188074
7304 -3188074 -7155968 -12480924 -15484286 -15259231 -12086389 -8003643 -6634924 -8481209
7296 -8481209 -8800665 -4559751 -817498 -4367138 -12685049 -16017045 -10504447 -2426973
7288 -2426973 1958612 3945420 6697465 8335299 5760417 1132123 -1158736 -1632075
7280 -1632075 -4321768 -9200879 -11324259 -8186261 -3502234 -1808301 -2497524 -1820966 1031693
7271 1031693 2918067 1704761 -462460 -328968 1635731 1915041 -980616 -4802944 -7397130
7262 -7397130 -9190764 -10392657 -9162935 -5543784 -3959403 -7269369 -10693773 -7305864
7254 -7305864 1618309 7965674 8217720 6599659 6003087 3639713 -1297213 -3343015 813454
7245 813454 5960219 6272358 4096282 4336141 5162175 2195978 -1835270 -536300 4893411
7236 4893411 6701696 2738684 -686960 837892 4026180 4326360 1905865 -764600
7228 -764600 -1949594 130909 5803548 10609526 9185141 3565854 1376375 4350829
7220 4350829 5716135 1451779 -3376275 -3621633 -2366321 -4666780 -8753431 -9838331
7212 -9838331 -8479363 -8702660 -10626691 -10915634 -8762057 -6364199 -4864507 -3923567 -3714052
7203 -3714052 -3876789 -2718154 -702578 -1641828 -6564808 -9975696 -7062428 -1300323 662895
7194 662895 -1341471 -2762468 -3189619 -6135050 -11016648 -12707624 -9490931 -5091821 -2127153
7185 -2127153 474489 2716306 2260929 -615090 -2362257 -2102598 -2850795 -5011950 -4392747
7176 -4392747 456866 4230019 2069665 -3341136 -6019098 -4829992 -3165845 -2750501
7168 -2750501 -2203495 -1013784 -1090321 -3594130 -6383800 -5869751 -1236367 3697727 3934824
7159 3934824 -733446 -4955854 -4872234 -3756237 -7019283 -13226651 -15398884 -11460535 -7684781
7150 -7684781 -9552727 -14035692 -14431352 -9516088 -4135090 -2594949 -4730859 -7684063
7142 -7684063 -9206173 -9268449 -9215613 -9136783 -7074131 -2645658 220023 -1959839 -5712350
7133 -5712350 -4179933 2524327 6695828 4461277 1155541 1872020 3323825 649091
7125 649091 -3300982 -2703767 925679 1084664 -2786257 -4576523 -1791190 640902 -1549968
7116 -1549968 -6014741 -8267200 -7500619 -5475489 -3344271 -2065891 -3025592 -5868164 -7900770
7107 -7900770 -7507880 -6231371 -6043555 -6681981 -7216047 -8100241 -9705366 -10465088 -8610629
7098 -8610629 -4828866 -1468505 236494 695773 329943 -950306 -2564143 -2879287 -805215
7089 -805215 2565225 4671788 4235960 2766588 2441518 2928168 2010351 -482300 -1751168
7080 -1751168 -245478 1619091 1168624 -154112 900381 4117257 6218275 5713636 3866958
7071 3866958 1360240 -2080733 -4762018 -4139641 -1761457 -2594053 -7600337 -11380681 -9959644
7062 -9959644 -6775700 -7060563 -9698042 -9556767 -5797564 -2657802 -2784808 -4649262 -6452693
7053 -6452693 -7918474 -7809655 -4386823 579040 2833941 2221743 3413929 7661487 9043067
7044 9043067 3238645 -4368960 -5302522 -18492 3291810 899790 -2419727 -2306441 -927071
7035 -927071 -1457025 -2361694 -1457933 -1297560 -5346117 -11341444 -13544688 -10597235 -6897741
7026 -6897741 -6553719 -9457684 -13004949 -14439554 -11769093 -5564144 136928 1597606
7018 1597606 2204 -396186 1682824 3534152 3207573 1627843 -243730 -2601478 -4427843
7009 -4427843 -3629292 -666539 1359757 1284142 895833 345904 -2983979 -8953443 -12692882
7000 -12692882 -11506136 -9519409 -11081602 -13124586 -9647744 -1636083 3641621 2916082
6992 2916082 776738 2106169 5495220 6505649 4009858 437149 -2277440 -4174328
6984 -4174328 -5321504 -4694229 -1796688 1435564 1589835 -2554331 -7808234 -9536805 -7057239
6975 -7057239 -4366311 -4890921 -7551494 -9130053 -8254289 -5341894 -1055357 2672505 2387510
6966 2387510 -2666768 -7607997 -7006946 -2187485 349662 -2458061 -7122029 -9523954
6958 -9523954 -9987490 -10897829 -12353546 -12316716 -9447945 -4416601 484719 2598172 1232582
6949 1232582 -1173468 -1899896 -1554160 -2418439 -3701340 -2062661 2550180 5529146 3860492
6940 3860492 308980 -1104910 -811304 -1727352 -3843292 -4501770 -3098813 -1919782 -2109939
6931 -2109939 -1701017 1326303 5685121 7565779 4342383 -2643190 -8707327 -9693611 -5799292
6922 -5799292 -1160944 569449 -754116 -3415151 -6537581 -9553085 -10536965 -7791585
6914 -7791585 -3075110 -860395 -3248520 -6958700 -6910376 -2623776 391731 -3186024 -11333484
6905 -11333484 -15662812 -10811738 -1244707 3781845 1151434 -3687783 -5430328 -5545758
6897 -5545758 -7640004 -10090515 -8126393 -1765953 3360498 3613710 1578875 1232917 2406040
6888 2406040 2439458 816373 -819217 -1933192 -3410691 -4884802 -4562946 -2594753 -2511818
6879 -2511818 -7408645 -15266053 -19914105 -17381274 -10321982 -5017113 -4461624 -6057004
6871 -6057004 -6338271 -5657850 -6266146 -7400782 -5612484 -231659 4563076 4721947 1310553
6862 1310553 -1379884 -1291424 -62129 219530 -419684 -701014 -222256 -334435 -2995877
6853 -2995877 -8022901 -11546374 -9408304 -3217161 -225089 -4460542 -10446833 -9831901
6845 -9831901 -2653664 3181361 3231110 1235636 1153795 916011 -2150524 -5012922 -3434315
6836 -3434315 647183 1860879 -529572 -2546348 -1940525 426853 4207872 8898733
6828 8898733 10552394 5639776 -1704619 -3131861 1947167 4784753 193337 -5988870
6820 -5988870 -6490217 -3245199 -2588227 -4804447 -5448499 -3987384 -3912483 -5601059 -5905112
6811 -5905112 -4747309 -5749895 -9270514 -10543323 -6834243 -1776090 49180 -815243
6803 -815243 -949652 376548 1139189 653682 705509 2515565 4449679 3614052 -550527
6794 -550527 -4867788 -5508513 -2661021 -618642 -2138649 -4523510 -3508135 438854 2839766
6785 2839766 1660659 -418958 -584464 581368 1404255 2175300 3957250 6045700 6479070
6776 6479070 4326846 425720 -3504797 -5938344 -6461030 -5827702 -4451363 -1464084 3207318
6767 3207318 6592203 5119172 -478838 -5303434 -6062605 -4261792 -2764367 -1991065 -1312892
6758 -1312892 -1660250 -4000076 -6693593 -7246929 -6137819 -6233880 -8270162 -9393461 -7276787
6749 -7276787 -3886920 -3316117 -6427775 -9587741 -9302500 -6462128 -4328784 -3423390 -1219084
6740 -1219084 2914877 5872328 5721162 5272389 7465333 9674521 7273579 1808113 179256
6731 179256 4843837 9963405 9604719 5323074 2147125 585875 -2743843 -8309039 -12235912
6722 -12235912 -11746572 -8394450 -5261186 -3833396 -4509365 -7476684 -11349521 -12719079
6714 -12719079 -9313453 -3330665 -179 -2249979 -7418835 -9811701 -6435781 109823
6706 109823 4411353 3502939 -707770 -3663472 -2386472 1990157 5364314 4773117 1717940
6697 1717940 454737 2375281 3763639 905323 -4144623 -5906479 -2999752 271542
6689 271542 429821 -828163 -672413 -149707 -1869567 -4706404 -4696376 -970415 2464179
6680 2464179 1715295 -2340404 -5445352 -4755788 -1347309 1458370 1669446 538028 702536
6671 702536 2453214 3053141 688253 -2336374 -2471307 -299344 -148273 -3729877 -7091849
6662 -7091849 -5939963 -1847142 -120874 -2444607 -5254914 -5944497 -6889697 -10802985 -14754306
6653 -14754306 -12777866 -4000574 5324497 8635283 5229101 -1201714 -7196027 -10692351
6645 -10692351 -10044851 -5112536 1208511 5051247 5356351 3982158 2207321 -934874
6637 -934874 -6223538 -11609570 -13332445 -9722761 -3390801 890370 753840 -1776381 -3365547
6628 -3365547 -3421901 -3575181 -4103843 -3643519 -2447426 -2703519 -4585097 -5126399 -2765380
6619 -2765380 -184834 -557855 -3511644 -6857478 -9530824 -10550680 -8385210 -4509864
6611 -4509864 -4254105 -9935134 -15878590 -14940171 -7892788 -1645951 -131386 -1938527 -4938712
6602 -4938712 -7440278 -6319446 -468961 4740282 3201283 -2109551 -2313804 4151887
6594 4151887 9437433 8584882 5341160 3012542 -1518428 -9770785 -15681895 -14089958
6586 -14089958 -8863509 -5967119 -4271072 -643850 1273035 -3473808 -10469664 -10713170
6578 -10713170 -4957575 -3482258 -10418595 -17191596 -14743754 -5277155 2235488 3049145
6570 3049145 -935901 -5720796 -7894805 -5455056 -11195 3196313 671773 -4855882
6562 -4855882 -7866951 -6919281 -5315133 -5603898 -6745038 -7294138 -8142742 -9944008 -10049525
6553 -10049525 -5309122 2584433 7859131 7469399 4121609 1238264 -1607994 -5483056
6545 -5483056 -7640148 -4925889 45269 1305805 -2111367 -5195564 -4827040 -3657295
6537 -3657295 -4793095 -7240248 -8512635 -7619885 -3737579 3523427 10330960 10132013 2336538
6528 2336538 -4912945 -4537951 848814 4156578 3610372 2370580 1854775 1269725 1600585
6519 1600585 4282412 7134321 6923598 5077347 5690650 8454700 8834883 5406520 2019721
6510 2019721 1837075 3531776 4550482 4490986 3927276 2768402 1000379 -885972 -2586066
6501 -2586066 -3506581 -2333866 773081 2777580 1405929 -1012762 -662600 1944746 3043559
6492 3043559 1517882 -537944 -2479252 -5436515 -7892337 -6182374 -726848 2938509
6484 2938509 1320685 -2802528 -5241022 -5543208 -4906026 -2824810 673293 2252300 -1182991
6475 -1182991 -7242585 -9805147 -6042992 559559 4287951 2616105 -2484438 -7006799
6467 -7006799 -8017726 -5354389 -1448965 377987 -1581193 -5571257 -7350831 -4402781
6459 -4402781 741622 2992713 807449 -2267196 -2838280 -1763133 -1350601 -1315255 -470622
6450 -470622 -389366 -3644851 -9099315 -12337038 -11031587 -7463198 -5414224 -6219305 -7790260
6441 -7790260 -6366949 -233 8524611 13536448 12572865 8876021 6378840 4866280
6433 4866280 2582148 742256 1630397 4151552 5333011 4893919 4332905 2765152 -1768842
6424 -1768842 -7307518 -8811069 -4505327 2097244 6719512 7720595 5305778 1028321
6416 1028321 -1771081 -621730 2395790 2641739 -1018072 -4985392 -6061534 -5016667
6408 -5016667 -4550375 -6002306 -8462614 -9470912 -6901112 -1664727 2427837 3042230 1938731
6399 1938731 1542866 1300270 -310014 -2930007 -6097718 -10518103 -14528143 -13506073 -6937931
6390 -6937931 -1460433 -1621531 -2622562 970985 4454837 -18614 -9452010 -13429770
6382 -13429770 -9566199 -4821246 -2284984 1893372 7574390 8277813 2605787 -2479022
6374 -2479022 -3328337 -4707478 -9273172 -11673922 -8070411 -2630433 588189 3551984
6366 3551984 6689165 4485268 -4547037 -11735379 -9878350 -4095061 -3153125 -6139351
6358 -6139351 -6129485 -2144951 963431 1011557 -567891 -3221591 -6223337 -6271286 -2154947
6349 -2154947 1452376 472531 -1994854 -1100243 1922752 3240855 3328435 3966103 2674893
6340 2674893 -2844725 -8543622 -9375362 -7298838 -7033459 -7623187 -5618682 -2952686 -3666271
6331 -3666271 -5952915 -5452364 -3392621 -3320181 -3086358 908773 4679834 1999287 -3589556
6322 -3589556 -3141439 2470362 3462943 -2222835 -5291206 -818385 3817557 1630420 -3008226
6313 -3008226 -2425386 2442973 4660334 1265040 -4549438 -8309071 -8071999 -5791427 -5994297
6304 -5994297 -9908497 -11454043 -4371012 7155998 12095472 7471821 1672004 817333
6296 817333 499809 -4610580 -10898118 -11881328 -8369483 -5764145 -5064932 -3079047 573907
6287 573907 2481158 962745 -1466353 -1329904 2130835 6225443 7234584 4717062 2707175
6278 2707175 4076757 5251262 1274930 -4995062 -5593261 80899 3374760 -359826
6270 -359826 -4648010 -2920265 598178 -1903144 -8817348 -11396851 -6752595 -1305548
6262 -1305548 -1500129 -6583493 -11181683 -11275065 -7019674 -1840161 1161574 2419009 3966837
6253 3966837 4531625 620992 -6478456 -10182213 -7849388 -4947117 -5880226 -6490171 -1769480
6244 -1769480 4007669 2858369 -4109743 -7814108 -4085635 2341011 6562696 8488529
6236 8488529 8150327 3742303 -3033477 -6274573 -4109099 -2311612 -5918529 -11830465
6228 -11830465 -13959467 -11850140 -9426942 -8099562 -6374448 -4697309 -5263307 -7142690
6220 -7142690 -6641652 -3659040 -3161458 -7786791 -12426123 -9941618 -736914 7180409 7636715
6211 7636715 2509219 -2220109 -3500405 -2462705 -1090310 -398356 -854643 -2166833 -3082069
6202 -3082069 -3124606 -3622159 -5167106 -5590509 -3297521 -1165183 -3095787 -7294593 -7843191
6193 -7843191 -3693437 -967946 -4064700 -9193446 -10360019 -8008708 -7090680 -8854028
6185 -8854028 -9568534 -6849780 -2894524 -810844 -913162 -1619863 -1841779 -1588104 -1566225
6176 -1566225 -2585517 -4307415 -4670356 -1853476 3025151 6206831 4681286 -989109
6168 -989109 -7116926 -10102530 -9600046 -8282386 -7919743 -6800699 -2867027 1764592 2789646
6159 2789646 152462 -1532556 -70244 1075372 -1099063 -3899291 -3379172 -827601
6151 -827601 -595824 -3468499 -6290620 -6969867 -6227843 -5267575 -4798772 -5480229 -6845266
6142 -6845266 -7334872 -7598323 -10806359 -16465640 -17953778 -11703956 -5260878 -8411407 -17924217
6133 -17924217 -20106506 -9509974 3692860 8030563 4434741 909331 398987 410834
6125 410834 6911 198306 -176464 -2786511 -5311452 -3947578 303389 2586536 1077647
6116 1077647 -1351826 -2159788 -1734312 -861081 459265 1088709 -753076 -4152675 -5820906
6107 -5820906 -4777538 -3790115 -4893406 -6238327 -5155082 -2201473 -181672 -503006 -2268917
6098 -2268917 -4132110 -5517943 -6358648 -6714151 -6704484 -6439676 -6082241 -5899101 -5936451 -5890061
6088 -5890061 -5612718 -5133726 -3826021 -935258 1975620 944439 -5563496 -12844789 -14173901
6079 -14173901 -8909256 -3398538 -3062453 -6305055 -7628870 -4591904 90452 2092862
6071 2092862 -315432 -4996949 -8199979 -8472376 -7926645 -8680783 -9363839 -7522227 -4352979
6062 -4352979 -3441500 -5000799 -5401778 -2987742 -191606 1086723 1651512 1158658 -2574557
6053 -2574557 -7784247 -7893068 -598663 7174710 8386257 5174174 3157515 1396277
6045 1396277 -3809108 -8618976 -5325053 4048674 7851272 845345 -8450660 -10201362
6037 -10201362 -5717978 -2528863 -2654486 -1720570 3126763 9328383 12038202 8754496
6029 8754496 1887999 -2778485 -2369301 -957175 -3367043 -6168453 -1613997 9009912
6021 9009912 14468994 9205355 1473164 484325 3222242 1613753 -3511040 -5028609
6013 -5028609 -2328189 -1693619 -4954630 -6604152 -3089491 2083569 4035571 1956759
6005 1956759 -2281989 -6588327 -9013542 -9206092 -9269666 -9908358 -7386575 1115103 10807221
5996 10807221 13614182 8429271 1493101 -2762068 -5189027 -6593568 -5763021 -3927333
5988 -3927333 -4911069 -8932429 -11523603 -10300581 -7843714 -6479881 -5401858 -4439072 -5224393
5979 -5224393 -6744594 -5203862 -499529 2603660 2081587 1672946 3486878 3779121 121780
5970 121780 -3169280 -2106139 -541974 -4337725 -11512099 -14744610 -11789613 -7372423
5962 -7372423 -5580125 -5782984 -6111851 -6319004 -6423361 -5948776 -5271263 -5237432 -5108002 -3109636
5952 -3109636 546082 2943319 1407787 -3484308 -7958729 -8276814 -4787368 -2324026
5944 -2324026 -4761155 -9562110 -10467427 -5636481 239851 2429543 876213 -2518491
5936 -2518491 -6672407 -9256351 -6659686 436279 5389010 3514448 -1580980 -3612804
5928 -3612804 -2274366 -1528434 -2104647 -1409619 524417 655269 -1713626 -4002112 -4872414
5919 -4872414 -5338657 -5235084 -3069457 -213147 -902828 -6145697 -10766095 -8776509 -73248
5910 -73248 9544046 13832457 11053170 4893784 1004844 1674394 4028137 4317687 2790666
5901 2790666 2357898 3615330 4307331 3615229 3548088 4889087 4710032 291894 -6064681
$$ [...]
##END NTUPLES=NMR SPECTRUM
##END=
