##TITLE=31Pdec_SR129_rm2
 , 124 sc
 30.6.2022
##JCAMPDX= 6.0         $$ Bruker NMR JCAMP-DX V2.0
##DATA TYPE= NMR SPECTRUM
##DATA CLASS= NTUPLES
##ORIGIN= UXNMR, Bruker Analytische Messtechnik GmbH
##OWNER= root
$$ XWIN-NMR		Version 3.5
$$ Thu Jun 30 14:32:45 2022 Russian Standard Time (UT+4h)  she@DPX200
##.OBSERVE FREQUENCY= 81.013821
##.OBSERVE NUCLEUS= ^31P
##.ACQUISITION MODE= SIMULTANEOUS
##.ACQUISITION SCHEME= undefined
##.AVERAGES= 124
##.DIGITISER RES= 16
##SPECTROMETER/DATA SYSTEM= spect
##.PULSE SEQUENCE= zgpg30
##.SOLVENT NAME= CDCl3
##.SHIFT REFERENCE= (INTERNAL, CDCl3, 0, 248.564)
##AUDIT TRAIL= $$ (NUMBER, WHEN, WHO, WHERE, WHAT)
$$ ##TITLE= Audit trail, XWIN-NMR		Version 3.5
$$ ##JCAMPDX= 5.01
$$ ##ORIGIN= Bruker BioSpin GmbH
$$ ##OWNER= she
$$ F:/spectra/data/she/nmr/P31/1/pdata/1/auditp.txt
$$ ##AUDIT TRAIL=  $$ (NUMBER, WHEN, WHO, WHERE, WHAT)
(   1,<2022-06-30 14:31:16.01 +0400>,<she>,<DPX200>,
      <continue with go, POWCHK disabled, PULCHK disabled
       configuration hash MD5:
       00 E9 B6 7A A2 85 ED C7 34 08 36 98 17 FE 4E 26
       data hash MD5: 32K
       9E 93 6A F2 C8 33 0C 17 74 1F 77 1C 7A AD C4 10>)
(   2,<2022-06-30 14:31:17.96 +0400>,<she>,<DPX200>,
      <Start of raw data processing
       efp BC_mod = 2 LB = 1 FT_mod = 6 PKNL = 1 PHC0 = -10008.35 PHC1 = 337.656 SI = 64K 
       data hash MD5: 64K
       60 BE 4B 1A 0E 8A 3C 28 3D 39 97 E6 DD 10 BB E2>)
(   3,<2022-06-30 14:31:40.35 +0400>,<she>,<DPX200>,
      <pk PHC0 = 71.17007 PHC1 = 0 
       data hash MD5: 64K
       D3 09 28 1D AE 07 2E BB CD 3B E7 80 B4 AB 9D 1D>)
(   4,<2022-06-30 14:32:13.56 +0400>,<she>,<DPX200>,
      <pk PHC0 = 16.39182 PHC1 = -245.2 
       data hash MD5: 64K
       03 B4 5C D6 9A 95 F1 0F 15 74 E1 B3 B3 B8 DA 00>)
(   5,<2022-06-30 14:32:16.82 +0400>,<she>,<DPX200>,
      <abs ABSG = 5 
       data hash MD5: 64K
       20 F3 8C E3 ED 7D DF BC DE A8 5F 75 48 35 1F D3>)
$$ ##END=
$$ 
$$ hash MD5
$$ 49 7E 37 C6 62 83 A7 59 7F 2F 53 A2 94 AD 04 0B
##$RELAX= 
##$RELAX= 
##$RELAX= 
##$RELAX= 
##$RELAX= 
##$RELAX= 
##$RELAX= 
##$RELAX= 
$$ Bruker specific parameters
$$ --------------------------
##$DU= <F:/spectra>
##$EXPNO= 1
##$NAME= <P31>
##$PROCNO= 1
##$TYPE= <nmr>
##$USER= <she>
##$AMP= (0..31)
100 100 100 100 100 100 100 100 100 100 100 100 100 100 100 100 100 100 
100 100 100 100 100 100 100 100 100 100 100 100 100 100 
##$AQSEQ= 0
##$AQ_mod= 1
##$AUNM= <au_zg>
##$AUTOPOS= <>
##$BF1= 81.014009
##$BF2= 200.13
##$BF3= 200.13
##$BF4= 200.13
##$BF5= 200.13
##$BF6= 200.13
##$BF7= 200.13
##$BF8= 200.13
##$BYTORDA= 1
##$CFDGTYP= 0
##$CFRGTYP= 5
##$CHEMSTR= <none>
##$CNST= (0..31)
1 1 145 1 1 1 1 1 1 1 1 1 1 1 1 1 1 1 1 1 1 1 1 1 1 1 1 1 1 1 1 1 
##$CPDPRG= <waltz16>
##$CPDPRG1= <>
##$CPDPRG2= <waltz16>
##$CPDPRG3= <>
##$CPDPRG4= <mlev>
##$CPDPRG5= <mlev>
##$CPDPRG6= <mlev>
##$CPDPRG7= <mlev>
##$CPDPRG8= <mlev>
##$CPDPRGB= <>
##$CPDPRGT= <>
##$D= (0..31)
0 1 0 0 0 0 0 0 0 0 0 0.03 2e-05 3e-06 0 0 0 0 0 0 0 0 0 0 0 0 0 0 0 0 
0 0 
$$ [...]
##$SUBNAM3= <"">
##$SUBNAM4= <"">
##$SUBNAM5= <"">
##$SUBNAM6= <"">
##$SUBNAM7= <"">
##$SUBNAM8= <"">
##$SUBNAM9= <"">
##$SW= 501.771253377433
##$SWIBOX= (0..15)
0 1 3 0 0 0 0 0 0 0 0 0 0 0 0 0 
##$SW_h= 40650.406504065
##$TD= 32768
##$TD0= 1
##$TE= 0
##$TE2= 300
##$TE3= 300
##$TEG= 300
##$TL= (0..7)
0 120 53 12 22 120 120 120 
##$TP= (0..7)
150 150 150 150 150 150 150 150 
##$TP07= 0
##$TPNAME0= <>
##$TPNAME1= <>
##$TPNAME2= <>
##$TPNAME3= <>
##$TPNAME4= <>
##$TPNAME5= <>
##$TPNAME6= <>
##$TPNAME7= <>
##$TPOAL= (0..7)
0.5 0.5 0.5 0.5 0.5 0.5 0.5 0.5 
##$TPOFFS= (0..7)
0 0 0 0 0 0 0 0 
##$TUNHIN= 0
##$TUNHOUT= 0
##$TUNXOUT= 0
##$USERA1= <user>
##$USERA2= <user>
##$USERA3= <user>
##$USERA4= <user>
##$USERA5= <user>
##$V9= 5
##$VALIST= <valist>
##$VCLIST= <CCCCCCCCCCCCCCC>
##$VD= 0
##$VDLIST= <DDDDDDDDDDDDDDD>
##$VPLIST= <PPPPPPPPPPPPPPP>
##$VTLIST= <TTTTTTTTTTTTTTT>
##$WBST= 1024
##$WBSW= 4
##$XGAIN= (0..3)
0 0 0 0 
##$XL= 0
##$YL= 0
##$YMAX_a= 24551
##$YMIN_a= -51696
##$ZGOPTNS= <>
##$ZL1= 120
##$ZL2= 120
##$ZL3= 120
##$ZL4= 120
##$ABSF1= 248.5645
##$ABSF2= -253.2056
##$ABSG= 5
##$ABSL= 3
##$ALPHA= 0
##$AQORDER= 0
##$ASSFAC= 0
##$ASSFACI= 0
##$ASSFACX= 0
##$ASSWID= 0
##$AUNMP= <proc_1d>
##$AZFE= 0.1
##$AZFW= 0.5
##$BCFW= 0
##$BC_mod= 2
##$BYTORDP= 0
##$COROFFS= 0
##$CY= -3
##$DATMOD= 1
##$DC= 0
##$DFILT= <>
##$DTYPP= 0
##$F1P= 0
##$F2P= 0
##$FCOR= 1
##$FTSIZE= 65536
##$FT_mod= 6
##$GAMMA= 0
##$GB= 0
##$INTBC= 1
##$INTSCL= 5.30512e-09
##$ISEN= 30
##$LB= 1
##$LEV0= 0
##$LPBIN= 0
##$MAXI= 10000
##$MC2= 0
##$MEAN= 0
##$ME_mod= 0
##$MI= 50
##$NCOEF= 0
##$NC_proc= -7
##$NLEV= 6
##$NOISF1= 182.463
##$NOISF2= 159.3651
##$NSP= 0
##$NTH_PI= 0
##$NZP= 0
##$OFFSET= 248.5645
##$PC= 4
##$PHC0= -9920.788
##$PHC1= 92.45601
##$PH_mod= 1
##$PKNL= yes
##$PPARMOD= 0
##$PSCAL= 0
##$PSIGN= 0
##$REVERSE= no
##$SF= 81.014009
##$SI= 65536
##$SIGF1= 159.3651
##$SIGF2= -187.1042
##$SINO= 113.3802
##$SIOLD= 16384
##$SREGLST= <1H.CDCl3>
##$SSB= 0
##$STSI= 65536
##$STSR= 0
##$SW_p= 40650.406504065
##$SYMM= 0
##$S_DEV= 0
##$TDeff= 32768
##$TDoff= 0
##$TI= <>
##$TILT= no
##$TM1= 0
##$TM2= 0
##$TOPLEV= 0
##$USERP1= <user>
##$USERP2= <user>
##$USERP3= <user>
##$USERP4= <user>
##$USERP5= <user>
##$WDW= 1
##$XDIM= 65536
##$YMAX_p= 372345790
##$YMIN_p= -426367633
$$ End of Bruker specific parameters
$$ ---------------------------------
##NTUPLES= NMR SPECTRUM
##VAR_NAME=  FREQUENCY,     SPECTRUM/REAL,   SPECTRUM/IMAG
##SYMBOL=    X,             R,               I
##VAR_TYPE=  INDEPENDENT,   DEPENDENT,       DEPENDENT
##VAR_FORM=  AFFN,          ASDF,            ASDF
##VAR_DIM=   65536,         65536,           65536
##UNITS=     HZ,            ARBITRARY UNITS, ARBITRARY UNITS
##FACTOR=    0.620285442955139, 1,           1
##FIRST=     20137.2065510759, 0,            0
##LAST=      -20513.1999529892, 0,           0
##MIN=       -20513.1999529892, -426367633,  0
##MAX=       20137.2065510759, 372345790,    0
$$ Real data points
##PAGE= N=1
##DATA TABLE= (X++(R..R)), XYDATA
$$ [...]
$$ plain form
42639 6469095 10152554 11638729 10134643 8583480 9894025 13135825 14799076 13549767
42631 13549767 12351439 14964643 20767922 24379619 21242641 12918407 5674524 3983424
42623 3983424 6586499 8982921 8323089 5202023 1870090 -106036 -682584 -547022 342337
42614 342337 2990298 7396531 10844131 9824341 4189378 -1898775 -3977028 -1498786
42606 -1498786 2365099 4222601 3246238 1311659 988798 2953993 5149923 4918530 1906005
42597 1906005 -1586025 -2822302 -907497 2220671 2697580 -1460494 -6408335 -5243577
42589 -5243577 2697213 8574816 4673413 -4263102 -6705818 -308150 5464755 3746624
42581 3746624 -912866 -1839228 -786075 -2981038 -6966522 -6668907 -908715 5575727
$$ packed form
42639F469095L683459J486175j504086j551163J310545L241800J663251j249309
42631A3549767j198328K613204N803279L611697l136978q324234p243883j691100
42623C983424K603075K396422o59832l121066l331933j976126n76548J35562Q89359
42614C42337K647961M406233L447600j019790n634963o088153k078253K478242
42606a498786L863885J857502r76363j934579l22861J965195K195930k31393l012525
42597A906005l492030j236277J914805L128168M76909m158074m947841J164758
42589e243577P940790N877603l901403q936515k442716O397668N772905j718131
42581C746624m659490r26362J053153k194963l985484K97615N760192O484442
$$ plain form
42573 5575727 9051225 9240023 6252663 567586 -4531623 -5455014 -3226485 -2037182
42565 -2037182 -3336832 -4833426 -4433015 -1812462 2443265 5868377 4699624 -323713
42557 -323713 -1749673 5350806 14825243 17207855 13753072 14001000 20119029 23590374
42549 23590374 19129757 12086530 8327130 5873056 1988309 514497 5190904 11828083
42541 11828083 14372129 13888227 14313091 13745021 8246607 1329518 704366 6387793 10429767
42532 10429767 9188150 8083328 11873746 17058835 18027306 16147994 18080946 27036243
42524 27036243 39238415 48405220 51490149 50160930 47941019 46264759 43478791 37901369
42516 37901369 30865538 25448798 22795779 21151810 18167305 12951905 6546458 1728747
$$ packed form
42573E575727L475498J88798k987360n685077n099209r23391K228529J189303
42565b037182j299650j496594M00411K620553M255727L425112j168753n023337
42557c23713j425960P100479R474437K382612l454783K47928O118029L471345
42549B3590374m460617p043227l759400k454074l884747j473812M676407O637179
42541A1828083K544046m83902M24864n68070n498414o917089o25152N683427M041974
42532A0429767j241617j104822L790418N185089R68471j879312J932952Q955297
42524B7036243J2202172R166805L084929j329219k219911j676260k785968n577422
42516C7901369p035831n416740k653019j643969k984505n215400o405447m817711
$$ plain form
42508 1728747 1390559 5310076 9375797 9972385 8245269 7736323 8784520 8436151 5693643
42499 5693643 3260543 3116212 3647997 3088530 3107913 6172442 10884271 13191986 12072165
42490 12072165 10956939 12501163 14613503 14015158 11971739 13001147 18109990 23283178
42482 23283178 26061712 29515372 36468707 43329316 44591110 41201800 38488902 36878634
42474 36878634 31791734 23424254 18755756 20689553 22511448 18180836 11779591 10182179
42466 10182179 11517122 8921142 2468415 -1295049 -421357 278863 -1593534 -2613800
42458 -2613800 -781572 1010349 1072453 1948130 4419234 4561206 516680 -3149117 -2237918
42449 -2237918 469589 261819 -1514999 28067 5050535 8520064 7128310 2348428
$$ packed form
42508A728747l38188L919517M065721N96588j727116n08946J048197l48369k742508
42499E693643k433100j44331N31785n59467J9383L064529M711829K307715j119821
42490A2072165j115226J544224K112340n98345k043419J029408N108843N173188
42482B3283178K778534L453660O953335O860609J261794l389310k712898j610268
42474C6878634n086900q367480m668498J933797J821895m330612o401245j597412
42466A0182179J334943k595980o452727l763464Q73692P00220j872397j020266
42458b613800J832228J791921O2104Q75677K471104J41972m044526l665797R11199
42449b237918K707507k07770j776818J543066N022468L469529j391754m779882
$$ plain form
42441 2348428 -2768482 -5882465 -4902335 641810 7199729 9510212 6263421 1054479
42433 1054479 -2699488 -4969090 -6382925 -5491903 -1343408 2950158 2510872 -3062165
42425 -3062165 -8202875 -7696696 -3095377 -549735 -2583791 -4991107 -3276164 655552
42417 655552 1438581 -1674255 -3886955 -2190146 708537 1598936 2111559 5481023 10346778
42408 10346778 11976376 9272753 6784380 8581458 12732243 13792100 9529536 3180531
42400 3180531 -825674 -1543901 -1002685 -356595 1393673 4757422 7935781 8899078 7915262
42391 7915262 6614771 5680745 4882282 4095772 2663024 -581006 -4426500 -4562626 738336
42382 738336 5993523 4420132 -2251200 -5580169 -2543394 619955 -928828 -2761831
$$ packed form
42441B348428n116910l113983R80130N544145O557919K310483l246791n208942
42433A054479l753967k269602j413835Q91022M148495M293566m39286n573037
42425c062165n140710N06179M601319K545642k034056k407316J714943L931716
42417F55552P83029l112836k212700J696809K898683Q90399N12623L369464M865755
42408A0346778J629598k703623k488373J797078M150785J059857m262564o349005
42400C180531m006205p18227N41216O46090J750268L363749L178359R63297r83816
42391G915262j300491r34026p98463p86510j432748l244030l845494j36126N300962
42382G38336N255187j573391o671332l328969L036775L163349j548783j833003
$$ plain form
42374 -2761831 1137861 8068601 10550227 7597959 5212610 6710222 9027594 8915169
42366 8915169 6911592 3946137 -585330 -5179865 -5493118 -470620 4465375 4074427
42358 4074427 488112 -309393 2570886 4266940 2503311 1798118 6827743 14584321
42350 14584321 16978373 10832060 1942896 -1961603 238973 3826337 5790201 7932878
42342 7932878 12047759 15638420 15080618 11218168 8605824 9287626 10100682 7294640 1987919
42333 1987919 -898513 1243319 5391534 6431427 2982778 -1608735 -3635684 -2475019
42325 -2475019 627164 4632827 7787141 7084634 2015550 -2596581 -1682418 2595871
42317 2595871 3255569 -1054617 -3621719 -40049 4737604 4282670 805628 880650 4058547
$$ packed form
42374b761831L899692O930740K481626k952268k385349J497612K317372j12425
42366H915169k003577k965455m531467m594535l13253N022498M935995l90948
42358D074427l586315p97505K880279J696054j763629p05193N029625P756578
42350A4584321K394052o146313q889164l904499K200576L587364J963864K142677
42342G932878M114881L590661n57802l862450k612344O81802Q13056k806042n306721
42333A987919k886432K141832M148215J039893l448649m591513k026949J160665
42325b475019L102183M005663L154314p02507n069084m612131R14163M278289
42317B595871O59698m310186k567102L581670M777653m54934l477042P5022L177897
$$ plain form
42308 4058547 3655533 -1375415 -3449303 2061848 8868509 8235689 1156928 -3664818
42300 -3664818 -2171307 499694 -1458647 -6095414 -6609270 -383716 8136455 13330121
42292 13330121 14336775 13983314 14011137 13854456 13283391 13302584 13968212 13926672 13195362 14048427
42282 14048427 17692226 22209419 25363491 27125661 27582469 25146157 19724768 15082687
42274 15082687 14246083 14512720 11372006 5971177 3652235 5527678 6977196 5367099
42266 5367099 3959450 6030102 9676936 11517157 12066461 13945759 16882761 17764562
42258 17764562 14796244 9522267 5366626 5187754 9064030 13772087 15992043 16373810
42250 16373810 18213275 21779410 23080854 19403021 12891690 7073742 3096532 1346237
$$ packed form
42308D058547m03014n030948k073888N511151O806661o32820p078761m821746
42300c664818J493511K671001j958341m636767n13856O225554Q520171N193666
42292A3330121J006654l53461K7823j56681n71065J9193O65628m1540p31310Q53065
42282A4048427L643799M517193L154072J762170M56808k436312n421389m642081
42274A5082687q36604K66637l140714n400829k318942J875443J449518j610097
42266E367099j407649K070652L646834J840221N49304J879298K937002Q81801
42258A7764562k968318n273977m155641j78872L876276M708057K219956L81767
42250A6373810J839465L566135J301444l677833o511331n817948l977210j750295
$$ plain form
42242 1346237 3103912 7505795 9976073 7445587 2965894 1551027 3367839 4823191
42234 4823191 4760989 5361152 7624335 9924522 10977898 10996779 10031259 8144253 6985482
42225 6985482 8245490 10714107 11559859 10063339 7364647 3518213 -1626518 -5372903
42217 -5372903 -4317129 400592 4354968 6784929 11384887 18673016 22694021 18583175
42209 18583175 9564550 2564983 -372415 -2196061 -4311957 -4623655 -1952155 1643029
42201 1643029 4121972 6137013 8657420 9844252 6858917 647610 -3429871 -1332344
42193 -1332344 4428828 7638336 6437065 5620472 9575367 15997143 19457828 18661620
42185 18661620 16253625 13493867 10353345 9905029 16068098 25744627 29631154 23996596
$$ packed form
42242A346237J757675M401883K470278k530486m479693j414867J816812J455352
42234D823191o2202O00163K263183K300187J053376J8881r65520j887006j158771
42225F985482J260008K468617Q45752j496520k698692l846434n144731l746385
42217e372903J055774M717721L954376K429961M599958P288129M021005m110846
42209A8583175r018625o999567k937398j823646k115896l11698K671500L595184
42201A643029K478943K015041K520407J186832k985335o211307m077481K097527
42193a332344N761172L209508j201271q16593L954895O421776L460685p96208
42185A8661620k407995k759758l140522m48316O163069R676529L886527n634558
$$ plain form
42177 23996596 16173013 14167411 15740537 13500168 7331367 4739623 9530610 16391169
42169 16391169 18065034 13665339 8181058 6445399 8937070 11991845 11637753 8032237
42161 8032237 5232702 5536905 6297380 4703055 2962161 4563036 7415503 6305227
42153 6305227 1771475 475778 5276786 10525750 10272518 6747476 6595024 11335149
42145 11335149 15770910 14945256 9333358 3068914 -659525 -1769630 -1864868 -1415660 901023
42136 901023 5334022 8677712 7148754 1649036 -2423488 -1431812 2565665 4963718
42128 4963718 3623635 -97348 -3135689 -2463409 2812382 9716304 13494361 12607541
42120 12607541 10124091 9500717 10986498 12879350 13931279 13498105 11682939 10266084
$$ packed form
42177B3996596p823583k005602J573126k240369o168801k591744M790987O860559
42169A6391169J673865m399695n484281j735659K491671L054775l54092l605516
42161H032237k799535L04203P60475j594325j740894J600875K852467j110276
42153F305227m533752j295697M801008N248964k53232l525042j52452M740125
42145A1335149M435761q25654n611898o264444l728439j110105r5238M49208K316683
42136I01023M432999L343690j528958n499718m072524R91676L997477K398053
42128D963718j340083l720983l038341O72280N275791O903922L778057q86820
42120A2607541k483450o23374J485781J892852J051929m33174j815166j416855
$$ plain form
42112 10266084 10885002 11553344 8458275 2494496 -203573 3289924 7948365 8074559
42104 8074559 5390498 5082686 6946845 6496241 3470473 2950937 7463942 13334006 16593520
42095 16593520 18345119 21887817 27278719 31151269 30617009 25841971 19630140 15446411
42087 15446411 15281246 18628784 23159175 26121170 25855622 23611411 23577615 28547117 35277233
42078 35277233 37375238 33465521 28321050 24531611 18693092 9358313 2753379 4359005
42070 4359005 9317579 8858579 3405128 922906 3609670 5268048 2623379 483047
42062 483047 2923730 6768743 7502249 5634088 3319106 -179205 -5459419 -9396427
42054 -9396427 -8543445 -3452747 2880806 7904333 9176712 5266576 -668644 -2285065
$$ packed form
42112A0266084O18918O68342l095069n963779k698069L493497M658441J26194
42104H074559k684061l07812J864159m50604l025768n19536M513005N870064L259514
42095A6593520J751599L542698N390902L872550n34260m775038o211831m183729
42087A5446411j65165L347538M530391K961995k65548k244211l3796M969502O730116
42078C5277233K098005l909717n144471l789439n838519r334779o604934J605626
42070D359005M958574m59000n453451k482222K686764J658378k644669k140332
42062D83047K440683L845013P33506j868161k314982l498311n280214l937008
42054i396427Q52982N090698O333553N023527J272379l910136n935220j616421
$$ plain form
42046 -2285065 2220022 7424697 8101765 5359985 2978534 2099233 2601474 5231556 8700286
42037 8700286 8914346 5123948 2789061 5908916 10308359 9506061 4032541 -336125
42029 -336125 -1089739 -441419 -56397 674013 2061274 3780535 5977919 7607258 5800678
42020 5800678 357394 -3749846 -2493563 1048339 1230724 -1615334 -2144580 1926360
42012 1926360 7435195 10542093 9831184 5746639 629318 -2011826 -1540508 -1537645 -4050197
42003 -4050197 -5678729 -3278422 319737 1332506 1716742 4613800 7037540 4704700
41995 4704700 992086 2447692 7455987 8567381 5030182 3355622 5417320 5968364
41987 5968364 3282350 2364339 5084855 6559421 4600665 3631174 5280669 4285237 -1106001
$$ packed form
42046b285065M505087N204675O77068k741780k381451q79301N02241K630082L468730
42037H700286K14060l790398k334887L119855M399443q02298n473520m368666
42029c36125p53614O48320L85022P30410J387261J719261K197384J629339j806580
42020E800678n443284m107240J256283L541902J82385k846058n29246M070940
42012A926360N508835L106898p10909m084545n117321k641144M71318K863k512552
42003d050197j628532K400307L598159J012769L84236K897058K423740k332840
41995D704700l712614J455606N008295J111394l537199j674560K061698N51044
41987E968364k686014r18011K720516J474566j958756r69491J649495r95432n391238
$$ plain form
41978 -1106001 -3435569 2652217 10858598 12288935 8105680 5895619 8368019 12762135
41970 12762135 17326975 21503841 23191919 22315664 23821543 30901005 38652354 41068303
41962 41068303 41119967 46684383 58707222 70504133 77151882 78681735 75426157 67538047
41954 67538047 58718348 53507028 50713506 45868509 40146211 39916900 46516237 53305111
41946 53305111 54846222 52738425 49772885 44344609 34659360 23952924 17014963 14211138
41938 14211138 12696525 11540029 12134911 14657627 17144615 17816451 16294537 12752966
41930 12752966 7657976 2760178 1193831 5252534 13286940 19491540 18936177 13705946
41922 13705946 11815465 18008213 27493975 31535223 27765195 21551003 17944980 16367614
$$ packed form
41978a106001k329568O087786Q206381J430337m183255k210061K472400M394116
41970A2762135M564840M176866J688078q76255J505879P079462P751349K415949
41962D1068303N1664N564416J2022839J1796911O647749J529853l255578p888110
41954F7538047q819699n211320k793522m844997n722298k29311O599337O788874
41946E3305111J541111k107797k965540n428276r685249j0706436o937961k803825
41938A4211138j514613j156496N94882K522716K486988O71836j521914l541571
41930A2752966n094990m897798j566347M058703Q034406O204600n55363n230231
41922A3705946j890481O192748R485762M041248l770028o214192l606023j577366
$$ plain form
41914 16367614 13900912 10227400 7511302 7533457 10395273 14565554 17288512 16441871
41906 16441871 12917812 9938774 9213173 8829837 5855432 487675 -3147597 -767417
41898 -767417 7073620 14182470 14461674 8720009 3846416 4620794 8935697 12300639 13561438
41889 13561438 13431914 10923982 5840795 2572673 5925903 13683999 18418507 17052041
41881 17052041 13888986 13308048 14254031 13954397 12966936 13575790 15759451 17524064 17892238
41872 17892238 17702833 18347824 20705683 24489451 28520244 32830548 39897410 51736079
41864 51736079 66420045 80198420 92549710 105794636 119766935 130518335 134712011
41857 134712011 131768427 121562754 104507121 84813242 68781280 57952755 48429502
$$ packed form
41914A6367614k466702l673512k716098K2155K861816M170281K722958q46641
41906A6441871l524059k979038p25601l83336k974405n367757l635272K380180
41898g67417P841037P108850K79204n741665m873593P74378M314903L364942J260799
41889A3561438j29524k507932n083187l268122L353230P758096M734508j366466
41881A7052041l163055n80938R45983k99634r87461O08854K183661J764613L68174
41872A7892238j89405O44991K357859L783768M030793M310304P066862J1838669
41864E1736079J4683966J3778375J2351290J3244926J3972299J0751400M193676
41857A34712011k943584j0205673j7055633j9693879j6031962j0828525r523253
$$ plain form
41850 48429502 38734522 32846428 32390027 31785105 26349470 20301586 20078998 23170834
41842 23170834 21342830 13678917 8574473 11776525 19136787 23529666 23597029 22714914
41834 22714914 23450283 26214362 30419964 34089606 34606933 32281005 30993183 33000060
41826 33000060 35359650 34209974 30488856 28008571 27190507 24611483 18785283 12869297
41818 12869297 10526933 11626477 13361172 13716915 12439467 10149050 8167411 8212701
41810 8212701 10584844 13197145 13976010 13918442 16037622 20955628 25108632 24396230 18920282
41801 18920282 13082307 11083286 13031795 15601196 15807756 13386716 9712507 5920389
41793 5920389 3271331 4006565 8959360 14101813 12959410 4580866 -3839037 -5518952
$$ packed form
41850D8429502r694980n888094m56401o04922n435635o047884k22588L091836
41842B3170834j828004p663913n104444L202052P360262M392879O7363q82115
41834B2714914P35369K764079M205602L669642N17327k325928j287822K006877
41826C3000060K359590j149676l721118k480285q18064k579024n826200n915986
41818A2869297k342364J099544J734695L55743j277448k290417j981639M5290
41810H212701K372143K612301P78865n7568K119180M918006M153004p12402n475948
41801A8920282n837975j999021J948509K569401K06560k421040l674209l792118
41793E920389k649058P35234M952795N142453j142403q378544q419903j679915
$$ plain form
41785 -5518952 -2685881 -2029800 -3572932 -799261 7647689 13875833 11841100 6150693
41777 6150693 4334475 5310045 2611843 -3833332 -7076090 -3853785 1337593 4015923
41769 4015923 5154613 6697289 7228218 5246734 2555310 1321297 1142951 1608913 4181387
41760 4181387 8547127 10632420 8097645 5148160 7718656 15504090 22609279 24949170
41752 24949170 23309116 19869132 15653086 11802692 10104476 10896686 12018974 10681419
41744 10681419 5978068 86923 -2563322 1034160 8339940 12789842 11447463 9056635
41736 9056635 11705131 18616589 24343303 27817287 33924569 45273068 57246850 63661910
41728 63661910 63831507 61158122 57429184 52061829 45610126 40242855 36436672 32078290
$$ packed form
41785e518952K833071O56081j543132K773671Q446950O228144k034733n690407
41777F150693j816218R75570k698202o445175l242758L222305N191378K678330
41769D015923J138690J542676N30929j981484k691424j234013j78346M65962K572474
41760D181387M365740K085293k534775k949485K570496P785434P105189K339891
41752B4949170j640054l439984m216046l850394j698216P92210J122288j337555
41744A0681419m703351n891145k650245L597482P305780M449902j342379k390828
41736I056635K648496O911458N726714L473984O107282J1348499J1973782O415060
41728F3661910J69597k673385l728938n367355o451703n367271l806183m358382
$$ plain form
41720 32078290 26006982 20439923 18145835 18312028 17413852 14241479 11703837 12141161
41712 12141161 12733129 8560945 -91316 -6816328 -6522764 -904636 5118663 9327373
41704 9327373 11857363 11905049 9055218 6201195 6167672 5918151 -305626 -10939603 -15922409
41695 -15922409 -8971760 3264234 8966939 5463489 641027 1005570 3861582 3017103
41687 3017103 -1920114 -5412934 -3581165 1419942 5045524 6069988 7005955 9814424
41679 9814424 13425099 16051073 17978837 20381305 22646400 23141765 22046359 21006557
41671 21006557 20222155 18547347 16445010 15527913 14589871 10053738 2109925 -3665331
41663 -3665331 -3769908 -2074284 -3640791 -6607328 -5542487 -536299 3405600 5128388
$$ packed form
41720C2078290o071308n567059k294088J66193q98176l172373k537642M37324
41712A2141161N91968m172184q652261o725012K93564N618128O023299M208710
41704I327373K529990M7686k849831k854023l3523k49521o223777j0633977m982806
41695a5922409O950649J2235994N702705l503450m822462L64543K856012q44479
41687C017103m937217l492820J831769N001107L625582J024464R35967K808469
41679I814424L610675K625974J927764K402468K265095M95365j095406j039802
41671B1006557p84402j674808k102337r17097r38042m536133p943813n775256
41663c665331j04577J695624j566507k966537J064841N006188L941899J722788
$$ plain form
41655 5128388 8514805 13990888 15741860 10365096 2793398 -105951 2462927 7136010
41647 7136010 11972958 15744349 15362776 9360717 1811707 -1978283 -1997711 -1456516 -439233
41638 -439233 3039830 7229490 7969677 5547571 4408430 5704273 5986965 4303765 4567217
41629 4567217 8779902 13453564 15485300 16425256 17712394 16768138 11997704 7244648
41621 7244648 6464819 7626918 6966758 5930132 7971281 11029999 10051028 5972994 5083724
41612 5083724 8700591 10315743 5623196 -234539 504567 7721324 14067909 14397117
41604 14397117 10601535 7250112 5714693 4139343 1622585 -34011 437068 656241
41596 656241 -2540388 -7418685 -8118800 -2475915 4563776 7915507 9056419 11781884
$$ packed form
41655E128388L386417N476083J750972n376764p571698k899349K568878M673083
41647G136010M836948L771391l81573o002059p549010l789990j9428N41195J017283
41638d39233L479063M189660P40187k422106j139141J295843K82692j683200K63452
41629D567217M212685M673662K031736R39956J287138r44256m770434m753056
41621G244648p79829J162099o60160j036626K041149L058718r78971m078034q89270
41612E083724L616867J615152m692547n857735P39106P216757O346585L29208
41604A4397117l795582l351423j535419j575350k516758j656596M71079K19173
41596F56241l196629m878297p00115N642885P039691L351731J140912K725465
$$ plain form
41588 11781884 14673419 13494403 9038335 6057655 5100615 2362990 -1930253 -2515388
41580 -2515388 1483499 3573802 88739 -3472881 -1473824 2463679 1638300 -2701454
41572 -2701454 -3959066 -978028 1478594 1734154 2957590 5575853 5199044 129663
41564 129663 -4998290 -5828417 -3869690 -2639522 -2132711 -318112 2632590 4617969 4477641
41555 4477641 2696569 774773 785007 3225713 4652165 878622 -6043804 -8126488
41547 -8126488 -1519086 7417781 9894723 5467448 503783 -1665973 -3444980 -6601537
41539 -6601537 -8906543 -8125505 -4889692 -275120 5590404 11118856 13312004 12107845
41531 12107845 11152104 12061471 11383545 6048119 -1294123 -5704509 -6145801 -4787825 -2656422
$$ packed form
41588A1781884K891535j179016m456068k980680r57040k737625m293243n85135
41580b515388L998887K090303l485063l561620J999057L937503q25379m339754
41572b701454j257612K981038K456622K55560J223436K618263l76809n069381
41564A29663n127953q30127J958727J230168N06811J814599K950702J985379j40328
41555D477641j781072j921796J0234K440706J426452l773543o922426k082684
41547h126488O607402Q936867K476942m427275m963665k169756j779007l156557
41539f601537k305006P81038L235813M614572N865524N528452K193148j204159
41531A2107845r55741R09367o77926n335426p342242m410386m41292J357976K131403
$$ plain form
41522 -2656422 -82089 686620 -1752172 -3914301 -1518918 3005462 3087179 -1503185 -3394488
41513 -3394488 971815 5307385 3103229 -2289580 -3016494 1744283 6111334 7024430
41505 7024430 6644236 6173113 4267440 2317426 4655559 11259575 15987371 15199140 13071763
41496 13071763 14387121 16649346 14790353 10434510 9795860 13351494 14494463 9926476
41488 9926476 5453900 8048119 16279476 22762879 23413724 19885266 14658562 9019660
41480 9019660 5800995 8483422 15401272 19359032 16284776 10733575 8980237 9965315
41472 9965315 8362429 4313863 3312700 6540813 8441121 5910947 3398603 5295345
41464 5295345 8887661 9563587 8430555 9371163 12132758 14040671 15615880 18454489
$$ packed form
41522b656422K574333P68709k438792k162129K395383M524380Q1717m590364j891303
41513c394488M366303M335570k204156n392809p26914M760777M367051R13096
41505G024430l80194m71123j905673j950014K338133O604016M727796p88231k127377
41496A3071763J315358K262225j858993m355843o38650L555634J142969m567987
41488I926476m472576K594219Q231357O483403O50845l528458n226704n638902
41480I019660l218665K682427O917850L957760l074256n551201j753338R85078
41472I965315j602886m048566j001163L228113J900308k530174k512344J896742
41464E295345L592316O75926j133032R40608K761595J907913J575209K838609
$$ plain form
41456 18454489 20067507 17506290 14189075 15735098 20142898 20263080 15914020 14421386
41448 14421386 17539331 17667845 11207009 6235090 10075060 16921528 16477095 9472587
41440 9472587 5084335 6135363 6812861 4284352 2893802 5181564 7161009 5884537
41432 5884537 4926614 7893517 11467414 9926935 3621450 -1683647 -2379017 -47375
41424 -47375 2349373 3903875 5055102 5814289 5620000 4112065 1791072 188379 807686
41415 807686 3240736 4954475 3892098 1018445 -570409 890891 3815268 4876350
41407 4876350 2455160 -1614559 -3717156 -1771581 3244829 8794476 13053281 15546428
41399 15546428 16531969 16586543 16244994 15225704 12456581 7723172 2931440 821004 2518306
$$ packed form
41456A8454489J613018k561217l317215J546023M407800J20182m349060j492634
41448A4421386L117945J28514o460836m971919L839970O846468m44433p004508
41440I472587m388252J051028O77498k528509j390550K287762J979445j276472
41432E884537r57923K966903L573897j540479o305485n305097o95370K331642
41424d7375K396748J554502J151227P59187j94289j507935k320993j602693O19307
41415H07686K433050J713739j062377k873653j588854J461300K924377J061082
41407D876350k421190m069719k102597J945575N016410N549647M258805K493147
41399A5546428R85541N4574l41549j019290k769123m733409m791732k110436J697302
$$ plain form
41390 2518306 6865881 11665024 14903827 15492355 13903985 11660820 9278898 5645061
41382 5645061 941168 -962889 3968167 13603926 19859648 17163032 8795386 2542231
41374 2542231 1456857 1894398 224142 -2156385 -1953570 686340 2644424 2335889 1057104
41365 1057104 200552 -359456 -819664 -603817 351789 1284289 2203605 3969577 6173780
41356 6173780 7200477 7459860 9996193 15874629 21112228 20856682 15378870 9476765
41348 9476765 6791794 6873733 7158563 5985815 4228865 4854121 9187469 12924091 9447145
41339 9447145 -528198 -6854774 -1808113 9652339 17033339 18391171 20003697 24071507
41331 24071507 25617347 22211924 18286688 17315454 16922799 14698690 12394828 11318436
$$ packed form
41390B518306M347575M799143L238803N88528j588370k243165k381922l633837
41382E645061m703893j904057M931056R635759O255722k696616q367646o253155
41374B542231j085374M37541j670256k380527K02815K639910J958084l08535j278785
41365A057104q56552n60008m60208K15847R55606R32500R19316J765972K204203
41356F173780J026697K59383K536333N878436N237599k55546n477812n902105
41348I476765k684971Q1939K84830j172748j756950O25256M333348L736622l476946
41339I447145r975343o326576N046661J1460452P381000J357832J612526M067810
41331B4071507J545840l405423l925236r71234l92655k224109k303862j076392
$$ plain form
41323 11318436 9712895 7591240 7723048 8931445 5842465 -891535 -2425606 4721190
41315 4721190 11416646 9650439 5357287 7826799 13306900 11226232 2340743 -2532648
41307 -2532648 -325859 1038340 -1709827 -1143162 7298003 16686354 19363519 17733928
41299 17733928 18000624 19925113 19488522 16812841 14998612 14343886 13280103 12740954 14827901
41290 14827901 18686740 21429463 21796863 20186874 16926596 13103741 11070742 11538437
41282 11538437 12106391 10942446 9602197 9739412 9620840 7072828 3733174 2833757 4251917
41273 4251917 5331399 5637502 7171361 9938332 10809824 7873480 3572519 2091135
41265 2091135 4717166 8803020 10861781 10087731 8836504 9788067 12852386 15174145
$$ packed form
41323A1318436j605541k121655J31808J208397l088980o734000j534071P146796
41315D721190O695456j766207m293152K469512N480101k080668q885489m873391
41307b532648K206789J364199k748167N66665Q441165R388351K677165j629591
41299A7733928K66696J924489m36591k675681j814229o54726j063783n39149K086947
41290A4827901L858839K742723L67400j609989l260278l822855k032999M67695
41282A1538437N67954j163945j340249J37215j18572k548012l339654q99417J418160
41273D251917J079482L06103J533859K766971Q71492k936344m300961j481384
41265B091135K626031M085854K058761p74050j251227R51563L064319K321759
$$ plain form
41257 15174145 14082647 9725924 5095183 3824318 7254721 12802610 15858618 14318348
41249 14318348 10599457 8303380 8242248 9415655 12252169 17750271 23771025 25471978
41241 25471978 20407454 11136794 2123555 -4026279 -6630728 -5420524 -688435 5609210
41233 5609210 10081057 10033501 6123000 2562963 2999861 6023321 7183476 5926534 6790298
41224 6790298 11840131 16240884 15049881 10637683 8541272 9107253 8965935 8305295 10018512
41215 10018512 12894836 12571740 9099256 6927058 7035138 5760582 2432108 1491792
41207 1491792 5110152 9634427 11515711 11517946 11326030 11157226 12032339 14928496 16816638
41198 16816638 13884372 9430635 10775778 16798493 17719488 10582070 5124691 8656167
$$ packed form
41257A5174145j091498m356723m630741j270865L430403N547889L056008j540270
41249A4318348l718891k296077o1132J173407K836514N498102O020754J700953
41241B5471978n064524r270660r013239o149834k604449J210204M732089O297645
41233E609210M471847m7556l910501l560037M36898L023460J160155j256942Q63764
41224F790298N049833M400753j191003m412198k096411N65981j41318o60640J713217
41215A0018512K876324l23096l472484k172198J08080j274556l328474r40316
41207A491792L618360M524275J881284K235j91916j68804Q75113K896157J888142
41198A6816638k932266m453737J345143O022715R20995p137418n457379L531476
$$ plain form
41190 8656167 14471494 12997130 6368055 2841242 3264954 3028508 2457200 4850096 7643736
41181 7643736 6075632 3525149 7566827 16397148 19758487 14353015 8295590 7735358
41173 7735358 8412443 4853048 151790 708064 6284241 11015003 11382731 8448341 3985129
41164 3985129 -1335157 -6286161 -8811613 -8210363 -6194188 -4988439 -4764369 -3765809 -1357260
41155 -1357260 292388 -650106 -1890374 479831 5911842 9853863 10726823 11595887 13593662
41146 13593662 13432299 10173279 8526100 11497019 15530508 17472491 20097201 25026022
41138 25026022 26869218 22001163 16907947 18570837 22047277 18468432 10957210 9938895
41130 9938895 15073198 15795474 10115059 8731640 17209309 26844939 28294486 23291072
$$ packed form
41190H656167N815327j474364o629075l526813M23712k36446n71308K392896K793640
41181G643736j568104k550483M041678Q830321L361339n405472o057425n60232
41173G735358O77085l559395m701258N56274N576177M730762L67728k934390m463212
41164C985129n320286m951004k525452O01250K016175J205749K24070R98560K408549
41155a357260J649648r42494j240268K370205N432011L942021Q72960Q69064J997775
41146A3593662j61363l259020j647179K970919M033489J941983K624710M928821
41138B5026022J843196m868055n093216J662890L476440l578845p511222j018315
41130I938895N134303P22276n680415j383419Q477669R635630J449547n003414
$$ plain form
41122 23291072 17473433 11916110 7752304 9267141 15348335 16791904 9573815 2392333
41114 2392333 3047414 5821656 2156681 -3636149 -1185476 8174347 12836991 8474465
41106 8474465 2889309 2926913 6279059 8140349 8152971 8286424 9586264 12760006 17312486
41097 17312486 19489074 15931853 9716305 7683570 11343541 15654737 17496222 19700995
41089 19700995 24914579 30612073 32975140 31883534 29331864 25844584 21100081 16120485
41081 16120485 12653326 11442918 12112217 13571697 14218005 13267100 12032996 12345629 14073569
41072 14073569 16154706 19296209 24717242 30413102 32030490 28203536 22184169 17333806
41064 17333806 13782212 10655677 8698901 8624147 8899231 7602486 5582860 5649060 8575885
$$ packed form
41122B3291072n817639n557323m163806J514837O081194J443569p218089p181482
41114B392333O55081K774242l664975n792830K450673R359823M662644m362526
41106H474465n585156L7604L352146J861290J2622J33453J299840L173742M552480
41097A7312486K176588l557221o215548k032735L659971M311196J841485K204773
41089A9700995N213584N697494K363067j091606k551670l487280m744503m979596
41081A6120485l467159j210408O69299J459480O46308r50905j234104L12633J727940
41072A4073569K081137L141503N421033N695860J617388l826954o019367m850363
41064A7333806l551594l126535j956776p4754K75084j296745k019626O6200K926825
$$ plain form
41055 8575885 11403853 10528032 6141442 2706884 4311349 10043914 15205020 16732378
41047 16732378 15421699 12803115 8963457 4841183 3437612 6060834 9822583 11761535
41039 11761535 13041436 15627961 17277118 14488803 8997391 6218394 7584299 9329139
41031 9329139 9093869 8812165 10125779 11631077 12172904 12652174 12976222 11368489 8512257
41022 8512257 8182635 11589044 15270822 17036581 19355683 23455106 24917602 20356672
41014 20356672 14702702 15327468 20787384 22249897 16158156 9080267 8297096 12922383
41006 12922383 17028041 17302311 14301175 9384549 4360829 2323491 4901740 9204199
40998 9204199 10774386 9580636 10043862 14573021 20024030 22085183 20926715 20462169
$$ packed form
41055H575885K827968q75821m386590l434558J604465N732565N161106J527358
41047A6732378j310679k618584l839658m122274j403571K623222L761749J938952
41039A1761535J279901K586525J649157k788315n491412k778997J365905J744840
41031I329139k35270k81704J313614J505298N41827M79270L24048j607733k856232
41022H512257l29622L406409L681778J765759K319102M099423J462496m560930
41014B0356672n653970O24766N459916J462513o091741p077889p83171M625287
41006A2922383M105658K74270l001136m916626n023720k037338K578249M302459
40998I204199J570187j193750M63226M529159N451009K061153j158468m64546
$$ plain form
40990 20462169 23448839 29367940 36024432 40939415 41954768 39125963 35739690 34681906
40982 34681906 33975378 29445370 22229967 19065564 22967865 28252025 28671594 26364307
40974 26364307 27071689 29476048 26798238 18619293 13311401 16338415 22544070 23807804
40966 23807804 19465800 14957195 14073858 17237906 24624016 35884776 47749113 55755556
40958 55755556 58023257 55260668 49086977 43055146 42490076 48846333 55824777 55777633
40950 55777633 49338792 44429054 46189580 52299792 58105905 61588851 62409629 60509423
40942 60509423 57414657 55582564 54899497 52551366 47276088 40870476 34991266 30041617
40934 30041617 27943104 31564558 39346352 44558899 42935483 38105877 36565853 39739850
$$ packed form
40990B0462169K986670N919101O656492M914983J015353k828805l386273j057784
40982C4681906p06528m530008p215403l164403L902301N284160M19569k307287
40974B6364307P07382K404359k677810q178945n307892L027014O205655J263734
40966B3807804m342004m508605q83337L164048P386110J1260760J1864337Q006443
40958E5755556K267701k762589o173691o031831n65070O356257O978444m7144
40950E5777633o438841m909738J760526O110212N806113L482946Q20778j900206
40942F0509423l094766j832093o83067k348131n275278o405612n879210m949649
40934C0041617k098513L621454P781794N212547j623416m829606j540024L173997
$$ plain form
40926 39739850 43824171 45227515 43166383 38526446 33052894 28939911 27489449 28923704
40918 28923704 33720434 41614188 48880052 50585321 47134550 44238769 44098202 41768587
40910 41768587 34107623 26942655 27355288 32894850 35466494 33229681 31177870 31559957
40902 31559957 31737253 31335052 33454606 37487941 38159005 33965330 29993478 29827691 30935284
40893 30935284 30904397 31873885 34973787 36261203 32851780 28287896 27166044 28664384
40885 28664384 29838084 30989446 32907074 33061413 30114451 28391357 31788823 36639253
40877 36639253 37363578 36317382 40179729 47998210 51182830 45927993 37971435 33259541
40869 33259541 30882700 28126641 26301202 27290327 28620162 26445782 21108561 16266606
$$ packed form
40926C9739850M084321J403344k061132m639937n473552m112983j450462J434255
40918B8923704M796730P893754P265864J705269l450771k895781j40567k329615
40910D1768587p660964p164968M12633N539562K571644k236813k051811L82087
40902C1559957J77296m02201K119554M033335O71064m193675l971852j65787J107593
40893C0935284l0887R69488L099902J287416l409423m563884j121852J498340
40885B8664384J173700J151362J917628J54339k946962j723094L397466M850430
40877C6639253P24325j046196L862347P818481L184620n254837p956558m711894
40869C3259541k376841k756059j825439R89125J329835k174380n337221m841955
$$ plain form
40861 16266606 14033209 13602533 13586052 13679215 14545469 16956437 20393371 22568621 21692046
40852 21692046 18902162 16776566 16130412 16342772 17516276 19223379 18603764 14131748
40844 14131748 10391625 13625900 22313001 28195724 28046015 27949236 32874323 38169663
40836 38169663 36319849 27634162 18841347 14149791 12814199 13212069 14258771 14220981
40828 14220981 12588418 12003397 14540443 17701663 18225212 18081421 21645633 27811638
40820 27811638 30307287 26310775 20119459 17209236 18418832 21044861 22358644 20981493
40812 20981493 17666370 15632552 17617848 22107128 25012454 25198520 25308927 26783347
40804 26783347 27417026 24920226 20165725 15999036 15180324 19639452 28602045 37018946
$$ packed form
40861A6266606k233397m30676j6481R3163Q66254K410968L436934K175250q76575
40852B1692046k789884k125596o46154K12360J173504J707103o19615m472016
40844A4131748l740123L234275Q687101N882723j49709r6779M925087N295340
40836C8169663j849814q685687q792815m691556j335592L97870J046702l7790
40828A4220981j632563n85021K537046L161220N23549j43791L564212O166005
40820B7811638K495649l996512o191316k910223J209596K626029J313783j377151
40812B0981493l315123k033818J985296M489280K905326J86066J10407J474420
40804B6783347O33679k496800m754501m166689q18712M459128Q962593Q416901
$$ plain form
40796 37018946 39435289 36389839 33474019 33115638 31570842 26014837 20200081 19632860
40788 19632860 24307340 29903265 33906094 36946780 39712344 41950589 43619890 44462360
40780 44462360 43669202 42294741 44161358 51250451 59522645 62641968 59250969 53811844
40772 53811844 50959862 51602760 53651722 53861681 49929243 43579842 40323115 42943772
40764 42943772 46790806 45714523 41390189 41317732 47640139 54086294 55697728 55620651 58855714
40755 58855714 64377165 68272440 71035350 75943582 81861556 83632751 80346761 78573978
40747 78573978 85169735 99252978 113113922 119680433 117681499 110405268 101255076 91464463
40739 91464463 81680562 73874106 69751677 67942871 65561219 63044456 64184387 69577724
$$ packed form
40796C7018946K416343l045450k915820l58381j544796n556005n814756n67221
40788A9632860M674480N595925M002829L040686K765564K238245J669301Q42470
40780D4462360p93158j374461J866617P089093Q272194L119323l390999n439125
40772E3811844k851982O42898K048962K09959l932438o349401l256727K620657
40764D2943772L847034j076283m324334p2457O322407O446155J611434p7077L235063
40755E8855714N521451L895275K762910M908232N917974J771195l285990j772783
40747G8573978O595757J4083243J3860944O566511j998934p276231r150192r790613
40739I1464463r783901p806456m122429j808806k381652k516763J139931N393337
$$ plain form
40731 69577724 73475694 70750632 64670949 63018818 67247645 70692754 68489887 64073481
40723 64073481 62779284 63105328 59275022 50786204 43982494 43247875 45213465 44490049
40715 44490049 41962544 43132247 49300756 55177160 56529337 56164960 59351345 66121165
40707 66121165 72104455 75575570 79308306 85533006 93144529 100407745 106306454 108259478
40699 108259478 103172490 92975187 84631195 81344767 77714365 67665041 53660462
40692 53660462 43159200 38806523 37687133 38003292 39944310 40998405 37611086 32198296
40684 32198296 31633598 36839141 40327479 37055869 31657787 30617787 32485951 31516639
40676 31516639 27559116 26094902 29693610 34828545 37216995 36065017 32569369 27921240
$$ packed form
40731F9577724L897970k725062o079683j652131M228827L445109k202867m416406
40723F4073481j294197L26044l830306q488818o803710p34619J965590p23416
40715D4490049k527505J169703O168509N876404J352177l64377L186385O769820
40707F6121165N983290L471115L732736O224700P611523P263216N898709J953024
40699A08259478n086988j0197303q343992l286428l630402j0049324j4004579
40692E3660462j0501262m352677j119390L16159J941018J054095l387319n412790
40684C2198296n64698N205543L488338l271610n398082j040000J868164r69312
40676C1516639l957523j464214L598708N134935K388450j151978l495648m648129
$$ plain form
40668 27921240 23968858 23092033 25713338 29203737 30415577 28820574 26656174 26234706
40660 26234706 27432586 28170491 27444101 26719218 27113745 26595294 22631655 16945285 14166742
40651 14166742 15550968 17816458 19037181 21306833 25567184 28287027 26768960 24224893
40643 24224893 25454337 29975285 33481887 34056992 32859960 30464185 26929562 24316586
40635 24316586 24708629 26381655 26058179 24324612 24444032 26182650 25754462 22563538 21148559
40626 21148559 24519400 29421121 30702511 27788768 24522668 24206140 26463508 27963265
40618 27963265 25488700 19394793 14006647 12981035 14763690 15172907 14106162 15977850
40610 15977850 22519502 28890013 29417226 24678159 20022982 18549408 18450552 16926069
$$ packed form
40668B7921240l952382q76825K621305L490399J211840j595003k164400m21468
40660B6234706J197880P37905p26390p24883L94527n18451l963639n686370k778543
40651A4166742J384226K265490J220723K269652M260351K719843j518067k544067
40643B4224893J229444M520948L506602N75105j197032k395775l534623k612976
40635B4316586L92043J673026l23476j733567J19420J738618m28188l190924j414979
40626B1148559L370841M901721J281390k913743l266100l16528K257368J499757
40618B7963265k474565o093907n388146j025612J782655M09217j066745J871688
40610A5977850O541652O370511N27213m739067m655177j473574r8856j524483
$$ plain form
40602 16926069 14083066 12120383 12125061 12965711 13147966 12780359 13145221 14845446 17263879
40593 17263879 19562856 21077103 21086057 20005021 20603305 25337426 31930985 34851710 32633470
40584 32633470 30243548 31837533 34838565 34719451 32181558 30729641 29690121 25522616
40576 25522616 19115847 15926813 18322321 22464378 23488216 19919167 13014332 6013484
40568 6013484 3899456 8984380 16363625 18794514 16578973 16881960 22093349 25474683
40560 25474683 21443477 14184305 11417075 14045624 17060581 17671402 17483674 18289635
40552 18289635 20105511 22568956 24798985 24523122 20426050 15134827 13396497 17082815
40544 17082815 23336111 27492451 27187752 24281668 23078841 25687517 29402625 30345618
$$ packed form
40602A6926069k843003j962683M678Q40650J82255l67607L64862J700225K418433
40593A7263879K298977J514247Q954j081036N98284M734121O593559K920725k218240
40584C2633470k389922J593985L001032j19114k537893j451917j039520m167505
40576B5522616o406769l189034K395508M142057J023838l569049o904835p000848
40568F013484k114028N084924P379245K430889k215541L02987N211389L381334
40560B5474683m031206p259172k767230K628549L014957O10821j87728Q05961
40552A8289635J815876K463445K230029k75863m097072n291223j738330L686318
40544A7082815O253296M156340l04699k906084j202827K608676L715108R42993
$$ plain form
40536 30345618 28955328 28951375 31219424 32645431 31614282 30456533 30961442 31524524 30801737
40527 30801737 30380950 31383488 31913778 30484184 28693125 27928184 26827999 24874807
40519 24874807 24958046 28822571 33048742 33474928 31266080 30896324 34150014 39576114 45803124
40510 45803124 51697943 54861814 53582470 49366177 44971524 41285346 38120278 35769907
40502 35769907 33477619 29267067 24068710 22640797 26753196 30832062 28928253 23157652
40494 23157652 20164426 21576540 23546952 24127921 25158684 27358376 29167892 30771931
40486 30771931 34317742 39425203 42736008 42798021 41979256 43062600 46910128 53405777
40478 53405777 61835953 70891330 80873510 93886055 107969540 113778120 103473782 82091315
$$ packed form
40536C0345618j390290l953K268049J426007j031149j157749N04909N63082p22787
40527C0801737m20787J002538N30290j429594j791059p64941j100185j953192
40519B4874807Q3239L864525M226171M26186k208848l69756L253690N426100O227010
40510D5803124N894819L163871j279344m216293m394653l686178l165068k350371
40502C5769907k292288m210552n198357j427913M112399M078866j903809n770601
40494B3157652k993226J412114J970412N80969J030763K199692J809516J604039
40486C0771931L545811N107461L310805O2013q18765J083344L847528O495649
40478E3405777Q430176R055377R982180J3012545J4083485N808580j0304338k1382467
$$ plain form
40470 82091315 63341266 53824750 48343933 41876068 37823249 40123731 44314529 43314553
40462 43314553 38113180 35613600 37433499 37580463 31905267 24238090 20633927 21272088
40454 21272088 21466822 18896898 16196191 16305041 18386270 19820622 19994399 19910043 19657448
40445 19657448 19015792 19395946 21832506 23776124 21954303 18290034 18146516 21977727
40437 21977727 24266183 22630717 21903934 25659534 29663668 28962250 26539866 28783691
40429 28783691 36021688 43706072 49804494 54793147 57356441 56684252 56129196 57567387
40421 57567387 55306475 44046487 30375363 26379310 32606713 37934686 37227554 37964160
40413 37964160 45778123 53712454 52053053 41604992 31013623 25972390 26129756 28382107
$$ packed form
40470H2091315j8750049r516516n480817o467865m052819K300482M190798r99976
40462D3314553n201373k499580J819899J46964n675196p667177l604163O38161
40454B1272088J94734k569924k700707J08850K081229J434352J73777q4356k52595
40445A9657448o41656L80154K436560J943618j821821l664269j43518L831211
40437B1977727K288456j635466p26783L755600M004134p01418k422384K243825
40429B8783691P237997P684384O098422M988653K563294o72189n55056J438191
40421E7567387k260912j1259988j3671124l996053O227403N327973p07132P36606
40413C7964160P813963P934331j659401j0448061j0591369n041233J57366K252351
$$ plain form
40405 28382107 28938901 25776252 22043363 23027787 27788921 29226904 24729829 20281826
40397 20281826 20739686 22951308 22923880 22817862 25115773 26414469 23938397 22539015 27317437
40388 27317437 33721319 33501497 27672547 25078447 29410982 35427690 37678991 36022494
40380 36022494 32278798 27573715 23566918 21267879 18617872 13874212 10403903 12519826
40372 12519826 17445222 18129470 14274599 13320974 18711529 24370329 24451086 22258643 24089338
40363 24089338 28684216 29363791 24714039 20560243 20766129 21846477 19484829 16118695
40355 16118695 17377333 22845673 25871128 23300080 20144808 21682531 25505086 26180161
40347 26180161 24292572 24501916 26648801 26265314 23576915 23853629 27444207 28010993 23982780
$$ packed form
40405B8382107N56794l162649l732889R84424M761134J437983m497075m448003
40397B0281826M57860K211622k7428j06018K297911J298696k476072j399382M778422
40388B7317437O403882k19822n828950k594100M332535O016708K251301j656497
40380C6022494l743696m705083m006797k299039k650007m743660l470309K115923
40372A2519826M925396O84248l854871r53625N390555N658800Q0757k192443J830695
40363B4089338M594878O79575m649752m153796K05886J080348k361648l366134
40355A6118695J258638N468340L025455k571048l155272J537723L822555O75075
40347B6180161j887589K09344K146885l83487k688399K76714L590578N66786m028213
$$ plain form
40338 23982780 23278415 31130523 40540572 41799976 35812514 30799345 30765826 34785171
40330 34785171 43020596 54695116 63433684 63765470 60209528 61165928 65720756 65942619
40322 65942619 60911266 57809496 58682357 57266757 51678581 49697544 56617778 66664009
40314 66664009 72162368 73871131 76128449 78060606 76359590 72195131 68891662 66022342
40306 66022342 61525615 56913799 54941728 54194289 51044036 45650528 41755437 41483657
40298 41483657 43662050 46127753 47004807 45310393 42774241 43043514 46689447 49575583
40290 49575583 48972023 48368396 52509467 59992295 64897669 64355323 60854659 58272811
40282 58272811 59102354 64682212 74770817 87046288 99345545 112155007 127729642
$$ packed form
40338B3982780p04365P852108R410049J259404n987462n013169l3519M019345
40330C4785171Q235425J1674520Q738568L31786l555942R56400M554828K21863
40322F5942619n031353l101770Q72861j415600n588176j981037O920234J0046231
40314F6664009N498359J708763K257318J932157j701016m164459l303469k869320
40306F6022342m496727m611816j972071p47439l150253n393508l895091k71780
40298D1483657K178393K465703Q77054j694414k536152K69273L645933K886136
40290D9575583o03560o03627M141071P482828M905374n42346l500664k581848
40282E8272811Q29543N579858J0088605J2275471J2299257J2809462J5574635
$$ plain form
40275 127729642 147847204 172570415 198013025 214663626 213432798 197011041 180518256
40268 180518256 175996257 180166717 182769396 182443287 186580763 198279498 212667865 225993102
40260 225993102 239102798 249474559 248000637 228889495 198376621 169517952 150995490
40253 150995490 143080351 140780040 137877038 130574442 120094774 110496952 103209622 96119046
40245 96119046 88318221 82052306 78820071 77208989 75967203 75598087 75681846 74746397 74220294
40236 74220294 77651221 83752605 85492920 79514728 71349417 66827590 63227788 54947264
40228 54947264 44256800 39322284 43102671 50732657 57331313 62207627 65136887 64714827
40220 64714827 62224229 62163219 66435651 71572368 74029835 75392261 79952030 89270111
$$ packed form
40275A27729642K0117562K4723211K5442610J6650601j230828j6421757j6492785
40268A80518256m521999M170460K602679l26109M137476J1698735J4388367J3325237
40260B25993102J3109696J0371761j473922j9111142l0512874k8858669j8522462
40253A50995490p915139k300311k903002p302596j0479668r597822p287330p090576
40245I6119046p800825o265915l232235j611082j241786l69116Q3759r35449n26103
40236G4220294L430927O101384J740315n978192q165311m521827l599802q280524
40228E4947264j0690464m934516L780387P629986O598656M876314K929260m22060
40220F4714827k490598o1010M272432N136717K457467J362426M559769R318081
$$ plain form
40212 89270111 101758578 116787126 136613449 162692303 190003639 206855563 203564751
40205 203564751 182548766 157350874 140025692 131880604 127873729 125409380 124432606 122693778
40197 122693778 117586980 111673545 110460286 114794258 120870235 128014374 141071007 164126882
40189 164126882 196563046 235935944 279592880 321988036 354956767 372345790 371321287
40182 371321287 350182438 310990269 264600092 225581677 199281713 179653576 161829379
40175 161829379 149652707 147242662 150476483 152500177 152177432 151599466 150403205 148513338
40167 148513338 149880766 157038598 165583492 170135447 172222756 176138940 180769551 182579688
40159 182579688 183631787 189124253 199083581 209627052 220140799 231197667 237021549
$$ packed form
40212H9270111J2488467J5028548J9826323K6078854K7311336J6851924l290812
40205B03564751k1015985k5197892j7325182q145088m006875k464349r76774j738828
40197A22693778n106798n913435j213259M333972O075977P144139J3056633K3055875
40189A64126882L2436164L9372898M3656936M2395156L2968731J7389023j024503
40182C71321287k1138849l9192169m6390177l9018415k6299964j9628137j7824197
40175A61829379j2176672k410045L233821K023694l22745n77966j196261j889867
40167A48513338J367428P157832Q544894M551955K087309L916184M630611J810137
40159A82579688J052099N492466R959328J0543471J0513747J1056868N823882
$$ plain form
40152 237021549 229068338 207564984 181663899 157560349 134260395 112022852 96269201
40145 96269201 89742330 87649296 84471587 80442825 78115440 77343885 77014556 77932047
40137 77932047 81161938 86496143 94111934 104350964 114783946 121307206 123094955 122633291
40129 122633291 120669709 116031183 110804257 109849790 113867022 118623248 122453949 128502193
40121 128502193 137964584 147840909 157637919 171120162 188376840 203954456 217212188
40114 217212188 236104996 263577134 287158827 291303221 276372297 256909175 243348375
40107 243348375 233573021 221721681 207532979 195565549 190508875 194690128 206586278
40100 206586278 220996825 233195357 242805492 251844968 260656296 268258524 274503584 278575490
$$ packed form
40152B37021549p953211k1503354k5901085k4103550k3299954k2237543j5753651
40145I6269201o526871k093034l177709m028762k327385p71555l29329R17491
40137G7932047L229891N334205P615791J0239030J0432982O523260J787749m61664
40129A22633291j963582m638526n226926r54467M017232M756226L830701O048244
40121A28502193R462391R876325R797010J3482243J7256678J5577616J3257732
40114B17212188J8892808K7472138K3581693M144394j4930924j9463122j3560800
40107B43348375r775354j1851340j4188702j1967430n056674M181253J1896150
40100B06586278J4410547J2198532R610135R039476Q811328P602228O245060M071906
$$ plain form
40092 278575490 277366060 269132163 257382090 247530798 240664791 233596067 223856259 211836251
40084 211836251 199346677 188612331 181151887 175610813 169005512 161969409 159185749 161934549
40076 161934549 164555995 162211656 157600855 154810335 151018446 141286527 128463797 120450122
40068 120450122 118831064 117609406 112943526 107224061 103151989 100348900 98775018 99377098
40060 99377098 99866296 95334244 84929464 73526693 65464614 60649058 57442666 54908213
40052 54908213 51501086 46156714 41439218 40964948 43068531 42118536 37047800 33104260
40044 33104260 33589632 35418381 35079006 33541181 32381202 30342209 27528388 28295524
40036 28295524 35147902 42960588 44210780 38416669 32437936 32229791 37259590 42464313
$$ packed form
40092B78575490j209430q233897j1750073r851292o866007p068724r739808j2020008
40084B11836251j2489574j0734346p460444n541074o605301p036103k783660K748800
40076A61934549K621446k344339m610801k790520l791889r731919j2822730q013675
40068A20450122j619058j221658m665880n719465m072072k803089j573882O02080
40060I9377098M89198m532052j0404780j1402771q062079m815556l206392k534453
40052E4908213l407127n344372m717496m74270K103583r49995n070736l943540
40044C3104260M85372J828749l39375j537825j159979k038993k813821P67136
40036B8295524O852378P812686J250192n794111n978733k08145N029799N204723
$$ plain form
40028 42464313 43438049 40020655 36095781 35456344 37780160 40101748 41798272 45226695
40020 45226695 51212442 57477304 62637601 68173984 74772210 80232277 83183498 85523282
40012 85523282 88478652 89239446 84695972 76334038 68364259 62683380 58396946 54648117
40004 54648117 51071673 46750444 41486041 37232624 35936646 36797422 37714903 38394791
39996 38394791 39802895 41475311 41813059 40728326 39959634 40764605 42694583 44449548
39988 44449548 44867719 43508887 41194747 39424698 38661893 38233789 38439212 40867143 45275889
39979 45275889 48190503 47021628 44289204 44818158 49000432 51759771 49026408 42959332
39971 42959332 39250510 40655109 44858404 47941286 48017248 45492222 41880289 39410560
$$ packed form
40028D2464313R73736l417394l924874o39437K323816K321588J696524L428423
40020D5226695N985747O264862N160297N536383O598226N460067K951221K339784
40012H5523282K955370P60794m543474q361934p969779n680879m286434l748829
40004E4648117l576444m321229n264403m253417j295978Q60776R17481O79888
39996C8394791J408104J672416L37748j084733p68692Q04971J929978J754965
39988D4449548M18171j358832k314140j770049p62805m28104K05423K427931M408746
39979D5275889K914614j168875k732424N28954M182274K759339k733363o067076
39971D2959332l708822J404599M203295L082882P5962k525026l611933k469729
$$ plain form
39963 39410560 40015867 42880572 44355364 42779490 42304380 48335188 59188939 66596718
39955 66596718 66122583 63197528 66262970 77161774 90904359 101399300 104214925 97671308
39947 97671308 85941628 77936754 77900370 79784339 76258726 69851858 67959774 69789096
39939 69789096 67810743 61504681 59066945 63322426 66185164 61692064 55634210 56167319
39931 56167319 62246146 68106568 72702378 76930695 76877560 68909855 58488267 54976192
39923 54976192 58654395 60774028 56453896 50250276 48026875 49832669 52638715 54758196
39915 54758196 55477216 54668265 54688966 58941981 67022025 74969628 81674425 90654150 102974204
39906 102974204 112528222 112420674 103685781 93493264 85827302 78286477 68554852 59830463
$$ packed form
39963C9410560O05307K864705J474792j575874m75110O030808J0853751P407779
39955F6596718m74135k925055L065442J0898804J3742585J0494941K815625o543617
39947I7671308j1729680q004874l6384J883969l525613o406868j892084J829322
39939F9789096j978353o306062k437736M255481K862738m493100o057854N33109
39931E6167319O078827N860422M595810M228317n3135p967705j0421588l512075
39923E4976192L678203K119633m320132o203620k223401J805794K806046K119481
39915E4758196P19020q08951K0701M253015Q080044P947603O704797Q979725J2320054
39906A02974204R554018j07548q734893j0192517p665962p540825r731625q724389
$$ plain form
39898 59830463 57022101 59621595 61857077 60041293 56819294 56679533 59488938 61020408
39890 61020408 58977097 55891054 55931103 60624847 67593608 71913251 69632020 62567993
39882 62567993 58967265 65937302 81044408 94939461 102695906 108337113 116888564 126687956
39874 126687956 132672406 133915581 134507750 139003958 149190072 162657789 172280826 170276535
39866 170276535 155901554 136698182 119780317 105292147 91168363 79498421 72986359
39859 72986359 68871180 62766738 56266162 54146660 55424266 54217532 49374477 46245937
39851 46245937 47805732 50651639 51958577 54163588 59271543 63524919 62014741 55403879
39843 55403879 48426914 44202323 43147493 45027695 48470451 49989040 47033599 41781594
$$ packed form
39898E9830463k808362K599494K235482j815784l221999j39761K809405J531470
39890F1020408k043311l086043M0049M693744O968761M319643k281231p064027
39882F2567993l600728O970037J5107106J3895053P756445N641207Q551451R799392
39874A26687956N984450J243175N92169M496208J0186114J3467717R623037k004291
39866A70276535j4374981j9203372j6917865j4488170j4123784j1669942o512062
39859G2986359m115179o104442o500576k119502J277606j206734m843055l128540
39851D6245937J559795K845907J306938K205011N107955M253376j510178o610862
39843E5403879o976965m224591j054830J880202L442756J518589k955441n252005
$$ plain form
39835 41781594 39588454 43609778 51897824 59044651 60200240 55306368 50423457 52691963
39827 52691963 62257720 71207939 72567085 68359851 66187948 69720333 76180474 82366268
39819 82366268 88869293 97257671 106441965 114033988 119433788 123363655 125295166 123500888
39811 123500888 117699958 110039447 102838293 96310780 89347235 82137331 77023914 76321314
39803 76321314 79754177 84788893 89474918 93893972 97961961 98852753 93016756 81566745
39795 81566745 71347310 68117135 69624605 68416663 61397196 53062277 48290662 46093281
39787 46093281 43450602 41595688 43466495 46878691 46143955 40555332 35723505 35400137
39779 35400137 37475221 40038816 45314093 53463066 57975296 53671168 46102580 45737439
$$ packed form
39835D1781594k193140M021324Q288046P146827J155589m893872m882911K268506
39827E2691963R565757Q950219J359146m207234k171903L532385O460141O185794
39819H2366268O503025Q388378R184294P592023N399800L929867J931511j794278
39811A23500888n800930p660511p201154o527513o963545p209904n113417p02600
39803G6321314L432863N034716M686025M419054M067989Q90792n835997j1450011
39795H1566745j0219435l230175J507470j207942p019467q334919m771615k197381
39787D6093281k642679j854914J870807L412196p34736n588623m831827l23368
39779C5400137K075084K563595N275277Q148973M512230m304128p568588l65141
$$ plain form
39771 45737439 53711794 60523858 59817842 56480444 57788676 62293258 62976196 58350672
39763 58350672 54175869 54236320 54925206 51400384 45492258 43636176 48158316 54530225
39755 54530225 57911641 58839162 60093476 60698086 57048547 49255935 42200208 39400904
39747 39400904 39278370 38913545 38234985 38264328 38124975 36942549 36872615 40850216 47996105
39738 47996105 54092124 56608062 57337495 60132080 67170498 76672723 83281223 82310328
39730 82310328 75239631 69224598 69152351 72137597 72328349 68801405 65070178 62692779
39722 62692779 60092112 57066657 55576512 55552436 54361746 51430941 49253567 48602007
39714 48602007 47076025 44228569 43599586 46697365 49085797 46441428 41078892 37563901
$$ packed form
39771D5737439P974355O812064p06016l337398J308232M504582O82938m625524
39763E8350672m174803O0451O88886l524822n908126j856082M522140O371909
39755E4530225L381416R27521J254314O04610l649539p792612p055727k799304
39747C9400904j22534l64825o78560K9343j39353j182426o9934L977601P145889
39738D7996105O096019K515938P29433K794585P038418R502225O608500r70895
39730H2310328p070697o015033p2247K985246J90752l526944l731227k377399
39722F2692779k600667l025455j490145k4076j190690k930805k177374o51560
39714D8602007j525982k847456o28983L097779K388432k644369n362536l514991
$$ plain form
39706 37563901 34501761 27009059 16719740 12369250 18103991 26833541 29351141 26199812
39698 26199812 25254918 29588432 33879010 33426130 30925048 31193173 33293163 32475376 28010095
39689 28010095 24273863 24148757 25656586 26279622 27002089 30090850 35621115 42401538
39681 42401538 49889680 56409381 57597266 50736736 40451217 36089838 41669335 50832636
39673 50832636 54042078 49375909 43461913 41957867 42508889 39311543 32339407 27994292
39665 27994292 30539753 36999570 42266079 45357760 47419719 47047359 42557907 36893777
39657 36893777 34722753 35528607 35304065 34594135 37802434 43384156 42687907 32500010
39649 32500010 21895011 20892350 27487052 32333016 32162112 31150339 31466895 30599519
$$ packed form
39706C7563901l062140p492702j0289319m350490N734741Q729550K517600l151329
39698B6199812r44894M333514M290578m52880k501082K68125K099990q17787m465281
39689B8010095l736232j25106J507829O23036P22467L088761N530265O780423
39681D2401538P488142O519701J187885o860530j0285519m361379N579497R163301
39673E0832636L209442m666169n913996j504046N51022l197346o972136m345115
39665B7994292K545461O459817N266509L091681K061959l72360m489452n664130
39657C6893777k171024Q05854k24542p09930L208299N581722o96249j0187897
39649C2500010j0604999j002661O594702M845964j70904j011773L16556q67376
$$ plain form
39641 30599519 28107093 27764594 31036859 33840215 32387269 28542386 26947712 29325588
39633 29325588 33631469 37226141 39238716 40285820 40479105 38108985 31710585 23821189
39625 23821189 20069863 22656287 27148888 28203250 26078236 24617267 25315999 27021557
39617 27021557 29248985 31620622 31810865 28416028 24403801 23394519 24166982 23650732
39609 23650732 23630472 28560738 37400024 43750710 44462473 42466654 40563353 38168923
39601 38168923 35313368 34149901 34590664 33335845 29127319 24667945 22034708 20772720
39593 20772720 21607815 26672649 34148919 37947742 35245258 29834194 25997571 23899953
39585 23899953 22918394 23842938 25093021 22689205 17441118 16090972 20946756 24580086
$$ packed form
39641C0599519k492426l42499L272265K803356j452946l844883j594674K377876
39633B9325588M305881L594672K012575J047104J93285k370120o398400p889396
39625B3821189l751326K586424M492601J054362k125014j460969O98732J705558
39617B7021557K227428K371637J90243l394837m012227j009282P72463n16250
39609B3650732k0260M930266Q839286O350686P11763j995819j903301k394430
39601C8168923k855555j163467M40763j254819m208526m459374k633237j261988
39593B0772720Q35095N064834P476270L798823k702484n411064l836623k097618
39585B3899953r81559R24544J250083k403816n248087j350146M855784L633330
$$ plain form
39577 24580086 20720594 14907466 16852229 25918712 32194599 30311519 24732858 21580515
39569 21580515 21854181 23597292 25333648 25883979 24665102 23217424 23509905 24606073
39561 24606073 23978885 21890939 21316975 23722902 27987748 33201167 39361286 45434435
39553 45434435 49676806 51723263 51809209 48846278 42460352 35974484 33523363 34617554
39545 34617554 35345595 34443923 33847031 33524481 31027156 27038005 25958926 28866273 30933746
39536 30933746 28949616 26731283 28733110 31999985 30051337 22942985 17752158 19107184
39528 19107184 24302229 28761537 31554065 33227634 32389906 28301802 24299753 24191714
39520 24191714 26310309 25711604 22335539 21988442 27475815 33667981 35073557 34315047
$$ packed form
39577B4580086l859492n813128J944763R066483O275887j883080n578661l152343
39569B1580515K73666J743111J736356N50331j218877j447678K92481J096168
39561B4606073o27188k087946n73964K405927M264846N213419O160119O073149
39553D5434435M242371K046457Q5946k962931o385926o485868k451121J094191
39545C4617554P28041r01672n96892l22550k497325l989151j079079K907347K067473
39536C0933746j984130k218333K001827L266875j948648p108352n190827J355026
39528A9107184N195045M459308K792528J673569q37728m088104m002049j08039
39520B4191714K118595n98705l376065l47097N487373O192166J405576p58510
$$ plain form
39512 34315047 37677686 44616664 48151987 45336606 40808669 38817779 38259747 38132979
39504 38132979 41160801 47294267 49547080 43049026 34226512 33295922 39962830 45045175
39496 45045175 45868808 50796100 65729893 84177240 95775490 98833805 98550576 97173299
39488 97173299 93036931 87572564 86086239 90265616 94733229 93093682 84589555 73408553
39480 73408553 63803009 57331354 53151314 49506685 45505581 41814540 39090690 36511561
39472 36511561 33343300 30939647 30718478 30979000 29178645 27132269 29422134 35521801
39464 35521801 38587867 35043908 30583687 31959915 36689796 37125189 32363135 28879119
39456 28879119 29809660 31141381 29966874 29295429 31545923 33681447 33177133 33377774 37628251
$$ packed form
39512C4315047L362639O938978L535323k815381m527937j990890n58032j26768
39504C8132979L027822O133466K252813o498054q822514r30590O666908N082345
39496D5045175Q23633M927292J4933793J8447347J1598250L058315k83229j377277
39488I7173299m136368n464367j486325M179377M467613j639547q504127j1181002
39480G3408553r605544o471655m180040l644629m001104l691041k723850k579129
39472C6511561l168261k403653k21169K60522j800355k046376K289865O099667
39464C5521801L066066l543959m460221J376228M729881M35393m762054l484016
39456B8879119R30541J331721j174507o71445K250494K135524n04314K00641M250477
$$ plain form
39447 37628251 42452653 42523043 39214625 38015898 39655690 40200010 38755549 38659097 41086896
39438 41086896 43348410 44073586 44865162 46239049 47078715 48803009 54689142 63841239
39430 63841239 71178141 75010600 79108026 84992288 87987097 84673271 79412599 78841700
39422 78841700 83207170 87338426 87370695 82532151 73050524 60788646 50108374 43919908
39414 43919908 40247914 36323375 34114193 37196856 43341065 45474949 40597154 33427885
39406 33427885 29965175 30880375 32862793 33614426 33317262 32772998 32168156 31345207 30249492
39397 30249492 29126927 28430751 28210343 27749617 26399392 24617969 23533770 23543390 23902100
39388 23902100 23702011 22912506 22483190 23499511 26035908 28871398 30533565 30281388 27835123
$$ packed form
39447C7628251M824402P0390l308418j198727J639792N44320j444461r6452K427799
39438D1086896K261514P25176P91576J373887Q39666J724294N886133R152097
39430F3841239P336902L832459M097426N884262K994809l313826n260672n70899
39422G8841700M365470M131256L2269m838544r481627j2261878j0680272o188466
39414D3919908l671994l924539k209182L082663O144209K133884m877795p169269
39406C3427885l462710R15200J982418P51633k97164n44264o04842q22949j095715
39397C0249492j122565o96176k20408m60726j350225j781423j084199R620L58710
39388B3902100k00089p89505m29316J016321K536397K835490J662167k52177k446265
$$ plain form
39379 27835123 23215888 17931518 15229368 17326793 22854887 28619244 33003477 35643378
39371 35643378 35138130 30513027 24504443 21558118 22149173 22782304 22243966 23625975 28552611
39362 28552611 33538678 34688887 32729245 30630462 29089603 27251561 25458797 24274134
39354 24274134 22658891 19903155 17867315 18900732 22699179 26738469 28180277 24590545
39346 24590545 15982439 7779264 7775210 16982891 26724638 28289523 22592612 16772357
39338 16772357 14579218 14802582 16380136 19283224 21580208 21135470 19972963 22123872
39330 22123872 27142708 30289909 29358395 26947561 25558273 24855621 24687446 26403860
39322 26403860 29373147 29859151 25730444 19830830 16654515 17453925 20128938 22284635
$$ packed form
39379B7835123m619235n284370k702150K097425N528094N764357M384233K639901
39371C5643378n05248m625103o008584k946325N91055O33131n38338J382009M926636
39362B8552611M986067J150209j959642k098783j540859j838042j792764j184663
39354B4274134j615243k755736k035840J033417L798447M039290J441808l589732
39346B4590545q608106q203175m054R207681R741747J564885n696911n820255
39338A6772357k193139K23364J577554K903088K296984m44738j162507K150909
39330B2123872N018836L147201r31514k410834j389288p02652j68175J716414
39322B6403860K969287M86004m128707n899614l176315P99410K675013K155697
$$ plain form
39314 22284635 22911857 22236360 21180625 20407059 19407624 17174231 13849319 11022755 10588445
39305 10588445 13829326 20641853 28446250 32885739 31441514 26091412 21147562 18884040
39297 18884040 18140169 16308377 11883679 6334023 4018758 8058533 15387045 18985019
39289 18985019 16750244 14492431 17375247 22515207 24420637 23863024 25128533 27006627
39281 27006627 24015382 16312487 11073137 12414624 16164157 17119051 16203393 17172662
39273 17172662 20250563 22504704 21981510 18890610 14825205 12652445 14869321 20345367
39265 20345367 24843910 26064655 25726491 25513663 24057894 19932172 14977512 12312503
39257 12312503 12857069 15503811 18754069 20744838 20041282 18138814 18741237 22596758
$$ packed form
39314B2284635O27222o75497j055735p73566r99435k233393l324912k826564m34310
39305A0588445L240881O812527P804397M439489j444225n350102m943850k263522
39297A8884040p43871j831792m424698n549656k315265M039775P328512L597974
39289A8985019k234775k257813K882816N139960J905430n57613J265509J878094
39281B7006627k991245p702895n239350J341487L749533R54894r15658R69269
39273A7172662L077901K254141n23194l090900m065405k172760K216876N476046
39265B0345367M498543J220745l38164k12828j455769m125722m954660k665009
39257A2312503N44566K646742L250258J990769p03556j902468O02423L855521
$$ plain form
39249 22596758 25591889 24365348 21324015 21066558 23868825 26195183 26245189 25164053
39241 25164053 23392937 19938869 15904557 15048673 18999387 24317157 26261307 23920758
39233 23920758 19954900 16743469 14865068 14326071 14709272 14221325 11128952 6760787
39225 6760787 4785086 6443290 8740748 8889766 8178235 9101648 10940522 11552193 11897891
39216 11897891 14686889 19286754 22235086 22513614 21924623 20533378 16986808 13538079
39208 13538079 14515143 18592616 19454362 16297930 15905041 20606239 22888297 18161865
39200 18161865 14244763 19030868 25998699 23567909 13949890 9600077 13207596 15073458
39192 15073458 10852551 7921122 10766805 13253909 11252790 11099945 17540889 23233498
$$ packed form
39249B2596758K995131j226541l041333k57457K802267K326358N0006j081136
39241B5164053j771116l454068m034312q55884L950714N317770J944150k340549
39233B3920758l965858l211431j878401n38997L83201m87947l092373m368165
39225F760787j975701J658204K297458J49018p11531R23413J838874O11671L45698
39216A1897891K788998M599865K948332K78528n88991j391245l546570l448729
39208A3538079R77064M077473Q61746l156432l92889M701198K282058m726432
39200A8161865l917102M786105O967831k430790r618019m349813L607519J865862
39192A5073458m220907k931429K845683K487104k001119j52845O440944N692609
$$ plain form
39184 23233498 19785361 11676435 9181957 13014310 16065522 16291432 17383695 18812252
39176 18812252 15642483 8418543 4141147 6037740 10032221 12922147 16604764 21666239
39168 21666239 23775552 20415743 15751255 14464489 15116917 14251198 13427363 16553798
39160 16553798 22082668 23706409 19129169 13405076 12163235 15266587 19195955 22492929
39152 22492929 25727127 28097519 27943359 26402003 27090640 31177095 35363110 36122261
39144 36122261 33930838 31824603 31400154 31726525 30910523 27646397 22765334 20060689
39136 20060689 23143882 30036956 33730113 30379063 24171160 21365969 22625884 24814298
39128 24814298 27009988 29618975 30151464 26160561 21074706 20570916 23645976 24238120
$$ packed form
39184B3233498l448137q108926k494478L832353L051212K25910J092263J428557
39176A8812252l169769p223940m277396J896593L994481K889926L682617N061475
39168B1666239K109313l359809m664488j286766O52428q65719q23835L126435
39160A6553798N528870J623741m577240n724093j241841L103352L929368L296974
39152B2492929L234198K370392j54160j541356O88637M086455M186015P59151
39144C6122261k191423k106235m24449L26371q16002l264126m881063k704645
39136B0060689L083193O893074L693157l351050o207903k805191J259915K188414
39128B4814298K195690K608987N32489l990903n085855n03790L075060N92144
$$ plain form
39120 24238120 21961574 23301317 30011857 34399694 30665586 24183344 23389788 27388513
39112 27388513 28669136 25390997 23643707 27560090 33241772 34495043 30971789 28118383
39104 28118383 30290725 35748619 39036154 37877191 36060163 38075018 42671782 45081041
39096 45081041 44901443 47331461 55656818 66796279 76237575 83607322 90786460 97575567
39088 97575567 101912427 102016793 96260044 83692861 67103557 52914002 45388225 42986536
39080 42986536 42297232 42569619 43816758 43768367 40636162 36791564 35662106 36169003 34120590
39071 34120590 28797061 24656484 25842681 31418419 37058023 40046668 41357522 42961048
39063 42961048 44290157 42894114 38516382 34026167 31140589 28357352 25461425 25971155
$$ packed form
39120B4238120k276546J339743O710540M387837l734108o482242p93556L998725
39112B7388513J280623l278139j747290L916383N681682J253271l523254k853406
39104B8118383K172342N457894L287535j158963j817028K014855M596764K409259
39096D5081041j79598K430018Q325357J1139461R441296P369747P179138O789107
39088I7575567M336860J04366n756749j2567183j6589304j4189555p525777k401689
39080D2986536o89304K72387J247139m8391l132205l844598j129458N06897k048413
39071C4120590n323529m140577J186197N575738N639604K988645J310854J603526
39063D2961048J329109j396043m377732m490215k885578k783237k895927N09730
$$ plain form
39055 25971155 30573160 32336922 25666196 17116044 18073270 27497994 32329512 26544295
39047 26544295 19020142 18624043 21998714 22267507 20472021 20546843 20591419 17551350 14377974
39038 14377974 14362729 14182751 10939338 10168591 17295723 26341974 27743957 23311520 22051308
39029 22051308 24133421 21500572 13512139 9218272 12521477 16818232 17460319 18745166
39021 18745166 24014622 28363066 27078736 23842862 24347180 27454834 28674411 28115230
39013 28115230 29199987 32100481 33459982 31661452 29086171 29274233 32956365 36494048
39005 36494048 35097763 29229997 25739135 29298891 35195732 35710859 31504404 29917233
38997 29917233 33007741 35069432 32587090 28788646 26485082 23855339 19951695 17427435
$$ packed form
39055B5971155M602005J763762o670726q550152R57226R424724M831518n785217
39047B6544295p524153l96099L374671K68793j795486P4822M4576l040069l173376
39038A4377974j5245j79978l243413p70747P127132R046251J401983m432437j260212
39029B2051308K082113k632849p988433m293867L303205M296755O42087J284847
39021A8745166N269456M348444j284330l235874N04318L107654J219577n59181
39013B8115230J084757K900494J359501j798530k575281J88062L682132L537683
39005C6494048j396285n867766l490862L559756N896841N15127m206455j587171
38997B9917233L090508K061691k482342l798444k303564k629743l903644k524260
$$ plain form
38989 17427435 16822387 14797312 11167319 10894329 15432753 18922174 17395336 15192834
38981 15192834 17045795 19848826 18228787 13327178 10277169 11286500 16454627 26790276
38973 26790276 40818741 52663097 59130511 64170126 70824827 74511876 71284509 66645305
38965 66645305 66895754 66850948 57360601 41838055 32834823 32985654 32333264 26225684 22723593
38956 22723593 27591370 34112686 35218315 35454415 41401320 48162840 46666133 39692681
38948 39692681 38832673 46781682 53689845 52620726 49098614 51495317 59128581 64780774
38940 64780774 64277546 58951019 51957650 46475268 45160912 47348377 48443189 45767977
38932 45767977 43512726 47945752 58745617 69536307 77034147 85007736 97611562 112598134
$$ packed form
38989A7427435o05048k025075l629993k72990M538424L489421j526838k202502
38981A5192834J852961K803031j620039m901609l050009J009331N168127J0335649
38973B6790276J4028465J1844356O467414N039615O654701L687049l227367m639204
38965F6645305K50449m4806r490347j5522546r003232J50831o52390o107580l502091
38956B2723593M867777O521316J105629K36100N946905O761520j496707o973452
38948C9692681q60008P949009O908163j069119l522112K396703P633264N652193
38940F4780774n03228n326527o993369n482382j314356K187465J094812k675212
38932D5767977k255251M433026J0799865J0790690P497840P973589J2603826J4986572
$$ plain form
38924 112598134 123531901 126016349 119415126 105130105 86642249 69917174 60096291
38917 60096291 57336708 57934782 59441028 62620548 68512225 76096271 83730896 90844812
38909 90844812 96662064 98493725 93386804 81777846 68135017 56899950 48399427 40238584
38901 40238584 32511042 28955702 31333066 35274435 35202283 31941743 31060746 34015008
38893 34015008 36079962 34079317 30765677 29222280 28325375 27356757 29898583 38087107
38885 38087107 47339418 52668092 56548173 63784071 71646974 73195953 68952549 66618228
38877 66618228 68782547 69374738 64377205 58356857 57071202 60078429 64341521 69533348
38869 69533348 76038674 82765701 90453392 101866480 114755643 120158778 112903191 99123097
$$ packed form
38924A12598134J0933767K484448o601223j4285021j8487856j6725075r820883
38917F0096291k759583N98074J506246L179520N891677P584046P634625P113916
38909I0844812N817252J831661n106921j1608958j3642829j1235067q500523q160843
38901D0238584p727542l555340K377364L941369p2152l260540q80997K954262
38893C4015008K064954k000645l313640j543397q96905r68618K541826Q188524
38885C8087107R252311N328674L880081P235898P862903J548979m243404k334321
38877F6618228K164319N92191m997533o020348j285655L007227M263092N191827
38869F9533348O505326O727027P687691J1413088J2889163N403135p255587j3780094
$$ plain form
38861 99123097 87728766 78802762 67140178 53671108 45067466 43017260 41830448 37718938
38853 37718938 33678426 32999372 33761952 33119298 32547939 34516405 36624286 33891850 26554612
38844 26554612 21414807 23759217 30492437 33901428 31079885 26380812 24245231 23350338
38836 23350338 20157556 15118027 11655533 11077024 12647446 16893696 23704369 28481523
38828 28481523 26589378 21521609 21497690 26849354 28729184 23131834 17816866 20304061
38820 20304061 26815780 30002124 30793428 34008357 37443169 35077230 28046255 22892685
38812 22892685 20886471 18562085 17351903 22110335 29814681 30678476 22922944 16282017
38804 16282017 17155811 20007132 18523026 15916265 17059561 18378832 14358900 8497480
$$ packed form
38861I9123097j1394331q926004j1662584j3469070q603642k050206j186812m111510
38853C7718938m040512o79054P62580o42654n71359J968466K107881k732436p337238
38844B6554612n139805K344410O733220L408991k821543m699073k135581q94893
38836B3350338l192782n039529l462494n78509J570422M246250O810673M777154
38828B8481523j892145n067769k3919N351664J879830n597350n314968K487195
38820B0304061O511719L186344P91304L214929L434812k365939p030975n153570
38812B2892685k006214k324386j210182M758432P704346Q63795p755532o640927
38804A6282017Q73794K851321j484106k606761J143296J319271m019932n861420
$$ plain form
38796 8497480 8589607 14516337 19315269 20130199 19830819 19228935 16181476 12362809 12766867
38787 12766867 17264904 20017068 18977998 18709707 21189939 21318350 16007571 11162651
38779 11162651 13492970 20159841 23346180 21805134 20517660 20715689 18376181 13194368
38771 13194368 11200768 15434385 20356425 19937530 16425880 15736804 17719893 17555102
38763 17555102 15297978 16809221 23835962 29498415 27407226 21077003 19459816 25064662
38755 25064662 31301299 31503820 26403078 21378982 19536363 19749388 19629574 17898544
38747 17898544 14570321 11045968 9963178 12911699 17772890 20045429 17753463 13642541
38739 13642541 11357572 10916086 9917828 8204393 8457721 11884248 16100036 18696914
$$ packed form
38796H497480R2127N926730M798932Q14930k99380o01884l047459l818667M04058
38787A2766867M498037K752164j039070k68291K480232J28411n310779m844920
38779A1162651K330319O666871L186339j541046j287474J98029k339508n181813
38771A3194368j993600M233617M922040m18895l511650o89076J983089j64791
38763A7555102k257124J511243P026741N662453k091189o330223j617187N604846
38755B5064662O236637K02521n100742n024096j842619K13025j19814j731030
38747A7898544l328223l524353j082790K948521M861191K272539k291966m110922
38739A3642541k284969m41486r98258j713435K53328L426527M215788K596878
$$ plain form
38731 18696914 20645347 23955179 27419599 27499594 23416775 19051176 18779629 22489744
38723 22489744 25668389 24335143 19462846 15942449 16796989 19500484 19772082 18082120
38715 18082120 18853785 22604932 23477424 17766942 11122531 12095465 20241010 26143276
38707 26143276 23314670 15179550 9331759 9240933 13260973 18172439 21570717 23089236
38699 23089236 24524270 26820746 27215087 22845183 16986832 16591974 22309071 26483099
38691 26483099 23997552 19850211 21448638 27564947 30636944 27706628 23363116 22499565
38683 22499565 24968701 27574707 27569119 23936766 18470093 15845696 19673917 27880546
38675 27880546 34298016 35315273 33076000 31729695 32232340 31780097 27980021 22973073
$$ packed form
38731A8696914J948433L309832L464420P9995m082819m365599k71547L710115
38723B2489744L178645j333246m872297l520397Q54540K703495K71598j689962
38715A8082120P71665L751147Q72492n710482o644411R72934Q145545N902266
38707B6143276k828606q135120n847791r0826M020040M911466L398278J518519
38699B3089236J435034K296476L94341m369904n858351l94858N717097M174028
38691B6483099k485547m147341J598427O116309L071997k930316m343512q63551
38683B2499565K469136K606006n588l632353n466673k624397L828221Q206629
38675B7880546O417470J017257k239273j346305N02645m52243l800076n006948
$$ plain form
38667 22973073 22013748 26398040 29555808 24386967 14191199 10380454 17320022 25880508
38659 25880508 26375048 21673715 20688427 23848730 24106616 19968882 17666109 19961275
38651 19961275 22040725 20880721 20400463 23463069 25958463 24009470 21400585 23808671
38643 23808671 29427175 31506604 28305045 24894834 25465660 28394496 29608553 27604859
38635 27604859 23951466 20579063 17771973 14699021 11657911 10844227 13547590 17391590
38627 17391590 18836026 18186793 18949970 21765010 22707971 19224202 14299463 12371438
38619 12371438 13942912 16825273 20119669 23876068 26666392 26637244 24010545 20307538
38611 20307538 16370186 13149845 12599545 15116760 17661578 17368739 15841108 16788547
$$ packed form
38667B2973073r59325M384292L157768n168841j0195768l810745O939568Q560486
38659B5880508M94540m701333r85288L160303K57886m137734k302773K295166
38651A9961275K079450j160004m80258L062606K495394j948993k608885K408086
38643B3808671N618504K079429l201559l410211N70826K928836J214057k003694
38635B7604859l653393l372403k807090l072952l041110q13684K703363L844000
38627A7391590J444436o49233P63177K815040R42961l483769m924739j928025
38619A2371438J571474K882361L294396L756399K790324k9148k626699l703007
38611B0307538l937352l220341n50300K517215K544818k92839j527631R47439
$$ plain form
38603 16788547 20324331 23007879 23318767 23591982 25660517 27389220 25282533 19321117
38595 19321117 13880631 13840080 19702116 26369987 27547723 22075087 15133087 12552705
38587 12552705 15128107 19319390 21726039 21223996 18447213 15626849 15927011 20280235
38579 20280235 25058897 25066049 19095427 11260096 7052595 9001314 15180246 20622655
38571 20622655 21335221 18426311 16956056 19292502 21849591 20719065 17728427 16942806
38563 16942806 17425361 14941954 10062664 8393710 11754530 15131466 14963473 15097443
38555 15097443 20571572 29563580 36101979 37959458 37156722 34652576 29755692 24311134
38547 24311134 22504763 25415723 29288038 30469836 29335170 28106959 27282741 25937255
$$ packed form
38603A6788547L535784K683548L10888K73215K068535J728703k106687n961416
38595A9321117n440486m0551N862036O667871J177736n472636o942000k580382
38587A2552705K575402M191283K406649n02043k776783k820364L00162M353224
38579B0280235M778662P152n970622p835331m207501J948719O178932N442409
38571B0622655P12566k908910j470255K336446K557089j130526k990638p85621
38563A6942806M82555k483407m879290j668954L360820L376936j67993J33970
38555A5097443N474129Q992008O538399J857479q02736k504146m896884n444558
38547B4311134j806371K910960L872315J181798j134666j228211q24218j345486
$$ plain form
38539 25937255 23960924 22241919 21198477 20192252 18342131 15834488 14621243 17009503
38531 17009503 22504697 27001641 26976705 23909240 22289222 23581860 24996045 24441605
38523 24441605 23318644 23102068 22509457 20432105 18906746 20125453 22599271 23715818
38515 23715818 24416993 27226024 30532151 29704545 24630265 21578773 25377333 33076477
38507 33076477 37882244 36826006 32118049 27305171 24949653 26193754 29438972 30686001
38499 30686001 28187989 25686192 27929817 34089678 39336256 42231756 46008110 52155756
38491 52155756 57769030 61205988 65693629 73836415 82185468 85821906 86230007 89712393
38483 89712393 98512665 107983612 113004214 113172292 110511210 105921446 100278398 96158445
$$ packed form
38539B5937255j976331j719005j043442j006225j850121k507643j213245K388260
38531A7009503N495194M496944k4936l067465j620018J292638J414185n54440
38523B4441605j122961k16576n92611k077352j525359J218707K473818J116547
38515B3715818P01175K809031L306127q27606n074280l051492L798560P699144
38507C3076477M805767j056238m707957m812878k355518J244101L245218J247029
38499C0686001k498012k501797K243625O159861N246578K895500L776354O147646
38491E2155756N613274L436958M487641Q142786Q349053L636438M08101L482386
38483H9712393Q800272R470947N020602J68078k661082m589764n643048m119953
$$ plain form
38475 96158445 95305610 95637994 93338671 87198638 78816875 69494322 59691573 51242795
38467 51242795 46834531 46179312 45319587 41505602 36758671 34471153 34246383 33044673
38459 33044673 30376335 28693285 28556512 27402232 24450798 22875886 24411902 25422367
38451 25422367 22480733 19164703 21771454 29204680 33123059 29087983 22038470 18621280
38443 18621280 19244553 20859734 22866002 25902674 28472320 29568529 31711449 36391233
38435 36391233 39422110 36880141 33265467 36204105 43825817 45969079 39462176 33598133
38427 33598133 36371021 42764344 42748086 35350301 27840887 24637453 24265181 25339824
38419 25339824 28409791 32037801 33061330 31264413 28959857 25978103 20324618 14163136
$$ packed form
38475I6158445q52835L32384k299323o140033q381763r322553r802749q448778
38467E1242795m408264o55219q59725l813985m746931k287518k24770j201710
38459C3044673k668338j683050j36773j154280k951434j574912J536016J010465
38451B5422367k941634l316030K606751P433226L918379m035076p049513l417190
38443A8621280O23273J615181K006268L036672K569646J096209K142920M679784
38435C6391233L030877k541969l614674K938638P621712K143262o506903n864043
38427C3598133K772888O393323j6258p397785p509414l203434l72272J074643
38419B5339824L069967L628010J023529j796917k304556k981754n653485o161482
$$ plain form
38411 14163136 13367340 19374627 26452987 29260691 28733863 28170644 27919122 27159575 27279095
38402 27279095 29762689 33201021 35507664 36873773 37820670 36902088 33385901 29702028
38394 29702028 27886593 26040898 22068755 18560167 19434969 23411745 25718077 25337935
38386 25337935 25482314 27206748 27967298 27149050 27646702 30261926 31438607 29002405 25809526
38377 25809526 24757788 24097864 21280248 18167023 18198600 20570874 21439039 19574385 16968210
38368 16968210 14854794 12988603 12163581 13452755 15132261 14308820 11693937 10580225
38360 10580225 10693003 8146141 3318456 3278753 12122989 22964723 25349920 18836654
38352 18836654 13254932 15576420 22361170 26744756 27399070 27074494 26350819 23653188
$$ packed form
38411A4163136p95796O007287P078360K807704n26828n63219k51522p59547J19520
38402B7279095K483594L438332K306643J366109R46897r18582l516187l683873
38394B9702028j815435j845695l972143l508588Q74802L976776K306332l80142
38386B5337935J44379J724434P60550q18248M97652K615224J176681k436202l192879
38377B5809526j051738o59924k817616l113225L1577K372274Q68165j864654k606175
38368A6968210k113416j866191q25022J289174J679506q23441k614883j113712
38360A0580225J12778k546862m827685l9703Q844236J0841734K385197o513266
38352A8836654n581722K321488O784750M383586O54314l24576p23675k697631
$$ plain form
38344 23653188 19605592 16787041 15545978 13824144 11257435 10069038 11344671 13401315
38336 13401315 14502674 14356576 12410135 8108951 3950062 4295392 8857148 11329524
38328 11329524 8092901 4649309 8153293 15966118 18421192 12906380 7983481 10768090
38320 10768090 16427496 15384396 7063797 196521 639783 4891864 6774644 5724841
38312 5724841 5774349 9181523 13985735 16664087 15236008 10735830 7156827 8560033
38304 8560033 14167730 17550822 13443369 4777250 -244912 1794658 6018132 6898619
38296 6898619 5373019 5475152 7406112 8530083 9238759 12292526 16480469 16601525 11483522
38287 11483522 7087623 8561266 13010363 13997618 10543024 7336542 7343598 8511601 7944975
$$ packed form
38344B3653188m047596k818551j241063j721834k566709j188397J275633K056644
38336A3401315J101359j46098j946441m301184m158889L45330M561756K472376
38328A1329524l236623l443592L503984P812825K455074n514812m922899K784609
38320A0768090N659406j043100q320599o867276M43262M252081J882780j049803
38312E724841M9508L407174M804212K678352j428079m500178l579003J403206
38304H560033N607697L383092m107453q666119n022162K039570M223474Q80487
38296F898619j525600J02133J930960J123971P08676L053767M187943J21056n118003
38287A1483522m395899J473643M449097R87255l454594l206482P056J168003n66626
$$ plain form
38278 7944975 5861562 4333750 4302852 5094950 5983333 7439861 10655575 15433071 19077445
38269 19077445 19079891 16772386 15686128 15891932 13638328 8150351 4469969 6277299 9826889
38260 9826889 9617511 6959671 7333366 11257821 13908394 13053467 11330758 10466267 9037535
38251 9037535 6901349 6430127 7863917 8231928 6436628 4989649 5373507 6146567 6797338
38242 6797338 8584451 10289083 8625289 4625888 3611638 6353516 6834036 2401882
38234 2401882 -782626 2297464 6758024 6067752 3421007 6072558 12086220 12701374
38226 12701374 6747683 2790964 5691114 10024806 9933505 7725962 8114884 10038063
38218 10038063 9799157 8170722 8520135 10238529 9709709 7078417 6887633 11175140 16037526
$$ packed form
38278G944975k083413j527812l0898P92098Q88383J456528L215714M777496L644374
38269A9077445K446k307505j086258K05804k253604n487977l680382J807330L549590
38260I826889k09378k657840L73695L924455K650573q54927j722709q64491j428732
38251I037535k136186m71222J433790L68011j795300j446979L83858P73060O50771
38242F797338J787113J704632j663794l999401j014250K741878M80520m432154
38234B401882l184508L080090M460560o90272k646745K651551O013662O15154
38226A2701374n953691l956719K900150M333692r1301k207543L88922J923179
38218A0038063k38906j628435L49413J718394n28820k631292j90784M287507M862386
$$ plain form
38209 16037526 16870852 14131767 11603272 10917968 10648237 10007604 10267948 11844151 12729718
38200 12729718 11509418 9836270 9728446 10104401 8743359 6421129 5817633 7021656
38192 7021656 7771611 7907868 9397242 11483637 10548922 6459479 4351681 7200623 10720463
38183 10720463 9529664 5277178 4228331 8583855 14359055 17035009 15818332 12701377
38175 12701377 10174975 9777888 10933158 11548442 10935771 10930622 12954865 15733774 17271109
38166 17271109 17121281 15561505 13110971 12032305 14804076 19395318 20293218 16762601
38158 16762601 15252461 19812789 25099676 24180695 18961122 16576826 18905679 22471534
38150 22471534 25826907 29396487 29997613 23915221 15040023 11881056 15845179 19928459
$$ packed form
38209A6037526Q33326k739085k528495o85304k69731o40633K60344J576203Q85567
38200A2729718j220300j673148j07824L75955j361042k322230o03496J204023
38192G021656P49955J36257J489374K086395r34715m089443k107798K848942L519840
38183A0720463j190799m252486j048847M355524N775200K675954j216677l116955
38175A2701377k526402l97087J155270O15284o12671n149K024243K778909J537335
38166A7271109j49828j559776k450534j078666K771771M591242Q97900l530617
38158A6762601j510140M560328N286887r18981n219573k384296K328853L565855
38150B2471534L355373L569580O01126o082392q875198l158967L964123M083280
$$ plain form
38142 19928459 19875689 18950312 20043579 20923617 20188935 20659642 23108872 23161331 18787858
38133 18787858 15141512 17140398 22125509 24828842 25327359 26763359 28679980 28252786
38125 28252786 25843884 24036486 22614631 19410321 15357117 14094468 16379258 18675427
38117 18675427 18111841 16123594 16123268 19235759 23402106 26158593 27565303 29719936 33134852
38108 33134852 35097968 33439223 30643714 31235997 35577026 39647414 40945881 40812967
38100 40812967 40459194 38894523 36079578 34131468 33775638 33453531 33500070 36690913 42306042
38091 42306042 44476474 40021835 33667622 31177159 31110130 28566273 24098200 22793480
38083 22793480 25821400 28885869 29239394 29007964 30476895 32461909 33082570 32733572 32307782
$$ packed form
38142A9928459n2770r25377J093267Q80038p34682M70707K449230N2459m373473
38133A8787858l646346J998886M985111K703333M98517J436000J916621m27194
38125B8252786k408902j807398j421855l204310m053204j262649K284790K296169
38117A8675427n63586j988247l26L112491M166347K756487J406710K154633L414916
38108C3134852J963116j658745k795509N92283M341029M070388J298467j32914
38100D0812967l53773j564671k814945j948110l55830l22107M6539L190843N615129
38091D2306042K170432m454639o354213k490463o7029k543857m468073j304720
38083B2793480L027920L064469L53525k31430J468931J985014O20661l48998m25790
$$ plain form
38074 32307782 30961564 27658535 23249845 19266339 15937739 13164151 12493508 15903914
38066 15903914 22408129 27838287 29316909 28774375 30178006 33900849 36477302 36246017
38058 36246017 35894911 37599561 38979363 37213884 34516734 35134351 38674674 41446805
38050 41446805 43433689 48216334 55848117 61797072 64207355 66326637 69755160 71420839
38042 71420839 70430849 71827761 78723865 85817367 86687499 83757688 84313868 88792320
38034 88792320 90024506 83985144 75149375 69934116 69611220 71419265 72800864 72298111
38026 72298111 68984365 63494819 58398292 55838980 55377167 55100415 54247952 53703558 53931692
38017 53931692 53405609 50205914 45362472 43100674 46103516 51288142 52610600 48235612
$$ packed form
38074C2307782j346218l303029m408690l983506l328600k773588o70643L410406
38066A5903914O504215N430158J478622n42534J403631L722843K576453k31285
38058C6246017l51106J704650J379802j765479k697150O17617L540323K772131
38050D1446805J986884M782645P631783N948955K410283K119282L428523J665679
38042G1420839r89990J396912O896104P093502Q70132k929811N56180M478452
38034H8792320J232186o039362q835769n215259l22896J808045J381599n02753
38026G2298111l313746n489546n096527k559312m61813k76752q52463n44394K28134
38017E3931692n26083l199695m843442k261798L002842N184626J322458m374988
$$ plain form
38009 48235612 42663831 41001980 43125508 44697301 42544527 37778544 34217475 34394678
38001 34394678 37075888 39147667 39909977 41498761 44163957 44444011 40920712 38421874
37993 38421874 41696441 47327615 47886688 42876440 39091185 40418534 44027583 47104458
37985 47104458 50292108 53199312 53753245 54009752 59174362 68037136 71951138 67174359
37977 67174359 60928875 60522579 63408073 63446597 60490821 57632603 54842852 51865036
37969 51865036 52124051 57054682 61372081 60673066 58993244 61865815 66646855 67364682
37961 67364682 64799247 63547839 62920599 59450876 55337167 55389749 57855200 57161269 53970056
37952 53970056 53597615 55914415 56013813 54076139 55192191 59410056 61183659 59320744
$$ packed form
38009D8235612n571781j661851K123528J571793k152774m765983l561069J77203
38001C4394678K681210K071779P62310J588784K665196K80054l523299k498838
37993C8421874L274567N631174N59073n010248l785255J327349L609049L076875
37985D7104458L187650K907204N53933K56507N164610Q862774L914002m776779
37977F7174359o245484m06296K885494L8524k955776k858218k789751k977816
37969E1865036K59015M930631M317399o99015j679822K872571M781040P17827
37961F7364682k565435j251408o27240l469723m113709N2582K465451o93931l191213
37952E3970056l72441K316800R9398j937674J116052M217865J773603j862915
$$ plain form
37944 59320744 58469324 59676088 58524974 54454164 53002075 56012047 57836730 54715973
37936 54715973 50599807 49944100 51140365 50749068 48660616 45852979 42200062 39202922
37928 39202922 39789875 43017725 44050604 41450395 39256215 40074097 41744665 42542355
37920 42542355 43461405 43449943 39340295 33293039 33031379 40575166 47416168 45876352 39524598
37911 39524598 36872708 39495678 42193657 41580525 39025725 36878315 35915383 35631218
37903 35631218 34942526 33783404 34094786 36517638 37174852 32678971 27354929 28492657
37895 28492657 34450139 36082779 31464505 29349954 34355652 38867343 35749465 29760405
37887 29760405 28418850 29457905 26455737 20696040 17977799 18460334 18977572 21349080
$$ packed form
37944E9320744q51420J206764j151114m070810j452089L009972J824683l120757
37936E4715973m116166o55707J196265l91297k088452k807637l652917k997140
37928C9202922N86953L227850J032879k600209k194180Q17882J670568P97690
37920D2542355R19050j1462m109648o047256k61660P543787O841002j539816o351754
37911C9524598k651890K622970K697979o13132k554800k147410r62932k84165
37903C5631218o88692j159122L11382K422852O57214m495881n324042J137728
37895B8492657N957482J632640m618274k114551N005698M511691l117878n989060
37887B9760405j341555J039055l002168n759697k718241M82535N17238K371508
$$ plain form
37879 21349080 28769643 36890504 38078298 32864657 28472429 27536667 26842269 25736886
37871 25736886 26670005 28036791 25767144 22280334 24536678 31875703 35060058 30168945
37863 30168945 24829395 26469115 31721674 32746927 28566381 24560105 24225959 26414503
37855 26414503 28818467 30401994 31234844 31992576 32696563 31395537 26257731 19471010
37847 19471010 16124608 18096859 21831528 23386615 22849458 22214315 21633198 19980468
37839 19980468 17378285 15120789 13984347 13949981 15028289 17549090 21777864 27087092
37831 27087092 31235982 31530287 27708839 22607293 18904609 16671135 15261797 15367522
37823 15367522 17198315 18906012 19230710 19444337 20190517 19321925 16129999 14468327 17386191
$$ packed form
37879B1349080P420563Q120861J187794n213641m392228r35762o94398j105383
37871B5736886R33119J366786k269647l486810K256344P339025L184355m891113
37863C0168945n339550J639720N252559J025253m180546m006276l34146K188544
37855B6414503K403964J583527Q32850P57732P03987j301026n137806o786721
37847A9471010l346402J972251L734669J555087n37157o35143n81117j652730
37839A9980468k602183k257496j136442l4366J078308K520801M228774N309228
37831B7087092M148890K94305l821448n101546l702684k233474j409338J05725
37823A5367522J830793J707697L24698K13627P46180q68592l191926j661672K917864
$$ plain form
37814 17386191 21757867 23291304 23756260 27029034 30690248 29134843 23524748 20402144
37806 20402144 20755743 19208029 14962029 14302107 19419199 23583344 21942341 19457664
37798 19457664 22515239 28867068 31898159 30083187 26548897 23253793 20876133 20975819
37790 20975819 23462362 25195863 25171149 27045411 32275592 35633194 32898666 28099188
37782 28099188 26684561 26270176 22001695 17219053 19518916 28129038 34529000 35173249
37774 35173249 34527147 34919331 32600055 26123705 20256962 18168626 16957003 14651037
37766 14651037 14922311 20321559 26556400 28412379 26824802 25538556 24980619 24087308
37758 24087308 24341220 27011284 29370124 28243182 24701575 21259063 17626050 13614740
$$ packed form
37814A7386191M371676J533437M64956L272774L661214j555405n610095l122604
37806B0402144L53599j547714m246000o59922N117092M164145j641003k484677
37798A9457664L057575O351829L031091j814972l534290l295104k377660R9686
37790B0975819K486543J733501k4714J874262N230181L357602k734528m799478
37782B8099188j414627m14385m268481m782642K299863Q610122O399962O44249
37774C5173249o46102L92184k319276o476350n866743k088336j211623k305966
37766A4651037K71274N399248O234841J855979j587577j286246n57937q93311
37758B4087308K53912K670064K358840j126942l541607l442512l633013m011310
$$ plain form
37750 13614740 12652512 16941695 22219330 23456901 23088771 26468241 31061392 28762494
37742 28762494 19407098 13260638 16895435 23697345 23150285 14635120 6940686 7031253
$$ packed form
37750A3614740r62228M289183N277635J237571l68130L379470M593151k298898
37742B8762494r355396o146460L634797O801910n47060q515165p694434R0567
$$ [...]
##END NTUPLES=NMR SPECTRUM
##END=
