##TITLE=31Pdec_SR129_k2
 DMSO-d6, 24 sc
 7.7.2022
##JCAMPDX= 6.0         $$ Bruker NMR JCAMP-DX V2.0
##DATA TYPE= NMR SPECTRUM
##DATA CLASS= NTUPLES
##ORIGIN= UXNMR, Bruker Analytische Messtechnik GmbH
##OWNER= root
$$ XWIN-NMR		Version 3.5
$$ Thu Jul  7 15:26:10 2022 Russian Standard Time (UT+4h)  she@DPX200
##.OBSERVE FREQUENCY= 81.013821
##.OBSERVE NUCLEUS= ^31P
##.ACQUISITION MODE= SIMULTANEOUS
##.ACQUISITION SCHEME= undefined
##.AVERAGES= 124
##.DIGITISER RES= 16
##SPECTROMETER/DATA SYSTEM= spect
##.PULSE SEQUENCE= zgpg30
##.SOLVENT NAME= CD2Cl2
##.SHIFT REFERENCE= (INTERNAL, CD2Cl2, 0, 248.564)
##AUDIT TRAIL= $$ (NUMBER, WHEN, WHO, WHERE, WHAT)
$$ ##TITLE= Audit trail, XWIN-NMR		Version 3.5
$$ ##JCAMPDX= 5.01
$$ ##ORIGIN= Bruker BioSpin GmbH
$$ ##OWNER= she
$$ F:/spectra/data/she/nmr/P31/1/pdata/1/auditp.txt
$$ ##AUDIT TRAIL=  $$ (NUMBER, WHEN, WHO, WHERE, WHAT)
(   1,<2022-07-07 15:06:05.62 +0400>,<she>,<DPX200>,
      <continue with go, POWCHK disabled, PULCHK disabled
       configuration hash MD5:
       00 E9 B6 7A A2 85 ED C7 34 08 36 98 17 FE 4E 26
       data hash MD5: 32K
       52 48 B9 4C CD 6F 01 0B BA A3 B0 FE 3B 7C 9D 63>)
(   2,<2022-07-07 15:25:05.51 +0400>,<she>,<DPX200>,
      <Start of raw data processing
       efp BC_mod = 2 LB = 1 FT_mod = 6 PKNL = 1 PHC0 = -10181.4 PHC1 = 702.0562 SI = 64K 
       data hash MD5: 64K
       51 C6 49 53 58 32 2F 12 6C CD 47 B5 26 7C 67 E2>)
(   3,<2022-07-07 15:25:38.50 +0400>,<she>,<DPX200>,
      <pk PHC0 = -56.76971 PHC1 = 129.8002 
       data hash MD5: 64K
       2D 08 82 22 84 D9 2A 72 47 62 50 17 68 7C F1 E8>)
(   4,<2022-07-07 15:25:41.75 +0400>,<she>,<DPX200>,
      <abs ABSG = 5 
       data hash MD5: 64K
       B4 74 98 98 AC 51 42 42 1D 3F DF 77 83 43 46 9D>)
$$ ##END=
$$ 
$$ hash MD5
$$ 98 EF C9 5A 1F 0C A0 41 73 08 7C 9B 2D 63 8B 3D
##$RELAX= 
##$RELAX= 
##$RELAX= 
##$RELAX= 
##$RELAX= 
##$RELAX= 
##$RELAX= 
##$RELAX= 
$$ Bruker specific parameters
$$ --------------------------
##$DU= <F:/spectra>
##$EXPNO= 1
##$NAME= <P31>
##$PROCNO= 1
##$TYPE= <nmr>
##$USER= <she>
##$AMP= (0..31)
100 100 100 100 100 100 100 100 100 100 100 100 100 100 100 100 100 100 
100 100 100 100 100 100 100 100 100 100 100 100 100 100 
##$AQSEQ= 0
##$AQ_mod= 1
##$AUNM= <au_zg>
##$AUTOPOS= <>
##$BF1= 81.014009
##$BF2= 200.13
##$BF3= 200.13
##$BF4= 200.13
##$BF5= 200.13
##$BF6= 200.13
##$BF7= 200.13
##$BF8= 200.13
##$BYTORDA= 1
##$CFDGTYP= 0
##$CFRGTYP= 5
##$CHEMSTR= <none>
##$CNST= (0..31)
1 1 145 1 1 1 1 1 1 1 1 1 1 1 1 1 1 1 1 1 1 1 1 1 1 1 1 1 1 1 1 1 
##$CPDPRG= <waltz16>
##$CPDPRG1= <>
##$CPDPRG2= <waltz16>
##$CPDPRG3= <>
##$CPDPRG4= <mlev>
##$CPDPRG5= <mlev>
##$CPDPRG6= <mlev>
##$CPDPRG7= <mlev>
##$CPDPRG8= <mlev>
##$CPDPRGB= <>
##$CPDPRGT= <>
##$D= (0..31)
0 1 0 0 0 0 0 0 0 0 0 0.03 2e-05 3e-06 0 0 0 0 0 0 0 0 0 0 0 0 0 0 0 0 
0 0 
##$DATE= 1657191796
##$DBL= (0..7)
120 120 120 11 120 120 24 19 
##$DBP= (0..7)
150 150 150 150 150 150 150 150 
##$DBP07= 0
##$DBPNAM0= <>
##$DBPNAM1= <>
$$ [...]
##$SUBNAM3= <"">
##$SUBNAM4= <"">
##$SUBNAM5= <"">
##$SUBNAM6= <"">
##$SUBNAM7= <"">
##$SUBNAM8= <"">
##$SUBNAM9= <"">
##$SW= 501.771253377433
##$SWIBOX= (0..15)
0 1 3 0 0 0 0 0 0 0 0 0 0 0 0 0 
##$SW_h= 40650.406504065
##$TD= 32768
##$TD0= 1
##$TE= 0
##$TE2= 300
##$TE3= 300
##$TEG= 300
##$TL= (0..7)
0 120 53 12 22 120 120 120 
##$TP= (0..7)
150 150 150 150 150 150 150 150 
##$TP07= 0
##$TPNAME0= <>
##$TPNAME1= <>
##$TPNAME2= <>
##$TPNAME3= <>
##$TPNAME4= <>
##$TPNAME5= <>
##$TPNAME6= <>
##$TPNAME7= <>
##$TPOAL= (0..7)
0.5 0.5 0.5 0.5 0.5 0.5 0.5 0.5 
##$TPOFFS= (0..7)
0 0 0 0 0 0 0 0 
##$TUNHIN= 0
##$TUNHOUT= 0
##$TUNXOUT= 0
##$USERA1= <user>
##$USERA2= <user>
##$USERA3= <user>
##$USERA4= <user>
##$USERA5= <user>
##$V9= 5
##$VALIST= <valist>
##$VCLIST= <CCCCCCCCCCCCCCC>
##$VD= 0
##$VDLIST= <DDDDDDDDDDDDDDD>
##$VPLIST= <PPPPPPPPPPPPPPP>
##$VTLIST= <TTTTTTTTTTTTTTT>
##$WBST= 1024
##$WBSW= 4
##$XGAIN= (0..3)
0 0 0 0 
##$XL= 0
##$YL= 0
##$YMAX_a= 5073
##$YMIN_a= -5648
##$ZGOPTNS= <>
##$ZL1= 120
##$ZL2= 120
##$ZL3= 120
##$ZL4= 120
##$ABSF1= 248.5645
##$ABSF2= -253.2056
##$ABSG= 5
##$ABSL= 3
##$ALPHA= 0
##$AQORDER= 0
##$ASSFAC= 0
##$ASSFACI= 0
##$ASSFACX= 0
##$ASSWID= 0
##$AUNMP= <proc_1d>
##$AZFE= 0.1
##$AZFW= 0.5
##$BCFW= 0
##$BC_mod= 2
##$BYTORDP= 0
##$COROFFS= 0
##$CY= -3
##$DATMOD= 1
##$DC= 0
##$DFILT= <>
##$DTYPP= 0
##$F1P= 0
##$F2P= 0
##$FCOR= 1
##$FTSIZE= 65536
##$FT_mod= 6
##$GAMMA= 0
##$GB= 0
##$INTBC= 1
##$INTSCL= 5.30512e-09
##$ISEN= 30
##$LB= 1
##$LEV0= 0
##$LPBIN= 0
##$MAXI= 10000
##$MC2= 0
##$MEAN= 0
##$ME_mod= 0
##$MI= 50
##$NCOEF= 0
##$NC_proc= -8
##$NLEV= 6
##$NOISF1= 182.463
##$NOISF2= 159.3651
##$NSP= 0
##$NTH_PI= 0
##$NZP= 0
##$OFFSET= 248.5645
##$PC= 4
##$PHC0= -10238.17
##$PHC1= 831.8564
##$PH_mod= 1
##$PKNL= yes
##$PPARMOD= 0
##$PSCAL= 0
##$PSIGN= 0
##$REVERSE= no
##$SF= 81.014009
##$SI= 65536
##$SIGF1= 159.3651
##$SIGF2= -187.1042
##$SINO= 113.3802
##$SIOLD= 16384
##$SREGLST= <1H.CDCl3>
##$SSB= 0
##$STSI= 65536
##$STSR= 0
##$SW_p= 40650.406504065
##$SYMM= 0
##$S_DEV= 0
##$TDeff= 32768
##$TDoff= 0
##$TI= <>
##$TILT= no
##$TM1= 0
##$TM2= 0
##$TOPLEV= 0
##$USERP1= <user>
##$USERP2= <user>
##$USERP3= <user>
##$USERP4= <user>
##$USERP5= <user>
##$WDW= 1
##$XDIM= 65536
##$YMAX_p= 481985219
##$YMIN_p= -122292676
$$ End of Bruker specific parameters
$$ ---------------------------------
##NTUPLES= NMR SPECTRUM
##VAR_NAME=  FREQUENCY,     SPECTRUM/REAL,   SPECTRUM/IMAG
##SYMBOL=    X,             R,               I
##VAR_TYPE=  INDEPENDENT,   DEPENDENT,       DEPENDENT
##VAR_FORM=  AFFN,          ASDF,            ASDF
##VAR_DIM=   65536,         65536,           65536
##UNITS=     HZ,            ARBITRARY UNITS, ARBITRARY UNITS
##FACTOR=    0.620285442955139, 1,           1
##FIRST=     20137.2065510759, 0,            0
##LAST=      -20513.1999529892, 0,           0
##MIN=       -20513.1999529892, -122292676,  0
##MAX=       20137.2065510759, 481985219,    0
$$ Real data points
##PAGE= N=1
##DATA TABLE= (X++(R..R)), XYDATA
$$ [...]
##PAGE= N=2
##DATA TABLE= (X++(I..I)), XYDATA
12924I813561M718977m747909p612132n178208k301798p6671K07953k538003k907688
12915a0621918M750083J2854075P887017o819487j2296417k572159N764508O37995
12907d16303o928394l436723M332336L233748k580296m38016P062487O372889
12899G201728k997461p148846k26175P773611P727550K564521j623234m590538
12891H681156p688183q695421n163455J756922Q432853J0267957L908816p049024
12883D451621j1905733n502587K701312J313410n091125l062858O842597R844208
12875d09155J726642l064092M320725J0663309J609923j3113621j2835512K147340
12867h954441J0987130M278620l454066R02447Q293275L979834p472073r613415
$$ plain form
12924 9813561 14532538 9784629 2172497 -3005711 -5307509 -5384180 -5176227 -7714230 -10621918
12915 -10621918 -5871835 6982240 14869257 8049770 -4246647 -6818806 -1054298 -416303
12907 -416303 -7344697 -10781420 -6449084 -3215336 -5795632 -6233648 828839 7201728
12899 7201728 4204267 -2944579 -3170754 4602857 12330407 14894928 13271694 8681156
12891 8681156 992973 -7702448 -12865903 -11108981 -2676128 7591829 11500645 4451621
12883 4451621 -7454112 -12956699 -10255387 -8941977 -14033102 -17095960 -10253363 -409155
12875 -409155 1317487 -1746605 2574120 13237429 14847352 1733731 -11101781 -8954441
12867 -8954441 2032689 6311309 2857243 3759690 12052965 16032799 8560726 -1052689
12859a052689p57098L705514l831242j1413689o349219O124111J1800478P374389
12851E600555J633253R66446L032885L700097K490862N09152j424321j882051
12843A4626878k95563P32255j469435m680463m172083Q9865K836338N71815m279477
12834C960130p036043n940678l064652j570360k115770j761843K042390O939600
12826h547226Q745696Q356508R328204Q605479o40652j4151992j6782402m766962
12818i853347M833227j471791j1617118o537239Q739928J2987541K969078l025556
12810b975277L366640Q426577K113567m511107J252831J2583719J4271867M356295
12802C8885112o858420j1847129j0647124o619416m306477o007673o588296R13463
$$ plain form
12859 -1052689 -1809787 1895727 -1935515 -13349204 -19698423 -13574312 -1773834 5600555
12851 5600555 7233808 8200254 11233139 14933236 17424098 17933250 16508929 14626878
12843 14626878 14331315 15063570 13594135 8913672 4741589 4831454 7667792 8239607 3960130
12834 3960130 -3075913 -9016591 -12081243 -13651603 -15767373 -17529216 -15486826 -8547226
12826 -8547226 198470 8554978 17883182 26488661 25848009 11696017 -5086385 -9853347
12818 -9853347 -5020120 -6491911 -18109029 -24646268 -15906340 -2918799 50279 -2975277
12810 -2975277 391363 8817940 10931507 6420400 7673231 20256950 34528817 38885112
12802 38885112 32026692 20179563 9532439 2913023 -1393454 -7401127 -13989423 -13075960
12794a3075960J2008501J3472098L016673n718733l347398K521703J978033j949178
12786H905739j824749J079537J792664Q38196J8126k310680m726504j443440N878974
12777H207863O707209r12730n068475n37170J067800p064455j1984514k801392
12769a2385864Q563698O863528o44021R87557O307637N11003j0541485p875738
12761h213685P269546J4042495N861494j224028K735723P486192L327394l852527
12753B7432604n972557n103415n253493m993990l633025l129524j131806N739331
12745C954125J1000739N162737n972665o746720K625241M609537o482708j3602439
12737e452153m333672Q778009P893108m035614j0530787n287422L940295Q683889
$$ plain form
12794 -13075960 -1067459 12404639 15421312 9702579 6355181 8876884 10854917 8905739
12786 8905739 7080990 8160527 9953191 10791387 10809513 8498833 3772329 2328889 8207863
12777 8207863 14915072 14002342 8933867 8396697 9464497 2400042 -9584472 -12385864
12769 -12385864 -3822166 3041362 2397341 3384898 9692535 10203538 -337947 -8213685
12761 -8213685 -944139 13098356 18959850 17735822 20471545 27957737 31285131 27432604
12753 27432604 21460047 16356632 11103139 6109149 2476124 -653400 -1785206 3954125
12745 3954125 14954864 20117601 14144936 7398216 10023457 14632994 8150286 -5452153
12737 -5452153 -9785825 -1007816 6885292 2849678 -7681109 -12968531 -9028236 -344347
12729c44347O809170Q26561l625524j874827K924680K656843l472229p265579
12721c365252m617612r43501l73910L41475L028946L319596n80559l714381l009646
12712i914844q00317K688463R047390J1853121J656447j4947514j7609625j216779
12704a9243658J3677152R848546k730010n255621J762286N000338K258637K012170
12696G329840N114182L768842l451644r123453q599883l930685J997986O633258
12688b61557N975945l26054n435763l998633j8226N58981o84622J94605J458242
12679b537082P45489J211873M298207M147285j581730m095634K367916P934132
12671A2490456K095654p175048n417952L713144M096868n850013j0843907l883801
$$ plain form
12729 -344347 6464823 7291384 3665860 1791033 4715713 7372556 3900327 -3365252
12721 -3365252 -7982864 -8926365 -9300275 -8958800 -5929854 -2610258 -3190817 -6905198 -9914844
12712 -9914844 -10715161 -8026698 1020692 12873813 14530260 -417254 -18026879 -19243658
12704 -19243658 -5566506 4282040 1552030 -3703591 -1941305 3059033 5317670 7329840
12696 7329840 12444022 16212864 12761220 3637767 -4962116 -8892801 -6894815 -261557
12688 -261557 5714388 5388334 -47429 -4046062 -4064288 -3505307 -4189929 -3995324 -2537082
12679 -2537082 -1791593 -579720 3718487 7865772 6284042 2188408 4556324 12490456
12671 12490456 14586110 7411062 1993110 5706254 9803122 3953109 -6890798 -10774599
12663a0774599M417054N212404L809003O676960R752255P166006J354489k442264
12655B5171308l709067l158741P60238O581564P808277J487172o579050r587509
12647A8774192p852243n464420l720572j867456l84368K97950J347736K772108
12639C902927J854328k758823p450145o856214k3796Q156452J1531437Q319727
12631A6675893K184882k347613m413430n280484m433147j258621J007434p88266
12623A346648k588843J977257R195694Q098748j653789o714219o45776M994789
12615A4010509m81992q758430o027316M712603R644684N845964J642862k48206
12607B0340678l974536p103977k099843P925924R689542r52580j2257983j2618158
$$ plain form
12663 -10774599 -6357545 -1145141 2663862 9340822 19093077 26259083 27613572 25171308
12655 25171308 21462241 18303500 19063738 25645302 33453579 34940751 28361701 18774192
12647 18774192 10921949 5457529 1736957 -130499 -514867 -216917 1130819 3902927
12639 3902927 5757255 2998432 -4451713 -11307927 -11331723 -3175271 8356166 16675893
12631 16675893 18860775 16513162 12099732 6819248 2386101 1127480 2134914 1346648
12623 1346648 -1242195 735062 9930756 18029504 16375715 9661496 9015720 14010509
12615 14010509 13528517 4770087 -1257229 3455374 13100058 18946022 20588884 20340678
12607 20340678 16366142 9262165 7162322 15088246 24777788 23825208 11567225 -1050933
12599a050933l550941N833685Q689803L226453o227678j0284601m245819M032436
12591c577595M045107k031343l822416Q4054J544970j616021k259180K905812
12583d726612Q204034Q389046L573645m576717j1792620r275874N006785J6542013
12575A1343700J0358957o073747j2513850n746602m35906j724841L12361O904576
12567B424648N754226l999757o394207K713224N963487m491239j0794948l06526
12559i131092J0657148M331458p884562o050338M034104L262783o539387p744144
12551a5064030J607798P343345N540547N198671P311061M178716j849318r04966
12543A3361824L847469r4730j0172129j0284205J206660P253826M20614o049733
$$ plain form
12599 -1050933 -4601874 1231811 9921614 13148067 6920389 -3364212 -7610031 -3577595
12591 -3577595 467512 -1563831 -5386247 -5302193 -3757223 -5373244 -7632424 -4726612
12583 -4726612 3477422 11866468 15440113 10863396 -929224 -10205098 -5198313 11343700
12575 11343700 21702657 15628910 3115060 -2631542 -3067448 -4792289 -4479928 2424648
12567 2424648 8178874 4179117 -2215090 498134 6461621 1970382 -8824566 -9131092
12559 -9131092 1526056 5857514 -2027048 -8077386 -4043282 -780499 -7319886 -15064030
12551 -15064030 -13456232 -6112887 -572340 4626331 11937392 16116108 14266790 13361824
12543 13361824 17209293 17114563 6942434 -3341771 -2135111 5118715 5539329 -510404
12535e10404k215009L587075K432192o45960L71723J160078j200542k34493N664785
12526H409445N594135n481956j4403682r129117J822180L788941q34090q7880
12518a0322024N149645M243508k192423k669671M138253N953469k081421q127820
12510e908484k289646P487414P703482l39025l405684L432384J0082243O905539
12502B3668223j399342l317693K359893M987000j711039r540225p139733L454336
12494A1361420R042927K869351p354095j0446614m712843K928350O136962L847752
12486A3673210j414767o344533q629823p702156l964111J828507P226385Q126207
12478B798919L161097l436501o706850o835382o171300l218340L996030J0320934
$$ plain form
12535 -510404 -2725413 861662 3293854 2647894 3019617 4179695 2979153 2744660 8409445
12526 8409445 14003580 8521624 -5882058 -15011175 -13188995 -9400054 -10234144 -10322024
12518 -10322024 -5172379 -928871 -3121294 -5790965 -1652712 4300757 2219336 -5908484
12510 -5908484 -8198130 -710716 6992766 6653741 3248057 6680441 16762684 23668223
12502 23668223 22268881 18951188 21311081 26298081 24587042 15046817 7907084 11361420
12494 11361420 20404347 23273698 15919603 5472989 760146 3688496 9825458 13673210
12486 13673210 12258443 5913910 -2715913 -10418069 -14382180 -12553673 -5327288 2798919
12478 2798919 5960016 2523515 -4183335 -11018717 -17190017 -20408357 -16412327 -6091393
12470f091393P455143l674865j2129747j0578729l036154K945472M895523L886534
12462a6328216J619657K072881Q495790J4990055R618202q046642k0835127j4408828
12454b2822228K537283R552233K492678k415345O186436J7870936J5780860Q93167
12446C0076020r419386n265713L688123L950563k302227k836772L064228J726978
12438B2681814j2227216k2643116j2158661J1627840K4014903J4846211j366220
12431B4775555p865582m709431j042912k20744k0615L20163L13615L28139p03501
12422A1174687m138584n989278m13384Q568555Q887830j644862j0091689p251156
12414h97881m88203L77187j498169P30019L498796Q85567k090386J715209O713953
$$ plain form
12470 -6091393 1363750 -2311115 -14440862 -25019591 -28055745 -25110273 -20214750 -16328216
12462 -16328216 -14708559 -12635678 -4139888 10850167 20468369 12421727 -8413400 -22822228
12454 -22822228 -20284945 -10732712 -8240034 -10655379 -4468943 13401993 29182853 30076020
12446 30076020 20656634 15390921 19079044 23029607 20727380 17890608 20954836 22681814
12438 22681814 10454598 -12188518 -24347179 -12719339 11295564 26141775 24775555
12431 24775555 16909973 12200542 11157630 10936886 10916271 11236434 11550049 11878188 11174687
12422 11174687 7036103 1046825 633441 9201996 18089826 16444964 6353275 -897881
12414 -897881 -1386084 -1008897 -2507066 -1777047 1721749 2607316 516930 2232139 8946092
12405H946092L483763l426105k590077L772656L479657l634409n228118J579624
12397F383083N344618N67139l601811k72079M165535K656945j365341k639994
12389A1238095l273532o166589q116178n858710j606815J964703M844709N158913
12381a815404N86007l678065L82294Q367499O588254m982684q651740L574853
12373C71014J4452627O600556j0280279j4011506k564554O158656K745910l336873
12365A35551k108150L169371M200034p05629o951776r222377n009531K884691
12357a3607816P809358O966469M928837N462863M884617m68671n903957n467034
12349D604666k090772j580200j487337L473895R084433O646810k018534o738526
$$ plain form
12405 8946092 12429855 9003750 6413673 10186329 13665986 10031577 4803459 6383083
12397 6383083 11727701 12294840 8693029 8420950 12586485 15243430 13878089 11238095
12389 11238095 7964563 1797974 -6318204 -12176914 -13783729 -11819026 -6974317 -1815404
12381 -1815404 -1229397 -4907462 -4525168 3842331 10430585 5447901 -3203839 371014
12373 371014 14823641 21424197 11143918 -2867588 -5432142 726514 3472424 135551
12365 135551 -1972599 1196772 5396806 4691177 -2260599 -11482976 -16492507 -13607816
12357 -13607816 -5798458 1168011 6096848 11559711 16444328 15975657 10071700 4604666
12349 4604666 2513894 933694 -553643 2920252 12004685 18651495 16632961 9894435
12341I894435n004503l602239m508855k137061L688023M970877k95470k977244
12333B7963K608423R104952P853442J879854m95510R55777n46460o970167j1462566
12324B955708o788690N090099J3221982Q699521m110074j1169532o336028K84780
12316A847766k496346r613561p621034M131519J2658569J0831549N092262K306448
12308A7137172J109064n40626m62711R44244r26279n629669o345676j586729J587025
12299E285815j45751j266826J183337K238408K04739J570962Q163255J0988791
12291B8222730M740618k735808m058101m048690q023465r848004l690593K793274
12283C351961P43439l511733O26213Q289527O798842k205359n437398r3744L554317
$$ plain form
12341 9894435 4889932 1287693 -3221162 -5358223 -1670200 3300677 3005207 27963
12333 27963 2636386 11741338 19594780 21474634 20979124 21934901 21388441 14418274 2955708
12324 2955708 -3832982 1257117 14479099 23178620 19068546 7899014 1562986 1847766
12316 1847766 -648580 -10262141 -17883175 -13751656 -1093087 9738462 14830724 17137172
12308 17137172 18246236 17705610 17242899 18187143 17260864 11631195 5285519 3698790 5285815
12299 5285815 5140064 3873238 5056575 7294983 7499722 9070684 17233939 28222730
12291 28222730 32963348 30227540 26169439 22120749 14097284 4249280 558687 3351961
12283 3351961 4095400 583667 1209880 9499407 16298249 14092890 8655492 8561748 12116065
12274A2116065J080944q93127M18207m65584m014907k830562L443862M131738
12266A2986636n294781j3971201j0921265J46291Q603382J0991779R845559N867243
12258A8253643k95965l652329m95400M528928L931719k030360o421273n992794
12250G826169m410143m847406n057136k471975j28194k464127o212996k037026
12242a9802834J1271972K0152896J1811471o540931j4648067o011255M261445
12235D94697K521978n154787o084785r06758J486640M37706J619927M422932M377851
12226C215401L725276O681114Q389553K096080o668482p668130l974368n950038
12218a53594j0076059l054407J2537317J7261444M222300r670445r188775k38174
$$ plain form
12274 12116065 13197009 12303882 12722089 12256505 8241598 5411036 8854898 12986636
12266 12986636 7691855 -6279346 -17200611 -17054320 -8450938 2540841 12386400 18253643
12258 18253643 17957678 14305349 13809949 18338877 22270596 20240236 13818963 7826169
12250 7826169 3416026 -1431380 -6488516 -8960491 -9088685 -11552812 -17765808 -19802834
12242 -19802834 -8530862 11622034 23433505 16892574 2244507 -3766748 494697
12235 494697 3016675 -2138112 -8222897 -9129655 -7643015 -7205309 -5585382 -1162450 3215401
12226 3215401 6940677 13621791 22011344 24107424 17438942 9770812 5796444 -153594
12218 -153594 -10229653 -13284060 -746743 16514701 20737001 11066556 1877781 1639607
12210A639607M947022N951549O928652N164149j524783p009085o725981n376163
12202C994967o303502m321668K388912N538127J422328n45631N192867Q425988
12194A5792388J120495o439082l105624K479137k566771j0174246l747895J1204490
12186D562892J2837967k172774j2736681n682222O429666O742004l041894r860740
12178b921782p517759L31196P247904Q234683L003407j992089o45928L432807
12170I172439K266964k607693j865616N408724Q703321K269882o239350p744932
12162I363739l412327K12965J04013l236363p715016q435378j714622O902417
12154g930572O530518l761821j1539658p036957M920777J3364292J3998383Q700091
$$ plain form
12210 1639607 6586629 12538178 19466830 24630979 23106196 16097111 9371130 3994967
12202 3994967 -2308535 -6630203 -4241291 1296836 2719164 2173533 7366400 15792388
12194 15792388 16912883 10473801 7368177 9847314 7280543 -2893703 -6641598 4562892
12186 4562892 17400859 15228085 2491404 -3190818 3238848 9980852 6938958 -2921782
12178 -2921782 -10439541 -10108345 -2860441 5374242 8377649 6385560 5739632 9172439
12170 9172439 11439403 8831710 6966094 12374818 21078139 23348021 17108671 9363739
12162 9363739 5951412 6164377 6268390 3032027 -4682989 -13118367 -14832989 -7930572
12154 -7930572 -1400054 -5161875 -16701533 -23738490 -18817713 -5453421 8544962 17245053
12146A7245053l1913p696125p584010M17922N691778o01579j2063819j3925083
12138a8547776k110146J1746198J5029528P996978N16373r18260J255370K114583
12130A7082848J461736J451943J44955o097809j3525057j2209271k67991J0578143
12122a380503J0055982L107023K20627O79824k935918q297633n867873L016459
12114a402012N572153k237532q686163m392291M747183Q943547P958880N984005
12106A6487770K655498k823189o400204n677605m859847o304071m452562M105114
12098g269096J1662120R506496J304192k906739j525263p79185k871334m417021
12090B704170m645245n771656n971654r86567O579410P843072m6303q615832q455199
$$ plain form
12146 17245053 17213140 9517015 1933005 2350927 8042705 7441126 -4622693 -18547776
12138 -18547776 -20657922 -8911724 6117804 14114782 14631155 13712895 14968265 17082848
12130 17082848 18544584 19996527 20141482 14043673 518616 -11690655 -11958646 -1380503
12122 -1380503 8675479 11782502 12003129 12682953 9747035 1449402 -4418471 -1402012
12114 -1402012 4170141 1932609 -6753554 -11145845 -6398662 2544885 10503765 16487770
12106 16487770 19143268 16320079 9919875 4242270 -617577 -6921648 -11374210 -7269096
12098 -7269096 4393024 13899520 15203712 12296973 10771710 9992525 7121191 2704170
12090 2704170 -1941075 -7712731 -13684385 -14670952 -8091542 -248470 -294773 -8910605 -17365804
12081a7365804n91332O063381O279196L808350M624613P479135M967878m833746
12073A0431671j2432550q014653M213572J0468229N761691r76381j832162k62725
12065G356692j909773m086167j693448K974556M185825J968497K29450n53487
12057H472145k115520l191328j786446J82567K855j108546j188010j523035k703086
12048d958404j732933J379911L59005o574368r175814J169088J4828143J3502900
12040H797528m270581j9081675j4577394L929821J8377985J8255408P802842k089196
12032A7144738m670057j576388J229756Q02723j111694l214019o448248q815545
12024f658734m996220M293498R248071L874732m246252n062519q49678j30529
$$ plain form
12081 -17365804 -17957136 -11893755 -5614559 -1806209 2818404 10297539 15265417 10431671
12073 10431671 -2000879 -10015532 -5801960 4666269 10427960 9451579 7619417 7356692
12065 7356692 5446919 1360752 -332696 2641860 6827685 8796182 9025632 8472145
12057 8472145 6356625 3165297 1378851 1561418 1564273 455727 -732283 -2255318 -4958404
12048 -4958404 -6691337 -5311426 -4952421 -11526789 -20702603 -19533515 -4705372 8797528
12040 8797528 4526947 -14554728 -29132122 -25202301 -6824316 11431092 19233934 17144738
12032 17144738 12474681 10898293 12128049 12930772 11819078 8605059 2156811 -6658734
12024 -6658734 -11654954 -7361456 1886615 5761347 1515095 -3547424 -4397102 -4527631
12016d527631k285128l32897M392139L843606j330030j622654M670601P824767
12008A0632773L100247j573946N25418M394076L065070j517353m299604n591394
12000H735287o537992l711050L561018P008006K21146q840058o860579M919723
11992a504499J0942166L560720n431994k187605P853886P104680p313353j6802439
11984c778438p231551R337681J1076398j922142q898176p20862P865491M215121
11976I943522k652325o75037L389755j960484r586282n166180O094790O738676
11968F126435l095816o527030k2632J739040n391676o103960O136961J5028040
11960G889362Q300376j679099n868N420190n09485j2290061j2353162J40716R135553
$$ plain form
12016 -4527631 -6812759 -7145656 -2753517 1090089 -239941 -1862595 2808006 10632773
12008 10632773 13733020 12159074 12684492 17078568 20143638 18626285 14326681 8735287
12000 8735287 2197295 -1513755 2047263 9055269 9276415 436357 -6424222 -1504499
11992 -1504499 9437667 12998387 7566393 5378788 13232674 20337354 13024001 -3778438
11984 -3778438 -11009989 -1672308 9404090 7481948 -1416228 -2137090 5728401 9943522
11976 9943522 7291197 6616160 10005915 8045431 -1540851 -6707031 -612241 6126435
11968 6126435 3030619 -3496411 -3519043 -1780003 -7171679 -13275639 -7138678 7889362
11960 7889362 16189738 14510639 14504771 19924961 19415476 7125415 -5227747 -5087031 4048522
11951D048522P328920L905681N957306P614818J925947p155295j0188890m527377
11943H909632K555433K030750n875613j0244971l056846P662792O890997n188690
11935C683484j2018483n027566M402881M251126n26942j4349L325099K097139
11927A72389j176791j15344K759391K268719J677587M613981M528744l467616
11919A1261060r187018k317421P531723M728685n267164m280574P078024R808519
11911A9355834j375398r836781n112351K615571L033737Q00383J373243l12269
11903A0541969o743047r086238k370198M292340L197055P21072L447492M267927
11895H268372m634437j5219021j3976939j997714P898882R066230N297836J590375
$$ plain form
11951 4048522 11377442 15283123 21240429 28855247 30781194 23625899 13437009 8909632
11943 8909632 11465065 13495815 7620202 -2624769 -5681615 1981177 8872174 3683484
11935 3683484 -8334999 -13362565 -8959684 -4708558 -5235500 -5249849 -1924750 172389
11927 172389 -1004402 -1119746 1639645 3908364 5585951 10199932 14728676 11261060
11919 11261060 2074042 -243379 7288344 12017029 6749865 2469291 9547315 19355834
11911 19355834 17980436 8143655 3031304 5646875 8680612 9480995 10854238 10541969
11903 10541969 3798922 -5287316 -7657514 -3365174 -168119 552953 4000445 8268372
11895 8268372 3633935 -11585086 -25562025 -27559739 -19660857 -10594627 -5296791 -3706416
11887c706416K20357K271653N118826K547811n815607j0540256m749420N365735
11879i287317R292833N176577k554752j0618455j4123765n755810J1558928J9983136
11871C671375Q140367r788454j1321459L008580J2128663N732900m728178p622319
11863g78525n932663n086123j866678N695812R901509N217953r12255R1466K846906
11854I177402l040114j3614721j3765428K32808J3868889J3931558M680138j888638
11846I581894l499828n587712o916689q0246J2714765J6984936N512823r197592
11838A9512351j1451764m176765k322724q921641j2058806n443740K917841O148844
11830a5796404Q156069J1148499P477734n378993j3681006n589578P977429P308098
$$ plain form
11887 -3706416 -3486059 -1214406 3904420 6452231 636624 -9903632 -14653052 -9287317
11879 -9287317 5516 5182093 2627341 -7991114 -22114879 -27870689 -16311761 3671375
11871 3671375 11811742 2023288 -9298171 -6289591 5839072 11571972 6843794 -778525
11863 -778525 -6711188 -11797311 -13663989 -7968177 1933332 7151285 6239030 6330496 9177402
11854 9177402 6137288 -7477433 -21242861 -21010053 -7141164 6790394 11470532 9581894
11846 9581894 6082066 494354 -6422335 -6502581 6212184 23197120 28709943 19512351
11838 19512351 8060587 3883822 1561098 -7360543 -19419349 -24863089 -21945248 -15796404
11830 -15796404 -7640335 3508164 10985898 5606905 -8074101 -13663679 -5686250 1621848
11822A621848n690656r458277L773875J4959924O587316j0670656j3114125J940700
11814a0050051J2892700N005589r114152q216376O840962J4209896K798829j1089085
11806C278312p217795R046090J5187817M779339n390597l074019K625216j08402
11798A9125961o367392n824078r52780M5732j195771N39402N50728o883213j2837646
11789a3799057m928039J0038228J3547966L805669k926816k7944J101674n481372
11781A330309r022299k616184L583148Q53086k449676L281859J0975813R097327
11773A5033383J021296k418284j119898j812111l027603Q76759N720858K837802
11765A7112202m406939m342922L553259P129945O13725p770604r739169o850221
$$ plain form
11822 1621848 -4068808 -13527085 -9753210 5206714 11794030 1123374 -11990751 -10050051
11814 -10050051 2842649 7848238 -1265914 -9482290 -2641328 11568568 14367397 3278312
11806 3278312 -3939483 5106607 20294424 25073763 19683166 16609147 19234363 19125961
11798 19125961 12758569 6934491 5981711 6027443 4831672 5371074 5921802 -961411 -13799057
11789 -13799057 -18727096 -8688868 4859098 8664767 5737951 5710007 6811681 1330309
11781 1330309 -7691990 -10308174 -6725026 -5871940 -8321616 -5039757 5936056 15033383
11773 15033383 16054679 13636395 12516497 10704386 7676783 8553542 14274400 17112202
11765 17112202 12705263 8362341 11915600 19045545 19659270 11888666 2149497 -4700724
11757d700724l041263K042160P606643Q778437M511691R73778J763545J548278
11749A9482545m521636j0788633p845691L564497J2293834J0177523P62794o159424
11741A6965809n440283l69281K900981K517600J313981J105965o5615l407818
11733A5521339n510901k891437J663016K158472j732356l776389Q0182O339495
11725A1851421Q801921N495293o96197n662639p060521n747704m941286o254558
11717d214270o979516l704248K205749N986879N623307K921874o60043m580068
11709c400336o131403k467641L771749O588150N115920L663160K559521k611680
11701G087440j0031304r919774J10951P691218L075942m509326n66081J0597526
$$ plain form
11757 -4700724 -7741987 -5699827 1906816 10685253 15196944 16170722 17934267 19482545
11749 19482545 14960909 4172276 -3673415 -108918 12184916 22362439 23125233 16965809
11741 16965809 11525526 11156245 14057226 16574826 17888807 18994772 18929157 15521339
11733 15521339 10010438 7119001 8782017 10940489 9208133 5431744 5511926 11851421
11725 11851421 20653342 26148635 25452438 19789799 12729278 6981574 2040288 -4214270
11717 -4214270 -11193786 -14898034 -12692285 -6705406 -1082099 1839775 1179732 -3400336
11709 -3400336 -9531739 -11999380 -8227631 -1639481 3476439 7139599 9699120 7087440
11701 7087440 -2943864 -12863638 -12752687 -5061469 -1985527 -6494853 -7060934 3536592
11693C536592J1353194j180539r848895m118405M340860J526245o998314o621903
11685h011165L101141R820463Q090399M033116K043582m45796m177679n226004
11677I228057l116804k265416k967075j04840O259928Q174797J853459n882454
11669A1179652p968869o042398l853474J00592O586553R746698N505543j9182
11661A5235115O58549L896448P08357q206725j2945291q612375m63126M614492
11653e114556M391398r364m739743l919372L451222R482287P539980K705832K785041
11644A6572725L414116m531746j5188281j2143996N229023J7078033J0982115
11637B1411989j478981n160104k990082m423540n742664J283324J0040978O929279
$$ plain form
11693 3536592 14889786 13709247 3860352 -258053 4082807 5609052 -1389262 -8011165
11685 -8011165 -4910024 4910439 13000838 17033954 19077536 18631740 14454061 9228057
11677 9228057 6111253 3845837 878762 773922 7033850 15208647 17062106 11179652
11669 11179652 3210783 -2831615 -6685089 -6584497 2056 9748754 15254297 15235115
11661 15235115 15893664 19790112 20498469 12291744 -653547 -9265922 -9729048 -5114556
11653 -5114556 -723158 -732522 -5472265 -9391637 -5940415 3541872 11081852 13787684 16572725
11644 16572725 19986841 15455095 266814 -11877182 -6648159 10429874 21411989
11637 21411989 19933008 14772904 11782822 7359282 1616618 2899942 12940920 19870199
11629A9870199n374637j0288478k636305M770735K197281m223428n469793k635536
11621c789962o11801Q33427K722123K139961j090560l77320P413122J3786046
11613B1025036Q961541l744129j1881470r516950j612560M918077O895103L187713
11605A8232361m228109p502696m5237J1612380J2129196j932958j4276697r406269
11597D581971N752740J1356682K209404o853708m093201L587336M124223j520347
11589A9145100m323938l177213m453929q829088r762013n035048j8308J978905
11581a4475532L957397P435944Q099595K731429n204275r861781q625741k392222
11573a8335186M921157P334031L375574P57394O535487J3953681J0168631k709804
$$ plain form
11629 19870199 14495562 4207084 1570779 6341514 8538795 4315367 -1154426 -3789962
11621 -3789962 -4401763 -3568336 -846213 1293748 203188 -174132 7238990 21025036
11613 21025036 29986577 26242448 14360978 4844028 3231468 8149545 15044648 18232361
11605 18232361 14004252 6501556 6456319 18068699 30197895 28264937 13988240 4581971
11597 4581971 10334711 21691393 23900797 17047089 12953888 16541224 20665447 19145100
11589 19145100 14821162 11643949 7190020 -1639068 -11401081 -16436129 -16454437 -14475532
11581 -14475532 -10518135 -3082191 5017404 7748833 2544558 -7317223 -15942964 -18335186
11573 -18335186 -13414029 -6079998 -2704424 -1947030 4588457 18542138 28710769 26000965
11565B6000965q170610l18455O805780J994224o281926o507031l078359m132074
11557F312514l234430Q125006J8740829J0030204j2981091k4345896j2680286
11550a0033150N062314R991336M360629O42559J681461J873228q80480l602128
11542I095769l710442n12604M561136O599557J556404o468503q792970m113389
11534a785042M93272J253408J505884K504984N45212l848705m049859J289486
11526b091360M686451K153729n80584Q30602J908764j050913l607803k160570
11518H8316r03362k475052j385340M451860N438295n065076j5899790j1488245
11510b7238394M659363J3715753P489918k325851k670860L935986N705934j664799
$$ plain form
11565 26000965 17830355 17511900 24317680 26311904 20029978 13522947 10444588 6312514
11557 6312514 3078084 11203090 29943919 39974123 26993032 2647136 -10033150
11550 -10033150 -4970836 5020500 9381129 10023688 11705149 13578377 12697897 9095769
11542 9095769 5385327 4872723 9433859 16033416 17589820 11121317 2328347 -1785042
11534 -1785042 -1291770 -38362 1467522 3972506 4517718 669013 -3380846 -2091360
11526 -2091360 2595091 4748820 4168236 4998838 6907602 5856689 2248886 88316
11518 88316 -815046 -3290098 -4675438 -223578 5214717 149641 -15750149 -27238394
11510 -27238394 -22579031 -8863278 -1373360 -3699211 -6370071 -2434085 3271849 1607050
11502A607050r908699q432448K906574J2658254J0731314O68809n506011l364525
11494A360318L68932M01003o93116r82498l220382n808069j363289Q929177J1676678
11485A0668754J223930q798439n535782L106277K819364l494195l686983P40401
11477b956673n98042n016593o44200J0155579J2440540L861939k651278k728105
11469A1863167n168824r331576j784155J6438734K2898287O936011j1502084j2232703
11461A8116857m542291o780115j3266313o398416R113473J1469871j987318r772322
11453d046574m19923J1293858R797358J144692j232225J292174j673466r980767
11445F175127j2769627n308203M532739P400964L023341k389576m782186m991791
$$ plain form
11502 1607050 -8301649 -16734097 -13827523 -1169269 9562045 10230854 4724843 1360318
11494 1360318 1729250 2130253 1437137 454639 -2765743 -8573812 -9937101 -1007924 10668754
11485 10668754 11892684 3094245 -2441537 664740 3484104 -10091 -3697074 -2956673
11477 -2956673 -3554715 -8571308 -9215508 940071 13380611 17242550 14591272 11863167
11469 11863167 6694343 -2637233 -4421388 12017346 34915633 41851644 30349560 18116857
11461 18116857 13574566 6794451 -6471862 -12870278 -3756805 7713066 5725748 -4046574
11453 -4046574 -4466497 6827361 16624719 17769411 16537186 17829360 16155894 6175127
11445 6175127 -6594500 -11902703 -7369964 31000 3054341 664765 -4117421 -9109212
11437i109212m305202j113915N461770J0486559O888120m229647j1993517q307912
11429a6222956J944564P812162N809199J188316j033053l455L381544O047536
11421H923857K349139q263982j5617965j0123708K022087O224861J652809J797484
11413a1035418R822865J0189140n231903j8331338r075498J1637289J4970800
11406B945937l073657j5207669m130389J2123782R405534n813523r013267L237185
11398i526067J0173809J513171p749630l708496M951921M009135k838525l456801
11390f631483K6334l630768j1725600q878248P533521K0345497J6073078J576153
11382A4688484q786397j0398923o061012J719456P782344M537633n474951p605088
$$ plain form
11437 -9109212 -13414414 -14528329 -9066559 1420000 8308120 4078473 -7915044 -16222956
11429 -16222956 -14278392 -6466230 -657031 531285 -501768 -505223 2876321 8923857
11421 8923857 11272996 3009014 -12608951 -22732659 -20710572 -14485711 -12832902 -11035418
11413 -11035418 -1212553 8976587 3744684 -14586654 -23662152 -12024863 2945937
11406 2945937 -127720 -15335389 -19465778 -7341996 2063538 -3749985 -12763252 -9526067
11398 -9526067 647742 2160913 -5588717 -9297213 -4345292 -336157 -3174682 -6631483
11390 -6631483 -6605149 -10235917 -21961517 -30839765 -23306244 -2960747 13112331 14688484
11382 14688484 5902087 -4496836 -10557848 -8838392 -1056048 3481585 -1993366 -9598454
11374i598454L872676J3592043P165728n166194m291707O511773P385516m378083
11366A5093298r904945q38545P041827P40389r484474q880076j151411J573676
11358e810261r61030j493050J85704J161235M839105J2097835J1963039k534398
11350A9448179j6794841j1608545P064346J5109850N280125n394169m700701p02418
11342G701826k254088l723131Q75043M643456N23753n312124m454547k05872O47394
11333a558290N20328M065639O970231L404787k554608m229001l988272o151777
11325c520963n740443K585479J1096327R155108J448616K82240L820087l02375
11317A8824076j1249497j3915271l835153N075985K901882k822909l070447j260916
$$ plain form
11374 -9598454 -5725778 7866265 15031993 9865799 5574092 12085865 19471381 15093298
11366 15093298 5188353 4349808 11391635 12132024 2647550 -6232526 -7383937 -5810261
11358 -5810261 -6771291 -8264341 -8078637 -6917402 -2078297 10019538 21982577 19448179
11350 19448179 2653338 -8955207 -1890861 13218989 18499114 13104945 8404244 7701826
11342 7701826 5447738 1724607 2599650 7243106 7766859 2454735 -1999812 -2205684 -1558290
11333 -1558290 -1037962 3027677 9997908 13402695 10848087 6619086 2630814 -3520963
11325 -3520963 -9261406 -6675927 4420400 13575508 15024124 15306364 19126451 18824076
11317 18824076 7574579 -6340692 -10175845 -5099860 -2197978 -5020887 -8091334 -9352250
11309i352250k337021j832760L574399O536961J571239l011943K106940J0819908
11301H075473J0469259Q71486p530505r407873p047449j958024M366490N569754
11293C408611j546617p659202k296090Q224706Q226315k949843r071036j602200
11285e265356Q478949Q667152K006264j241525R14331L274632K989446M54088
11277B0277981m137787q763656q619226k797836K397015K023356j39042J537967
11269A778772M673075K781809l695653p459185m897999n51513j45036l423325
11261a0939055n335986k056848N007329J0190491Q753999J677365n572547q982407
11253g257659q675189n823442n45979N677807R007886P270207K889322r7782j82536
$$ plain form
11309 -9352250 -11689271 -13522031 -9947632 -3410671 -1839432 -4851375 -2744435 8075473
11301 8075473 18544732 19416218 11885713 2477840 -4569609 -6527633 -2161143 3408611
11293 3408611 1861994 -5797208 -8093298 131408 8357723 5407880 -3663156 -5265356
11285 -5265356 3213593 11880745 13887009 12645484 13559815 16834447 19823893 20277981
11277 20277981 16140194 7376538 -1242688 -4040524 -1643509 379847 240805 1778772
11269 1778772 6451847 9233656 5538003 -1921182 -6819181 -7370694 -7515730 -10939055
11261 -10939055 -16275041 -18331889 -13324560 -3134069 5619930 7297295 1724748 -7257659
11253 -7257659 -15932848 -21756290 -22302269 -16624462 -7616576 -346369 2542953 2445171 2262635
11244B262635J427377K472657R67511k404119l467366o3952K513981k018262r059763
11235g369301o766705N474085J2468177M086335q446415p560722N717688J4187359
11227A1790501Q856475j815208p161701o599814l780510P08835N436946N157458
11219A2592982j903397r165147r635712m770171p42698N56496J963499M765336
11211f338812O504260M751663P55561r11189L089910R312756R043652m12387q852623
11202A6942791n106547N785248P914142j812242q328349k415033L707886l641320
11194A3046576j5369964j2217569M123343J1663462P44108j2201912r823601K574924
11186a7460633Q926645O415373M652509P269539P675234J885981n264066q067022
$$ plain form
11244 2262635 3690012 6162669 7130180 4726061 1258695 1194743 3708724 1690462 -7369301
11235 -7369301 -14136006 -8661921 3806256 7892591 -553824 -8114546 -2396858 11790501
11227 11790501 20646976 18831768 11670067 5070253 1289743 1998578 7435524 12592982
11219 12592982 10689585 1524438 -8111274 -12881445 -13624143 -13067647 -11104148 -6338812
11211 -6338812 165448 4917111 5672672 4761483 7851393 17164149 26207801 25795414 16942791
11202 16942791 11836244 17621492 25535634 23723392 15395043 12980010 16687896 13046576
11194 13046576 -2323388 -14540957 -10417614 1245848 1989956 -10211956 -20035557 -17460633
11186 -17460633 -8533988 -2118615 2533894 9803433 17478667 19364648 14100582 6033560
11178F033560o262243j885304L676470P640830O611589J922199n18749J518346
11170A8736698K694051k011264q931083r950391l684133K457491K075283k439870
11162a053218m319985j792022P36690L2256j682146j167606O88094J130726O77818
11153f749393K379241O785190J0748766J0795016N386519m486828j3713377j4485133
11145c339999m712281O421470P851128J063898k423796J733009N513013L071987
11137A5178429j83367J068450J857265l055622p571011l808509L215956K929896
11129I631487l240443m991188j183895n08080m486482m543885J762876N835837
11121a723773L481711J712784M605932N688556J603897K09395N665569P948532
$$ plain form
11178 6033560 -228683 -2113987 1562483 9203313 15814902 17737101 17218352 18736698
11170 18736698 21430749 19419485 10488402 538011 -3146122 -688631 1386652 -1053218
11162 -1053218 -5373203 -7165225 -6428535 -6396279 -8078425 -9246031 -8557937 -7427211 -6749393
11153 -6749393 -4370152 2415038 13163804 23958820 29345339 24858511 11145134 -3339999
11145 -3339999 -8052280 -1630810 6220318 7284216 4860420 6593429 12106442 15178429
11137 15178429 14995062 16063512 17920777 14865155 7294144 3485635 6701591 9631487
11129 9631487 6391044 1399856 215961 -292119 -4778601 -9322486 -7559610 -1723773
11121 -1723773 1757938 3470722 8076654 13765210 15369107 15578502 21244071 29192603
11113B9192603q52807j0727158q363034J188530L362641j713437j452716N670523
11105A6305145P344661n45434o846980m985801l569790q915846j1337689r40341
11097a3492075J3168911J3820514J005614p924630k957156O238344O361035j004079
11089A5216478m079947J334042P256297O010479j52318m739596o657804q714564
11081E473067r779814n824408J335939M147045Q72481m41672N119775R185594
11073A0088007J459431j2517309j5562286j855195J3525768J2863522k210520
11066E791418j3410012q742425L542524O811863j772265p677383L09942J3075098
11058b071240J3281061N56746p997608l581643K393548j189164o659144j725387
$$ plain form
11113 29192603 28339796 17612638 9249604 10438134 13800775 12087338 10634622 16305145
11105 16305145 23649806 23104372 16257392 11271591 7701801 -1214045 -12551734 -13492075
11097 -13492075 -323164 13497350 14502964 6578334 3621178 9859522 16220557 15216478
11089 15216478 11136531 12470573 19726870 25737349 25585031 20845435 14187631 5473067
11081 5473067 -4306747 -10131155 -8795216 -4648171 -3775690 -4217362 902413 10088007
11073 10088007 11547438 -969871 -16532157 -18387352 -4861584 8001938 5791418
11066 5791418 -7618594 -16361019 -12818495 -6006632 -7778897 -15456280 -15146338 -2071240
11058 -2071240 11209821 11766567 3768959 187316 2580864 1391700 -5267444 -6992831
11050f992831Q608884R933691J821506l183294r05679N87080k077924k930120
11042D861313o44763j854306p265056q830448m522617j612987j114681N319692
11034a5663853J6671288J7380011J161734j4776717j2300825K607216J0941945
11027F020799P069121o0871m167462n515209l074812L357286P109661K969385
11019A3707898k504656p11840L977888J953249l787386k476577M890140O879932
11011B1928648J416663k115705j362597m651724j2622791j2975125o69915J1036895
11003a5651Q908529k373763r944784j0474926q172977l479647M966599J2378226
10995h208394J2577298P951604N687884O071841K932414n009237j0920599r022624
$$ plain form
11050 -6992831 1616053 11549744 13371250 10187956 9282277 9869357 7791433 4861313
11042 4861313 4216550 2362244 -4902812 -13733260 -18255877 -19868864 -20983545 -15663853
11034 -15663853 1007435 18387446 19549180 4772463 -7528362 -4921146 6020799
11027 6020799 13089920 13029049 8861587 3346378 271566 3628852 10738513 13707898
11019 13707898 11203242 10491402 14469290 16422539 12635153 10158576 15048716 21928648
11011 21928648 23345311 21229606 19867009 15215285 2592494 -10382631 -11052546 -15651
11003 -15651 8892878 6519115 -3425669 -13900595 -22073572 -25553219 -20586620 -8208394
10995 -8208394 4368904 12320508 18008392 24080233 27012647 22003410 11082811 2060187
10987B060187j495203N137287O927248M820987K270417J137770l67336m430786
10979A6060571q628102p778726j692036L533144L992168K629872K379862O73377
10971A1170130m015768n998364m58516O430457M813871l356641o389597q38174
10963A357398L492932M5785l763177K49961N850576J424874j0351514j4321089
10955a6014254m453072P811591J0213952M735764K93247j019715k156059j957236
10947b545782K135436N673532K155630m690439m438583L229253O445580n45737
10939G418890p957854n756213J323438L112095P68649K874601Q926259Q832446
10931A9542311j138279j2181389j4944230r851238k771495L108602P567470R993569
$$ plain form
10987 2060187 564984 5702271 12629519 17450506 19720923 20858693 20491357 16060571
10979 16060571 7432469 -346257 -2038293 1494851 5487019 8116891 10496753 11170130
10971 11170130 7154362 1155998 697482 7127939 11941810 8585169 2195572 1357398
10963 1357398 4850330 4896115 1132938 1382899 7233475 8658349 -1693165 -16014254
10955 -16014254 -20467326 -12655735 -2441783 2293981 2587228 1567513 -588546 -2545782
10947 -2545782 -410346 5263186 7418816 2728377 -1710206 1519047 7964627 7418890
10939 7418890 -538964 -6295177 -4971739 -1859644 -1090995 1783606 10709865 19542311
10931 19542311 18404032 6222643 -8721587 -18572825 -21344320 -18235718 -10668248 -674679
10923f74679R222880M782811k716459j0345110j2679944o682079L082549P845678
10915h164353L948300l962703q696124o517732J515503J0285320J3290612Q496436
10907A0195259J070672k840033l123616k566305k04316N332798Q426268J848319
10899A8139046j0014382j3038559j917588J1281619J2142109J326115q552335
10892I366025r032182k999397J930511K185911L75975J019333M595533O539023
10884A3980732L543590j132767k188709q0156Q24499J35295P77912J420940k207612
10875A5073724p846693p614743r11158K692150k135584p590523m311376N059548
10867g584655J0692198Q656328K594634l289919o397514m415263J798007O421415
$$ plain form
10923 -674679 8548201 13331012 10614553 269443 -12410501 -19092580 -16010031 -8164353
10915 -8164353 -4216053 -8178756 -16874880 -23392612 -21877109 -11591789 1698823 10195259
10907 10195259 11265931 8425898 5302282 2735977 2531661 7864459 16290727 18139046
10899 18139046 8124664 -4913895 -6831483 4450136 16592245 17918360 9366025
10892 9366025 333843 -2665554 -735043 1450868 1826843 2846176 7441709 13980732
10884 13980732 17524322 16391555 14202846 14122690 14947189 15082484 15860396 17281336 15073724
10875 15073724 7227031 -387712 -1298870 1393280 -742304 -8332827 -12644203 -7584655
10867 -7584655 3107543 11763871 14358505 11068586 4671072 255809 2053816 8475231
10859H475231N102202R62050k92973J460367K032584k88694l721749o406255o797231
10850E25532l223297K908373N953061K092894n367827r850921q477479l025242
10842a8464906K948243N850694M459494K106277K285972J976444l738853j0018961
10834a2595596n677900Q336100J5786942P487935m741688o166545k10251J211215
10826C430212j149095J728323P685022N712136m199164r859269o251124j433930
10818d336889j109855r04694K636930N466776M534369K739945J936086N2841k436700
10809H578809k155557k36734o09382p97643M166453Q874376K991278q988896j0465292
10800A357412J49920L859084q005194j6309779l133846J7394045J7921453j549700
$$ plain form
10859 8475231 13577433 14539483 14246510 15706877 17739461 17450767 13729018 7322763 525532
10850 525532 -2697765 210608 6163669 8256563 2888736 -6962185 -15439664 -18464906
10842 -18464906 -15516663 -9665969 -5206475 -3100198 -814226 1162218 -2576635 -12595596
10834 -12595596 -18273496 -9937396 5849546 13337481 8595793 2429248 2218997 3430212
10826 3430212 2281117 4009440 11694462 17406598 13207434 3348165 -2902959 -4336889
10818 -4336889 -5446744 -6351438 -3714508 1752268 6286637 9026582 10962668 11015509 8578809
10809 8578809 6423252 6186518 5577136 4779493 8945946 17820322 20811600 11822704 1357412
10800 1357412 1507332 5366416 -2638778 -18948557 -22082403 -4688358 13233095 11683395
10792A1683395j3981188m067856J3312901J6642532M082296r697871j2448446
10785E525763m321803M814063M859260l584040q440129j606177Q309653P711943
10777A3268533q52507k478258N296754P469019l196437j1913236m667674P411726
10769A0337920L625448j2837203j6946937J191792K0283812J7417476j001275
10762B2071033j1227304n496306K776385L160091N14820J238433K475975Q39425
10754A6352552o21886j186221o530613j5574724j5131852O32370J6009797J3615249
10746G564672r7149o027441k369441l237075j0471354r611040L073419J1487093
10738i688316N406430l806876l309903K097600K574967K81980J053281J628123
$$ plain form
10792 11683395 -2297793 -6365649 6947252 23589784 27672080 17974209 5525763
10785 5525763 1203960 6018023 10877283 7293243 -1146886 -2753063 5556590 13268533
10777 13268533 12416026 9937768 15234522 22703541 19507104 7593868 2926194 10337920
10769 10337920 13963368 1126165 -15820772 -14628980 5654832 23072308 22071033
10762 22071033 10843729 5347423 8123808 11283899 11798719 13037152 15513127 16352552
10754 16352552 15730666 14544445 8013832 -7560892 -22692744 -22060374 -6050577 7564672
10746 7564672 7467523 1440082 -929359 -4166434 -14637788 -24248828 -21175409 -9688316
10738 -9688316 -4281886 -8088762 -11398665 -9301065 -6726098 -6444118 -5390837 -3762714
10730c762714j704766k753476L276978Q423094M976426k84717J354560L951460
10722A3476845j623641q866124n689537L761817N539324p28334l164543N70074
10714C275881J031190m142790o287592j847515K605825L117640K966288L470313
10706D189240J915398j380839m317234q530316j2981970q537858O816492J5712999
10698g114088L842227j2727049p225404J4973718K1886545M303463j1370375o850530
10690b81493K720057R31189j787503P566592J6598145Q274320p990400j1086530
10682A4944377k005841J048925o493152j1940838q553241k923122m06438J252238
10674a5077092M017805O744094Q884289Q946275L659599m274936n128681L185800
$$ plain form
10730 -3762714 -5467480 -8220956 -4943978 3479116 8455542 8170825 9525385 13476845
10722 13476845 11853204 2987080 -2702457 1059360 6598684 5870350 2705807 3275881
10714 3275881 4307071 164281 -6123311 -7970826 -5365001 -2247361 718927 4189240
10706 4189240 6104638 4723799 406565 -8123751 -21105721 -29643579 -22827087 -7114088
10698 -7114088 -3271861 -15998910 -23224314 -8250596 13635949 17939412 6569037 -281493
10690 -281493 2438564 3369753 1582250 9148842 25746987 34021307 26030907 14944377
10682 14944377 12938536 13987461 7494309 -4446529 -12999770 -15922892 -16329330 -15077092
10674 -15077092 -11059287 -4315193 4569096 13515371 17174970 12900034 7771353 10957153
10666A0957153Q709319L011277n184991m730200M62979J031833j383273q08167
10658A2065930J03154k255296k019196M471845P451293l19805q005165m364828
10650G127932J320202l964906j1385416n135140P181606N697101o890016r692493
10642a5741130N81966O858024M127398N361256J2172394R081009n706457j1641862
10634E092598J062385J4268554J0764494j251016o450322o106234q255152r575505
10626d50198k863109P763604J1947198O279724n107532j5145769j5139427k291039
10618a5006548J1286919J0057582k332824p381756n07961L752276n92330n95904
10610a320546R361414J3494681R20672j3305645j0227055M962679J3296455Q401399
$$ plain form
10666 10957153 19666472 22677749 17492758 12762558 13225537 14257370 12874097 12065930
10658 12065930 12169084 9913788 7894592 12366437 19817730 19497925 11492760 7127932
10650 7127932 8448134 4483228 -6902188 -12037328 -4855722 841379 -6048637 -15741130
10642 -15741130 -15159164 -8301140 -4173742 1187514 13359908 22440917 16734460 5092598
10634 5092598 6154983 20423537 31188031 29937015 23486693 17380459 9125307 -450198
10626 -450198 -3313307 4450297 16397495 22677219 17569687 2423918 -12715509 -15006548
10618 -15006548 -3719629 6337953 4005129 -3376627 -3884588 -132312 -724642 -1320546
10610 -1320546 8040868 21535549 22456221 9150576 -1076479 3886200 17182655 25584054
10602B5584054k277174j1762988j5623998j0005689L88315K752419m863443p297593
10594b3106097M106369J5626670J2208495P98464k712311J836575L367865o43339
10586A1482691m193806n007052l713889J477461Q174349P332016j973646o716051
10578F862073o7805O007117J438549l356174L924088J3895306R848323m903589
10570C3647888j3671231j2163715q803076o325555j424764K830421J264819j526303
10562f171516J463703O174294N338900K653519M890980P751831M108717j819436
10554B4390992k857582k344362m838221l877026N428923J2703261P900332o35994
10546C5870323r36693J756308k628330q112039m183682L344979L162142j288881
$$ plain form
10602 25584054 23306880 11543892 -4080106 -14085795 -13697480 -10945061 -15808504 -23106097
10594 -23106097 -18999728 -3373058 8835437 9633901 6921590 8758165 12126030 11482691
10586 11482691 7288885 2281833 -1432056 45405 8219754 15551770 13578124 6862073
10578 6862073 6794268 12801385 14239934 10883760 14807848 28703154 38551477 33647888
10570 33647888 19976657 7812942 -990134 -7315689 -8740453 -5910032 -4645213 -6171516
10562 -6171516 -4707813 1466481 6805381 9458900 14349880 22101711 26210428 24390992
10554 24390992 21533410 19189048 14350827 10473801 15902724 28605985 36506317 35870323
10546 35870323 34933630 36689938 34061608 25949569 21765887 25110866 28273008 26984127
10538B6984127j871645k935034q417658p247461O279400J4658805M385176p502780
10530B4332930j825362P645745l19699j3702664r124056L745497Q34358r316808
10522B269941k138693J2739791O449872j3487350j3471494N889798J1976821L8947
10514A0267633k359083R223105J0505427N20687L778561J6621753Q847892j5587773
10506D1818202j9327925O0795N658580o945182k129881K0514668J8769214q591994
10498D9826477j2458243J1695699J0336096j9032945r411396M3394880M8953643
10491A23304211j1552673j9237810P6798908J18720686l6632525k51399422k61206037
10484b61204662n2964347J18166139R5311867J7012p361613M1799783L8118621
$$ plain form
10538 26984127 25112482 22177448 13759790 6512329 12791729 27450534 31835710 24332930
10530 24332930 22507568 30153313 29833614 16130950 7006894 10752391 11586749 2269941
10522 2269941 131248 12871039 19320911 5833561 -7637933 -1748135 10228686 10267633
10514 10267633 7908550 17131655 27637082 28157769 31936330 48558083 57405975 41818202
10506 41818202 22490277 22551072 28209652 21264470 19134589 39649257 58418471 49826477
10498 49826477 37368234 49063933 59400029 40367084 30955688 74350568 123304211
10491 123304211 111751538 92513728 169312636 288033322 251400797 1375 -261204662
10484 -261204662 -314169009 -196002870 -100691003 -100673991 -108035604 -66235821 -28117200
10477b8117200p972833j5257201J3470386J4699179j1230463j1700823J3792705
10470c2316250J8099483l491251j1358614J642141M732129o238576m159538J2366746
10462b0723730J5659502K113025l302516L848791J817578j2053017j5080363k131225
10454b9851955N935830J458457J03894O674999O425445k819244l438221Q403893
10446g106902J2620320p59811j4207247j0866683K238663R817868Q272620J268388
10438A277216p858800j2183507n046505O899136R187090J271393k944500J379997
10430h018480L741007p23129k763798J979189L578735l533107q647037k500988
10422a6887608O493677N846256j588579m163828j8085L032339J872528J159108
$$ plain form
10477 -28117200 -36090033 -51347234 -37876848 -23177669 -34408132 -46108955 -32316250
10470 -32316250 -14216767 -17708018 -29066632 -27424491 -22692362 -28930938 -33090476 -20723730
10462 -20723730 -5064228 -2951203 -6253719 -2404928 -587350 -12640367 -27720730 -29851955
10454 -29851955 -23916125 -22457668 -22353774 -15678775 -9253330 -12072574 -15510795 -7106902
10446 -7106902 5513418 4753607 -9453640 -20320323 -18081660 -8263792 8828 1277216
10438 1277216 -6581584 -18765091 -23811596 -16912460 -7725370 -6453977 -9398477 -8018480
10430 -8018480 -4277473 -5000602 -7764400 -5785211 -2206476 -5739583 -14386620 -16887608
10422 -16887608 -10393931 -4547675 -6136254 -10300082 -10318167 -7285828 -5413300 -4254192
10414d254192L151437L663704k92945m934580m664276J16784K940411r12552q167706
10405a3353915j0817660n259699M025538J0048047R892192N504919J214683Q03851
10397B057956L404538K745608m486431j0738614o040567N551876Q522935k004260
10389i86959j1977770q323202L319097R083577O174175J961900O41558O03264
10381D95640K92771j449266o042292r560440l519436J1058282J8782841R346502
10373A9404602n787545q059227L044765J2213427J0557492K134044p890157j7057000
10365H560401j9214192q921536O552678J2309020N029874l664315m531179m47202
10357d326451L164655O354941R037071P182317R5375n766687n418140k333372
$$ plain form
10414 -4254192 -1102755 2560949 2268004 -2666576 -7330852 -7214068 -4273657 -5186209 -13353915
10405 -13353915 -24171575 -29431274 -25405736 -15357689 -5465497 39422 1254105 2057956
10397 2057956 5462494 8208102 3721671 -7016943 -13057510 -7505634 1017301 -986959
10389 -986959 -12964729 -21287931 -17968834 -8885257 -2711082 -749182 -107624 495640
10381 495640 788411 -660855 -6703147 -16263587 -19783023 -8724741 10058100 19404602
10373 19404602 13617057 5557830 8602595 20816022 31373514 33507558 25617401 8560401
10365 8560401 -10653791 -19575327 -13022649 -713629 4316245 651930 -3879249 -4326451
10357 -4326451 -1161796 5193145 14230216 21412533 21507908 15741221 10323081 7989709
10349G989709k382466n098851n170020k01291N943601O927260Q26011o300746
10341B533207o153984Q18526M471944j323595r103299p926614J372032Q454196
10333f857587P589429J615999n261231j0085763q957010j485933M131191J96091
10325a9114814p312868n218948P048393J5669754J2647344N920328M392413M098966
10317A8130568k431926j1345784j2214168l649031N070271O811977L508188L0437
10309C910532k397471m753600o744970p401968o527041l612887K158514Q507471
10301a6861420R481290K612402m867248k928001P443576J4006645R631699J543870
10293B0062813j164451j366957n974046j0697970n875785N190417Q151644j081417
$$ plain form
10349 7989709 5607243 508392 -4661628 -4862919 1080682 8007942 8833953 2533207
10341 2533207 -3620777 -2802251 1669693 346098 -8757201 -16683815 -15311783 -6857587
10333 -6857587 731842 2347841 -2913390 -12999153 -21956163 -23442096 -19310905 -19114814
10325 -19114814 -26427682 -31646630 -24598237 -8928483 3718861 9639189 14031602 18130568
10317 18130568 15698642 4352858 -7861310 -11510341 -6440070 371907 3880095 3910532
10309 3910532 1513061 -3240539 -9985509 -17387477 -23914518 -27527405 -25368891 -16861420
10301 -16861420 -7380130 -4767728 -9634976 -12562977 -5119401 8887244 18518943 20062813
10293 20062813 18898362 17531405 11557359 859389 -5016396 174021 8325665 7244248
10285G244248j0472233j0030103k942909M705057J1617414J4136654O180502o909296
10277A3529334r484819P75168O061987l435855j1265079q55281J4919053J1730627
10269B1975135q199310j9420144j0751684K977294P153256M644717K761469Q68108
10261B008841k113660j652127L517135O493483K370128m386776p159258n180447
10253f102681j267070K327412L551076J448037j296143j229944Q69074K345201
10245F44962L753833O081862N962939K90474p243617j0626643r170214m974659
10237a5281063J724553Q022662O542595l118254r076956l455501M684218M218142
10229e739604l71887l22972j91100n937362o645241Q728900K5044067J8614169
$$ plain form
10285 7244248 -3227985 -13258088 -16200997 -11495940 121474 14258128 20438630 13529334
10277 13529334 4044515 4819683 10881670 7445815 -3819264 -4674545 10244508 21975135
10269 21975135 13775825 -5644319 -16396003 -13418709 -6265453 -1620736 1140733 2008841
10261 2008841 -104819 -1756946 1760189 8253672 10623800 6237024 -922234 -6102681
10253 -6102681 -7369751 -5042339 -1491263 -43226 -1339369 -2569313 -1700239 644962
10245 644962 4398795 10480657 16443596 16734070 9490453 -1136190 -10306404 -15281063
10237 -15281063 -13556510 -5533848 1008747 -2109507 -11186463 -14641964 -9957746 -5739604
10229 -5739604 -6111491 -6434463 -6625563 -12562925 -19208166 -10479266 14564801 33178970
10221C3178970l460518j1232217J126719P655536n175454j8092951j3476618j219210
10213a0695743M081379N874910R571779P333246l662804r237049k177796K590383
10205C678305m951192r471991J692707J1632038J201050j5151679j1014354P941095
10197a4444021J3583624J150645o684458P52419Q944781O722735J238178l73822
10189A0890081j473214l145771j083564J204895m267933j1055590m146769J2023094
10181a054771J5106988O77708q408495P69278R426204q92153j6362246j3108341
10173a3845828M253694J1011071P50419q932871o705225j188668j494709k911079
10165a9063196Q22010M847969K113057l618076k937428M921950J0601247O928466
$$ plain form
10221 33178970 29718452 18486235 19612954 27268490 22093036 4000085 -9476533 -10695743
10213 -10695743 -6614364 -739454 8832325 16165571 12502767 3265718 1087922 3678305
10205 3678305 -1272887 -10744878 -9052171 2579867 3780917 -11370762 -22385116 -14444021
10197 -14444021 -860397 290248 -6394210 -5641791 3302990 10025725 11263903 10890081
10189 10890081 9416867 6271096 5187532 6392427 2124494 -8931096 -13077865 -1054771
10181 -1054771 14052217 14729925 6321430 7090708 16516912 15624759 -737487 -13845828
10173 -13845828 -9592134 1418937 2169356 -6763515 -13468740 -14657408 -16152117 -19063196
10165 -19063196 -18241186 -13393217 -11280160 -14898236 -17835664 -12913714 -2312467 4615999
10157D615999k352167p675326n143463m41762p07219m754911m870798J898265
10149a9431382R052192R586537N269510K701114L235573K484973j254189m144374
10141G499954l564489k450723l786074m576302o8110P401357R169342J590924
10133A1215879p575900p994261K79539P400747O574249P23463m497937p792440
10125a666661q938287n044590L488231Q305169K936222n571963m619061N151084
10117e959856R879305L169478m692794l361493K475506K992850o58794j018477
10109B825725J170599m26383m070084k220157L190710J528609q101994j2624881
10101a8727856m560617O426408R108627O513353O203399N041288k898063j0456868
$$ plain form
10157 4615999 2263832 -5411494 -10554957 -10996719 -11703938 -16458849 -21329647 -19431382
10149 -19431382 -10379190 -792653 4476857 7177971 10413544 12898517 11644328 7499954
10141 7499954 3935465 1484742 -2301332 -6877634 -6945744 455613 9624955 11215879
10133 11215879 3639979 -4354282 -4074743 3326004 9900253 10623716 6125779 -1666661
10125 -1666661 -10604948 -15649538 -12161307 -3856138 -919916 -6491879 -11110940 -5959856
10117 -5959856 3919449 7088927 2396133 -965360 1510146 4502996 3844202 2825725
10109 2825725 3996324 3569941 -500143 -2720300 470410 1999019 -6102975 -18727856
10101 -18727856 -23288473 -16862065 -7753438 -1240085 4963314 10004602 7106539 -3350329
10093c350329n519411P528909J0749212j120443j2203641q402762L695348Q318222
10085c04895J635942o786480p637719j08320R220769J1074316J746343r949498
10077a109542j0078836K636737J3830253J2385378L540641k616148n766118r575477
10069C246888j0416025l626795N184070P086964L525539J622046O18988m088722
10061C152953p528966r28986J0523396J1549479j91244j0233324r632804n834107
10053i123603n774504l617036N230083J1141287M201888p762486q936168J245231
10045a3395308P810406K303085o722190p807487j858020K162121J275798J172505
10037a5059090N585063R429813O221817j389478m597442j114146K369710J901704
$$ plain form
10093 -3350329 -8869740 -1340831 9408381 8287938 -3915703 -12318465 -8623117 -304895
10085 -304895 1331047 -5455433 -13093152 -13201472 -3980703 7093613 8839956 -1109542
10077 -1109542 -11188378 -8551641 5278612 17663990 21204631 18588483 12822365 3246888
10069 3246888 -7169137 -10795932 -5611862 1475102 5000641 6622687 7241675 3152953
10061 3152953 -4376013 -5304999 5218397 16767876 16576632 6343308 -3289496 -9123603
10053 -9123603 -14898107 -18515143 -13285060 -2143773 2058115 -5704371 -14640539 -13395308
10045 -13395308 -5584902 -3281817 -10004007 -17811494 -19669514 -17507393 -16231595 -15059090
10037 -15059090 -9474027 -44214 6177603 4788125 190683 -923463 1446247 3347951
10029C347951K110257N992327P497828J730779n039492m966602j674949k869143
10021F128956n834690l163106J678713p53327p857203p489554J663021P694890
10013g932300M860698L86115q3161J088275L705079J0426082J4688593N563318
10005C2702699j1108024j5474331m007113L264941m666664j1384756j540102J2359561
9997A46211J0837365r14836l910679L576540P701085M055598M7994k605131q113846
9988A0820301j2771528r103266j193421J115813J08890M785300J1038383O895313
9980A1695785l952705n012040N045288Q768608p75376q259986k590920M418303
9972I336957p95034r533409m985953R325316J3293699j40849j4508448j2028705
$$ plain form
10029 3347951 5458208 11450535 18948363 20679142 15639650 10673048 8998099 6128956
10021 6128956 294266 -2868840 -1190127 -1943454 -9800657 -17290211 -15627190 -7932300
10013 -7932300 -3071602 -2685487 -2768648 -1680373 2024706 12450788 27139381 32702699
10005 32702699 21594675 6120344 2113231 5378172 711508 -10673248 -12213350 146211
9997 146211 10983576 10068740 6158061 9734601 17435686 21491284 21539278 18934147 10820301
9988 10820301 -1951227 -11054493 -12247914 -11132101 -11023211 -6237911 4800472 11695785
9980 11695785 7743080 2731040 7776328 16544936 15769560 7509574 4918654 9336957
9972 9336957 8541923 -991486 -5977439 3347877 16641576 16500727 1992279 -10036426
9964a0036426L877474J4146808P904197n155951p647826L451735J3152560Q544635
9956B8237206l940196q172580j037616M614020k20072q426226q640260j227147
9948A187129M410040L735325Q34047k40453p66011k187619j296592M409379R202430
9939A9287675M179056q665756j4939421n885218Q410753J2090142M604786k253420
9931A6828597m459860q238076j2961154q718249M484935J1657088N132807k902720
9923H23368k52688O760570O426947N70235l041577n672259j0337860r943685J185959
9914a3480990J2442700J0303632j67055l655323J419356L970417O07672j782496
9906I657913o77131K80820J218517L735649K834052m824909j0062210l637491
$$ plain form
9964 -10036426 -6158952 7987856 15892053 10736102 3088276 6540011 19692571 28237206
9956 28237206 24297010 16124430 15086814 19700834 19480762 11054536 2414276 1187129
9948 1187129 5597169 9332494 10166541 9926088 9160077 6972458 5675866 10085245 19287675
9939 19287675 23466731 14800975 -138446 -6023664 2387089 14477231 19082017 16828597
9931 16828597 12368737 4130661 -8830493 -17548742 -13063807 -1406719 3726088 823368
9923 823368 570680 7331250 13758197 14328432 11286855 5614596 -4723264 -14666949 -13480990
9914 -13480990 -1038290 9265342 9098287 5442964 6862320 10832737 11440409 9657913
9906 9657913 8980782 9261602 10480119 14215768 17049820 12224911 2162701 -1474790
9898a474790O519093O708111l68933k256570J052081K44739m294723n541499m763246
9889d175737m645202J559648J2511786O929886k0233143k8231870J8121182P8418668
9881F0255218P4086238P99o0033483m7629734k590219R946885p569060j1184303
9873A5282341N182418J1229621l04787p375143k844124j338723n910747n054227
9865H866629l28649l681207r984958l960381Q293331O632944n861384n802122
9857e825797Q962198J3783898j099213j4452418r220406L543519P468221M066147
9849G226149J010153k705443p938566q359350k300044K794030M543580Q861350
9841C131859J3901757Q771923n284889j1458093l440387M096956Q69829k686369
$$ plain form
9898 -1474790 5044303 11752414 11383481 9126911 10178992 10423731 6129008 587509 -4175737
9889 -4175737 -8820939 -7261291 5250495 12180381 -8052762 -36284632 -18163450 60255218
9881 60255218 134341456 134342255 74308772 26679038 24088819 34035704 26466644 15282341
9873 15282341 20464759 31694380 31389593 24014450 21170326 19831603 13920856 8866629
9865 8866629 8537980 4856773 -5128185 -9088566 -795235 5837709 -23675 -5825797
9857 -5825797 3136401 16920299 15821086 1368668 -7851738 -4308219 3160002 7226149
9849 7226149 8236302 5530859 -2407707 -10767057 -13067101 -10273071 -5729491 3131859
9841 3131859 17033616 25805539 20520650 9062557 5622170 9719126 10588955 7902586
9833G902586L049396P995825J102308q200635n623566L450821M141467k514248
9825A1303954l756233J072795J45306q922482j3914653o960562M460214Q956013
9817g615648M632502j805748l277281J777044P700018O607835j618238p479392
9809a078908m255327K241937K411871k920340m779490J83180O305309Q245661
9801F353893O183406J741065m278705q884517p534036j56513P111088Q127611
9793H663292K703896m107259o739135l159738L797927Q817545Q741001M585909
9785B3303438r94808o253116r574411q793758l477118L314075P067516N232537
9777I824355j014938o767122o300294O54468O352223L364150m587126n927754
$$ plain form
9833 7902586 10951982 18947807 20050115 11849480 6225914 9676735 13818202 11303954
9825 11303954 7547721 8620516 8765822 -156660 -14071313 -21031875 -16571661 -7615648
9817 -7615648 -2983146 -4788894 -8066175 -6289131 1410887 8018722 6400484 -1078908
9809 -1078908 -5334235 -3092298 -680427 -3600767 -8380257 -8197077 -1891768 6353893
9801 6353893 12537299 14278364 9999659 1115142 -6418894 -6575407 535681 8663292
9793 8663292 11367188 7259929 520794 -2638944 1158983 9976528 18717529 23303438
9785 23303438 22308630 16055514 6481103 -2312655 -5789773 -2475698 4591818 9824355
9777 9824355 8809417 2042295 -4257999 -3603531 2748692 6112842 1525716 -4402038
9769d402038L142931J2569634J1448451J648935o506490q050189o722260o332000
9761c203026n112418k38417N838966O840161N66687o725082o638740N96623N940517
9752b134729M490925L049319Q739942J5220851J0347291m351839j3773448j0426115
9744A1162197l555764k662767l576579J317846Q635136R579902L368394m310203
9736A9958162j0736007j4788670j1585105N96037J1646721R564301k196480q352416
9728e893457k759379N111676N957018J937067j293516l766554o560446n717613
9720a2985204K022670J1770864J4955872R161612l94619p073928p637126l349207
9712F470934R31420O61416l574696p081272p288847n544145k487270K906921P981425
$$ plain form
9769 -4402038 -1259107 11310527 22758978 24407913 17901423 9851234 3128974 -3203026
9761 -3203026 -8315444 -8553861 -2714895 4125266 4691953 -2033129 -8671869 -8075246 -2134729
9752 -2134729 2356196 5405515 14145457 29366308 39713599 35361760 21588312 11162197
9744 11162197 7606433 4943666 1367087 2684933 11320069 20899971 24268365 19958162
9736 19958162 9222155 -5566515 -17151620 -16555583 -4908862 4655439 2458959 -5893457
9728 -5893457 -8652836 -3541160 2415858 4352925 3059409 -707145 -7267591 -12985204
9720 -12985204 -10962534 808330 15764202 24925814 24531195 17457267 9820141 6470934
9712 6470934 7402354 8063770 4489074 -2592198 -9881045 -15425190 -17912460 -15005539 -7024114
9703g024114O583092j341086o263954j155516P491304P861161p58977p506439
9695b114529n068090K296986O826514O489835L624072j24471l884928o096485
9687A948904o139999n165166l303190J205573P896380J1925081R119688J573929
9679A9061200m507441n532112k972579j79309R59582M75591q14263k387853l988911
9670A13905m401819j749297K960653M388845p90859o985352n194697L710973Q552948
9661F05300L862793j609585J434768Q061279P310850m2632l478734l05874J181131
9652A7019296k819699n118819n59576N128482N493254L433415L984108M509246
9644C1069707K76179n811918p596458n798961n366068n573085j598463N047908
$$ plain form
9703 -7024114 -441022 -1782108 -8046062 -9201578 -1710274 6150887 5391910 -2114529
9695 -2114529 -7182619 -4885633 1940881 8430716 12054788 11930317 8045389 1948904
9687 1948904 -4191095 -9356261 -12659451 -11453878 -3557498 8367583 17487271 19061200
9679 19061200 14553759 9021647 6049068 5869759 6829341 7304932 6490669 4102816 113905
9670 113905 -4287914 -6037211 -3076558 1312287 521428 -6463924 -11658621 -7947648 605300
9661 605300 4468093 2858508 4293276 12354555 19665405 19622773 16144039 15838165 17019296
9652 17019296 14199597 9080778 8521202 13649684 19142938 22576353 26560461 31069707
9644 31069707 31345886 25533968 17937510 12138549 6772481 1199396 -399067 4648841
9636D648841O304526p68901q659776q341910K85657Q736708Q647012k12420r306428
9627A333309r814385k716109K530127Q32745k128122l9381L485750J433534l908901
9618h991433l738550L220744Q168448M617169l565499q011731m690661L749108
9610i242405J0211710Q345442j99308n696581k641294J476098k646525r994041
9602a0386904p572085M403178J1052799N115016k771517k194046R46738l693450
9594e100271j2034724j0782449K419496J4979036J5246759M760721n880413q033411
9586d425256j571129N755749N493095k605168r772898q004228J297982J0004605
9578c827248J2033345P750566K187854K50078J521780L42664n476840q566207
$$ plain form
9636 4648841 10953367 10184466 1524690 -6817220 -6531563 2205145 10852157 10639737 1333309
9627 1333309 -8481076 -11197185 -8667058 -7834313 -9962435 -10001816 -6516066 -5082532 -8991433
9618 -8991433 -12729983 -9509239 -1340791 3276378 -289121 -8300852 -12991513 -9242405
9610 -9242405 969305 9314747 9115439 3418858 777564 2253662 -392863 -10386904
9602 -10386904 -17958989 -13555811 -2503012 2612004 -159513 -2353559 -1406821 -5100271
9594 -5100271 -17134995 -27917444 -25497948 -10518912 4727847 9488568 3608155 -4425256
9586 -4425256 -5996385 -240636 5252459 2647291 -7125607 -15129835 -13831853 -3827248
9578 -3827248 8206097 15956663 18144517 18394595 19916375 20259039 14782199 6215992
9570F215992j885728P345767M897119q241084j4342566m660044P255139O654561
9562C239156j281936l526308m77562J01843O60545P336888J2563897M156526j1242701
9553A1530348j4402052l398575L479293k167578p041858j353939M837157J653321
9545f863883k686899J531088O517676J490203o090626k499153P645627Q336919
9537G380952j046510n400684Q70820O757840M641818N97323N53972J008051q48548
9528A4515034q60074J729578k96170q582967j2088078l055774Q982268J0204032
9520A0547849K797985P1904M914935O086677l157032j3991364j4272231m541135
9512a1542412M271860N606099L653357M894074Q113620O554017j294204q008007
$$ plain form
9570 6215992 4330264 11676031 16573150 8332066 -6010500 -10670544 -3415405 3239156
9562 3239156 1957220 -1569088 -2046650 -1944807 -1284262 6052626 18616523 22773049 11530348
9553 11530348 -2871704 -6270279 -2790986 -4958564 -12000422 -13354361 -8517204 -6863883
9545 -6863883 -9550782 -8019694 -1502018 -11815 -6102441 -8601594 -955967 7380952
9537 7380952 6334442 933758 1804578 8562418 13204236 13801559 14355531 15363582 14515034
9528 14515034 13654960 15384538 15088368 6505401 -5582677 -8638451 343817 10547849
9520 10547849 13345834 13417738 18332673 24419350 21262318 7270954 -7001277 -11542412
9512 -11542412 -7270552 -1664453 1988904 6882978 14996598 21550615 20256411 12248404
9504A2248404o871773j197826J158708J25837K825687J0413034J3943236P196374
9496C9841681l421608p690606n227984l544022n690284p205883m634275o57715
9488A769304M25182j875385m646619m974553k347695J059175K850725L420743
9480d319123M508671M869241J659343k922305k449924L364175O001347Q75543
9472A1586968m421444k064182K631384Q7755o371213n056854M169722Q115481
9464H677617K84266r547518r957025j944869O353463J0174531Q420161J544589
9456A4005215n615972o053127l95651K554755p38911l043212M30026K905347j876016
9447B172454p397474m763808J505325L62635p071258q556363K54309R744492J1071529
$$ plain form
9504 12248404 5376631 4178805 5337513 5463350 8289037 18702071 32645307 39841681
9496 39841681 36420073 28729467 23501483 19957461 14267177 7061294 2427019 1769304
9488 1769304 2194486 319101 -4327518 -9302071 -11649766 -10590591 -7739866 -4319123
9480 -4319123 189548 5058789 6718132 3795827 1345903 4710078 10711425 11586968
9472 11586968 7165524 5101342 7732726 7820481 1449268 -3607586 562136 8677617
9464 8677617 8961883 -585635 -10542660 -12487529 -6134066 4040465 12460626 14005215
9456 14005215 8389243 2336116 1940465 4495220 3756309 713097 1143123 4048470 2172454
9447 2172454 -5225020 -9988828 -8483503 -8120868 -15192126 -23748489 -23494180 -13749688 -2678159
9438b678159O776024L157124N34717l501607o706272m375416K552655O434016
9430B193082J746906o696172p722316K051265J1487754Q072066m166371q868084
9422a901870n52275P469770L599019m902750m789975K436145N269197J553731
9414H180992q04273M41513o43132n087123o256142k075580J115462k59744j437827
9405f825854K032183P720832J0658223Q035304m87465j0591713j3331618n614461
9397h404569K276859j46597o725166m286427M566173N726606p45262k46436Q445498
9388D60679Q289487n054094j1387409J232462J4408933Q723681m893304n953174
9380E827261N03779l122790j1456496m627492J3553312J7957147L340311p638625
$$ plain form
9438 -2678159 4097865 7254989 7789706 4288099 -2418173 -6793589 -4240934 2193082
9430 2193082 3939988 -2756184 -10478500 -8427235 3060519 11132585 6966214 -1901870
9422 -1901870 -2454145 5015625 8614644 3711894 -1078081 1358064 6627261 8180992
9414 8180992 7376719 7818232 7175100 2087977 -4168165 -6243745 -5128283 -5388027 -6825854
9405 -6825854 -4793671 2927161 13585384 21620688 21133223 10541510 -2790108 -8404569
9397 -8404569 -6127710 -6274307 -12999473 -17285900 -12719727 -6993121 -7738383 -7984819 460679
9388 460679 8750166 3696072 -7691337 -6458875 7950058 16673739 11780435 5827261
9380 5827261 6331040 3208250 -8248246 -12875738 677574 18634721 21975032 14336407
9372A4336407l040824J504418n125903r026964J064043J0234422K324432j0928709
9364A341322q983263L324001N296874m722390q788440k38955Q125153P572910
9356B927212M398263L723451P83373n743672p643233j770243K695909m92702l972332
9347e093974J525O001263M764264k184247o958545p530409n929512n91786Q742141
9338h779280J3507048N846839o735627q594902K148923J0919025Q119202J422632
9330A7853860J307912M804676K461275n337685r335347n991092j433983n04421
9322C825195m26895J672065K059272l281049j0010029j0021970l341445J647762
9314a7877094R90425P37207N376732P782132m13928j2275157j1451466M050256
$$ plain form
9372 14336407 11295583 12800001 7674098 -1352866 -288823 9945599 12270031 1341322
9364 1341322 -7641941 -4317940 978934 -3743456 -12531896 -12770851 -4645698 2927212
9356 2927212 7325475 11048926 11832299 6088627 -1554606 -3324849 -628940 -1121642 -5093974
9347 -5093974 -5092449 908814 5673078 3488831 -3469714 -11000123 -16929635 -17521421 -8779280
9338 -8779280 4727768 10574607 3838980 -4755922 -2606999 8312026 16431228 17853860
9330 17853860 19161772 23966448 26427723 21090038 11754691 5763599 4329616 3825195
9322 3825195 3398300 5070365 7129637 3848588 -6161441 -16183411 -19524856 -17877094
9314 -17877094 -16886669 -16149462 -10772730 -2990598 -3404526 -15679683 -27131149 -23080893
9306b3080893J6292388J1622297m63282k510938N506688R200083L041720m515997
9298A5092066q041096j1381373j4225019q261696O168868J3695074M801444p968902
9290a0120634p228354M203003R536941L849776j793076n98483R69938k584476
9282c765365n788305k661403K344424J413911m260881o169226j99909Q222131
9274a0864623J0337653L489387n362718o391697J208143O906616K576721m998679
9266c099197l014484P814832J2873419M560316o841489q299590j103473M483554
9258G373888M635226L058613J108141l307954q017201o918255O2753M207473j295585
9249I07099j1924801j6616330j0263824J105029P320729M830729k27237J45428
$$ plain form
9306 -23080893 -6788505 4833792 4370510 1859572 7366260 16566343 19608063 15092066
9298 15092066 7050970 -4330403 -18555422 -26817118 -20648250 -6953176 -2151732 -10120634
9290 -10120634 -17348988 -13145985 -3609044 240732 -1552344 -2150827 -1180889 -3765365
9282 -3765365 -9553670 -12215073 -9870649 -8456738 -12717619 -18886845 -19086754 -10864623
9274 -10864623 -526970 2962417 -2400301 -8791998 -7583855 -677239 1899482 -3099197
9266 -3099197 -6113681 1701151 14574570 19134886 12293397 3993807 2890334 7373888
9258 7373888 12009114 15067727 16175868 12867914 4850713 -2067542 -2004789 2202684 907099
9249 907099 -11017702 -27634032 -37897856 -36792827 -29472098 -24641369 -24868606 -24723178
9241b4723178O050851J0141813P923359L705504L480443N293430K233491n717561
9233H388152r422346l247484N142602L883824n940501j0011159l62091J1807523
9225B38520J0193315l507657j0777199j756781J1042513J0806493k44042n907240
9217A0087922j34254O091353K907197m610338o075359j359307J006124k669686
9209E243652o724391n238993k69388J628372j162944k907844J114007O412457
9201a905072L984606o461210j3695810q909362K575902R065831P776065N071572
9193b497478M389800K888724m44926k473383k951615n259592p780122l219995
9185a7348587R265545J8812184J5330084K080605r087669j0873970n022262J963316
$$ plain form
9241 -24723178 -18672327 -8530514 -607155 3098349 6578792 11872222 14105713 8388152
9233 8388152 -1034194 -4281678 860924 4744748 -1195753 -11206912 -11569003 238520
9225 238520 10431835 6924178 -3853021 -5609802 5432711 16239204 15995162 10087922
9217 10087922 9953668 16045021 18952218 14341880 8266521 6907214 7913338 5243652
9209 5243652 -1480739 -6719732 -6989120 -5360748 -6523692 -9431536 -8317529 -1905072
9201 -1905072 2079534 -4381676 -18077486 -26986848 -24410946 -15345115 -7569050 -2497478
9193 -2497478 1892322 4781046 4336120 1862737 -1088878 -6348470 -14128592 -17348587
9185 -17348587 -8083042 10729142 26059226 28139831 19052162 8178192 3155930 5119246
9177E119246L802232r24109o106172m329803K237539L424431l529883q044466
9169h350985j390522R632681J2360824N984629R5512r99697k047109n405287o005806
9160C874240q43440M025601J175059p150513j0736247m000894O381200Q851377
9152A576383J435951m992903j047837P177432N613422o920483j4787562o409899
9144a8355496R305196J4652598N639127n662289q375307l719767J427583M241029
9136h47326O095132P153992M832096j991983q812778q434547k27797O524086L740520
9127H031395l159398k140781O592821R384949J78685q691716m475944O899954
9119A2619965J0348100L488357k908306k723119r07566k752773o818121r456196
$$ plain form
9177 5119246 8921478 7997369 1891197 -2438606 -201067 3223364 -306519 -8350985
9169 -8350985 -9741507 -108826 12251998 18236627 18332139 17332442 15285333 9880046 3874240
9160 3874240 3030800 7056401 8231460 1080947 -9655300 -13656194 -7274994 1576383
9152 1576383 3012334 -1980569 -3028406 4149026 9762448 2841965 -11945597 -18355496
9144 -18355496 -9050300 5602298 11241425 5579136 -2796171 -6515938 -5088355 -847326
9136 -847326 5247806 12401798 17233894 15241911 6429133 -2005414 -2233211 4290875 8031395
9127 8031395 4871997 2731216 9324037 18708986 18887671 10195955 5720011 12619965
9119 12619965 22968065 26456422 23548116 20824997 19917431 17164658 10346537 890341
9111H90341q718937l425559M987916J0246357P676071K004784J500575N167180
9103B0328728L933393m972884j2951326j1317641j221779R545992J4211182J0422551
9095B7978216J562471m296317k033322L247779K097317n747977j0271306n169079
9087G367782L719703P081710L616432j293744m371894o990574j0183596j1077182
9079a2131363n914319L811449R998915N632491n641483j1553757n334556N864899
9071a5267724J0050468M254813m732996r696808p904305j56866Q838853J1401027
9063c213538M463134m847393o490070N95142Q093700Q178184K53515r389526j1552430
9054a3909282k214505R995720J0872195m65274q523199l871533K489704j837710
$$ plain form
9111 890341 -7828596 -11254155 -6266239 3980118 11656189 13660973 15161548 20328728
9103 20328728 24262121 19289237 6337911 -4979730 -6201509 3344483 17555665 27978216
9095 27978216 29540687 25244370 23211048 26458827 28556144 22808167 12536861 7367782
9087 7367782 11087485 18169195 21785627 20491883 16119989 9129415 -1054181 -12131363
9079 -12131363 -18045682 -14234233 -4235318 1397173 -4244310 -15798067 -21132623 -15267724
9071 -15267724 -5217256 -962443 -5695439 -15392247 -23296552 -23453418 -14614565 -3213538
9063 -3213538 1249596 -3597797 -10087867 -9492725 -1399025 6779159 7032674 -2356852 -13909282
9054 -13909282 -16123787 -6128067 4744128 4278854 -4244345 -8115878 -5626174 -7463884
9046g463884q757433l244015R790005J2274637K420681l807687m073L327109Q88347
9037E423687L46612K956680j697709j3310028j4632346N92457J3545002Q965219
9029B189574o48067K409485J0586647N338831r597430j3535983k207882P472432
9021B007607N422609P6076o65060j282883n589044p340606j781679M728301M322043
9012a02636j090951m408058l115197L72851L169989L113115k40068l535605k573481
9003h410041J790593N141931O414431P320696N817176j573183j0403825j0885018
8995d787240k517795L569707J341526j149868L508230Q200928L025203o215657
8987D975034n229003N543300R804397P9607j0256106o855105M495489P272557
$$ plain form
9046 -7463884 -16221317 -19465332 -9675327 2599310 5019991 1212304 1208231 4535340 5423687
9037 5423687 5770299 8726979 7029270 -6280758 -20913104 -20320647 -6775645 2189574
9029 2189574 1541507 3950992 14537639 19876470 10279040 -3256943 -5464825 2007607
9021 2007607 7430216 7506292 6841232 5558349 -30695 -7371301 -9152980 -4424679 -102636
9012 -102636 -1193587 -5601645 -8716842 -8343991 -5174002 -2060887 -2300955 -5836560 -8410041
9003 -8410041 -6619448 -1477517 4936914 12257610 18074786 16501603 6097778 -4787240
8995 -4787240 -7305035 -3735328 -2393802 -3543670 -35440 8165488 11190691 4975034
8987 4975034 -253969 5289331 15093728 15173335 4917229 -1937876 2557613 9830170
8979I830170j761337r919372p946571p00311K936643J436759j290122j933260
8971i347401J360450P800212J0898301L789109r009398j3444497m746154M464577
8963h234801K522366l759450r82101Q699641J1639699N186816L46471J775977
8955A7194618R52390o563083j1473373n869951L404644N578863J799962Q70040
8947E894110M812850P426842M103577l532492j0461007j1426291m733958L499107
8939d417262L646576m818659j0574686n401916M001321N983053P03327j626355
8931a2504601L271981Q374437O499905k42015m575036l249162P31660L120973
8923A428142L036552K055854L86351l108448o606354n509750J42214L565489J607151
$$ plain form
8979 9830170 8068833 -1850539 -9797110 -10497421 -7560778 -6124019 -7414141 -9347401
8971 -9347401 -7986951 -186739 10711562 14500671 5491273 -7953224 -12699378 -8234801
8963 -8234801 -5712435 -9471885 -10453986 -1754345 9885354 15072170 15418641 17194618
8955 17194618 18147008 11583925 110552 -5759399 -2354755 3224108 5024070 5894110
8947 5894110 10706960 18133802 22237379 18704887 8243880 -3182411 -7916369 -4417262
8939 -4417262 -770686 -5589345 -16164031 -21565947 -17564626 -11581573 -10878246 -12504601
8931 -12504601 -9232620 -858183 5641722 5399707 824671 -2424491 -1692831 1428142
8923 1428142 4464694 6520548 6906899 3798451 -2807903 -8317653 -8175439 -4609950 -3002799
8914c002799J150367P068240J0535203K074273r007973n646220Q043016R766364
8906B0980471n125164j3529875q46374J4432947R406565p963583j3841448n732305
8898b218766m74088k769807j241664N991049O489727k394795o490906J292418
8890a816832Q677923M505500m114518n361757q26610Q41726j100365j557471Q5617
8881f66787J141138K132253M139796L944182r67289o264870o289070k433379J16905
8872e147121O76004J444495N47913n201826j1202633p386208P179552J8648474
8864d41350J3438128l938592j4833778q805303M378488Q559120J420429n815095
8856f037953n581347j723998J69563Q17486K360347L404710L251644M071693M768160
$$ plain form
8914 -3002799 -1852432 5215808 15751011 17825284 8817311 3171091 11214107 20980471
8906 20980471 15855307 2325432 1479058 15912005 25318570 17354987 3513539 -2218766
8898 -2218766 -2692854 -5462661 -6704325 -713276 5776451 3381656 -3109250 -1816832
8890 -1816832 6861091 11366591 7252073 1890316 1063706 1905432 805067 -752404 -666787
8881 -666787 474351 2606604 6746400 10690582 9723293 3458423 -2830647 -5264026 -5147121
8872 -5147121 -4471117 -3026622 -2478709 -7680535 -18883168 -26269376 -19089824 -441350
8864 -441350 12996778 9058186 -5775592 -14580895 -10202407 -1643287 -222858 -6037953
8856 -6037953 -11619300 -13343298 -13173735 -12356249 -9995902 -6591192 -3339548 732145 5500305
8847E500305M69189p055661p580902K084432J0259806P237044O39894K099141
8839A3653248P013440K661588q997701j3388545o348114J204137K276092J956771
8831C0916L956406L610570j024565l668677p95316K302042J073637j985151m041948
8822e42086n569750m880922O46501N957582K927407m074629j275787J1661935
8814D850251J7511721P522936m052522k137451O630554O833040j944076q968475
8806B6245978j0888730j1291238q787044p76359O032295L693260k370702j340185
8798E17275M135080K759861m062562l167688P001304J1426112J849388j0350398
8790A0108372j1978518n601592m22876L133851Q647291J1551528M257312r690868
$$ plain form
8847 5500305 5969494 -1086167 -8667069 -6582637 3677169 10914213 11554107 13653248
8839 13653248 20666688 23328276 14330575 942030 -5406084 -4201947 -1925855 30916
8831 30916 3987322 7597892 6573327 2904650 2109334 4411376 5485013 3499862 -542086
8822 -542086 -6111836 -10992758 -10346257 -4388675 -1461268 -5535897 -6811684 4850251
8814 4850251 22361972 29884908 25832386 23694935 30325489 37158529 35214453 26245978
8806 26245978 15357248 4066010 -4721034 -5497393 534902 4228162 1857460 517275
8798 517275 4652355 7412216 3349654 181966 7183270 18609382 20458770 10108372
8790 10108372 -1870146 -7471738 -7894614 -4760763 3886528 15438056 19695368 10004500
8782A0004500j7190250j1399632J175651R575251Q873627J927584m381310m319204
8774e733783J362378N212309J632869n026125n351404K085596P837768L951945
8766E971553n165432q137764n00595J0804611J5881030J1261655J163537p113345
8758B4165250q567408m371149j043959k998327o115630l151375M208720N567705
8750G693827k684312r719459n217244M303123M568227m344030p753954Q76393
8742a2277429J0128465Q772557J896386M3089J635672j814079q541916q227687
8734h384942k5499M236415j695794q176369m322757N175029P125918m77308o078588
8725a2623895k160228M197376K846536m132510o129705j20557N327372L250154
$$ plain form
8782 10004500 -7185750 -18585382 -17409731 -7834480 1039147 2966731 -1414579 -5733783
8774 -5733783 -4371405 840904 2473773 -2552352 -7903756 -5818160 2019608 5971553
8766 5971553 806121 -7331643 -7832238 2972373 18853403 30115058 31278595 24165250
8758 24165250 15597842 11226693 10182734 7184407 1068777 -2082598 2126122 7693827
8750 7693827 5009515 -4709944 -9927188 -5624065 -1055838 -5399868 -13153822 -12277429
8742 -12277429 -2148964 6623593 8519979 8563068 10198740 8384661 -157255 -8384942
8734 -8384942 -8410441 -4174026 -5869820 -14046189 -18368946 -13193917 -6067999 -6545307 -12623895
8725 -12623895 -14784123 -10586747 -7740211 -11872721 -18002426 -18122983 -12795611 -9545457
8717i545457j987126k238153K541312N551114L214779j617346m931089m970911
8709a3982877j511890L574090O067082M259650K521254M925983P550300L965426
8701A7369018l358010n807484k447779j072078l905626l449523K998340O015210
8693F342068r58624r066595o793313K147504N527970K032649O82038L141243J006080
8684D061020p367830j0894884k503547Q806758J0616901M065236p64784r96714
8676E022156k203329n607272m824772K445914Q458077O301965M89517j10172L907228
8667A3879312L867630k560062p062763l709563J284210j201795r163413j2163553
8659a6829997n954441K989746P483838P284043N289431K380570q37148j793103
$$ plain form
8717 -9545457 -11532583 -13770736 -11229424 -5678310 -2463531 -4080877 -9011966 -13982877
8709 -13982877 -15494767 -11920677 -5853595 -1593945 927309 5853292 13403592 17369018
8701 17369018 14011008 8203524 5755745 4683667 778041 -2671482 326858 6342068
8693 6342068 5383444 -3683151 -10476464 -8328960 -2800990 -768341 -86303 3054940 4061020
8684 4061020 -3306810 -14201694 -16705241 -7898483 2718418 6783654 6018870 5022156
8676 5022156 2818827 -2788445 -7613217 -5167303 3290774 9592739 10082256 9972084 13879312
8667 13879312 17746942 15186880 8124117 4414554 5698764 4496969 -4666444 -16829997
8659 -16829997 -22784438 -19794692 -12310854 -5026811 262620 2643190 1806042 12939
8651A2939P00141L452032K422818k017535n338823l741538J840375O226158N359137
8642H915704J715015J401656M302214K614799o112989j1342882m160448O225712
8634C558781M138960p154052q644775L967882J2015160L804393n936197o54148
8626E096004R892816N796993r116023j2544501O64336J1274240O808291j276822
8618A6595334M54476O193535L812263l972186n669524p65017N87641n205388j0195068
8609A836066p458676L35519O382054P105633K642037m463109r226545p403488
8601a0250509o68780M800798O138468O162575O375509L012805n423690j1304543
8593a157367o273013M806631P333988l129708j3186099r654307K345834Q421718
$$ plain form
8651 12939 713080 4165112 6587930 4570395 -768428 -4509966 -2669591 3556567 8915704
8642 8915704 10630719 12032375 16334589 18949388 12836399 1493517 -2666931 3558781
8634 3558781 7697741 543689 -8101086 -4133204 7881956 11686349 5750152 5096004
8626 5096004 14988820 20785813 11669790 -874711 -210375 11063865 17872156 16595334
8618 16595334 17049810 23243345 27055608 23083422 17413898 16648881 17236522 12031134 1836066
8609 1836066 -5622610 -5287091 1094963 8200596 10842633 6379524 -2847021 -10250509
8601 -10250509 -10919289 -6118491 19977 6182552 12558061 15570866 10147176 -1157367
8593 -1157367 -7430380 -2623749 4710239 1580531 -11605568 -21259875 -18914041 -10492323
8585a0492323O325848O062155J0608242J0741677K071968o100880n620074j912964
8577A1683649k935335n440117l020096O6585m045504j0861058q301725M060175
8569a8793426J3331393J1658934M956533J278291O29140m86414k762977n570156
8561D241318q042350o979662m95028N678639L819510l089173m010047L072896
8553e803897P735771M273368M23780K884981N749431K108007l164085k957521
8545A1249835j463824n626313r938016m179312P453665J0084960P03675p352126
8537I32544m787243J859733L308776Q70917K28477J023169l7040k127698k787874
8528a516239k350253j008481K835763O797352M254703m267835p539088K47540
$$ plain form
8585 -10492323 -4166475 1895680 12503922 23245599 25317567 19216687 13596613 11683649
8577 11683649 8748314 3308197 288101 354686 -3690818 -14551876 -22853601 -18793426
8569 -18793426 -5462033 6196901 11153434 12431725 13060865 12574451 9811474 4241318
8561 4241318 -3801032 -10780694 -11275722 -5597083 -1777573 -4866746 -8876793 -5803897
8553 -5803897 1931874 6205242 6629022 9514003 15263434 17371441 14207356 11249835
8545 11249835 9786011 4159698 -5778318 -9957630 -2503965 7580995 8284670 932544
8537 932544 -3854699 -1994966 1313810 2184727 2413204 3436373 3399333 1271635 -1516239
8528 -1516239 -3866492 -4874973 -2039210 4758142 9012845 4745010 -2794078 -2546538
8520b546538P789001K587968q055516o953006N271469J0021090K77416p880715
8512E11169j251690R126940N782074p687461j3136894n642289K065557J478856
8504h753738j274377M69881L185184K231950R44030L484136O313965M109075j099141
8495I610965l349862j565911Q22736K062339K709402K558014J555439J509455
8487A5912577K655400J138552n202820j0782251p901753K009711Q518808N018617
8479A1366841k945490m923911J357243P591518N584193k611089p830049n920187
8471A669069k279531k567510l938602p83902M379084L662451l125181o630224
8463i614346j407803O239287P752747L554925P1392Q8699J002281k988k741769
$$ plain form
8520 -2546538 5242463 7830431 -225085 -7178091 -1906622 8114468 8391884 511169
8512 511169 -740521 8386419 14168493 6481032 -6655862 -12298151 -10232594 -8753738
8504 -8753738 -10028115 -9558234 -6373050 -4141100 -3197070 287066 6601031 10710106 9610965
8495 9610965 6261103 4695192 5517928 7580267 10289669 12847683 14403122 15912577
8487 15912577 18567977 19706529 14503709 3721458 -4180295 -2170584 6348224 11366841
8479 11366841 8421351 3497440 4854683 12446201 18030394 15419305 7589256 1669069
8471 1669069 -610462 -3177972 -7116574 -7900476 -3521392 141059 -2984122 -9614346
8463 -9614346 -11022149 -4782862 2969885 6524810 6596202 6684901 7687182 7684194 4942425
8454D942425m537013k766331R92305P65917n072633p545567J654116J4365390
8446B798609J4200039J872621l387491O411327J3915808L707952j2085622j2585001
8438A4848242o23856M227691k043472n080631K18113J855286n833150j1079565
8430c511342m655366N284018P306988K725111j314189l583195m706017j201217
8422c655209O920784J0640512L580757o927139r313895l449135J465589Q95412
8414A57676j102974O3932L976933O897519N226308j132738o838450n901244j25638
8405A221324K071525k525113p125647n070120J291942N671906N816401K441677
8397C793895l327901o910806j852476R501794J4028222M249370r385029j1557798
$$ plain form
8454 4942425 405412 -2360919 -1368614 -602697 -5675330 -13220897 -11566781 2798609
8446 2798609 16998648 18871269 15483778 21895105 35810913 39518865 27433243 14848242
8438 14848242 14224386 18452077 16408605 11327974 11546087 13401373 7568223 -3511342
8430 -3511342 -8166708 -2882690 4424298 7149409 5835220 2252025 -2453992 -3655209
8422 -3655209 3265575 13906087 17486844 10559705 1245810 -2203325 -737736 157676
8414 157676 -945298 -881366 3095567 9993086 15219394 14086656 7248206 1346962 1221324
8405 1221324 3292849 767736 -6357911 -11428031 -10136089 -4464183 1352218 3793895
8397 3793895 465994 -6444812 -8297288 1204506 15232728 19482098 10097069 -1460729
8389a460729k519169M478026K838494j225198j489496Q4667J68951K29068J852141
8380B956755K177167j493536o274270o826794k175342L078218L553388j743438
8372f747852q019679q481779j235565P473929Q892640J397842o962260o802415
8364b0485139K303290J1268184J1679452M928177r02429j830319j036186p62629
8356E162401J900282O951464O361976m646818j6143426j4149690q54545P387327
8348h031029K698549n444991o419824j754997K383792N018540O347096L494555
8340a708309k653860m635103O27679N672120L790986j408548l984632m191936
8332h491603k148711O381045J8530978J9673993K847648j6267136j8026414n254284
$$ plain form
8389 -1460729 -3979898 498128 3336622 2111424 621928 706595 875546 1104614 2956755
8380 2956755 5133922 3640386 -2633884 -9460678 -11636020 -8557802 -5004414 -6747852
8372 -6747852 -14767531 -23249310 -24484875 -17010946 -8118306 -6720464 -13682724 -20485139
8364 -20485139 -18181849 -6913665 4765787 9693964 8791535 6961216 5925030 5162401
8356 5162401 7062683 14014147 20376123 15729305 -414121 -14563811 -15418356 -8031029
8348 -8031029 -5332480 -10777471 -17197295 -18952292 -16568500 -11549960 -5202864 -1708309
8340 -1708309 -4362169 -8997272 -8369593 -2697473 1093513 -315035 -4299667 -8491603
8332 -8491603 -10640314 -4259269 14271709 33945702 36793350 20526214 2499800 -2754484
8324b754484L938915L407588K143272M129777L237345j720781l431505K33063
8316I183190K991009K292381J514034m68430p416319j2897687o080914P089949
8308c792787P003549r235064j9203107p136707J2490368J7031321P179597J28023
8300D465193J585323K649826o51815k031723J419099M242080K680599q88922m635381
8291H834279q950690j0374288l158750J0210600J7656759J1016224l469515j1800045
8283I964574p310402L020174O746889j26091q184714n768002N503375J1632558
8275A5478361M604861o601748q458321p83558N393163M541283K088070K999750
8267A9261861L528651j661703r362714j0332304j276126R437460J0195919m11363
$$ plain form
8324 -2754484 1184431 4592019 6735291 10865068 14102413 12381632 8950127 9183190
8316 9183190 12174199 14466580 15980614 15512184 8095865 -4801822 -10882736 -3792787
8308 -3792787 3210762 -6024302 -25227409 -32364116 -19873748 -2842427 4337170 4465193
8300 4465193 6050516 8700342 8048527 6016804 7435903 11677983 14358582 13469660 8834279
8291 8834279 -116411 -10490699 -13649449 -3438849 14217910 25234134 21764619 9964574
8283 9964574 2654172 5674346 12421235 12295144 4110430 -1657572 3845803 15478361
8275 15478361 20083222 13481474 5023153 4239595 9632758 14174041 16262111 19261861
8267 19261861 22790512 21128809 11766095 1433791 157665 9595125 19791044 19379681
8259A9379681j1251191j1344829k325579N207054N397975J640744j483722l651049
8251A569084n202359n020706l895360l660471j928848M474326J0028605N487535
8243A851806m701389l760292J1228014J9154629L954258j8667287k1352237l799681
8235a6092179R053021M418266m250997l086741K544331K162898k202414l144399
8227a0598214j220079o90384p9908L637130P617389P918327O320782N482354K782738
8218B1170135l953212r665899q371004k320270J953722L177394M269540M983707
8210A1244113K641549j672680l885069k830318n74734J524956K650729O15443
8202I713989m911874r029278o480483J082849O985528P617894M736293R67691
$$ plain form
8259 19379681 8128490 -3216339 -5541918 -334864 5063111 6703855 5220133 1569084
8251 1569084 -3633275 -8653981 -12549341 -16209812 -18138660 -13664334 -3635729 1851806
8243 1851806 -2849583 -6609875 4618139 23772768 27727026 9059739 -12292498 -16092179
8235 -16092179 -7039158 -2620892 -6871889 -9958630 -7414299 -5251401 -7453815 -10598214
8227 -10598214 -11818293 -12508677 -12588585 -8951455 -1334066 6584261 12905043 18387397 21170135
8218 21170135 17216923 7551024 -819980 -3140250 -1186528 1990866 6260406 11244113
8210 11244113 13885662 12212982 8327913 5497595 4922861 6447817 9098546 9713989
8202 9713989 4802115 -4227163 -10707646 -9624797 -2639269 4978625 9714918 10682609
8194A0682609k757386n733334o940649o064093l245035J074720M709801M536229
8186c737138P33791k367113j800528L90144Q63958r53950m178852p564931p461449
8177b6076068l29207R652941J1962529L528592n059026l281174N001224Q221673
8169C621484L401709k285450l051306J83668L931011N005123J409523m149723
8161H066039m978757J49049L292079r29951o633144p284846o674783q876820o621387
8152c0492521N606091J5268045P724601o965027n851508R589085J3388620l178734
8144E088652j6210705o927284R584687J0799618J592124O23403O734809L972683
8136A5257987p637325j1233055j668322O984136N026476l72437j023737r0001
$$ plain form
8194 10682609 7925223 2191889 -4748760 -10812853 -14057888 -12983168 -8273367 -3737138
8186 -3737138 -3003347 -5370460 -7170988 -6780844 -5916886 -6870836 -11049688 -18614619 -26076068
8177 -26076068 -26405275 -16752334 -4789805 -1261213 -6320239 -9601413 -4600189 3621484
8169 3621484 7023193 4737743 1686437 1870105 5801116 10806239 12215762 8066039
8161 8066039 3087282 3236331 6528410 5598459 -1034685 -8319531 -14994314 -23871134 -30492521
8152 -30492521 -24886430 -9618385 -1893784 -8858811 -14710319 -5121234 8267386 5088652
8144 5088652 -11122053 -18049337 -8464650 2334968 3927092 4550495 11285304 15257987
8136 15257987 7620662 -3612393 -5280715 1703421 6729897 6357460 5333723 5243722
8128E243722j859091k153259K711922O679708K291864p118365j0817703l968696
8120h989898O952133J1066964L749502q494012j4021807q519248M98585M168644
8112a3589137L410693M351316O461552L645195l683140o456591P03599J1500954
8104F344441J5562743R843327o5029o837768p484899m479467k316595k591416
8096G975337l145747k342307j544410k047283k841590l097191k918887l32482
8088a0294560O435357J1623522N640955q938314j5077319l639536J1359309J1652274
8080H761688P06749m101194N93216K064273m169571p020722m74015N845922M013824
8071F220170R38490M487740Q374477K530191r289623j4051939p760176P76101
$$ plain form
8128 5243722 3384631 1231372 3943294 10623002 12914866 5796501 -5021202 -8989898
8120 -8989898 -2037765 9029199 12778701 4284689 -9737118 -18256366 -17757781 -13589137
8112 -13589137 -10178444 -5827128 634424 4279619 596479 -5860112 -5156513 6344441
8104 6344441 21907184 31750511 31685482 24847714 17362815 12883348 10566753 7975337
8096 7975337 4829590 2487283 942873 -1104410 -3946000 -7043191 -9962078 -10294560
8088 -10294560 -3859203 7764319 13405274 4466960 -10610359 -14249895 -2890586 8761688
8080 8761688 9468437 5367243 5960459 8024732 3855161 -3165561 -3639576 2206346 6220170
8071 6220170 7158660 11646400 20020877 22551068 13261445 -790494 -8550670 -7774569
8063g774569L257319J137727Q33086M745673Q812920P393082j52489q225699j0833501
8054h06451p007897O35415Q976580J3158727P585693n975794j5929263j3741042
8046a3104032n070190j71563J412018O060234J1113771Q365185j5606l584592
8038E005225j108750j364374o009358o756475j323910K964576L729886O021307
8030A158127P935370J258363r742790r369268L474007J0366528L110855k725163
8022E466029L950403R510041M78604j0897723p035466M615969M846519n039118
8014E895258q109276j470201K383048l36253j414283L64524k382150q137160o395861
8005a9602354L319483R153469N647317k1100j961992j953320j021380K163975
$$ plain form
8063 -7774569 -4517250 -3379523 -2546437 2199236 11012156 18405238 18252749 10027050 -806451
8054 -806451 -7814348 -7178933 1797647 14956374 22542067 16566273 637010 -13104032
8046 -13104032 -18174222 -18345785 -16933767 -10873533 240238 8605423 8589817 5005225
8038 5005225 3896475 2532101 -3477257 -10233732 -11557642 -8593066 -4863180 1158127
8030 1158127 9093497 10351860 609070 -8760198 -5286191 5080337 8191192 5466029
8022 5466029 9416432 18926473 19405077 8507354 1471888 6087857 10934376 5895258
8014 5895258 -2214018 -3684219 -1301171 -1637424 -3051707 -2687183 -5069333 -13206493 -19602354
8005 -19602354 -16282871 -7129402 -1482085 -1503185 -3465177 -5418497 -6439877 -4275902
$$ [...]
##END NTUPLES=NMR SPECTRUM
##END=
