##TITLE=31Pdec_SR129_k
 DMSO-d6, 24 sc
 4.7.2022
##JCAMPDX= 6.0         $$ Bruker NMR JCAMP-DX V2.0
##DATA TYPE= NMR SPECTRUM
##DATA CLASS= NTUPLES
##ORIGIN= UXNMR, Bruker Analytische Messtechnik GmbH
##OWNER= root
$$ XWIN-NMR		Version 3.5
$$ Mon Jul  4 14:42:33 2022 Russian Standard Time (UT+4h)  she@DPX200
##.OBSERVE FREQUENCY= 81.013821
##.OBSERVE NUCLEUS= ^31P
##.ACQUISITION MODE= SIMULTANEOUS
##.ACQUISITION SCHEME= undefined
##.AVERAGES= 124
##.DIGITISER RES= 16
##SPECTROMETER/DATA SYSTEM= spect
##.PULSE SEQUENCE= zgpg30
##.SOLVENT NAME= DMSO
##.SHIFT REFERENCE= (INTERNAL, DMSO, 0, 248.564)
##AUDIT TRAIL= $$ (NUMBER, WHEN, WHO, WHERE, WHAT)
$$ ##TITLE= Audit trail, XWIN-NMR		Version 3.5
$$ ##JCAMPDX= 5.01
$$ ##ORIGIN= Bruker BioSpin GmbH
$$ ##OWNER= she
$$ F:/spectra/data/she/nmr/P31/1/pdata/1/auditp.txt
$$ ##AUDIT TRAIL=  $$ (NUMBER, WHEN, WHO, WHERE, WHAT)
(   1,<2022-07-04 14:41:19.96 +0400>,<she>,<DPX200>,
      <continue with go, POWCHK disabled, PULCHK disabled
       configuration hash MD5:
       00 E9 B6 7A A2 85 ED C7 34 08 36 98 17 FE 4E 26
       data hash MD5: 32K
       FC 6E EA 23 DA D9 F6 27 7A 2F 9A B3 E1 17 BC EE>)
(   2,<2022-07-04 14:41:22.92 +0400>,<she>,<DPX200>,
      <Start of raw data processing
       efp BC_mod = 2 LB = 1 FT_mod = 6 PKNL = 1 PHC0 = -9882.413 PHC1 = 17.05603 SI = 64K 
       data hash MD5: 64K
       91 DF 9F F1 77 FC 95 E6 A9 08 CB A1 63 1B 2D 7E>)
(   3,<2022-07-04 14:41:54.67 +0400>,<she>,<DPX200>,
      <pk PHC0 = -78.18447 PHC1 = 183.6 
       data hash MD5: 64K
       C4 CE 25 36 7B C9 37 63 9B 6D C0 D3 69 BB 0E 53>)
$$ ##END=
$$ 
$$ hash MD5
$$ 15 37 51 06 55 E2 F1 D5 53 9A EA 4C 93 DF EF 34
##$RELAX= 
##$RELAX= 
##$RELAX= 
##$RELAX= 
##$RELAX= 
##$RELAX= 
##$RELAX= 
##$RELAX= 
$$ Bruker specific parameters
$$ --------------------------
##$DU= <F:/spectra>
##$EXPNO= 1
##$NAME= <P31>
##$PROCNO= 1
##$TYPE= <nmr>
##$USER= <she>
##$AMP= (0..31)
100 100 100 100 100 100 100 100 100 100 100 100 100 100 100 100 100 100 
100 100 100 100 100 100 100 100 100 100 100 100 100 100 
##$AQSEQ= 0
##$AQ_mod= 1
##$AUNM= <au_zg>
##$AUTOPOS= <>
##$BF1= 81.014009
##$BF2= 200.13
##$BF3= 200.13
##$BF4= 200.13
##$BF5= 200.13
##$BF6= 200.13
##$BF7= 200.13
##$BF8= 200.13
##$BYTORDA= 1
##$CFDGTYP= 0
##$CFRGTYP= 5
##$CHEMSTR= <none>
##$CNST= (0..31)
1 1 145 1 1 1 1 1 1 1 1 1 1 1 1 1 1 1 1 1 1 1 1 1 1 1 1 1 1 1 1 1 
##$CPDPRG= <waltz16>
##$CPDPRG1= <>
##$CPDPRG2= <waltz16>
##$CPDPRG3= <>
##$CPDPRG4= <mlev>
##$CPDPRG5= <mlev>
##$CPDPRG6= <mlev>
##$CPDPRG7= <mlev>
##$CPDPRG8= <mlev>
##$CPDPRGB= <>
##$CPDPRGT= <>
##$D= (0..31)
0 1 0 0 0 0 0 0 0 0 0 0.03 2e-05 3e-06 0 0 0 0 0 0 0 0 0 0 0 0 0 0 0 0 
0 0 
##$DATE= 1656931084
##$DBL= (0..7)
120 120 120 11 120 120 24 19 
##$DBP= (0..7)
150 150 150 150 150 150 150 150 
##$DBP07= 0
##$DBPNAM0= <>
##$DBPNAM1= <>
##$DBPNAM2= <>
##$DBPNAM3= <>
##$DBPNAM4= <>
##$DBPNAM5= <>
##$DBPNAM6= <>
##$DBPNAM7= <>
##$DBPOAL= (0..7)
0.5 0.5 0.5 0.5 0.5 0.5 0.5 0.5 
##$DBPOFFS= (0..7)
$$ [...]
##$SUBNAM2= <"">
##$SUBNAM3= <"">
##$SUBNAM4= <"">
##$SUBNAM5= <"">
##$SUBNAM6= <"">
##$SUBNAM7= <"">
##$SUBNAM8= <"">
##$SUBNAM9= <"">
##$SW= 501.771253377433
##$SWIBOX= (0..15)
0 1 3 0 0 0 0 0 0 0 0 0 0 0 0 0 
##$SW_h= 40650.406504065
##$TD= 32768
##$TD0= 1
##$TE= 0
##$TE2= 300
##$TE3= 300
##$TEG= 300
##$TL= (0..7)
0 120 53 12 22 120 120 120 
##$TP= (0..7)
150 150 150 150 150 150 150 150 
##$TP07= 0
##$TPNAME0= <>
##$TPNAME1= <>
##$TPNAME2= <>
##$TPNAME3= <>
##$TPNAME4= <>
##$TPNAME5= <>
##$TPNAME6= <>
##$TPNAME7= <>
##$TPOAL= (0..7)
0.5 0.5 0.5 0.5 0.5 0.5 0.5 0.5 
##$TPOFFS= (0..7)
0 0 0 0 0 0 0 0 
##$TUNHIN= 0
##$TUNHOUT= 0
##$TUNXOUT= 0
##$USERA1= <user>
##$USERA2= <user>
##$USERA3= <user>
##$USERA4= <user>
##$USERA5= <user>
##$V9= 5
##$VALIST= <valist>
##$VCLIST= <CCCCCCCCCCCCCCC>
##$VD= 0
##$VDLIST= <DDDDDDDDDDDDDDD>
##$VPLIST= <PPPPPPPPPPPPPPP>
##$VTLIST= <TTTTTTTTTTTTTTT>
##$WBST= 1024
##$WBSW= 4
##$XGAIN= (0..3)
0 0 0 0 
##$XL= 0
##$YL= 0
##$YMAX_a= 4279
##$YMIN_a= -2984
##$ZGOPTNS= <>
##$ZL1= 120
##$ZL2= 120
##$ZL3= 120
##$ZL4= 120
##$ABSF1= 0
##$ABSF2= 0
##$ABSG= 0
##$ABSL= 0
##$ALPHA= 0
##$AQORDER= 0
##$ASSFAC= 0
##$ASSFACI= 0
##$ASSFACX= 0
##$ASSWID= 0
##$AUNMP= <proc_1d>
##$AZFE= 0.1
##$AZFW= 0.5
##$BCFW= 0
##$BC_mod= 2
##$BYTORDP= 0
##$COROFFS= 0
##$CY= -3
##$DATMOD= 1
##$DC= 0
##$DFILT= <>
##$DTYPP= 0
##$F1P= 0
##$F2P= 0
##$FCOR= 1
##$FTSIZE= 65536
##$FT_mod= 6
##$GAMMA= 0
##$GB= 0
##$INTBC= 1
##$INTSCL= 5.30512e-09
##$ISEN= 30
##$LB= 1
##$LEV0= 0
##$LPBIN= 0
##$MAXI= 10000
##$MC2= 0
##$MEAN= 0
##$ME_mod= 0
##$MI= 50
##$NCOEF= 0
##$NC_proc= -7
##$NLEV= 6
##$NOISF1= 182.463
##$NOISF2= 159.3651
##$NSP= 0
##$NTH_PI= 0
##$NZP= 0
##$OFFSET= 248.5645
##$PC= 4
##$PHC0= -9960.598
##$PHC1= 200.656
##$PH_mod= 1
##$PKNL= yes
##$PPARMOD= 0
##$PSCAL= 0
##$PSIGN= 0
##$REVERSE= no
##$SF= 81.014009
##$SI= 65536
##$SIGF1= 159.3651
##$SIGF2= -187.1042
##$SINO= 113.3802
##$SIOLD= 16384
##$SREGLST= <1H.CDCl3>
##$SSB= 0
##$STSI= 65536
##$STSR= 0
##$SW_p= 40650.406504065
##$SYMM= 0
##$S_DEV= 0
##$TDeff= 32768
##$TDoff= 0
##$TI= <>
##$TILT= no
##$TM1= 0
##$TM2= 0
##$TOPLEV= 0
##$USERP1= <user>
##$USERP2= <user>
##$USERP3= <user>
##$USERP4= <user>
##$USERP5= <user>
##$WDW= 1
##$XDIM= 65536
##$YMAX_p= 455370467
##$YMIN_p= -37556198
$$ End of Bruker specific parameters
$$ ---------------------------------
##NTUPLES= NMR SPECTRUM
##VAR_NAME=  FREQUENCY,     SPECTRUM/REAL,   SPECTRUM/IMAG
##SYMBOL=    X,             R,               I
##VAR_TYPE=  INDEPENDENT,   DEPENDENT,       DEPENDENT
##VAR_FORM=  AFFN,          ASDF,            ASDF
##VAR_DIM=   65536,         65536,           65536
##UNITS=     HZ,            ARBITRARY UNITS, ARBITRARY UNITS
##FACTOR=    0.620285442955139, 1,           1
##FIRST=     20137.2065510759, 0,            0
##LAST=      -20513.1999529892, 0,           0
##MIN=       -20513.1999529892, -37556198,   0
##MAX=       20137.2065510759, 455370467,    0
$$ Real data points
##PAGE= N=1
##DATA TABLE= (X++(R..R)), XYDATA
$$ [...]
##PAGE= N=2
##DATA TABLE= (X++(I..I)), XYDATA
$$ plain form
13027 -3806641 -4051137 -7769134 -8703232 -4453146 442283 2086023 2082739 2417738 1115553
13018 1115553 -2914404 -5380320 -2405634 2255840 1819113 -3239432 -5610126 -1818383
13010 -1818383 3419782 4925268 3994591 4869038 7914619 9602331 7477455 2605574
13002 2605574 -2121761 -4639398 -5161346 -5397467 -5726157 -4077280 463222 4218852 2625688
12993 2625688 -2977229 -6420364 -5006541 -2184506 -890078 382582 2383237 1722389
12985 1722389 -2816511 -5494011 -1249162 5305025 5591673 73561 -2027124 3658688
12977 3658688 10637668 11517850 7782012 5693408 6912261 7989804 6946731 5785776
12969 5785776 6659564 8642828 8958513 5906615 235114 -5571883 -9173180 -9891172 -8650127
$$ packed form
13027c806641k44496l717997r34098M250086M895429J643740l284L34999j302185
13018A115553m029957k465916K974686M661474m36727n058545k370694L791743
13010a818383N238165J505486r30677Q74447L045581J687712k124876m871881
13002B605574m727335k517637n21948k36121l28690J648877M540502L755630j593164
12993B625688n602917l443135J413823K822035J294428J272660K000655o60848
12985A722389m538900k677500M244849O554187K86648n518112k100685N685812
12977C658688O978980Q80182l735838k088604J218853J077543j043073j160955
12969E785776Q73788J983264L15685l051898n671501n806997l601297p17992J241045
$$ plain form
12960 -8650127 -6932496 -5974148 -5890111 -4830079 -518766 5858830 9054964 5540526 -1438933
12951 -1438933 -5557641 -5049015 -3165903 -2013215 -522310 1275751 933778 -1894755
12943 -1894755 -3894388 -3066427 -1495118 -1029663 15615 3235432 6673780 7934805
12935 7934805 7724015 7358211 5732864 1957066 -1815712 -3576904 -4776800 -6882680
12927 -6882680 -7437689 -3860467 1072300 2238736 -751661 -3862296 -4739446 -4167012 -2628585
12918 -2628585 -84726 1573754 517354 -1013281 735382 4796258 6487401 4484489
12910 4484489 2044101 1143866 569164 301857 2385136 6186194 7872474 6076222 3322646
12901 3322646 721440 -3323737 -7663735 -7872145 -3743596 -1149909 -3019789 -4666438
$$ packed form
12960h650127J717631R58348Q4037J060032M311313O377596L196134l514438o979459
12951a438933m118708N08626J883112J152688J490905J798061l41973k828533
12943a894755j999633Q27961J571309M65455J045278L219817L438348J261025
12935G934805k10790l65804j625347l775798l772778j761192j199896k105880
12927f882680n55009L577222M932767J166436k990397l110635q77150N72434J538427
12918b628585K543859J658480j056400j530635J748663M060876J691143k002912
12910D484489k440388r00235n74702k67307K083279L801058J686280j796252k753576
12901C322646k601206m045177m339998k08410M128549K593687j869880j646649
$$ plain form
12893 -4666438 -2364353 -138478 -2093043 -3818452 888192 8857680 11534932 7843483
12885 7843483 4643666 5184001 5491643 3137990 1793745 4440803 8174617 8980057 7228656
12876 7228656 5549207 4676949 3788762 2232985 -576388 -4286227 -5949001 -2764395
12868 -2764395 2721445 4336559 718034 -2287628 16194 4486538 4995461 749868
12860 749868 -3795234 -5154378 -3596211 -1036559 1081148 2377045 3432622 4234265
12852 4234265 2708820 -2490902 -7482474 -5875542 1981169 7206274 3608228 -3396791
12844 -3396791 -4169512 1906202 6737886 5737754 3152483 4371919 8591218 11578820
12836 11578820 11869375 11354190 11864009 13407136 14630508 13657806 9370278 2701503 -3949385
$$ packed form
12893d666438K302085K225875j954565j725409M706644P969488K677252l691449
12885G843483l199817N40335L07642k353653j344245K647058L733814Q05440j751401
12876G228656j679449q72258q88187j555777k809373l709839j662774L184606
12868b764395N485840J615114l618525l005662K303822M470344N08923m245593
12860G49868m545102j359144J558167K559652K117707J295897J055577Q01643
12852D234265j525445n199722m991572J606932P856711N225105l598046p005019
12844c396791p72721O075714M831684j000132k585271J219436M219299K987602
12836A1578820K90555n15185N09819J543127J223372r72702m287528o668775o650888
$$ plain form
12827 -3949385 -8713349 -10991562 -10842550 -9000270 -6911249 -5145408 -2413237 2014966
12819 2014966 5735778 5456102 1373152 -3144014 -5863537 -6960323 -6311841 -2961544
12811 -2961544 2034652 5367692 5369538 3745524 2464807 1486320 699185 1363158 3795275
12802 3795275 5775591 5157624 2485674 -430506 -2844230 -4592980 -5150624 -4757687 -4771146
12793 -4771146 -5268212 -4077178 -38694 4429570 6062876 4631482 2130593 -352734
12785 -352734 -2568110 -3224931 -1131024 2170446 3502964 1929474 -474415 -1719253
12777 -1719253 -1783390 -1214870 112700 2006090 3088153 2044145 -604764 -2511207 -1443490
12768 -1443490 2511973 6668761 8202091 6920759 4880569 3592935 3134260 3804800
$$ packed form
12827c949385m763964k278213J49012J842280K089021J765841K732171M428203
12819B014966L720812k79676m082950m517166k719523j096786O48482L350297
12811b961544M996196L333040J846j624014j280717r78487p87135O63973K432117
12802C795275J980316o17967k671950k916180k413724j748750n57644L92937j3459
12793d771146m97066J191034M038484M468264J633306j431394k500889k483327
12785c52734k215376o56821K093907L301470J332518j573490k403889j244838
12777a719253o4137N68520J327570J893390J082063j044008k648909j906443J067717
12768a443490L955463M156788J533330j281332k040190j287634m58675O70540
$$ plain form
12760 3804800 6203520 9000956 9380896 7137789 5624972 6662859 7364922 4798322
12752 4798322 1002342 -388106 -171568 -1525468 -3408859 -1553254 3898362 7193213
12744 7193213 4843151 124557 -2157501 -1331431 806560 3358827 5324892 4747597
12736 4747597 2001498 979581 3724795 6584110 5281384 1292705 -963879 -1122305
12728 -1122305 -2130720 -3820303 -2765797 1266562 4103601 3734808 3247104 5027795
12720 5027795 6402184 4098672 -460402 -3787022 -5363207 -6276314 -5320467 -1044397
12712 -1044397 3753382 4552344 1956847 1275550 4594565 7842771 7280179 4621769 3336571
12703 3336571 3621213 4030056 4809900 6048864 5246971 874716 -3566867 -3397208 509294
$$ packed form
12760C804800K398720K797436L79940k243107j512817J037887P02063k566600
12752D798322l795980j390448K16538j353900j883391J855605N451616L294851
12744G193213k350062m718594k282058Q26070K137991K552267J966065n77295
12736D747597k746099j021917K745214K859315j302726l988679k256584j58426
12728a122305j008415j689583J054506M032359K837039l68793m87704J780691
12720E027795J374389k303512m559074l326620j576185r13107R55847M276070
12712a044397M797779P98962k595497o81297L319015L248206n62592k658410j285198
12703C336571K84642M08843P79844J238964q01893m372255m441583J69659L906502
$$ plain form
12694 509294 3089978 2318402 632281 -262902 -1093211 -1380133 839104 4846944 7689982
12685 7689982 9581972 13242304 16574890 13049300 2780248 -4013951 -482505 6077641
12677 6077641 4624026 -3081741 -5708348 185655 6321629 7025564 7221607 12269480
12669 12269480 18185533 18092557 12917494 9059416 8454434 7260400 3445569 257590
12661 257590 1261816 5413544 8477564 7726085 4360908 1880456 2303232 4122524 4521033
12652 4521033 3044871 1492087 559115 -838148 -2549098 -2538115 -610637 158581 -1936946
12643 -1936946 -3516892 -193427 6695330 10636283 7653686 1333691 -1005652 3545988
12635 3545988 10209766 11889972 7330841 2174098 1142395 1810907 -830069 -5585841
$$ packed form
12694E09294K580684p71576j686121q95183q30309k86922K219237M007840K843038
12685G689982J891990L660332L332586l525590j0269052o794199L531446O560146
12677F077641j453615p705767k626607N894003O135974P03935J96043N047873
12669A2269480N916053r2976n175063l858078o04982j194034l814831l187979
12661B57590J004226M151728L064020p51479l365177k480452M22776J819292L98509
12652D521033j476162j552784r32972j397263j710950J0983J927478P69218k095527
12643a936946j579946L323465O888757L940953k982597o319995k339343M551640
12635C545988O663778J680206m559131n156743j031703O68512k640976m755772
$$ plain form
12627 -5585841 -5804402 865936 8524428 10726881 7851514 4155249 1419147 -882858
12619 -882858 -2152596 -1683950 -1414494 -3635466 -6677005 -6357268 -1752565 3002944 2914134
12610 2914134 -3160793 -11353700 -15383855 -11794507 -3831906 1633625 2030077 1201632
12602 1201632 2296732 2692394 -703659 -5078611 -5687538 -3454799 -2829531 -3750400 -2226669
12593 -2226669 1317036 1082736 -4964269 -10831326 -10394355 -5193467 -1037310 -254356 -1010443
12584 -1010443 -1992554 -3689795 -5502371 -4845218 -208162 6078031 9078544 5741314
12576 5741314 -1477839 -6101771 -3814616 3243478 9390296 11645887 11277487 10108647
12568 10108647 8153096 5142883 1903689 -611341 -2088047 -2451007 -2235111 -3008915
$$ packed form
12627e585841k18561O670338P658492K202453k875367l696265k736102k302005
12619h82858j269738M68646K69456k220972l041539L19737M604703M755509q8810
12610B914134o074927q192907m030155L589348P962601N465531L96452q28445
12602A201632J095100L95662l396053m374952o08927K232739O25268r20869J523731
12593b226669L543705k34300o047005n867057M36971N200888M156157P82954p56087
12584a010443r82111j697241j812576O57153M637056O286193L000513l337230
12576E741314p219153m623932K287155P058094O146818K255591l68400j168840
12568A0108647j955551l010213l239194k515030j476706l62960K15896p73804
$$ plain form
12560 -3008915 -5393468 -7110794 -5590669 -2267508 -1164628 -2883450 -3368932 211342
12552 211342 5432583 8153362 7599981 5980295 4889235 4099663 2958312 1595547 1100173
12543 1100173 2534247 4874142 4871978 1261445 -1769224 1033782 7981410 11157342 6653636
12534 6653636 -145974 -2173951 312925 2281054 2586740 4846457 10119600 13525901
12526 13525901 9955516 666642 -7631054 -9361774 -4805216 1071640 3514432 1702819
12518 1702819 -1584385 -3024956 -1362988 1905313 3737027 2413847 -129980 -370518
12510 -370518 1559763 1320821 -2825847 -5924888 -3167570 1907320 1949960 -2871373 -5203373
12501 -5203373 -2494656 -750935 -3699614 -5896434 -1594155 5794148 9449357 9804250
$$ packed form
12560c008915k384553j717326J520125L323161J102880j718822m85482L580274
12552B11342N221241K720779n53381j619686j091060p89572j141351j362765m95374
12543A100173J434074K339895k164l610533l030669K803006O947628L175932m503706
12534F653636o799610k027977K486876J968129L05686K259717N273143L406301
12526A3525901l570385r288874q297696j730720M556558N876856K442792j811613
12518A702819l287204j440571J661968L268301J831714j323180k543827k40538
12510c70518J930281k38942m146668l099041K757318N074890M2640m821333k332000
12501e203373K708717J743721k948679k196820M302279P388303L655209L54893
$$ plain form
12493 9804250 12413239 17864257 20770711 17882323 11350408 4394402 -1012110 -2494771
12485 -2494771 1225984 6500019 7099440 1691623 -4561722 -6729798 -5176422 -3182381
12477 -3182381 -2748778 -3881298 -5408695 -5334144 -2225984 3035629 8163336 11788310 13377060
12468 13377060 11992937 7687189 3261477 1684290 2191450 1858240 587850 1269871
12460 1269871 4943855 8971835 10500920 9180512 6255443 3411504 2446098 3543875
12452 3543875 4068720 1619639 -2204041 -3906767 -3216081 -2691058 -2814403 -1486767 1506304
12443 1506304 3556673 3412483 2746768 2958742 3677874 4658990 5774061 5358610 2479899
12434 2479899 251739 1975219 4513473 1768644 -4943101 -7418185 -3211996 409437
$$ packed form
12493I804250K608989N451018K906454k888388o531915o956006n406512j482661
12485b494771L720755N274035N99421n407817o253345k168076J553376J994041
12477c182381M33603j132520j527397P4551L108160N261613N127707L624974J588750
12468A3377060j384123m305748m425712j577187N07160l33210j270390O82021
12460A269871L673984M027980J529085j320408k925069k843939r65406J097777
12452C543875N24845k449081l823680j702726O90686N25023j23345J327636K993071
12443A506304K050369j44190o65715K11974P19132R81116J115071m15451k878711
12434B479899k228160J723480K538254k744829o711745k475084M206189L621433
$$ plain form
12426 409437 -1165317 -1984605 3808321 10803228 10284399 4195825 1622525 4193711 4851651
12417 4851651 580432 -3175629 -2322495 155727 1284736 3490937 8430393 11269525
12409 11269525 6758852 -2453783 -8924994 -9940097 -9165045 -9702865 -10168070 -8354202
12401 -8354202 -5117640 -2771469 -1775049 -1035285 -356448 -417226 -424077 1990443 7300619
12392 7300619 11983018 11901766 7414155 3094960 2185976 3273055 3058472 488500 -2903664
12383 -2903664 -5075972 -4680961 -1601587 2521865 5382044 6263632 5858794 3833938 -757813
12374 -757813 -6070038 -8041851 -6075325 -4334731 -4775218 -3130907 3776408 10458108
12366 10458108 8719650 -561964 -8204078 -9060001 -7047900 -6692310 -6230173 -2536204
$$ packed form
12426D09437j574754q19288N792926O994907n18829o088574k573300K571186O57940
12417D851651m271219l756061Q53134K478222J129009K206201M939456K839132
12409A1269525m510673r212635o471211j015103P75052n37820m65205J813868
12401h354202L236562K346171R96420P39764O78837o0778o851K414520N310176
12392G300619M682399q1252m487611m319195r08984J087079k14583k569972l392164
12383b903664k172308L95011L079374M123452K860179Q81588m04838k024856m591751
12374g57813n312225j971813J966526J740594m40487J644311O907315O681700
12366A0458108j738458r281614p642114q55923K012101L55590M62137L693969
$$ plain form
12358 -2536204 2050838 2474377 -1871367 -6541034 -7503771 -4587412 -358060 2385991
12350 2385991 2562315 1478877 959225 623405 -1202657 -3654680 -3398803 -72212 1341724
12341 1341724 -3474635 -11568976 -15430632 -11793544 -4823314 -217044 1374212 3691826
12333 3691826 8936706 14306120 15047561 10291869 4551273 2830154 5369001 8502408
12325 8502408 9646618 9171927 7659656 4243025 -1076197 -5526208 -5913022 -2324511
12317 -2324511 1562615 1782465 -2286966 -6993662 -7512883 -2885358 2633534 4516189
12309 4516189 3211008 2536521 4170668 6726283 9255781 11637208 11746104 7076148
12301 7076148 120897 -2879607 -609985 865518 -2595242 -6359034 -4127819 1993356
$$ packed form
12358b536204M587042M23539m345744m669667r62737K916359M229352K744051
12350B385991J76324j083438n19652l35820j826062k452023K55877L326591J413936
12341A341724m816359q094341l861656L637088O970230M606270J591256K317614
12333C691826N244880N369414P41441m755692n740596j721119K538847L133407
12325H502408J144210m74691j512271l416631n319222m450011l86814L588511
12317b324511L887126K19850m069431m706696n19221M627525N518892J882655
12309D516189j305181o74487J634147K555615K529498K381427J08896m669956
12301G076148o955251l000504K269622J475503l460760l763792K231215O121175
$$ plain form
12293 1993356 4425793 1022850 -2941445 -3108723 -771139 1358725 3178837 5244536
12285 5244536 6442370 5834801 4706716 5083158 7366483 10130896 11183892 8848560
12277 8848560 3649042 -1331520 -3164923 -1894252 544243 3163455 5812518 7437269
12269 7437269 7137975 6246495 6452060 6338415 3106213 -2099423 -4024065 387775 8006157
12260 8006157 12868456 11646808 5504803 -1099956 -3053615 1306624 7786208 10154468
12252 10154468 6900359 1987994 -1062772 -2535964 -3358810 -2536616 245750 2715254
12244 2715254 3197749 3147702 4115240 4726449 3372985 1496420 1036207 693672 -1631011
12235 -1631011 -4320923 -4197193 -2427362 -3632993 -8521937 -11843012 -9588024 -4589857
$$ packed form
12293A993356K432437l402943l964295j67278K337584K129864J820112K065699
12285E244536J197834o07569j128085L76442K283325K764413J052996k335332
12277H848560n199518m980562j833403J270671K438495K619212K649063J624751
12269G437269k99294q91480K05565j13645l232202n205636j924642M411840P618382
12260H006157M862299j221648o142005o604759j953659M360239O479584K368260
12252A0154468l254109m912365l050766j473192q22846Q22194K782366K469504
12244B715254M82495n0047R67538O11209j353464j876565m60213l42535k324683
12235a631011k689912J23730J769831j205631m888944l321075K254988M998167
$$ plain form
12227 -4589857 -2044976 -2012253 -37059 5702622 11506198 12976726 9954724 5358603
12219 5358603 1291697 -1732196 -3120618 -2300961 -233535 1361379 2401144 3955647
12211 3955647 5220605 3799623 86389 -1772987 268335 2080377 -1142577 -6979881
12203 -6979881 -8062268 -2333200 3595780 3171772 -1624588 -3478980 615336 6167539
12195 6167539 7358912 3785922 -155826 -1480445 -2197763 -5637938 -10593113 -12063985
12187 -12063985 -8307297 -3738638 -2742063 -3842771 -3382645 -1990788 -2608675 -4166406
12179 -4166406 -3041869 15306 617465 -1470497 -1794423 454361 504650 -3170306 -5052743
12170 -5052743 -1527091 2773131 2690881 963468 2654457 5710846 4309842 -1145345
$$ packed form
12227d589857K544881L2723J975194N739681N803576J470528l022002m596121
12219E358603m066906l023893j388422Q19657K067426J594914J039765J554503
12211C955647J264958j420982l713234j859376K041322J812042l222954n837304
12203f979881j082387N729068N928980m24008m796360j854392M094316N552203
12195F167539J191373l572990l941748j324619p17318l440175m955175j470872
12187a2063985L756688M568659R96575j100708M60126J391857o17887j557731
12179d166406J124537L057175O02159k087962l23926K248784N0289l674956j882437
12170e052743L525652M300222q2250j727413J690989L056389j401004n455187
$$ plain form
12162 -1145345 -4601591 -3644980 -1623581 -917359 -164010 1413319 2219804 1803466 1988642
12153 1988642 3629422 5443079 6336812 6191374 4920970 3460277 4224050 7327385 8362788
12144 8362788 4057478 -1922752 -3604624 -1014186 1709826 4258492 9115692 13851209
12136 13851209 12672478 6191195 1592409 1579558 1211231 -1894825 -2667863 1979064 6550442
12127 6550442 5333914 1068108 -579933 302142 885861 2326298 6438942 9353000
12119 9353000 5934521 -1439806 -5334712 -3483591 -566654 -338300 -1561345 -1942184
12111 -1942184 -1404212 -858711 -1034583 -2407129 -3739130 -2110098 2698477 6138305 4945606
12102 4945606 2561062 3759886 6725078 6681208 5089810 7301832 11694990 10199376
$$ packed form
12162a145345l456246R56611K021399P06222P53349J577329Q06485m16338J85176
12153A988642J640780J813657Q93733j45438j270404j460693P63773L103335J035403
12144H362788m305310n980230j681872K590438K724012K548666M857200M735517
12136A3851209j178731o481283m598786j2851l68327l106056p73038M646927M571378
12127F550442j216528m265806j648041Q82075N83719J440437M112644K914058
12119I353000l418479p374327l894906J851121K916937K28354j223045l80839
12111a942184N37972N45501j75872j372546j332001J629032M808575L439828j192699
12102D945606k384544J198824K965192m3870j591398K212022M393158j495614
$$ plain form
12094 10199376 1704623 -3745277 1160729 9772036 10357574 1716249 -6704155 -7949417
12086 -7949417 -4456150 -2087887 -2615034 -3639530 -2775575 -21606 2839549 4217574
12078 4217574 4224210 3918543 3008648 -214586 -5636294 -9599101 -8489663 -3481843 342577
12069 342577 -114551 -2519140 -2346039 1456399 5445806 6341087 5033551 4448388 4546275
12060 4546275 2504183 -1625463 -3123141 924602 6307575 6797784 2706486 -374777
12052 -374777 -501619 -1500829 -5409968 -8410238 -6935986 -3397410 -2389531 -4414126 -6715647
12043 -6715647 -7644564 -6786828 -3198344 2710397 7314121 7511976 4958973 3115706 1754246
12034 1754246 -1409864 -4924085 -4559046 -113713 3743336 4485278 4873964 7213445 8880194
$$ packed form
12094A0199376q494753n449900M906006Q611307N85538q641325q420404j245262
12086g949417L493267K368263n27147j024496Q63955K753969K861155J378025
12078D217574O636l05667r09895l223234n421708l962807J109438N007820L824420
12069C42577m57128k404589J73101L802438L989407Q95281j307536n85163R7887
12060D546275k042092m129646j497678M047743N382973M90209m091298l081263
12052c74777j26842r99210l909139l000270J474252L538576J007879k024595k301521
12043f715647r28917Q57736L588484N908741M603724J97855k553003j843267j361460
12034A754246l164110l514221L65039M445333L857049P41942L88686K339481J666749
$$ plain form
12025 8880194 6631324 2006081 -1101750 -1921242 -2256910 -2131861 87541 3687355 5393557
12016 5393557 3811500 1345240 662842 1235615 600131 -2148446 -5184741 -5783431 -2903093
12007 -2903093 1740538 5331651 7046448 8665316 11220623 12441998 9713482 4662237
11999 4662237 1717020 2043263 2397666 1017950 745147 3728949 6623197 5300164 2014929
11990 2014929 2501672 6541083 7332037 1747767 -4354156 -4542175 -1115207 -968946 -4816162
11981 -4816162 -6544681 -3032127 1237437 1214150 -1743822 -3177230 -2613055 -3309223 -6349758
11972 -6349758 -8964814 -8776962 -6420903 -3168823 1088199 5790886 7983532 5390000
11964 5390000 418543 -1711573 534118 2542503 -804530 -8166048 -12592908 -9605629
$$ packed form
12025H880194k248870m625243l107831q19492l35668J25049K219402L599814J706202
12016E393557j582057k466260o82398N72773o35484k748577l036295n98690K880338
12007b903093M643631L591113J714797J618868K555307J221375k728516n051245
11999D662237k945217L26243L54403j379716k72803K983802K894248j323033l285235
11990B014929M86743M039411P90954n584270o101923j88019L426968J46261l847216
11981d816162j728519L512554M269564k3287k957972j433408N64175o96168l040535
11972f349758k615056J87852K356059L252080M257022M702687K192646k593532
11964E390000m971457k130116K245691K008385l347033p361518m426860K987279
$$ plain form
11956 -9605629 -2560697 1421092 -149396 -2825449 -1420179 3580461 7138396 5867591
11948 5867591 1247622 -2780334 -3352636 207279 6464133 11940784 12942293 9123143
11940 9123143 4458037 3249284 5742538 8783390 9821387 8654348 6036754 2718612
11932 2718612 -152763 -1534558 -1767530 -2138924 -3141591 -4152000 -4257235 -2199890 3162004
11923 3162004 10144313 13511468 9966691 3494699 893983 2216032 1031122 -4763467
11915 -4763467 -8631554 -5051111 2223799 6291264 6755404 7483161 8536975 7207722
11907 7207722 4786374 5058750 6869048 5186876 -230954 -3938617 -3483574 -2598482 -4114481
11898 -4114481 -5671465 -4609066 -1696017 2070885 6878512 10191084 7567259 453876
$$ packed form
11956i605629P044932L981789j570488k676053J405270N000640L557935j270805
11948E867591m619969m027956n72302L559915O256854N476651J001509l819150
11940I123143m665106j208753K493254L040852J037997j167039k617594l318142
11932B718612k871375j381795k32972l71394j002667j010409j05235K057345N361894
11923C162004O982309L367155l544777o471992k600716J322049j184910n794589
11915d763467l868087L580443P274910M067465M64140P27757J053814j329253
11907G207722k421348K72376J810298j682172n417830l707663M55043Q85092j515999
11898d114481j556984J062399K913049L766902M807627L312572k623825p113383
$$ plain form
11890 453876 -3038321 755464 5109105 3051296 -2310136 -3954216 -2487713 -3763925
11882 -3763925 -8079624 -9891109 -7072373 -2881841 1085352 6655789 12987486 15551198
11874 15551198 13165550 10229422 9510029 7981739 3004603 -1965496 -2094827 1333734
11866 1333734 2570264 -709637 -5085383 -6978490 -7199268 -8442790 -10364198 -9811722
11858 -9811722 -5918224 -2249275 -2066243 -3526793 -2812217 -716376 -1456600 -4871388 -5603422
11849 -5603422 -2130629 -520996 -4945952 -9942933 -8235061 -2042314 756669 -997437
11841 -997437 -1414974 1405710 2618005 -6226 -1931845 197790 3213082 3490763 2654698
11832 2654698 3218498 3386691 867959 -1594927 628320 7064164 12197941 11949012 7641288
$$ packed form
11890D53876l492197L793785M353641k057809n361432j644080J466503j276212
11882c763925m315699j811485K818736M190532L967193N570437O331697K563712
11874A5551198k385648k936128p19393j528290m977136m970099j29331L428561
11866A333734J236530l279901m375746j893107k20778j243522j921408N52476
11858i811722L893498L668949J83032j460550P14576K095841p40224l414788p32034
11849e603422L472793J609633m424956m996981J707872O192747K798983j754106
11841i97437m17537K820684J212295k624231j925619K129635L015292K77681q36065
11832B654698N63800J68193k518732k462886K223247O435844N133777k48929m307724
$$ plain form
11823 7641288 3932586 4057712 6600242 7008765 3577046 680718 3053372 8193426
11815 8193426 9390980 6002364 4476540 7751281 10299051 7028278 986599 -2446231
11807 -2446231 -3705273 -5725312 -6973020 -4564337 -1356179 -2616112 -6877284 -7281891
11799 -7281891 -2259283 1906144 825794 -1697163 -249521 3894723 5248643 2416453
11791 2416453 -259681 1105014 5303290 8323912 8159982 5888440 3035783 -63867
11783 -63867 -2948118 -4062024 -2674104 -411612 1128975 3141935 7311446 11641831
11775 11641831 12095181 8297827 3866993 797010 -2124656 -4459205 -2917063 2568077
11767 2568077 6577451 5598508 3237242 3817028 5062421 2623334 -1573713 -2035086 1203010
$$ packed form
11823G641288l708702J25126K542530M08523l431719k896328K372654N140054
11815H193426J197554l388616j525824L274741K547770l270773o041679l432830
11807b446231j259042k020039j247708K408683L208158j259933m261172m04607
11799g281891N022608M165427j080350k522957J447642M144244J353920k832190
11791B416453k676134J364695M198276L020622j63930k271542k852657l099650
11783f3867k884251j113906J387920K262492J540587K012960M169511M330385
11775A1641831M53350l797354m430834l069983k921666k334549J542142N485140
11767B568077M009374r78943k361266N79786J245393k439087m197047m61373L238096
$$ plain form
11758 1203010 2963725 1823615 1988787 5579576 9062094 9070286 6758712 4415096 2218268
11749 2218268 568174 1543787 5282623 8080879 6854015 3172201 643259 405075
11741 405075 1149248 1546530 815272 -1158826 -2667775 -1310334 2085969 3105763 -631433
11732 -631433 -5840448 -7917311 -6589420 -4439101 -2120836 1217821 4309265 4869237
11724 4869237 3910091 4793908 7699567 9118351 7733303 6539295 7248565 6808941 2702169
11715 2702169 -1796923 -1940895 1327722 3436749 3938744 6486843 11028867 12228885
11707 12228885 7847918 3254856 3936656 7768917 9073261 6923267 4344083 1790211
11699 1790211 -2671301 -7655896 -8836660 -5453390 -1340077 1372883 4623266 9067734
$$ packed form
11758A203010J760715j140110J65172L590789L482518Q192k311574k343616k196828
11749B218268j650094R75613L738836K798256j226864l681814k528942k38184
11741D05075P44173L97282p31258j974098j508949J357441L396303J019794l737196
11732f31433n209015k076863J327891K150319K318265L338657L091444N59972
11724D869237r59146Q83817K905659J418784j385048j194008P09270m39624m106772
11715B702169m499092j43972L268617K109027N01995K548099M542024J200018
11707A2228885m380967m593062O81800L832261J304344k149994k579184k553872
11699A790211m461512m984595j180764L383270M113313K712960L250383M444468
$$ plain form
11691 9067734 11249675 8594217 3337309 -1156657 -4669162 -8050352 -9883526 -8275699
11683 -8275699 -3998815 485082 3324756 3105790 -903931 -6354188 -8501751 -5676997
11675 -5676997 -1471128 614576 1360023 1981182 200547 -5246963 -9405466 -6446051
11667 -6446051 982454 3881395 -978190 -6507173 -5075103 1290654 3908061 -1303448
11659 -1303448 -9065493 -11570225 -7698431 -3387561 -3219686 -4503514 -1921632 3984365
11651 3984365 7123059 4532834 152325 -1655928 -2027716 -4038567 -6496718 -5114047
11643 -5114047 1532591 9981478 15033582 13667680 7492472 2137036 1823170 4061338
11635 4061338 3075866 -1315136 -3314850 -645885 2086045 2170935 3703192 9155842 13252447
$$ packed form
11691I067734K181941k655458n256908m493966l512505l381190j833174J607827
11683h275699M276884M483897K839674k18966m009721n450257k147563K824754
11675e676997M205869K085704P45447O21159j780635n447510m158503K959415
11667f446051P428505K898941m859585n528983J432070O365757K617407n211509
11659a303448p762045k504732L871794M310870J67875j283828K581882N905997
11651C984365L138694k590225m380509j808253l71788k010851k458151J382671
11643e114047O646638Q448887N052104j365902o175208n355436l13866K238168
11635D061338r85472m391002j999714K668965K731930Q4890J532257N452650M096605
$$ plain form
11626 13252447 11617586 8949798 10834970 13419673 10464367 5613872 6854170 12110310
11618 12110310 12078773 6007744 2665082 5040583 5826396 597673 -5177569 -5908935 -3325142
11609 -3325142 -334388 3883193 8590611 9477103 6230260 4574297 6827499 8281828
11601 8281828 6906740 7708311 12083651 12139796 3143930 -6470663 -6364242 952474 5849504
11592 5849504 6565970 8360276 11487324 10701393 5586845 1931578 2375980 3291906 1651043
11583 1651043 -1289347 -3615177 -4686411 -3506772 -119943 2014881 73270 -2714041
11575 -2714041 -1052801 4111336 7151325 6733456 6755227 8430237 8190177 4569607 1051654
11566 1051654 297816 744461 594978 407190 182103 -1473343 -3762636 -3848016 -2106143
$$ packed form
11626A3252447j634861k667788J885172K584703k955306m850495J240298N256140
11618A2110310l1537o071029l342662K375501P85813n228723n775242p31366K583793
11609c325142K990754M217581M707418Q86492l246843j655963K253202J454329
11601H281828j375088Q01571M375340N6145q995866r614593J06421P316716M897030
11592E849504P16466J794306L127048p85931n114548l655267M44402R15926j640863
11583A651043k940390k325830j071234J179639L386829K134824j941611k787311
11575b714041J661240N164137L039989m17869K1771J675010k40060l620570l517953
11566A051654p53838M46645j49483j87788k25087j655446k289293q5380J741873
$$ plain form
11557 -2106143 -2592346 -6473205 -9571388 -8492035 -4748553 -688101 3935787 8593107
11549 8593107 9984876 7162004 4573718 5796396 7615432 4940119 -1109346 -5032023
11541 -5032023 -5105898 -4578335 -5371839 -5589216 -3792200 -1401957 521560 3343519 7770818
11532 7770818 11354204 11341840 8422802 5560133 4182783 3604382 3527581 4574269 5860660
11523 5860660 4538088 -275950 -4504644 -2916856 3831352 8697123 6360947 -191690
11515 -191690 -3538939 -1011373 2925755 3288112 439875 -1824092 -1614466 -236923 728364
11506 728364 1462878 2853672 4695169 5632943 4710380 2650116 1246446 1280351 1540262
11497 1540262 583911 -1004473 -1310023 34598 1155746 738385 215652 1899821 5523721
$$ packed form
11557b106143m86203l880859l098183J079353L743482M060452M623888M657320
11549H593107J391769k822872k588286J222678J819036k675313o049465l922677
11541e032023p3875N27563p93504k17377J797016K390243J923517K821959M427299
11532G770818L583386j2364k919038k862669j377350n78401p6801J046688J286391
11523E860660j322572m814038m228694J587788O748208M865771k336176o552637
11515a91690l347249K527566L937128L62357k848237k263967K09626J377543R65287
11506G28364P34514J390794J841497R37774r22563k060264j403670L3905K59911
11497A540262r56351j588384l05550J344621J121148m17361n22733J684169L623900
$$ plain form
11488 5523721 8072389 7325429 4612657 3343364 5119860 8061588 9180242 7774028
11480 7774028 5776978 5043135 5328803 5245650 4181794 2492778 608829 -820886 -351866
11471 -351866 2954558 7182566 8189070 4116968 -1587541 -3707512 -1711487 -130644
11463 -130644 -1466189 -1798934 3277530 10447104 11592333 5184236 -874840 -239119 3401802
11454 3401802 3276918 340706 508912 3781622 4017500 -527701 -4052733 -2316296 1869557
11445 1869557 4780067 6929977 8603968 6544056 41962 -4925475 -3395104 909671
11437 909671 1573399 -505382 175815 3673521 4582391 990667 -3371788 -5643706 -6201055
11428 -6201055 -4706695 -281791 4090256 4069773 1777048 3977568 10553327 12359784
$$ packed form
11488E523721K548668p46960k712772j269293J776496K941728J118654j406214
11480G774028j997050p33843K85668q3153j063856j689016j883949j429715M69020
11471c51866L306424M228008J006504m072102n704509k119971J996025J580843
11463a30644j335545l32745N076464P169574J145229o408097o059076O35721L640921
11454C401802j24884k936212J68206L272710K35878m545201l525032J736437M185853
11445A869557K910510K149910J673991k059912o502094m967437J530371M304775
11437I09671O63728k078781O81197L497706R08870l591724m362455k271918n57349
11428f201055J494360M424904M372047k0483k292725K200520O575759J806457
$$ plain form
11420 12359784 4416186 -5650240 -7856946 -3173090 -63803 -1475917 -2621096 -495865
11412 -495865 1344099 -1161355 -6543014 -10020841 -9195607 -5764488 -2725141 -1053447
11404 -1053447 621570 2844082 2851100 -2276886 -9967728 -13439208 -10387872 -6503663 -7173437
11395 -7173437 -9483695 -7352335 -1802763 282467 -3045553 -5838308 -3345422 1725774
11387 1725774 4517793 4604981 3859664 1881709 -2018951 -4942097 -3227336 1906623 5575232
11378 5575232 5573390 3825806 1704713 -2135565 -8249022 -13957923 -16072361 -14000176 -9146326
11369 -9146326 -3489302 154830 -796757 -5175987 -7704471 -4798470 590828 2563871
11361 2563871 -313313 -4053614 -5107361 -3863916 -1982336 394155 3208618 4839385
$$ packed form
11420A2359784p943598j0066426k206706M683856L109287j412114j145179K125231
11412d95865J839964k505454n381659l477827Q25234L431119L039347J671694
11404a053447J675017K222512P018n127986p690842l471480L051336L884209o69774
11395g173437k310258K131360N549572K085230l328020k792755K492886N071196
11387A725774K792019Q7188p45317j977955l900660k923146J714761N133959L668609
11378E575232j842j747584k121093l840278o113457n708901k114438K072185M853850
11369i146326N657024L644132r51587m379230k528484K906001N389298J973043
11361B563871k877184l740301j053747J243445J881580K376491K814463J630767
$$ plain form
11353 4839385 4043565 2119459 1260607 1730700 2294031 2627702 3659749 5935588 8946678
11344 8946678 11666934 12717727 10782697 6282539 2006519 413253 618681 -266759
11336 -266759 -3031958 -5548347 -6231074 -6132693 -6587796 -6616401 -4368857 -192623 3374438
11327 3374438 4256956 2270572 -1420089 -4609854 -4342537 657159 7254792 9944975
11319 9944975 6995255 2538083 820370 833282 -222799 -523208 3819143 10029951 9312461
11310 9312461 -722069 -10134526 -8607989 773680 6441339 4570952 2310615 4724170
11302 4724170 7098570 3719830 -2523190 -4732300 -1936176 1160729 1977620 2453020
11294 2453020 4656075 8212305 11697846 13353805 11036213 4562375 -2343692 -5261252
$$ packed form
11353D839385p95820j924106q58852M70093N63331L33671J032047K275839L011090
11344H946678K720256J050793j935030m500158m276020j593266K05428q85440
11336b66759k765199k516389o82727R8381m55103k8605K247544M176234L567061
11327C374438Q82518j986384l690661l189765K67317M999696O597633K690183
11319I944975k949720m457172j717713J2912j056081l00409M342351O210808p17490
11310I312461j0034530r412457J526537R381669N667659j870387k260337K413555
11302D724170K374400l378740o243020k209110K796124L096905Q16891M75400
11294B453020K203055L556230L485541J655959k317592o473838o906067k917560
$$ plain form
11286 -5261252 -3859044 -1163423 941619 2674349 3838333 3773411 3503038 4651314 6270045
11277 6270045 5938276 4008890 3224597 3694709 2207754 -1959893 -4290212 -865522 5502727
11268 5502727 8261399 5316410 1409989 2052037 6975255 10550708 8084327 974706
11260 974706 -4586133 -3809486 2270475 8472679 10530775 8070659 3945122 1907083
11252 1907083 3942179 8230817 10180149 6896042 288754 -5358025 -8096829 -9214022
11244 -9214022 -10427484 -12057627 -13282453 -12378321 -7566969 262919 6605509 7650521
11236 7650521 4809029 2254236 1059005 -462729 -1388754 1477399 6786227 7837857
11228 7837857 2068589 -3189682 419500 10212930 15102508 9900209 1380758 -1555643
$$ packed form
11286e261252J402208K695621K105042J732730J163984o4922k70373J148276J618731
11277F270045l31769j929386p84293M70112j486955m167647k330319L424690O368249
11268E502727K758672k944989l906421O42048M923218L575453k466381p109621
11260I74706n560839P76647O079961O202204K058096k460116m125537k038039
11252A907083K035096M288638J949332l284107o607288n646779k738804j117193
11244i214022j213462j630143j224826R04132M811352P829888O342590J045012
11236G650521k841492k554793j195231j521734r26025K866153N308828J051630
11228G837857n769268n258271L609182R793430M889578n202299q519451k936401
$$ plain form
11220 -1555643 1018439 2391678 -280495 -2736637 -906013 2943079 3825339 1320531
11212 1320531 -250028 1542920 3807446 2661927 -1509045 -4989217 -5341169 -3193922
11204 -3193922 -557535 775335 22681 -1566418 -1296031 1532534 3712270 1878937
11196 1878937 -2706825 -5819068 -6125127 -6096704 -6881334 -5965433 -1632152 3125134 3743786
11187 3743786 -120975 -4057809 -3771203 710615 5417481 6419270 3762746 1473490
11179 1473490 3007905 7195221 10031601 9858618 8472849 7247311 5238986 2208750
11171 2208750 501400 1671658 3339137 2056941 -1858874 -4863001 -4862703 -2945060 -658889
11162 -658889 1934796 4834927 6667284 6060280 3725450 2075349 2744946 4925114 6280169
$$ packed form
11220a555643K574082J373239k672173k456142J830624L849092Q82260k504808
11212A320531j570559J792948K264526j145519m170972l480172l51952K147247
11204c193922K636387J332870p52654j589099K70387K828565K179736j833333
11196A878937m585762l112243l06059K8423p84630R15901M333281M757286O18652
11187C743786l864761l936834K86606M481818M706866J001789k656524k289256
11179A473490J534415M187316K836380j72983j385769j225538k008325l030236
11171B208750j707350J170258J667479j282196l915815l004127K98J917643K286171
11162f58889K593685K900131J832357o07004k334830j650101O69597K180168J355055
$$ plain form
11153 6280169 5412763 3191993 1413163 440904 -1052572 -3902582 -6948960 -8284939
11145 -8284939 -7202263 -4061399 942495 7295892 12527105 13029852 7899130 990437
11137 990437 -2551587 -1670471 300933 762004 949600 2617038 3908261 1537854 -3739222
11128 -3739222 -7261730 -6652620 -4793669 -5096300 -6412533 -5068420 -371173 4617559
11120 4617559 7362252 8581908 10198463 11922643 10924874 5271090 -2383140 -5925169
11112 -5925169 -2460240 2958235 2350853 -5077632 -11368006 -9839619 -3150418 1287643
11104 1287643 809784 -1216124 -1443337 175803 2203722 3191123 1691068 -2248733 -5919284
11095 -5919284 -6651561 -4903507 -2422732 1093284 6470660 11765972 14222019 14409789
$$ packed form
11153F280169q67406k220770j778830r72259j493476k850010l046378j335979
11145h284939J082676L140864N003894O353397N231213N02747n130722o908693
11137I90437l542024Q81116J971404M61071J87596J667438J291223k370407n277076
11128c739222l522508O09110J858951l02631j316233J344113M697247M988732
11120D617559K744693J219656J616555J724180r97769n653784p654230l542029
11112e925169L464929N418475o07382p428485o290374J528387O689201M438061
11104A287643m77859k025908k27213J619140K027919R87401j500055l939801l670551
11095e919284p32277J748054K480775L516016N377376N295312K456047J87770
$$ plain form
11087 14409789 14581022 14076515 10935770 7270989 7604105 11448013 12947936 9229105
11079 9229105 4028159 1226842 -90378 -1466868 -951289 2917447 6846394 6963995
11071 6963995 4629447 3782661 4562402 4081185 2275668 2181775 4354605 5465505 3745985
11062 3745985 2296485 4758164 9828490 12511440 10105391 5145206 2437883 4323312
11054 4323312 8952407 12338337 11784425 7867586 3397602 237848 -2489052 -6118197
11046 -6118197 -8905005 -7246035 -1377537 3149725 2474032 326299 2586414 7657537
11038 7657537 8182986 2397485 -2886894 -2640313 -467121 -1508706 -4435932 -5341996 -4471307
11029 -4471307 -3523247 -832220 4593411 8347315 6685396 3532981 4134173 5568569
$$ packed form
11087A4409789J71233n04507l140745l664781L33116L843908J499923l718831
11079I229105n200946k801317j317220j376490N15579L868736L928947J17601
11071F963995k334548q46786P79741m81217j805517r3893K172830J110900j719520
11062C745985j449500K461679N070326K682950k406049m960185k707323J885429
11054D323312M629095L385930n53912l916839m469984l159754k726900l629145
11046f118197k786808J658970N868498M527262o75693k147733K260115N071123
11038G657537N25449n785501n284379K46581K173192j041585k927226r06064Q70689
11029d471307R48060K691027N425631L753904j661919l152415O01192J434396
$$ plain form
11021 5568569 2328473 -2037563 465965 7630738 8830125 2096988 -2760408 -865677
11013 -865677 302984 -4378502 -7341998 -1218441 7335263 7074259 -859139 -5955559
11005 -5955559 -4444785 -2048764 -2322331 -1949928 1707307 6262044 9168600 10896512
10997 10896512 11565047 9522818 5236826 2378890 2738844 3163475 -71458 -5860514
10989 -5860514 -9493272 -8384721 -4698112 -2055529 -938741 1246684 5605352 9364804
10981 9364804 9644872 7778685 7152078 8098994 8457381 8211840 9116122 9859281 6770726
10972 6770726 497670 -2951143 114948 6468065 10885797 11533843 8729203 3209636
10964 3209636 -1673692 -768331 6213550 12461694 11893898 6155546 1188237 373893 3625154
$$ packed form
11021E568569l240096m366036K503528P164773J199387o733137m857396J894731
11013h65677J168661m681486k963496O123557Q553704k61004p933398n096420
11005e955559J510774K396021k73567L72403L657235M554737K906556J727912
10997A0896512O68535k042229m285992k857936L59954M24631l234933n789056
10989e860514l632758J108551L686609K642583J116788K185425M358668L759452
10981I364804K80068j866187o26607R46916L58387k45541R04282P43159l088555
10972F770726o273056l448813L066091O353117M417732O48046k804640n519567
10964C209636m883328R05361O981881O248144n67796n738352m967309q14344L251261
$$ plain form
10955 3625154 9048700 12295440 8590472 -624598 -6863394 -4419100 2507157 6293217
10947 6293217 5502621 3546715 1779466 -483993 -1913008 -799719 992946 637942
10939 637942 -580427 785906 4643433 7471274 6858066 2896462 -2923053 -7407138
10931 -7407138 -7144817 -3438984 -2314125 -6065992 -8894071 -5435692 618916 2064808
10923 2064808 -1390425 -4534026 -5442548 -6163146 -6804558 -5633347 -3636687 -2898244 -1908290
10914 -1908290 1619029 5095828 4578969 2214237 3369746 7635203 9673843 8134431
10906 8134431 6630063 6521282 6028319 6078155 9298305 13108290 11858551 6582409 4460688
10897 4460688 7400400 9749925 9243711 10741806 15412346 15824195 7997338 177043
$$ packed form
10955C625154N423546L246740l704968r215070o238796K444294O926257L786060
10947F293217p90596j955906j767249k263459j429015J113289J792665l55004
10939F37942j218369J366333L857527K827841o13208l961604n819515m484085
10931g407138K62321L705833J124859l751867k828079L458379O054608J445892
10923B064808l455233l143601r08522p20598o41412J171211J996660P38443R89954
10914a908290L527319L476799n16859k364732J155509M265457K038640j539412
10906H134431j504368j08781m92963M9836L220150L809985j249739n276142k121721
10897D460688K939712K349525n06214J498095M670540M11849p826857p820295
$$ plain form
10889 177043 1716076 9225241 12306541 8922028 6057636 7073650 7448673 3865030
10881 3865030 -152059 -406391 1677929 2462404 2221911 4046097 8208128 11003008 9272148
10872 9272148 3989126 -1127129 -3182684 -1785460 1460438 3966461 3561522 443047
10864 443047 -2522592 -2787982 -1107409 -125735 -665132 -1515124 -2220027 -3089765 -2779282
10855 -2779282 291503 3766310 3195631 -592064 -990387 4903645 11280784 11837381 8333898
10846 8333898 6104239 5154614 1874984 -3050771 -5068458 -3218666 -1406040 -2252365
10838 -2252365 -4457796 -6232172 -6940630 -5320368 -384985 5330601 7104595 3512120
10830 3512120 -1925208 -4879310 -4058626 -1222307 921009 1327252 1898783 4514751 6692194
$$ packed form
10889A77043J539033P509165L081300l384513k864392J016014L75023l583643
10881C865030m017089k54332K084320P84475k40493J824186M162031K794880j730860
10872I272148n283022n116255k055555J397224L245898K506023m04939l118475
10864D43047k965639k65390J680573R81674n39397q49992p04903q69738L10483
10855b779282L070785L474807n70679l787695l98323N894032O377139N56597l503483
10846H333898k229659r49625l279630m925755k017687J849792J812626q46325
10838b252365k205431j774376p08458J620262M935383N715586J773994l592475
10830C512120n437328k954102Q20684K836319K143316M06243N71531K615968K177443
$$ plain form
10821 6692194 4066550 -1721224 -3042026 2848697 8663729 7358101 2115107 323909
10813 323909 2546352 4196468 3912733 2924494 -161058 -6029340 -9307715 -4965283 2379223
10804 2379223 4150212 821991 259159 4528980 7942042 7881953 7936282 9439991 9058401
10795 9058401 6360558 5404806 7036605 7478914 6191389 7231287 10916552 11880220 7648148
10786 7648148 2010584 -1942300 -4911065 -6113420 -2942469 2113906 2465619 -2027857
10778 -2027857 -3633677 1120028 6129916 6173444 4415591 4845187 4995871 1924275 -983622
10769 -983622 776926 5504527 8218716 7060543 3101666 -2145416 -6082897 -6266626
10761 -6266626 -4551009 -5131371 -7018291 -4824927 1215208 3839850 520595 -1548448
$$ packed form
10821F692194k625644n787774j320802N890723N815032j305628n242994j791198
10813C23909K222443J650116k83735r88239l085552n868282l278375M342432P344506
10804B379223J770989l328221n62832M269821L413062o0089N4329J503709l81590
10795I058401k697843r55752J631799M42309j287525J039898L685265R63668m232072
10786G648148n637564l952884k968765j202355L170951N056375L51713m493476
10778b027857j605820M753705N009888M3528j757853M29596J50684l071596k907897
10769i83622J760548M727601K714189j158173l958877n247082l937481j83729
10761f266626J715617n80362j886920K193364O040135K624642l319255k069043
$$ plain form
10753 -1548448 3169187 9979842 12390195 11816293 12250839 11704022 6590132 -160585 -2938880
10744 -2938880 -1986266 -1326985 -1178035 922099 3605007 2777254 -1607099 -5108468 -4861994
10735 -4861994 -2201896 396109 1935630 2643339 3026923 3090868 2215901 731558 581677
10726 581677 2266791 3030867 1617577 2139669 7745311 13184943 11196868 4329922 1479310
10717 1479310 3898262 5079535 4211842 7339867 13222350 11529235 62026 -8970157
10709 -8970157 -6714900 -67349 1539022 479713 2570742 4489390 720985 -4686236
10701 -4686236 -4484573 -453948 935894 -158150 447625 2041239 1918814 2329213 5526518
10692 5526518 6929175 2426923 -2531182 -774101 4510452 5594827 3550474 4982677
$$ packed form
10753a548448M717635O810655K410353n73902M34546n46817n113890o750717k778295
10744b938880R52614O59281J48950K100134K682908q27753m384353l501369K46474
10735d861994K660098K598005J539521P07709L83584O3945q74967j484343j49881
10726E81677J685114P64076j413290N22092N605642N439632j988075o866946k850612
10717A479310K418952J181273q67693L128025N882483j693115j1467209r032183
10709h970157K255257O647551J606371j059309K091029J918648l768405n407221
10701d686236K01663M030625J389842j094044O05775J593614j22425M10399L197305
10692E526518J402657m502252m958105J757081N284553J084375k044353J432203
$$ plain form
10684 4982677 9145890 9634898 6672540 6759042 11087267 14116826 13026654 9923559 5786372
10675 5786372 455379 -2938780 -1577843 1136398 1158156 1916269 7755226 13133464 9607054
10666 9607054 1042115 -520704 6518160 11329509 8160475 3598809 3843793 6107643
10658 6107643 6615022 7238011 9534259 10479713 8728825 8159219 11085755 14036018 13783003
10649 13783003 12018167 11066627 10178285 8489592 6603877 3453035 -2911150 -9563146
10641 -9563146 -9472852 -553266 10735059 16770708 15647082 9946729 3566282 486512
10633 486512 1583193 2055618 -2760641 -9045142 -8272291 236614 7613768 7743725 4234547
10624 4234547 2957161 4550107 7321003 11177275 15062176 16003976 14215804 14041660
$$ packed form
10684D982677M163213M89008k962358Q6502M328225L029559j090172l103095m137187
10675E786372n330993l394159J360937K714241K1758P58113N838957N378238l526410
10666I607054q564939j562819P038864M811349l169034m561666K44984K263850
10658F107643N07379O22989K296248R45454j750888n69606K926536K950263k53015
10649A3783003j764836r51540q88342j688693j885715l150842o364185o651996
10641i563146R0294Q919586J1288325O035649j123626n700353o380447l079770
10633D86512J096681M72425m816259o284501P72851Q508905P377154J29957l509178
10624D234547j277386J592946K770896L856272L884901R41800j788172j74144
$$ plain form
10616 14041660 16517475 16198790 9216906 -232786 -5514697 -5556398 -3330469 -359057
10608 -359057 2893089 4458440 3248248 1683197 2071926 2593349 643287 -1993925 -1437433
10599 -1437433 2318027 5709617 6874190 6745727 5582073 2520773 -1224385 -2688076
10591 -2688076 -1625836 -1034443 -1771028 -467811 4551381 8897651 7927539 4397756 4827743
10582 4827743 9326888 11407305 8406115 5119890 4862934 4284239 1315944 990631 6845422
10573 6845422 12712870 11070199 4797039 2138492 4139473 6235108 8405862 13333790
10565 13333790 17556615 15809289 11949181 13664798 18339899 17415687 13260758 16316624
10557 16316624 25094940 25864732 15382127 7072596 9193131 13066007 10110788 5258985
$$ packed form
10616A4041660K475815l18685o981884r449692n281911m1701K225929K971412
10608c59057L252146J565351j210192j565051L88729N21423j950062k637212N56492
10599a437433L755460L391590J164573j28463j163654l061300l745158j463691
10591b688076J062240N91393p36585J303217N019192M346270r70112l529783M29987
10582D827743M499145K080417l001190l286225k56956n78695k968295l25313N854791
10573F845422N867448j642671o273160k658547K000981K095635K170754M927928
10565A3333790M222825j747326l860108J715617M675101r24212m154929L055866
10557A6316624Q778316P69792j0482605q309531K120535L872876k955219m851803
$$ plain form
10549 5258985 5155774 7066720 7907575 10958190 15718956 14829414 8719478 8455662 15959526
10540 15959526 17849441 8533070 1792976 7521343 14776050 12153006 7639612 11948605
10532 11948605 18344741 16722414 12823232 15098672 16512462 8437370 -386870 2063096
10524 2063096 10257749 12735613 11907331 14159541 14018895 6949208 3209385 9665185
10516 9665185 14093180 7907283 5737382 19231808 31818805 26485872 17777687 25466861
10508 25466861 37212602 32061950 21218280 27213503 40941246 40228939 33375322 40714892
10500 40714892 51006780 43390874 33763798 47146634 64567410 57071024 49630652 79187891
10492 79187891 112742156 99176094 85465502 160336266 270720347 234983718 61
$$ packed form
10549E258985j03211J910946Q40855L050615M760766q89542o109936k63816P503864
10540A5959526J889915r316371o740094N728367P254707k623044m513394M308993
10532A1948605O396136j622327l899182K275440J413790q075092q824240K449966
10524B063096Q194653K477864q28282K252210j40646p069687l739823O455800
10516I665185M427995o185897k169901J3494426J2586997n332933q708185P689174
10508B5466861J1745741n150652j0843670N995223J3727743p12307o853617P339570
10500D0714892J0291888p615906r627076J3382836J7420776p496386p440372K9557239
10492G9187891L3554265j3566062j3710592P4870764J10384081l5736629k34983657
$$ plain form
10485 61 -241516732 -286245432 -173043257 -87940786 -97261487 -112788886 -79325805 -48638427
10477 -48638427 -60276659 -74117408 -55505173 -33677756 -37076318 -43766079 -32665569
10470 -32665569 -23276578 -30413120 -32102951 -14812334 -3838664 -17450732 -32586453
10463 -32586453 -26581340 -15278673 -19578775 -28089752 -23241860 -14881823 -18279100 -24037865
10455 -24037865 -17832519 -8207086 -8983462 -13572403 -10498727 -6305108 -10690619 -15917430
10447 -15917430 -12365614 -8560017 -14930711 -22481136 -18083591 -7812363 -5294612 -8453569
10439 -8453569 -6738291 -1456957 -1083883 -4638382 -5676530 -5458712 -8237788 -10741888
10431 -10741888 -8757089 -6734146 -9637230 -13021025 -11600251 -9552069 -12369575 -16594793
$$ packed form
10485F1k41516793m4728700J13202175Q5102471r320701j5527399L3463081L0687378
10477d8638427j1638232j3840749J8612235K1827417l398562o689761J1100510
10470c2665569R388991p136542j689831J7290617J0973670j3612068j5135721
10463c2586453O005113J1302667m300102q510977M847892Q360037l397277n758765
10455b4037865O205346R625433p76376m588941L073676M193619m385511n226811
10447a5917430L551816L805597o370694p550425M397545J0271228K517751l158957
10439h453569J715278N281334L73074l554499j038148K17818k779076k504100
10431a0741888J984799K022943k903084l383795J420774K048182k817506m225218
$$ plain form
10423 -16594793 -16899964 -15193458 -14323184 -11441396 -5484854 -2060390 -3535946 -4103857
10415 -4103857 -1508830 -2476186 -9145401 -12315257 -6746890 -1047200 -3032757 -7134287
10407 -7134287 -6015581 -2923888 -2446686 -774808 4293841 5356205 -1551106 -7427097
10399 -7427097 -5250839 -2845800 -8539801 -15492235 -13987159 -8794460 -9531058 -12825355
10391 -12825355 -9464252 -2078844 -526476 -5037072 -7869574 -7100775 -6061483 -3830416
10383 -3830416 1420322 4430585 375380 -4318463 -812402 7014619 8625230 3952770
10375 3952770 1794949 4100721 4470628 800819 -2154789 -2312210 -2401942 -3015857 -1945091
10366 -1945091 314118 1318072 1047960 -267868 -4795362 -11473542 -13282256 -7409505
$$ packed form
10423a6594793l05171J706506Q70274K881788N956542L424464j475556n67911
10415d103857K595027r67356o669215l169856N568367N699690j985557m101530
10407g134287J118706L091693M77202J671878N068649J062364o907311n875991
10399g427097K176258K405039n694001o952434J505076N192699p36598l294297
10391a2825355L361103P385408J552368m510596k832502P68799J039292K231067
10383c830416N250738L010263m055205m693843L506061P827021J610611m672460
10375C952770k157821K305772L69907l669809k955608j57421q9732o13915J070766
10366a945091K259209J003954k70112j315828m527494o678180j808714N872751
$$ plain form
10358 -7409505 -1979292 -4316669 -9163640 -8202265 -4416485 -5464511 -8738024 -6018034
10350 -6018034 1153661 3978760 1489252 128364 175651 -4160873 -11506341 -13057975
10342 -13057975 -6863676 -1099072 -1327013 -4321728 -5970689 -6043323 -3859433 1848606
10334 1848606 7433727 7010629 1621606 -2188020 -3185780 -6236068 -11816205 -14000848
10326 -14000848 -10582402 -6567843 -5432968 -4909904 -3729139 -4677794 -8067424 -9318282
10318 -9318282 -6229759 -2391899 -473545 1795782 5800059 7978829 5549013 1859657
10310 1859657 1945983 5454228 7290677 3987908 -2415310 -6194330 -3434185 3614322
10302 3614322 8753957 9095844 7376387 5817760 2432582 -3186292 -5728412 -1495175
$$ packed form
10358g409505N430213k337377m846971R61375L785780j048026l273513K719990
10350f018034P171695K825099k489508j360888M7287m336524p345468j551634
10342a3057975O194299N764604k27941k994715j648961p2634K183890N708039
10334A848606N585121m23098n389023l809626r97760l050288n580137k184643
10326a4000848L418446M014559J134875N23064J180765r48655l389630j250858
10318i318282L088523L837860J918354K269327M004277K178770k429816l689356
10310A859657Q6326L508245J836449l302769o403218l779020K760145P048507
10302C614322N139635L41887j719457j558627l385178n618874k542120M233237
$$ plain form
10294 -1495175 4516991 5490949 2960975 2782038 4504109 3421284 632690 1339001 4163579
10285 4163579 2294652 -4225863 -7368335 -4049790 -444340 -424744 562860 5276021 7342378
10276 7342378 1178991 -7469080 -8916885 -3333110 663059 -992548 -3777706 -3527640
10268 -3527640 -2602806 -4698274 -8137500 -8162935 -4023535 -66833 428150 -563743 468274
10259 468274 2856411 2735612 -1086220 -5508504 -7505286 -7000989 -5093896 -2856490 -2458816
10250 -2458816 -5552700 -9535025 -9729331 -6630333 -6008515 -9739122 -12126398 -8734236
10242 -8734236 -3411702 -2044926 -4176689 -5874653 -6472981 -6862446 -5073228 207651
10234 207651 4808111 4076198 461898 137107 3854908 6811996 6138915 3342009 685215
$$ packed form
10294a495175O012166R73958k529974j78937J722071j082825k788594P06311K824578
10285D163579j868927o520515l142472L318545L605450J9596R87604M713161K066357
10276G342378o163387q648071j447805N583775L996169j655607k785158K50066
10268c527640R24834k095468l439226k5435M139400L956702M94983r91893J032017
10259D68274K388137j20799l821832m422284j996782N04297J907093K237406L97674
10250b458816l093884l982325j94306L098998O21818l730607k387276L392162
10242h734236N322534J366776k131763j697964n98328l89465J789218N280879
10234B07651M600460p31913l614300l24791L717801K957088o73081k796906k656794
$$ plain form
10225 685215 -150612 2540808 7903534 11146645 9037258 4636554 2606129 2771592 2646164
10216 2646164 2674106 3844958 3884544 1517821 634975 3977057 6786823 3844524 -1303803
10207 -1303803 -2300213 -1240738 -4378666 -9360988 -7627040 959012 6421547 2956807
10199 2956807 -4206963 -8003395 -7347784 -3843850 1488849 5641680 4574863 -573259
10191 -573259 -3729121 -2067256 1192919 2928890 3371820 2563623 -455399 -3967234 -4721516
10182 -4721516 -3406752 -3451918 -4332726 -2249755 2341683 4383896 1953702 -1733241 -4028204
10173 -4028204 -4249856 -279805 8459669 15120905 11495936 627876 -5826061 -3984432
10165 -3984432 -1527495 -3028292 -2732387 3155468 7471185 2829508 -6388572 -10578673
$$ packed form
10225F85215q35827K691420N362726L243111k109387m400704k030425J65463j25428
10216B646164K7942J170852L9586k366723q82846L342082K809766k942299n148327
10207a303803r96410J059475l137928m982322J733948Q586052N462535l464740
10199B956807p163770l796432O55611L503934N332699M152831j066817n148122
10191e73259l155862J661865L260175J735971M42930q08197l019022l511835p54282
10182d721516J314764m5166q80808K082971M591438K042213k430194l686943k294963
10173d028204k21652L970051Q739474O661236l624969j0868060o453937J841629
10165c984432K456937j500797K95905N887855M315717m641677r218080m190101
$$ plain form
10157 -10578673 -7954897 -4071473 -2653970 -3286455 -5019048 -6885840 -7183198 -5892694
10149 -5892694 -5021697 -4173345 -153642 6243387 8267844 1950131 -7698493 -13061868
10141 -13061868 -12271282 -7809756 -1709406 3655205 4554228 415984 -4099023 -5277249
10133 -5277249 -4819503 -4874025 -3539181 278680 2343893 -1039934 -6266607 -7108893 -3574074
10124 -3574074 -1060548 -2668757 -6614636 -9506685 -8820467 -4270963 577979 1058048
10116 1058048 -1802678 -1403379 4498366 9266948 7358276 3364625 4709381 9795856
10108 9795856 11183348 7675242 4757678 3954629 391512 -7503900 -13263576 -10863111
10100 -10863111 -3181358 1640458 -460616 -6659561 -11961099 -13952641 -13168328 -10804295
$$ packed form
10157a0578673K623776L883424J417503o32485j732593j866792k97358J290504
10149e892694Q70997Q48352M019703O397029K024457o317713r648624n363375
10141a3061868P90586M461526O100350N364611Q99023m138244m515007j178226
10133e277249M57746n4522J334844L817861K065213l383827n226673q42286L534819
10124c574074K513526j608209l945879k892049O86218M549504M848942M80069
10116A058048k860726L99299N901745M768582j908672l993651J344756N086475
10108I795856J387492l508106k917564q03049l563117p895412n759676K400465
10100a0863111P681753M821816k101074o198945n301538j991542P84313K364033
$$ plain form
10092 -10804295 -7443398 -4025730 -2573575 -4221472 -7108189 -8387144 -8017894 -7969359
10084 -7969359 -8065248 -6281601 -3363290 -2655151 -4172903 -3714177 -56987 1945274 -1202984
10075 -1202984 -5631548 -5653541 -1514684 2744262 5547829 6949056 4797106 -2242621
10067 -2242621 -9599980 -10691569 -5512551 -400451 560455 -680414 -904903 342529
10059 342529 2057532 3207560 2173851 -1702447 -5267922 -3694219 3281013 10057220
10051 10057220 11419135 7781400 3091612 -115771 -1883399 -2861861 -3368628 -3844092
10043 -3844092 -4477779 -4267130 -1873943 1867009 3526962 931601 -2978175 -2721521 2470721
10034 2470721 6946675 6230351 3065078 2145373 1891460 -2620641 -9973608 -12793698 -8609789
$$ packed form
10092a0804295L360897L417668J452155j647897k886717j278955L69250M8535
10084g969359r5889J783647K918311P08139j517752M58726L657190K002261l148258
10075a202984m428564k1993M138857M258946K803567J401227k151950p039727
10067b242621p357359j091589N179018N112100R60906j240869k24489J247432
10059C42529J715003J150028j033709l876298l565475J573703O975232O776207
10051A0057220J361915l637735m689788l207383j767628r78462n06767m75464
10043c844092o33687K10649K393187L740952J659953k595361l909776K56654N192242
10034B470721M475954p16324l165273r19705k53913m512101p352967k820090M183909
$$ plain form
10025 -8609789 -3448035 -2493436 -3808092 -4433613 -6005907 -9617433 -11120005 -7467592
10017 -7467592 -2893333 -2429238 -3543733 -1305515 1818185 -308196 -6057544 -7345085
10009 -7345085 -2275599 2222398 1793001 229450 665827 -744610 -7121664 -13185111
10001 -13185111 -12079599 -6070727 -3473490 -6640152 -9664487 -8058801 -4519066 -3204333
9993 -3204333 -3316051 -1622253 1971093 5043510 6816770 7985348 7645264 4405348 165502
9984 165502 -1575603 -1674188 -4651597 -10160808 -10647656 -1959962 8192192 8905750 929007
9975 929007 -4430361 -1032770 4829349 4781076 -668723 -5165798 -5491052 -3191833 -625192
9966 -625192 652958 -58316 -1000754 1185329 6220911 8727179 5283084 -14320 -1017379
$$ packed form
10025h609789N161754R54599j314656o25521j572294l611526j502572L652413
10017g467592M574259M64095j114495K238218L123700k126381n749348j287541
10009g345085N069486M497997m29397j563551M36377j410437o377054o063447
10001a3185111J105512O008872K597237l166662l024335J605686L539735J314733
9993c204333j11718J693798L593346L072417J773260J168578l40084l239916m239846
9984A65502j741105r8585k977409n509211m86848Q687694J0152154P13558p976743
9975I29007n359368L397591N862119m8273n449799m497075l25254K299219K566641
9966f25192J278150p11274r42438K186083N035582K506268l444095n297404j003059
$$ plain form
9957 -1017379 1998041 3842321 2416483 173321 -1327214 -2992275 -4276913 -2893014
9949 -2893014 304371 664202 -3900102 -9461730 -11440020 -10472407 -10031465 -10434097 -8878708
9940 -8878708 -4745288 -1347997 -1576029 -4144823 -5468418 -3824584 -483054 2208546
9932 2208546 2690368 1092467 -545893 11650 1951829 1324692 -3733419 -9249231 -9950846
9923 -9950846 -6276972 -2859774 -1028588 1757430 5049939 4801474 1365628 663834 3754627
9914 3754627 3061313 -5134495 -12010638 -8332388 981241 4446530 1340700 -179623
9906 -179623 815191 -2816341 -10946646 -13505279 -6471931 1232921 1687639 -1408258 -1589706
9897 -1589706 41806 -290359 -1371573 -548931 1138417 2510892 4899254 7110137 4784178
$$ packed form
9957a017379L015420J844280j425838k243162j500535j665061j284638J383899
9949b893014L197385L59831m564304n561628j978290R67613M40942m02632J555389
9940h878708M133420L397291k28032k568794j323595J643834L341530K691600
9932B208546M81822j597901j638360N57543J940179o27137n058111n515812p01615
9923i950846L673874L417198J831186K786018L292509k48465l435846p01794L090793
9914C754627o93314q195808o876143L678250R313629L465289l105830j520323
9906a79623R94814l631532q130305k558633P033348P704852M54718l095897j81448
9897a589706J631512l32165j081214Q22642J687348J372475K388362K210883k325959
$$ plain form
9888 4784178 -1136769 -3557936 -1362894 -2162853 -6186667 657660 25733904 51031773
9880 51031773 51101827 25819676 661091 -5008824 3332881 9585822 7393781 1583334
9872 1583334 -1770858 -798604 2216037 2797437 -1184250 -6130021 -6890924 -3759370 -1446552
9863 -1446552 -2118414 -3991364 -5868145 -8033402 -9170762 -7368391 -4005007 -2123301
9855 -2123301 -1371922 926309 4154787 4482432 575912 -4634671 -7751354 -7476507 -4512341
9846 -4512341 -1712096 -2268093 -4913151 -4230818 833729 3472092 -923296 -6418646 -5283960
9837 -5283960 -259416 655303 -2193253 -1954430 1511763 1354819 -3506942 -6231344 -4077981
9828 -4077981 -2397815 -4190064 -5271217 -3158237 -1848560 -3685579 -4518920 -1510094
$$ packed form
9888D784178n920947k421167K195042p99959m023814O844327K5076244K5297869
9880E1031773P0054k5282151k5158585n669915Q341705O252941k192041n810447
9872A583334l354192R72254L014641N81400l981687m945771p60903L131554K312818
9863a446552o71862j872950j876781k165257j137360J802371L363384J881706
9855b123301P51379K298231L228478L27645l906520n210583l116683K74847K964166
9846d512341K800245n55997k645058O82333N064547K638363m395388n495350J134686
9837e283960N024544R14719k848556K38823L466193j56944m861761k724402K153363
9828d077981J680166j792249j081153K112980J309677j837019q33341L008826
$$ plain form
9820 -1510094 1387672 439465 -1748148 -1750343 -1143876 -2108794 -2445959 218763 3496970
9811 3496970 3673356 481784 -4395729 -9255255 -10442353 -4244574 5764953 9181054
9803 9181054 1382076 -9264227 -11929589 -6704506 -2001683 -2304438 -4583290 -4873447
9795 -4873447 -2901540 -735568 -551565 -3079627 -5883876 -4800335 739683 5972108
9787 5972108 6602801 4008105 2491541 3921609 7280359 10808350 12324658 10189557
9779 10189557 6200540 4683375 6582680 7644353 4717114 281337 -2048701 -2911289
9771 -2911289 -4721286 -6950322 -7456555 -6032708 -3479335 355461 4601055 6054313
9763 6054313 3049136 -1631774 -4567517 -6043960 -7925110 -9874135 -10574263 -10100341 -8347903
$$ packed form
9820a510094K897766r48207k187613k195O06467r64918l37165K664722L278207
9811C496970J76386l191572m877513m859526j187098O197779J0009527L416101
9803I181054p798978j0646303k665362N225083M702823l02755k278852k90157
9795d873447J971907K165972J84003k528062k804249J083541N540018N232425
9787E972108O30693k594696j516564J430068L358750L527991J516308k135101
9779A0189557l989017j517165J899305J061673k927239m435777k330038q62588
9771b911289j809997k229036n06233J423847K553373L834796M245594J453258
9763F054313l005177m680910k935743j476443j881150j949025p00128M73922J752438
$$ plain form
9754 -8347903 -4062356 1633614 4029254 678272 -4537984 -6812768 -6716436 -6995660 -6338632
9745 -6338632 -1714753 4929643 7807146 4875444 148265 -1612505 454858 3615958
9737 3615958 4219495 861547 -3593606 -4799134 -2651815 -1002513 -531320 2805968 9271803
9728 9271803 11593200 5329466 -2522018 -2690900 2852238 5068977 2407188 1316125
9720 1316125 3380093 2537871 -3371411 -8133420 -7541316 -5643585 -6350102 -6657704 -3704661
9711 -3704661 -1667728 -4769797 -8564997 -5826586 1871662 5912519 2868287 -1610390
9703 -1610390 -1358345 3278260 7875097 9033594 5936895 354725 -3769619 -3651497 -1406143
9694 -1406143 -1586704 -4339045 -4573963 367250 5779220 5430972 -76585 -4589247 -4840265
$$ packed form
9754h347903M285547N695970K395640l350982n216256k274784R6332k79224O57028
9745f338632M623879O644396K877503k931702m727179j760770K067363L161100
9737C615958O03537l357948m455153j205528K147319J649302M71193L337288O465835
9728I271803K321397o263734p851484j68882N543138K216739k661789j091063
9720A316125K063968q42222n909282m762009N92104J897731p06517l07602K953043
9711c704661K036933l102069l795200K738411P698248M040857l044232m478677
9703a610390K52045M636605M596837J158497l096699n582170m124344J18122K245354
9694a406143j80561k752341k34918M941213N411970l48248n507557m512662k51018
$$ plain form
9685 -4840265 -3388141 -2869567 -1698065 2189123 6468992 6911633 3385216 -169869 -1483671
9676 -1483671 -2091720 -3069688 -2459017 678340 2654236 -573128 -6743462 -8989512 -4614126
9667 -4614126 1375666 2974819 437342 -1549406 -707921 1054910 1692296 1269858 -23301
9658 -23301 -2604439 -4967740 -3786305 942699 3613434 -479795 -7996813 -11116597 -7577946
9649 -7577946 -2525995 -95106 1475798 4355329 6130852 4295239 1576213 1766800
9641 1766800 3157805 1674307 -1495244 -1771986 32301 -2151042 -9278259 -13482244
9633 -13482244 -8277298 2073254 7422526 3261886 -5792378 -11698950 -9350818 425387
9625 425387 11000135 14596632 9699500 2772595 537044 2388002 3156885 1376617
$$ packed form
9685d840265J452124N18574J171502L887188M279869M42641l526417l555085j313802
9676a483671o08049r77968O10671L137357J975896l227364o170334k246050M375386
9667d614126N989792J599153k537477j986748Q41485J762831O37386m22438j293159
9658b3301k581138k363301J181435M729004K670735m093229p517018l119784L538651
9649g577946N051951K430889J570904K879531J775523j835613k719026J90587
9641A766800J391005j483498l169551k76742J804287k183343p127217m203985
9633a3482244N204946J0350552N349272m160640r054264n906572K348132R776205
9625D25387J0574748L596497m897132o926905k235551J850958P68883j780268
$$ plain form
9617 1376617 746787 3834844 8254126 10041094 8020668 3663594 -1084750 -4278236
9609 -4278236 -4009575 -135075 4385756 5547426 2164798 -3134581 -7083460 -8973300
9601 -8973300 -9948247 -10298882 -9472719 -8494391 -9609579 -12428456 -13116027 -9599108 -5231666
9592 -5231666 -4185208 -5062241 -3205428 1441403 3485779 -170772 -5993162 -8915102
9584 -8915102 -8253215 -6368096 -4451587 -2504281 -1636221 -3432866 -7364896 -10527022 -10044836
9575 -10044836 -5478305 557455 4409287 5126533 5505320 7808589 9883110 8554655
9567 8554655 5599476 5788114 9062141 9906552 5870098 1487154 1092523 2464756 1265865
9558 1265865 -2012735 -3700102 -2781894 -1057776 511076 1976135 2591034 1984783 1427031
$$ packed form
9617A376617o29830L088057M419282J786968k020426m357074m748344l193486
9609d278236K68661L874500M520831J161670l382628n299379l948879j889840
9601h973300r74947l50635Q26163R78328j115188k818877o87571L516919M367442
9592e231666J046458q77033J856813M646831K044376l656551n822390k921940
9584h915102O61887J885119J916509J947306Q68060j796645l932030l162126M82186
9575a0044836M566531O035760L851832P17246L78787K303269K074521j328455
9567H554655k955179J88638L274027Q44411m036454m382944l94631J372233j198891
9558A265865l278600j687367R18208J724118J568852J465059O14899o06251n57752
$$ plain form
9549 1427031 1168613 -1079779 -5742246 -8165291 -4162885 3225185 7321417 6915349 6775171
9540 6775171 9533741 12243573 11759770 8958743 6011779 3125798 -20585 -2195089
9532 -2195089 -1848222 1043208 5202798 8694006 9335588 6651958 3528183 3368533 5248686
9523 5248686 4844964 1062277 -1681581 -14450 2452400 -618293 -9196680 -15828473
9515 -15828473 -14389455 -7095204 -1136365 -174355 -1491059 -888479 2260001 5646506
9507 5646506 7576873 8026998 7190977 5077151 2576272 1336329 2065882 3761754 4850594
9498 4850594 4696529 4195937 5065386 7719873 9773107 8468601 5171157 4594987 7825927
9489 7825927 9579789 5847633 941246 1564292 5920517 5378838 -2950469 -11735684 -13072529
$$ packed form
9549A427031k58418k248392m662467k423045M002406P388070M096232m06068j40178
9540F775171K758570K709832m83803k801027k946964k885981l146383k174504
9532b195089L46867K891430M159590L491208O41582k683630l123775j59650J880153
9523E248686m03722l782687k743858J667131K466850l070693q578387o631793
9515a5828473J439018P294251N958839R62010j316704O02580L148480L386505
9507E646506J930367M50125q36021k113826k500879j239943P29553J695872J088840
9498D850594j54065n00592Q69449K654487K053234j304506l297444n76170L230940
9489G825927J753862l732156m906387O23046M356225n41679q329307q785215j336845
$$ plain form
9480 -13072529 -7219218 110570 4155476 2833694 -2957182 -8308748 -8025244 -3615056
9472 -3615056 -2059506 -5675545 -8612663 -6101657 -1279662 1010534 1472716 2629909
9464 2629909 3106111 1159993 -563606 417197 1147897 -1563364 -4547130 -3326069 -283093
9455 -283093 -706356 -3406493 -2739198 1797341 5375986 6106772 6234601 5814540 2639998
9446 2639998 -1470542 -1694603 1574009 2397892 -1392738 -4924292 -3985798 12734 4599744
9437 4599744 9656997 13696292 12445019 4789613 -3973725 -7987532 -6699350 -2818904
9429 -2818904 1656807 4827848 4191851 10624 -3267665 -2196142 777384 323057 -4894785
9420 -4894785 -10438433 -10867886 -5326621 1536432 4468054 3616792 3888607 7264013 8978695
$$ packed form
9480a3072529N853311P329788M044906j321782n790876n351566K83504M410188
9472c615056J555550l616039k937118K511006M821995K290196M62182J157193
9464B629909M76202j946118j723599R80803P30700k711261k983766J221061L042976
9455b83093m23263k700137O67295M536539L578645P30786J27829m20061l174542
9446B639998m110540k24061L268612Q23883l790630l531554R38494L998532M587010
9437D599744N057253M039295j251273p655406q763338m013807J288182L880446
9429b818904M475711L171041o35997m181227l278289J071523K973526m54327n217842
9420d894785n543648m29453N541265O863053K931622q51262K71815L375406J714682
$$ plain form
9411 8978695 4552731 -2498434 -4955646 -1849677 1501400 1975791 872882 -1479338
9403 -1479338 -6087096 -9923890 -7956370 -2292049 -1557344 -8052775 -12988827 -8963062
9395 -8963062 -399991 4069933 3810280 3996492 5519871 4591843 525178 -2870103 -3541512
9386 -3541512 -3746192 -5902530 -9340968 -11346058 -9352650 -3222655 2735592 2304083 -5286978
9377 -5286978 -12894622 -13611406 -8950242 -5167157 -4109906 -2773613 -162921 1324745
9369 1324745 1141890 1562258 2618101 1345274 -2315420 -3888008 -1315952 816249 -2204374
9360 -2204374 -7629397 -8651246 -3843165 1280740 2044799 -52552 -846303 872166 3103015
9351 3103015 3778403 2095269 -1693603 -5696517 -6862415 -4352814 -1390769 -1164573 -1920468
$$ packed form
9411H978695m425964p051165k457212L105969L351077M74391j102909k352220
9403a479338m607758l836794J967520N664321P34705o495431m936052M025765
9395h963062Q563071M469924k59653J86212J523379r28028m066665l395281o71409
9386c541512k04680k156338l438438k005090J993408O129995N958247m31509p591061
9377e286978p607644p16784M661164L783085J057251J336293K610692J487666
9369A324745j82855M20368J055843j272827l660694j572588K572056K132201l020623
9360b204374n425023j021849M808081N123905P64059k097351p93751J718469K230849
9351C103015O75388j683134l788872m002914j165898K509601K962045K26196p55895
$$ plain form
9342 -1920468 448936 5456585 8041370 6252588 4173170 5017330 5831718 2554738 -3411544
9333 -3411544 -8001313 -10903225 -14242180 -16804279 -14894419 -8430572 -1638399 2282768
9325 2282768 3493505 3041403 1900019 2058479 4772939 7973720 8717781 7408244 6284075
9316 6284075 5384649 3989044 3757232 5310004 4318320 -2175209 -7719959 -3430558 7578353
9307 7578353 12462342 6734399 61480 734289 4355832 3507823 -320830 -1819766 -1750518
9298 -1750518 -3687567 -6129071 -5732943 -4346593 -5326421 -6359562 -3406326 1118997 1616356
9289 1616356 -1398991 -2524299 -404407 1535116 1983682 2419017 1798312 -2364451 -7787506
9280 -7787506 -9034736 -5704104 -2770943 -2353069 -1426211 1387865 3032898 1737755 64315
$$ packed form
9342a920468K369404N007649K584785j788782k079418Q44160Q14388l276980n966282
9333c411544m589769k901912l338955k562099J909860O463847O792173L921167
9325B282768J210737m52102j141384J58460K714460L200781P44061j309537j124169
9316F284075q99426j395605k31812J552772r91684o493529n544750M289401J1008911
9307G578353M883989n727943o672919O72809L621543q48009l828653j498936O9248
9298a750518j937049k441504L96128J386350r79828j033141K953236M525323M97359
9289A616356l015347j125308K119892J939523M48566M35335o20705m162763n423055
9280g787506j247230L330632K933161M17874R26858K814076J645033j295143j673440
$$ plain form
9271 64315 311581 1541738 2784903 4807368 7332958 8733014 9392100 10914579 11578861
9262 11578861 8134599 2942651 2675546 7765404 10242598 5905680 1703269 5160274
9254 5160274 12185318 12942667 6359947 673497 681671 2252460 556084 -2908548 -4295450
9245 -4295450 -3653820 -3643471 -4702378 -4809874 -3046256 -958480 -371524 -1082736 -1112617
9236 -1112617 730504 2558724 752474 -5181986 -10193004 -8617760 -1542660 3554509
9228 3554509 1582966 -4329567 -7691635 -6954856 -5769602 -6245679 -6224382 -4116661 -2544319
9219 -2544319 -4361222 -7396233 -6799419 -2084965 1630559 384582 -3179706 -2988393 2924714
9210 2924714 9772323 11022265 5386369 -1527893 -2889253 1920815 6542114 5229858
$$ packed form
9271F4315K47266J230157J243165K022465K525590J400056O59086J522479O64282
9262A1578861l444262n191948k67105N089858K477194m336918m202411L457005
9254E160274P025044P57349o582720n686450Q174J570789j696376l464632j386902
9245d295450O41630J0349j058907j07496J763618K087776N86956p11212k9881
9236a112617J843121J828220j806250n934460n011018J575244P075100N097169
9228C554509j971543n912533l362068P36779J185254m76077K1297K107721J572342
9219b544319j816903l035011N96814M714454L715524j245977l564288J91313N913107
9210B924714O847609J249942n635896o914262j361360M810068M621299j312256
$$ plain form
9202 5229858 -93241 -2539320 714657 5205689 5601414 2255238 -489034 -261091 1491266
9193 1491266 2362238 1366968 -1071390 -3710342 -5146321 -4929695 -3691947 -1644667 1882328
9184 1882328 6468369 9673203 9726057 7962643 6653596 5374093 1946553 -3277332 -6620506
9175 -6620506 -5296409 -634665 3858999 6330340 7255073 7181509 5595525 2553518 131565
9166 131565 554392 2888356 3511864 970534 -1467385 -270508 2725999 2355625 -2525966
9157 -2525966 -7278944 -7737499 -4659311 -494725 4556524 10504191 14562248 13857786 9611032
9148 9611032 5315906 1802624 -2652746 -7873424 -10763957 -9228185 -4771020 -583147
9140 -583147 1506921 2031746 2954631 5422090 7626450 6190061 1096313 -2610436 -683360
$$ packed form
9202E229858n323099k446079L253977M491032L95725l346176k744272K27943J752357
9193A491266Q70972r95270k438358k638952j435979K16626J237748K047280L526995
9184A882328M586041L204834N2854j763414j309047j279503l427540n223885l343174
9175f620506J324097M661744M493664K471341R24733p3564j585984l042007k421953
9166A31565M22827K333964O23508k541330k437919J196877K996507l70374m881591
9157b525966m752978m58555L078188M164586N051249N947667M058057p04462m246754
9148I611032m295126l513282m455370n220678k890533J535772M457165M187873
9140e83147K090068N24825R22885K467459K204360j436389n093748l706749J927076
$$ plain form
9131 -683360 4136744 5186284 631999 -4528821 -5661467 -4013647 -3476367 -4836924 -5671077
9122 -5671077 -4168796 -663793 3721860 7768128 9738347 8173637 3632150 -1383587
9114 -1383587 -4688443 -5938819 -5623980 -3576714 255241 3864144 3900624 -488725 -5759207
9105 -5759207 -7671790 -6254593 -4955036 -5121609 -4179722 -243112 4184106 5211203 2548458
9096 2548458 -757897 -2478788 -2791455 -2272185 -678509 1823394 3736300 3266635 -107121
9087 -107121 -4968707 -8449611 -7976463 -3461432 2341579 6141019 6621372 4703106 2145858
9078 2145858 243196 -860854 -1930351 -3210553 -3566024 -2221847 -902853 -2142974
9070 -2142974 -5273551 -6525350 -4063736 -616060 404077 -632018 -958339 149244
$$ packed form
9131f83360M820104J049540m554285n160820j132646J647820N37280j360557q34153
9122e671077J502281L505003M385653M046268J970219j564710m541487n015737
9114a383587l304856j250376L14839K047266L831955L608903L6480m389349n270482
9105e759207j912583J417197J299557j66573R41887L936610M427218J027097k662745
9096B548458l306355j720891l12667N19270J593676K501903J912906m69665l373756
9087a07121m861586l480904M73148M515031N803011L799440M80353j918266k557248
9078B145858j902662j104050j069497j280202l55471J344177J318994j240121
9070b142974l130577j251799K461614L447676J020137j036095l26321J107583
$$ plain form
9062 149244 612934 -1146456 -3933147 -5201091 -4024222 -2092266 -1393645 -1289249 451911
9053 451911 3255552 3286887 -389563 -2458404 1584277 7652577 8223811 3669297 1211976
9044 1211976 2764889 2265841 -2806617 -5942625 -2077389 4021707 5640735 3984649
9036 3984649 3664485 3923349 1679588 -1099544 -643483 1419957 1409401 889325 3027462
9027 3027462 4771586 1105578 -5294956 -7767687 -7352566 -10729117 -16790038 -16243548 -6772810
9018 -6772810 1938715 2727006 1305216 6007868 14480184 17929636 14041021 8493170
9010 8493170 5894592 5346949 4502937 3397763 3358905 4277221 3844551 -177179 -6156712
9001 -6156712 -8454294 -3815458 3204738 5109728 1114451 -2783968 -3146740 -2654390 -3332765
$$ packed form
9062A49244M63690j759390k786691j267944J176869J931956O98621J04396J741160
9053D51911K803641L1335l676450k068841M042681O068300N71234m554514k457321
9044A211976J552913m99048n072458l136008L865236O099096J619028j656086
9036C984649l20164K58864k243761k779132M56061K063440j0556n20076K138137
9027C027462J744124l666008o400534k472731M15121l376551o060921N46490R470738
9018f772810Q711525P88291j421790M702652Q472316L449452l888615n547851
9010H493170k598578n47643q44012j105174l8858R18316m32670m021730n979533
9001f156712k297582M638836P020196J904990l995277l898419l62772M92350o78375
$$ plain form
8992 -3332765 -2673571 563213 2294210 -1051661 -6731967 -9631872 -8720856 -6158160 -3252404
8983 -3252404 -934564 -1252962 -4443196 -6692752 -4451007 721709 4651077 6071068
8975 6071068 6569775 6607938 4832540 747502 -4205953 -7821371 -8286983 -5362407 -1208784
8966 -1208784 1511123 2682447 3716395 3832677 1234941 -1637429 769603 8581494
8958 8581494 14104083 11456091 4368424 390163 1053867 2347983 1881014 499734 -1250785
8949 -1250785 -3368643 -4126916 -1751124 2270551 4822833 5024482 3512529 -201966 -5826475
8940 -5826475 -9386405 -6785780 203228 5450203 5725571 2975416 -102608 -2819172
8932 -2819172 -4762760 -5146848 -4706649 -5253418 -6600215 -6504247 -4242394 -1793414 -795120
$$ packed form
8992c332765O59194L236784J730997l345871n680306k899905R11016K562696K905756
8983c252404K317840l18398l190234k249556K241745N172716L929368J419991
8975F071068M98707L8163j775398m085038m953455l615418m65612K924576M153623
8966a208784K719907J171324J033948J16282k597736k872370K407032P811891
8958H581494N522589k647992p087667l978261O63704J294116m66969j381280j750519
8949a250785k117858p58273K375792M021675K552282K01649j511953l714495n624509
8940e826475l559930K600625O989008N246975K75368k750155l078024k716564
8932b819172j943588l84088M40199n46769j346797R5968K261853K448980R98294
$$ plain form
8923 -795120 -515438 360750 1681723 2381683 2018411 1334211 1650708 3113703 3314068
8914 3314068 -358889 -5813030 -6528088 369782 8656572 9788162 3925475 -528464
8906 -528464 1528777 5692661 5037540 -796158 -6398739 -7906847 -6326439 -4591672 -4127977
8897 -4127977 -4648750 -5613989 -6791521 -7536699 -6313407 -2069543 3400093 5637335 1683820
8888 1683820 -6089052 -11695327 -11319831 -6500675 -1601339 774832 1605649 3578572 7800973
8879 7800973 12062543 12584236 8121303 2110984 -125525 3443698 9511915 12487155
8871 12487155 9346211 1832133 -5482174 -9121523 -8983448 -7180075 -5384121 -3866780
8863 -3866780 -2553723 -1786302 -1748824 -1868723 -1195153 636392 2527470 2177171 -1506478
$$ packed form
8923g95120K79682Q76188J320973O99960l63272o84200L16497J462995K00365
8914C314068l672957n454141p15058O897870Q286790J131590n862687m453939
8906e28464K057241M163884o55121n833698n602581j508108J580408J734767M63695
8897d127977n20773r65239j177532p45178J223292M243864N469636K237242l953515
8888A683820p772872n606275L75496M819156M899336K376171Q30817J972923M222401
8879G800973M261570N21693m462933o010319k236509L569223O068217K975240
8871A2487155l140944p514078p314307l639349J38075J803373J795954J517341
8863c866780J313057P67421L7478j19899O73570J831545J891078l50299l683649
$$ plain form
8854 -1506478 -5937482 -6824912 -3824940 -1827976 -4414845 -8595013 -9464158 -7735827 -7812185
8845 -7812185 -9758163 -9082872 -4691248 -1027644 -746735 -866015 1323756 3656030 3533142
8836 3533142 2436794 2503302 2618994 1542627 1069117 2187477 1874587 -1783807 -4715367
8827 -4715367 -2248184 3338225 6133746 5485366 5758877 8194057 8871834 5254646 -143104
8818 -143104 -3655670 -4234170 -2508109 417375 2217218 478230 -4029329 -7279973 -6258450
8809 -6258450 -1949454 2340154 4431698 4845937 5707005 7966017 9742845 8737455 6177480
8800 6177480 5717513 7851743 8993877 7602209 6953746 9034409 10138130 6840876 2416022
8791 2416022 1853458 3576012 2410091 -1248265 -2209842 216420 891629 -2130985 -3863657
$$ packed form
8854a506478m431004q87430K999972J996964k586869m180168q69145J728331p6358
8845g812185j945978O75291M391624L663604K80909j19280K189771K332274j22888
8836C533142j096348O6508J15692j076367m73510J118360l12890l658394k931560
8827d715367K467183N586409K795521o48380K73511K435180O77777l617188n397750
8818a43104l512566n78500J726061K925484J799843j738988m507559l250644J021523
8809f258450M308996M289608K091544M14239Q61068K259012J776828j005390k559975
8800F177480m59967K134230J142134j391668o48463K080663J103721l297254m424854
8791B416022n62564J722554j165921l658356r61577K426262O75209l022614j732672
$$ plain form
8782 -3863657 -320821 4953281 5791766 1595296 -2616198 -2593838 1112633 4766626 5630620
8773 5630620 4409497 3445082 2927571 1022589 -1687615 -1462960 2549269 5378420 3250846
8764 3250846 -85118 676505 3292464 1620358 -3571773 -5340825 -2072485 -238177
8756 -238177 -3800704 -8078399 -7386011 -2926673 576429 1349110 45170 -3122078 -6952508
8747 -6952508 -8245131 -5855958 -3263902 -3896101 -6070073 -5602702 -1702665 2609669 4895698
8738 4895698 5747368 7205745 10002466 12161529 10386024 3839328 -3960716 -8558539
8730 -8558539 -8971669 -6738972 -2347567 3843119 8471179 7772704 3374060 929894 2387118
8721 2387118 3910272 2222189 -1376154 -4329355 -5917303 -5905688 -4206760 -2807594 -3704475
$$ packed form
8782c863657L542836N274102Q38485m196470m211494K2360L706471L653993Q63994
8773E630620j221123r64415n17511j904982k710204K24655M012229K829151k127574
8764C250846l335964P61623K615959j672106n192131j769052L268340J834308
8756b38177l562527m277695O92388M459338L503102P72681j303940l167248l830430
8747f952508j292623K389173K592056o32199k173972M67371L900037M312334K286029
8738D895698Q51670J458377K796721K159063j775505o546696p800044m597823
8730h558539m13130K232697M391405O190686M628060o98475m398644k444166J457224
8721B387118J523154j688083l598343k953201j587948J1615J698928J399166q96881
$$ plain form
8712 -3704475 -4125391 1119697 11040942 17485149 15155650 8023245 3216140 2741758 3884166
8703 3884166 4041216 2622418 1062734 2201969 6471244 8991403 5497880 638915
8695 638915 3169616 12225094 17049203 12807258 7235087 7138722 7948549 3535702 -2306421
8686 -2306421 -2940523 -560096 -1383845 -4513386 -5032546 -3817850 -4671275 -5359106 -1386407
8677 -1386407 4217874 5033900 2973074 5375337 11702681 13991925 10436780 7593527
8669 7593527 8140529 7441072 4369238 4487692 8833420 10160711 5377753 1810417 4780021
8660 4780021 8107745 4813363 -641256 -149236 3879741 2516976 -4665135 -8851695
8652 -8851695 -5860583 -1639373 -2150381 -5098256 -5005968 -1501615 1296050 1051582 -437614
$$ packed form
8712c704475m20916N245088R921245O444207k329499p132405m807105m74382J142408
8703C884166J57050j418798j559684J139235M269275K520159l493523m858965
8695F38915K530701R055478M824109m241945n572171r6365Q09827m412847n842123
8686b306421o34102K380427q23749l129541n19160J214696q53425o87831L972699
8677a386407N604281Q16026k060826K402263O327344K289244l555145k843253
8669G593527N47002o99457l071834J18454M345728J327291m782958l567336K969604
8660D780021L327724l294382n454619M92020M028977j362765p182111m186560
8652h851695K991112M221210n11008k947875R2288L504353K797665k44468j489196
$$ plain form
8643 -437614 -429631 1376131 3046516 3170513 2456689 2164015 2048380 1474507 1615525 3722173
8633 3722173 5439258 2550011 -4648493 -10426109 -10761948 -7829339 -5390275 -3805832
8625 -3805832 -2585931 -3586407 -7132511 -8488199 -3894053 2070132 1353001 -6161966
8617 -6161966 -12253819 -11596068 -7370200 -4431029 -2770218 -342812 2676540 5762016
8609 5762016 9888774 13914058 13155653 6156269 -449693 575761 6668650 8617412
8601 8617412 3620306 -1124000 808099 6480064 8764677 5735686 1258775 -757353
8593 -757353 854860 5106032 8753383 7719389 2144552 -2086438 -857068 1438987
8585 1438987 -1985980 -9064663 -10676313 -4101815 2746308 3128296 385577 372483 1214638
$$ packed form
8643d37614P983J805762J670385J23997p13824k92674j15635n73873J41018K106648
8633C722173J717085k889247p198504n777616l35839K932609K439064J584443
8625c805832J219901j000476l546104j355688M594146N964185p17131p514967
8617f161966o091853O57751M225868K939171J660811K427406L019352L085476
8609E762016M126758M025284p58405o999384o605962J025454O092889J948762
8601H617412m997106m744306J932099N671965K284613l028991m476911k016128
8593g57353J612213M251172L647351j033994n574837m230990J229370K296055
8585A438987l424967p078683j611650O574498O848123L81988k742719j3094Q42155
$$ plain form
8576 1214638 -2469217 -9013005 -11113562 -6517604 -480500 2243390 1691548 -1161743
8568 -1161743 -6050358 -9843085 -7597045 111684 6139244 6090639 3833958 4202427 5148996
8559 5148996 2308944 -2384774 -3032429 821999 3255476 691411 -3572900 -4768157
8551 -4768157 -2474854 659593 2890978 4192430 5255523 7132213 10124230 12092723
8543 12092723 9936764 3914053 -1578400 -2992285 -1514033 -404176 -537947 -961589
8535 -961589 -2203244 -5692133 -10109836 -11478159 -7899109 -2116938 1733657 2302258 921227
8526 921227 -927504 -2368289 -2581707 -1564257 -939867 -2011387 -3162329 -1458099 2663339
8517 2663339 4712361 1743644 -3186131 -4444095 -749746 3838562 5620714 5265721
$$ packed form
8576A214638l683855o543788k100557M595958O037104K723890n51842k853291
8568a161743m888615l792727K246040P708729O027560m8605k256681L68469R46569
8559E148996k840052m693718o47655L854428K433477k564065m264311j195257
8551d768157K293303L134447K231385J301452J063093J876690K992017J968493
8543A2092723k155959o022711n492453j413885J478252J109857j33771m23642
8535i61589j241655l488889m417703j368323L579050N782171L850595N68601j381031
8526I21227j848731j440785k13418J017450O24390j071520j150942J704230M121438
8517B663339K049022k968717m929775j257964L694349M588308J782152l54993
$$ plain form
8509 5265721 5556146 7677830 11059699 14644408 16425585 13741593 6731236 192499
8501 192499 -1141514 1392416 2425824 436025 -480242 2262022 5269410 4638730 2129758
8492 2129758 1712025 2599415 894119 -2986764 -4158406 -1024249 2217153 2624449 3045951
8483 3045951 6409658 9641834 7759070 1594974 -3158269 -3553437 -1836558 -594464
8475 -594464 475364 2071516 2806684 983003 -2739499 -5719524 -5795307 -3189085 -542247
8466 -542247 -548345 -2739039 -3645622 -1349225 1627914 1932188 361367 451701 3057857
8457 3057857 5496392 5726494 4292110 2265546 444961 545777 3640273 7055658 6608423
8448 6608423 2736453 414089 1686420 2776429 1041439 235961 4692312 11624719
$$ packed form
8509E265721K90425K121684L381869L584709J781177k683992p010357o538737
8501A92499j334013K533930J033408j989799r16267K742264L007388o30680k508972
8492B129758m17733Q87390j705296l880883j171642L134157L241402M07296M21502
8483C045951L363707L232176j882764o164096m753243l95168J716879J242094
8475e94464J069828J596152P35168j823681l722502k980025p5783K606222K646838
8466e42247o098k190694r06583K296397K977139L04274j570821R0334K606156
8457C057857K438535K30102j434384k026564j820585J00816L094496L415385m47235
8448F608423l871970k322364J272331J090009j734990q05478M456351O932407
$$ plain form
8440 11624719 14367266 11555923 7870757 6137020 4063338 -4637 -3033271 -2031100
8432 -2031100 474663 -404336 -4774250 -7941340 -7482053 -6409138 -7754127 -9431148 -7665786
8423 -7665786 -3367798 -912938 -1247290 -791818 2042282 3930913 2417044 385983 1438377
8414 1438377 4178717 4931006 3377040 1524829 -291745 -2038535 -1298744 2938866 6279969
8405 6279969 4653400 1993592 5294842 13182013 17062901 13611446 8087453 4273499
8397 4273499 -375833 -6957979 -10694596 -8475252 -4192555 -2383048 -2451077 -2858147 -4610292
8388 -4610292 -6414947 -3139876 5640311 11770541 8925614 1268756 -3873504 -5899940
8380 -5899940 -7143065 -5599697 447974 5728446 4699741 1057050 1783733 5159516
$$ packed form
8440A1624719K742547k811343l685166j733737k073682m067975l028634J002171
8432b031100K505763q78999m369914l167090M59287J072915j344989j677021J765362
8423g665786M297988K454860l34352M55472K834100J888631j513869k031061J052394
8414A438377K740340P52289j553966j852211j816574j746790P39791M237610L341103
8405F279969j626569k659808L301250P887171L880888l451455n523993l813954
8397D273499m649332o582146l736617K219344M282697J809507o8029m07070j752145
8388d610292j804655L275071Q780187O130230k844927p656858n142260k026436
8380e899940j243125J543368O047671N280472j028705l642691P26683L375783
$$ plain form
8372 5159516 4072967 -1086788 -2615661 2118498 7315064 7829172 3911804 -2844734
8364 -2844734 -10655752 -14819643 -11406545 -3806011 1264089 3448374 6813716 9513482
8356 9513482 5071864 -5286320 -11376779 -7744603 -174923 4369626 6308425 8387955
8348 8387955 9420090 7584657 4617076 3003462 3186245 5558272 10565939 15488733
8340 15488733 16164711 12792188 8870330 4825775 -674942 -4133613 -917120 4511498
8332 4511498 2618280 -5519705 -8258668 -2298365 1188368 -4820722 -11213259 -8227069
8324 -8227069 -1438806 -891792 -3539120 103588 7866934 8497088 -102832 -7812113 -7504426
8315 -7504426 -2917742 -332149 -993651 -3326881 -5863837 -6540949 -4139531 -826098 762849
$$ packed form
8372E159516j086549n159755j528873M734159N196566N14108l917368o756538
8364b844734p811018m163891L413098P600534N070100K184285L365342K699766
8356I513482m441618j0358184o090459L632176P569680M544549J938799K079530
8348H387955J032135j835433k967581j613614J82783K372027N007667M922794
8340A5488733O75978l372523l921858m044555n500717l458671L216493N428618
8332D511498j893218q137985k738963N960303L486733o009090o392537K986190
8324h227069O788263N47014k647328L642708P763346O30154q599920p709281L07687
8315g504426M586684K585593o61502k333230k536956o77112K401418L313433J588947
$$ plain form
8306 762849 1748982 4024730 5341730 2785067 -962135 -772222 3071783 5939509 6265641
8297 6265641 6179909 6266547 5502501 4965973 5872670 5631454 1900439 -1323477 1568623
8288 1568623 8448913 11986595 10599283 9462678 10866467 11136473 7933479 3734298
8280 3734298 911603 -550251 307328 4930135 10598565 12209624 9458753 6586705
8272 6586705 4908679 2013059 -1487487 -1731685 841315 1072413 -2119217 -3638382 -809703
8263 -809703 3071586 5845425 9583272 13856240 13733030 8337862 4093489 5077567 7143137
8254 7143137 6342584 5986425 9388104 12238446 9366889 3919911 2427971 4641796 5282710
8245 5282710 2658095 -1100289 -5285309 -9387168 -9573245 -3644764 2716344 2181920 -3132066
$$ packed form
8306G62849R86133K275748J317000k556663l747202J89913L844005K867726L26132
8297F265641q5732Q6638p64046n36528R06697k41216l731015l223916K892100
8288A568623O880290L537682j387312j136605J403789K70006l202994m199181
8280C734298k822695j461854Q57579M622807N668430J611059k750871k872048
8272F586705j678026k895620l500546k44198K573000K31098l191630j519165K828679
8263h09703L881289K773839L737847M272968j23210n395168m244373R84078K065570
8254G143137q00553l56159L401679K850342k871557n446978j491940K213825O40914
8245E282710k624615l758384m185020m101859j86077N928481O361108n34424n313986
$$ plain form
8236 -3132066 -4416007 619229 5133850 4363988 1724487 1630665 3007733 3095509 2302096
8227 2302096 1873370 1057036 -192488 520203 3841376 6190709 4961317 3170429 4881454
8218 4881454 8181125 7330050 1284890 -4238561 -4095612 63296 2570775 896705 -1886992
8209 -1886992 -1362686 2899853 6884481 6794607 3442764 1097877 2074222 3983767 3339819
8200 3339819 494049 -1074375 119729 1758796 1726233 1404998 3083297 5825811 6533696
8191 6533696 4408070 1787189 633855 578006 605332 332640 -664483 -2337703 -2795210
8182 -2795210 -472487 1938704 -309624 -6503384 -9572024 -5378011 1441274 4650518
8174 4650518 5132545 7218203 9992493 9160719 5718067 5244841 8432127 9376977 4866977
$$ packed form
8236c132066j283941N035236M514621p69862k639501r3822J377068Q7776p93413
8227B302096m28726q16334j249524P12691L321173K349333j229392j790888J711025
8218D881454L299671q51075o045160n523451J42949M158908K507479j674070k783697
8209a886992N24306M262539L984628q9874l351843k344887R76345J909545o43948
8200C339819k845770j568424J194104J639067l2563l21235J678299K742514P07885
8191F533696k125626k620881j153334n5849K7326k72692r97123j673220m57507
8182b795210K322723K411191k248328o193760l068640M194013O819285L209244
8174D650518M82027K085658K774290q31774l442652m73226L187286R44850m510000
$$ plain form
8165 4866977 -792668 -2485841 -559860 2027012 4037560 4777653 2962451 -298285
8157 -298285 -1089620 1993851 5520627 6624994 7104682 9402335 11942768 11456338 7143455
8148 7143455 232216 -7385738 -11936596 -9214800 -343072 7508324 9332743 7761548
8140 7761548 7368905 7689252 5882668 2504705 42764 -1145967 -1132665 1935955 7780253
8131 7780253 11012020 7598069 1445349 -809102 1278395 3687310 5198070 6489950
8123 6489950 5374135 697441 -1773653 3547688 10730251 8409334 -2500015 -8079026
8115 -8079026 -1074811 9177171 11306079 6864737 3856859 3064440 -458050 -6783980
8107 -6783980 -10534363 -9234670 -5717448 -2907511 -1128865 -23506 609094 1247627 1478365
$$ packed form
8165D866977n659645j693173J925981K586872K010548P40093j815202l260736
8157b98285p91335L083471L526776J104367M79688K297653K540433m86430m312883
8148G143455o911239p617954m550858K721796Q871728P851396J824419j571195
8140G761548l92643L20347j806584l377963k461941j188731J3302L068620N844298
8131G780253L231767l413951o152720k254451K087497K408915J510760J291880
8123F489950j115815m676694k471094N321341P182563k320917j0909349n579011
8115h079026P004215J0251982K128908m441342l007878p92419l522490o325930
8107f783980l750383J299693L517222K809937J778646J105359O32600O38533K30738
$$ plain form
8098 1478365 33328 -2083986 -1475144 2268563 4860285 4130016 4057131 7564717 9902363
8089 9902363 5336231 -3195921 -8154000 -8529018 -9283557 -11243865 -9872874 -4252601 760074
8080 760074 2678738 4170252 5755313 3379549 -3320962 -7298415 -3365292 4240199
8072 4240199 8387834 8518709 8518316 9079934 7753763 4087553 -238846 -4488408 -7825464
8063 -7825464 -7378237 -1903419 4301584 5672842 2436716 -601588 -1046502 -627696 -1069419
8054 -1069419 -2363236 -4396865 -6622486 -7076447 -5204673 -4094441 -6020464 -7800216
8046 -7800216 -5305706 -501304 1747176 2018428 4475340 7582279 4892956 -3771317
8038 -3771317 -9943253 -8068213 -2512726 226675 -61086 -397844 -319793 -413370 -70548
$$ packed form
8098A478365j445037k117314O08842L743707K591722p30269p2885L507586K337646
8089I902363m566132q532152m958079l75018p54539j960308J370991N620273N012675
8080G60074J918664J491514J585061k375764o700511l977453L933123P605491
8072D240199M147635J30875l93N61618j326171l666210m326399m249562l337056
8063g825464M47227N474818O205003J371258l236126l038304m44914M18806m41723
8054a069419j293817k033629k225621m53961J871774J110232j926023j779752
8046g800216K494510M804402K248480K71252K456912L106939k689323q664273
8038c771317o171936J875040N555487K739401k87761l36758P8051r3577L42822
$$ plain form
8029 -70548 -132590 -2709806 -5547996 -2947069 4231007 7032089 1920753 -2290625 1915607
8020 1915607 8181705 6740922 579876 -405622 3444942 3266034 -1687523 -2561582 3349089
8011 3349089 8074580 6775317 4493535 5229327 4980200 921315 -1982923 102342 2287599
8002 2287599 -854699 -5880177 -6160554 -2100573 731440 -83322 -2831797 -5653573 -6972408
7993 -6972408 -5456394 -3378182 -5687981 -11811367 -13630462 -6690137 1900668 3045011
7985 3045011 -1496723 -3012480 971577 5140783 5925917 5018933 4134115 3033081 2788121
7976 2788121 5185501 8533369 8921501 5827707 2349660 314251 -733210 -457075 1909681
7967 1909681 4571288 4661363 2410613 337611 -783118 -1686793 -1889304 -1028368 -1132508
$$ packed form
8029g0548o2042k577216k838190K600927P178076K801082n111336m211378M206232
8020A915607O266098j440783o161046r85498L850564j78908m953557q74059N910671
8011C349089M725491j299263k281782P35792k49127m058885k904238K085265K185257
8002B287599l142298n025478k80377M059981K832013q14762k748475k821776j318835
7993f972408J516014K078212k309799o123386j819095O940325Q590805J144343
7985C045011m541734j515757L984057M169206P85134r06984q84818j101034k44960
7976B788121K397380L347868L88132l093794l478047k035409j047461K76135K366756
7967A909681K661607R0075k250750k073002j120729r03675k02511Q60936j04140
$$ plain form
7958 -1132508 -3352925 -4442173 -1150421 3985052 6373418 6611102 8099565 9611681
7950 9611681 7140746 1794227 -1448538 -2141130 -4114635 -7295969 -7720920 -5678973 -5206325
7941 -5206325 -4861288 1241680 11029401 13555152 5125154 -3286866 -1230275 6855005
7933 6855005 10062933 6866616 3830138 3625187 3633423 3531436 5339793 7107448 4509474
7924 4509474 -1338630 -4507508 -3078681 -1315335 -2347479 -4192173 -4194401 -2633633 -494774
7915 -494774 2309701 5039759 5834040 4680525 3946677 4949047 6376893 6675541 5587064
7906 5587064 3013399 -1025676 -4845802 -6073688 -4723878 -2992278 -1775801 -101141
7898 -101141 1668342 1337633 -1221760 -2803413 -1484931 32295 -1738978 -5614853 -7005316
$$ packed form
7958a132508k220417j089248L291752N135473K388366K37684J488463J512116
7950I611681k470935n346519l242765o92592j973505l181334m24951K041947M72648
7941e206325L45037O102968R787721K525751q429998q412020K056591Q085280
7933F855005L207928l196317l036478k04951Q236j01987J808357J767655k597974
7924D509474n848104l168878J428827J763346j032144j844694k228J560768K138859
7915d94774K804475K730058P94281j153515p33848J002370J427846K98648j088477
7906E587064k573665m039075l820126j227886J349810J731600J216477J674660
7898a01141J769483l30709k559393j581653J318482J517226j771273l875875j390463
$$ [...]
##END NTUPLES=NMR SPECTRUM
##END=
