##TITLE=31Pdec_SR126_DCC
 , 124 sc
 12.5.2022
##JCAMPDX= 6.0         $$ Bruker NMR JCAMP-DX V2.0
##DATA TYPE= NMR SPECTRUM
##DATA CLASS= NTUPLES
##ORIGIN= UXNMR, Bruker Analytische Messtechnik GmbH
##OWNER= root
$$ XWIN-NMR		Version 3.5
$$ Thu May 12 13:57:31 2022 Russian Standard Time (UT+4h)  she@DPX200
##.OBSERVE FREQUENCY= 81.013821
##.OBSERVE NUCLEUS= ^31P
##.ACQUISITION MODE= SIMULTANEOUS
##.ACQUISITION SCHEME= undefined
##.AVERAGES= 124
##.DIGITISER RES= 16
##SPECTROMETER/DATA SYSTEM= spect
##.PULSE SEQUENCE= zgpg30
##.SOLVENT NAME= CDCl3
##.SHIFT REFERENCE= (INTERNAL, CDCl3, 0, 248.564)
##AUDIT TRAIL= $$ (NUMBER, WHEN, WHO, WHERE, WHAT)
$$ ##TITLE= Audit trail, XWIN-NMR		Version 3.5
$$ ##JCAMPDX= 5.01
$$ ##ORIGIN= Bruker BioSpin GmbH
$$ ##OWNER= she
$$ F:/spectra/data/she/nmr/P31/1/pdata/1/auditp.txt
$$ ##AUDIT TRAIL=  $$ (NUMBER, WHEN, WHO, WHERE, WHAT)
(   1,<2022-05-12 13:54:33.53 +0400>,<she>,<DPX200>,
      <continue with go, POWCHK disabled, PULCHK disabled
       configuration hash MD5:
       00 E9 B6 7A A2 85 ED C7 34 08 36 98 17 FE 4E 26
       data hash MD5: 32K
       1E BB 09 22 9C B9 20 F4 28 69 EB 1A 27 09 20 C8>)
(   2,<2022-05-12 13:54:45.81 +0400>,<she>,<DPX200>,
      <Start of raw data processing
       efp BC_mod = 2 LB = 1 FT_mod = 6 PKNL = 1 PHC0 = -9937.473 PHC1 = 179.0537 SI = 64K 
       data hash MD5: 64K
       EC B4 A4 67 51 B4 AA C8 ED 81 65 38 8E EA 7D 23>)
(   3,<2022-05-12 13:55:49.10 +0400>,<she>,<DPX200>,
      <pk PHC0 = -74.37864 PHC1 = 233.4002 
       data hash MD5: 64K
       FD D2 F0 14 E2 0F 69 9C B3 19 A7 5D 09 E2 5C 23>)
(   4,<2022-05-12 13:55:52.03 +0400>,<she>,<DPX200>,
      <abs ABSG = 5 
       data hash MD5: 64K
       C6 DE 0C CD F5 5D 9D AC AF 37 E9 92 85 F8 C2 EA>)
$$ ##END=
$$ 
$$ hash MD5
$$ 30 01 11 6C DF 9C 66 81 83 1E 9D 5F A9 E3 5D 95
##$RELAX= 
##$RELAX= 
##$RELAX= 
##$RELAX= 
##$RELAX= 
##$RELAX= 
##$RELAX= 
##$RELAX= 
$$ Bruker specific parameters
$$ --------------------------
##$DU= <F:/spectra>
##$EXPNO= 1
##$NAME= <P31>
##$PROCNO= 1
##$TYPE= <nmr>
##$USER= <she>
##$AMP= (0..31)
100 100 100 100 100 100 100 100 100 100 100 100 100 100 100 100 100 100 
100 100 100 100 100 100 100 100 100 100 100 100 100 100 
##$AQSEQ= 0
##$AQ_mod= 1
##$AUNM= <au_zg>
##$AUTOPOS= <>
##$BF1= 81.014009
##$BF2= 200.13
##$BF3= 200.13
##$BF4= 200.13
##$BF5= 200.13
##$BF6= 200.13
##$BF7= 200.13
##$BF8= 200.13
##$BYTORDA= 1
##$CFDGTYP= 0
##$CFRGTYP= 5
##$CHEMSTR= <none>
##$CNST= (0..31)
1 1 145 1 1 1 1 1 1 1 1 1 1 1 1 1 1 1 1 1 1 1 1 1 1 1 1 1 1 1 1 1 
##$CPDPRG= <waltz16>
##$CPDPRG1= <>
##$CPDPRG2= <waltz16>
##$CPDPRG3= <>
##$CPDPRG4= <mlev>
##$CPDPRG5= <mlev>
##$CPDPRG6= <mlev>
##$CPDPRG7= <mlev>
##$CPDPRG8= <mlev>
##$CPDPRGB= <>
##$CPDPRGT= <>
##$D= (0..31)
0 1 0 0 0 0 0 0 0 0 0 0.03 2e-05 3e-06 0 0 0 0 0 0 0 0 0 0 0 0 0 0 0 0 
0 0 
##$DATE= 1652349104
##$DBL= (0..7)
120 120 120 11 120 120 24 19 
##$DBP= (0..7)
150 150 150 150 150 150 150 150 
##$DBP07= 0
##$DBPNAM0= <>
##$DBPNAM1= <>
$$ [...]
##$SUBNAM3= <"">
##$SUBNAM4= <"">
##$SUBNAM5= <"">
##$SUBNAM6= <"">
##$SUBNAM7= <"">
##$SUBNAM8= <"">
##$SUBNAM9= <"">
##$SW= 501.771253377433
##$SWIBOX= (0..15)
0 1 3 0 0 0 0 0 0 0 0 0 0 0 0 0 
##$SW_h= 40650.406504065
##$TD= 32768
##$TD0= 1
##$TE= 0
##$TE2= 300
##$TE3= 300
##$TEG= 300
##$TL= (0..7)
0 120 53 12 22 120 120 120 
##$TP= (0..7)
150 150 150 150 150 150 150 150 
##$TP07= 0
##$TPNAME0= <>
##$TPNAME1= <>
##$TPNAME2= <>
##$TPNAME3= <>
##$TPNAME4= <>
##$TPNAME5= <>
##$TPNAME6= <>
##$TPNAME7= <>
##$TPOAL= (0..7)
0.5 0.5 0.5 0.5 0.5 0.5 0.5 0.5 
##$TPOFFS= (0..7)
0 0 0 0 0 0 0 0 
##$TUNHIN= 0
##$TUNHOUT= 0
##$TUNXOUT= 0
##$USERA1= <user>
##$USERA2= <user>
##$USERA3= <user>
##$USERA4= <user>
##$USERA5= <user>
##$V9= 5
##$VALIST= <valist>
##$VCLIST= <CCCCCCCCCCCCCCC>
##$VD= 0
##$VDLIST= <DDDDDDDDDDDDDDD>
##$VPLIST= <PPPPPPPPPPPPPPP>
##$VTLIST= <TTTTTTTTTTTTTTT>
##$WBST= 1024
##$WBSW= 4
##$XGAIN= (0..3)
0 0 0 0 
##$XL= 0
##$YL= 0
##$YMAX_a= 4573
##$YMIN_a= -2219
##$ZGOPTNS= <>
##$ZL1= 120
##$ZL2= 120
##$ZL3= 120
##$ZL4= 120
##$ABSF1= 248.5645
##$ABSF2= -253.2056
##$ABSG= 5
##$ABSL= 3
##$ALPHA= 0
##$AQORDER= 0
##$ASSFAC= 0
##$ASSFACI= 0
##$ASSFACX= 0
##$ASSWID= 0
##$AUNMP= <proc_1d>
##$AZFE= 0.1
##$AZFW= 0.5
##$BCFW= 0
##$BC_mod= 2
##$BYTORDP= 0
##$COROFFS= 0
##$CY= -3
##$DATMOD= 1
##$DC= 0
##$DFILT= <>
##$DTYPP= 0
##$F1P= 0
##$F2P= 0
##$FCOR= 1
##$FTSIZE= 65536
##$FT_mod= 6
##$GAMMA= 0
##$GB= 0
##$INTBC= 1
##$INTSCL= 5.30512e-09
##$ISEN= 30
##$LB= 1
##$LEV0= 0
##$LPBIN= 0
##$MAXI= 10000
##$MC2= 0
##$MEAN= 0
##$ME_mod= 0
##$MI= 50
##$NCOEF= 0
##$NC_proc= -9
##$NLEV= 6
##$NOISF1= 182.463
##$NOISF2= 159.3651
##$NSP= 0
##$NTH_PI= 0
##$NZP= 0
##$OFFSET= 248.5645
##$PC= 4
##$PHC0= -10011.85
##$PHC1= 412.4539
##$PH_mod= 1
##$PKNL= yes
##$PPARMOD= 0
##$PSCAL= 0
##$PSIGN= 0
##$REVERSE= no
##$SF= 81.014009
##$SI= 65536
##$SIGF1= 159.3651
##$SIGF2= -187.1042
##$SINO= 113.3802
##$SIOLD= 16384
##$SREGLST= <1H.CDCl3>
##$SSB= 0
##$STSI= 65536
##$STSR= 0
##$SW_p= 40650.406504065
##$SYMM= 0
##$S_DEV= 0
##$TDeff= 32768
##$TDoff= 0
##$TI= <>
##$TILT= no
##$TM1= 0
##$TM2= 0
##$TOPLEV= 0
##$USERP1= <user>
##$USERP2= <user>
##$USERP3= <user>
##$USERP4= <user>
##$USERP5= <user>
##$WDW= 1
##$XDIM= 65536
##$YMAX_p= 547142606
##$YMIN_p= -170190810
$$ End of Bruker specific parameters
$$ ---------------------------------
##NTUPLES= NMR SPECTRUM
##VAR_NAME=  FREQUENCY,     SPECTRUM/REAL,   SPECTRUM/IMAG
##SYMBOL=    X,             R,               I
##VAR_TYPE=  INDEPENDENT,   DEPENDENT,       DEPENDENT
##VAR_FORM=  AFFN,          ASDF,            ASDF
##VAR_DIM=   65536,         65536,           65536
##UNITS=     HZ,            ARBITRARY UNITS, ARBITRARY UNITS
##FACTOR=    0.620285442955139, 1,           1
##FIRST=     20137.2065510759, 0,            0
##LAST=      -20513.1999529892, 0,           0
##MIN=       -20513.1999529892, -170190810,  0
##MAX=       20137.2065510759, 547142606,    0
$$ Real data points
##PAGE= N=1
##DATA TABLE= (X++(R..R)), XYDATA
$$ [...]
45204 36332179 22483540 7101581 1502275 3093635 2536102 -2685157 -7576209 -6890374
45196 -6890374 924061 11853224 16561860 9456670 -1347411 -2671226 3166773 -752665
45188 -752665 -18845755 -31088357 -19453288 5264186 17489262 9830924 -3290075
45181 -3290075 -9395504 -8636533 -2931619 8545086 21050711 25918002 23844053 24252008
45173 24252008 28737327 27930254 18324353 8768601 4864380 426436 -7955492 -11004257
45165 -11004257 -1900642 9638472 10646361 3985918 1925392 7832484 17139027 29868151
45157 29868151 46916492 58105981 51176389 32470997 21607690 22592249 17059709 -7099172
45149 -7099172 -35982860 -48872644 -44443504 -35289481 -26647427 -15749869 -5684689 -2983053
45141 -2983053 -3403141 3520104 14660649 14321744 -385869 -11221955 -5132225 4781851
45133 4781851 -1923094 -22481783 -34729750 -27228633 -10502985 945957 3410517 -1223360
45125 -1223360 -11723266 -23065133 -26475823 -20594391 -14794524 -15904070 -19270757 -18636977
45117 -18636977 -17001379 -20580140 -28339782 -34468003 -35774106 -30853979 -18643139 -4209083
45109 -4209083 1778418 -2786944 -6018577 -108351 4306861 -5557600 -22280163 -28213853
45101 -28213853 -22287393 -18808359 -21957193 -20872914 -11607749 -4818875 -6583071 -8937246
45093 -8937246 -6244495 -4560888 -6405465 -2316714 11211317 19545962 9212297 -11329680
45085 -11329680 -23640486 -23375136 -19362131 -16407189 -12946569 -10276244 -10454012 -8645765
45077 -8645765 36170 9284273 9076491 1090517 -5844372 -12499529 -26579352 -43504619
45069 -43504619 -45789717 -26548339 -891009 13019447 14154318 11966566 8598130 -481055
45061 -481055 -12002391 -14657611 -6720773 -2754107 -13465176 -25896558 -18262749 5583674
45053 5583674 14140456 -10079300 -42734899 -48687982 -29490051 -16666145 -22928076 -28133304
45045 -28133304 -17272922 -3300496 607017 5708999 24862716 44597925 43096990
45038 43096990 23592698 8076460 6520053 12283329 20516317 31094435 38180448 34946569
45030 34946569 25232025 16455775 7828405 -682551 914194 15087324 22760477 9558413
45022 9558413 -5663012 4399929 31557957 43859844 35175809 28397954 30141616 20110939
45014 20110939 -6933428 -24674657 -15269790 3958152 9664778 2245176 -8818717
45007 -8818717 -23672117 -38623401 -37532253 -16044005 5294676 9954355 8516504 16057640
44999 16057640 26467306 27714687 23479202 20699606 14803705 6438875 11625587 32892867
44991 32892867 42109179 18886314 -13860910 -22485791 -11843102 -7942572 -8615683 7208870
44983 7208870 30890827 30434507 6052321 -4934002 12322709 26818612 13742662
44976 13742662 -7205372 -8241092 2644425 2726355 -2788497 8701368 34536180 44958122
44968 44958122 24529067 -6792023 -19670697 -8663506 7188200 9589728 -69250
44961 -69250 -6825304 -3319451 1386277 -2233222 -6846864 1639806 19608198 26186015
44953 26186015 10971469 -12509541 -26722144 -30369257 -30187880 -24974928 -11444235 1445550
44945 1445550 442163 -9530560 -5386652 24628547 60389667 69608090 46255138 18244271
44937 18244271 12553832 23097719 24553512 11163121 3174720 12588211 22766725 14314313
44929 14314313 -3969399 -7369182 9773996 28555707 31108841 16565095 -6131317
44922 -6131317 -26952151 -36866146 -33464354 -24581626 -17794626 -10538529 -29205 5431667
44914 5431667 -369300 -5177709 6248552 26162777 34470057 31201411 33854788 42770559
44906 42770559 36579505 8552873 -18104407 -22522908 -12583962 -7190732 -11036473 -19244524
44898 -19244524 -29432042 -36114326 -29179536 -10731024 1863538 1362315 1837176 11933163
44890 11933163 17468703 8582764 3434633 19740721 39041836 29796169 -2816283 -22288009
44882 -22288009 -14455653 -4109038 -12015146 -24901536 -22826703 -13406747 -17625270 -33775257
44874 -33775257 -37297713 -15125594 15945383 29212457 16545316 -8315340 -28143593
44867 -28143593 -36005358 -33269611 -24392087 -18123935 -25091719 -44427204 -57712538 -48009814
44859 -48009814 -22616398 -3705742 2486134 10154601 25043827 31601315 19551049
44852 19551049 4829205 7344230 21263469 26476898 20492677 18489724 26139091 32485096
44844 32485096 29745523 22665388 16409423 10404256 6221624 6951684 6156095 -7645495
44836 -7645495 -30980820 -44127550 -36122280 -18216797 -5389177 2029764 8062178 5807339
44828 5807339 -10941501 -28181632 -23404443 2527459 23207988 22445511 15180193 19735183
44820 19735183 23788409 1281108 -40462801 -58338799 -29148970 14965326 26951575
44813 26951575 5276334 -11897433 -4956389 5401994 -2184100 -17801906 -21233082
44806 -21233082 -12167855 -1901733 8798343 24340733 37133847 33940711 14393455
44799 14393455 -10101991 -30572350 -42542004 -41290857 -27706219 -13311117 -8157490
44792 -8157490 -8893958 -7839020 -5909340 -6679310 -7297800 -6802497 -12744257 -25994732 -30190346
44783 -30190346 -12632870 14143101 28730473 28837594 24859486 17177907 2549648 -7161123
44775 -7161123 238629 10267119 -977771 -25238274 -29058627 -4197297 20780633
44768 20780633 25612587 23016334 26840538 26672543 12115000 -3992070 -7939560 -9580241
44760 -9580241 -22131269 -34949681 -30113920 -13698436 -7179650 -15170000 -22484226 -19066473
44752 -19066473 -10377227 -5445983 -7939235 -15837732 -19700526 -7387539 19366439 41213940
44744 41213940 44632965 38752335 36168951 29829315 7758255 -19256285 -28104823 -17949231
44736 -17949231 -11297240 -19131543 -26592160 -19446619 -6225512 -3759071 -13334628 -22020541
44728 -22020541 -20531482 -11056727 -867538 5879976 10645553 16535810 22004235 21866695
44720 21866695 16755155 14770685 17678720 14096665 -2015954 -13653183 909977 34016281
44712 34016281 52690555 41597752 23217667 24236870 37172317 32449823 1498168
44705 1498168 -30146508 -34329616 -11841605 13173262 22343988 18461723 13880780 12312057
44697 12312057 7936295 -800965 -6120286 -3624051 -2169735 -12312433 -29297664 -38198870
44689 -38198870 -34314469 -26616887 -20553963 -11717913 -1424257 -3340447 -23412311 -44995948
44681 -44995948 -48517436 -37624430 -29388931 -24971408 -11030310 10524295 18204640 4224803
44673 4224803 -9633924 -3769257 9568663 7509880 -6246261 -9279256 1840397 7871585
44665 7871585 884178 -3779978 4025076 11844695 6919628 -3206424 -6018622 -4336881
44657 -4336881 -6678487 -10608565 -11072919 -13689980 -23113577 -27741696 -13762927 12026795
44649 12026795 29986542 33046458 29494424 26541963 26413228 31912584 39215688 32324261
44641 32324261 3247698 -29289819 -41537094 -37591062 -37165199 -38337549 -22503145 6399908
44633 6399908 21753682 17827723 19449915 37692880 48652427 32771386 6433947
44626 6433947 -5308137 -3034237 -94681 2099261 5692897 4463311 389919 10265126
44618 10265126 34325632 42292709 17238945 -10086029 -3364138 22775789 25970246
44611 25970246 1254650 -18471600 -19122965 -18300975 -20911615 -6833542 25352868 41835439
44603 41835439 21093229 -11479981 -18656498 327817 18020962 19506571 13400765
44596 13400765 10451698 9648128 4998531 -3782956 -8551927 98980 19636966 32721548
44588 32721548 25649141 6027645 -8317079 -12875948 -15179903 -15979224 -10085891 -2452052
44580 -2452052 -3032630 -7443323 -4244832 483368 -8801786 -24508431 -21127521 1798125
44572 1798125 13623232 339383 -13637851 -7876694 1472338 -5046654 -12720139 1052306
44564 1052306 24012437 26035135 5933680 -10929390 -13956648 -15224292 -19585504 -16750466
44556 -16750466 -5160462 1928058 -1208350 -5429183 -5744728 -8122799 -12951096 -10637362
44548 -10637362 -81061 5403491 -1430913 -9793898 -8582021 -4556173 -11967634 -30162468
44540 -30162468 -41348534 -30839415 -5353011 11686451 5609831 -11120535 -14937774
44533 -14937774 -5806699 -9742456 -38494911 -65538207 -60664270 -33381309 -16992332
44526 -16992332 -19791685 -21907587 -16033060 -16697055 -24514461 -16807139 11315582 27965951
44518 27965951 9034336 -22820980 -30029279 -12665970 -602930 -5556152 -11441358
44511 -11441358 -7566385 -2111821 -1211634 -422124 -1508060 -14330856 -35092257 -44277089
44503 -44277089 -35459637 -26073107 -28323405 -29428095 -16410326 -2217599 -5778431 -18804114
44495 -18804114 -16796492 3136983 19835448 22055989 20932036 25233042 27201623 21182796
44487 21182796 16162761 18690111 20615836 15792263 12377310 15018596 12111399 -1806273
44479 -1806273 -8197877 7605391 24904905 13116112 -19601607 -35886809 -25444877
44472 -25444877 -16442644 -24777521 -28627845 -9922286 11750805 11512127 -473062 -738912
44464 -738912 4277803 -9665406 -38758739 -50653052 -30132686 1316773 15154988
44457 15154988 4740861 -17235535 -32135854 -25709258 -2332113 12583953 2454630
44450 2454630 -12859369 -2869105 24168803 29152769 2887821 -16135969 1424619
44443 1424619 33756631 44464670 33074038 21042732 9898818 -12401344 -36074917
44436 -36074917 -36254291 -13357311 3280487 -4967443 -26623346 -42214708 -42743992 -23932573
44428 -23932573 13258315 49770237 58726832 37872870 12727622 -123625 -11455417
44421 -11455417 -31148264 -45613683 -41344762 -31106393 -34125353 -44250699 -41704004
44414 -41704004 -26864452 -17303854 -15980432 -7702012 11823474 26316991 23379057 10101381
44406 10101381 -1418345 -8101338 -10042038 -6170144 -2155429 -8338605 -23034713 -31337221
44398 -31337221 -26765025 -19539861 -16234696 -7883179 10446353 24174785 18662025 1933191
44390 1933191 -8296885 -10405351 -14591721 -20965301 -20734572 -14960837 -13913581 -19045088
44382 -19045088 -21615969 -18454458 -14097865 -8522138 1175509 7007985 -4529481 -29865503
44374 -29865503 -46528422 -39021659 -14374322 11091224 27544505 31525873 24759193
44367 24759193 18150322 23208565 33753483 29923260 7218213 -12808932 -10955974 2717075
44359 2717075 3085202 -16425017 -36778291 -37290572 -17784783 3576506 10886000 7726509
44351 7726509 10983311 25800333 35585987 25747975 6826004 -1991912 -2907073 -10723344
44343 -10723344 -21109317 -16654259 -3035028 -5373057 -22783647 -22229268 9187409 40713430
44335 40713430 45163941 35573161 31744192 24857005 5367918 -6538946 5212105 17594475
44327 17594475 8247913 2311745 30619438 64749987 52296476 3584125 -20184933
44320 -20184933 -2551136 10610229 -2823265 -6155505 21556236 40139797 15792529
44313 15792529 -18767441 -17371015 7679764 15657238 7071554 11285280 26734251 26796554
44305 26796554 14241012 18857889 41984313 49320359 25644921 -2244011 -8507849
44298 -8507849 -2155739 -3474729 -11109088 -9101717 7854235 28771936 38135803 28140997
44290 28140997 6341672 -8411631 -5458824 4918292 6699800 -274850 -5289302 -4878934
44282 -4878934 -519521 13379079 39246610 59602570 52994479 25762305 6569625
44275 6569625 8207390 15314110 11912062 -88453 -13697728 -26450138 -30381706 -13631491
44267 -13631491 17025678 33315302 18675660 -8826645 -19500107 -7456664 8974516
44260 8974516 13698876 7138584 -1998833 -9306138 -18451710 -34556455 -52291950 -54600268
44252 -54600268 -32350471 -2346081 8171033 -4450231 -17260630 -14538888 -6484683
44245 -6484683 -6340150 -7326328 3131945 19773414 27276102 23588273 19057081 17384576
44237 17384576 14020685 11724661 20626013 38736886 46468759 29789080 1540062 -10294153
44229 -10294153 5624936 31837002 44052917 38555714 30564174 28824494 24076200 7158374
44221 7158374 -13171447 -21707841 -18991020 -18454013 -24568204 -28273977 -24689963 -21570813
44213 -21570813 -26524524 -36870445 -45842921 -49224095 -43288893 -26662047 -7590771 735554
44205 735554 -4011100 -10749781 -10087147 -2546511 8330803 18754133 20106335 6580326
44197 6580326 -10523258 -12610456 -914884 5168531 1251447 5641574 23362570 28530219
44189 28530219 2580383 -31655293 -39979925 -25509648 -18949740 -30332058 -41259946
44182 -41259946 -42042541 -44684770 -52729455 -46214921 -11742622 30151305 44614462 22788143
44174 22788143 -8894444 -18006161 1181928 25103177 30083229 20525296 19739266 33228429
44166 33228429 37985920 17851004 -8390949 -13051354 126471 6024123 -479599 -1933577
44158 -1933577 5166202 1935436 -18635387 -36175885 -32851811 -16879624 -4825582 -317697
44150 -317697 -1837146 -11579854 -22470898 -15347920 13583846 38061668 32897812 7421654
44142 7421654 -9908251 -8649082 845744 11015100 20719436 20763071 -511099 -35161555
44134 -35161555 -57678665 -53629535 -33536465 -15950763 -8681215 -9139000 -12141535 -13458188
44126 -13458188 -12577182 -12974370 -14400452 -9083195 5204914 13668603 428896 -25924804
44118 -25924804 -38998401 -29031906 -14706072 -15139223 -25553487 -30190702 -26128016 -20975231
44110 -20975231 -15651903 -4493253 10729253 20523639 21693820 20154177 18161118 10590192
44102 10590192 -995347 -2272262 14737728 33760004 30949212 9323736 -140289
44095 -140289 20403967 47875825 46527210 15539668 -10552356 -7668775 11087376 19606113
44087 19606113 11933057 616427 -4896617 -5178700 -3921796 -4919177 -10032065 -12920858
44079 -12920858 -3804350 12141674 14278207 -4010950 -20252265 -14597824 -1974113
44072 -1974113 -8454738 -27211992 -29640769 -16110323 -18765724 -46806683 -65512917 -47703247
44064 -47703247 -14754712 -922549 -1947969 9075496 31588867 39236071 25271326
44057 25271326 11354310 8834196 3481712 -11956139 -18750572 -2199526 21039842
44050 21039842 25612970 13147584 5182998 10044335 17640148 22647096 31175637 42217208
44042 42217208 42104238 25664936 7955527 3639542 5613447 -2084371 -17020895 -20548639
44034 -20548639 -6612120 8032247 8005822 125617 237431 9408066 16118188 16140359
44026 16140359 15754577 17050088 14829255 10077387 12377995 23795124 33204500 34054249
44018 34054249 35562362 45697592 53672440 43814904 20567516 3784838 816685 -1205095
44010 -1205095 -12668044 -24773412 -22049268 -2441891 22045421 39151958 44939562
44003 44939562 42240214 35620300 27147267 15896639 2945574 -5065717 -2141527 8303213
43995 8303213 16575415 17868386 14142023 6687116 -4114584 -12038830 -9211934 661514
43987 661514 4415207 -1914306 -8647152 -11007128 -17221855 -29766888 -34694796 -23678858
43979 -23678858 -11967866 -15211610 -20306770 -3764380 27411912 41306678 28419027
43972 28419027 15017779 21445899 33893084 31862937 20548103 16800871 20712576 21770900
43964 21770900 19224155 15103641 -532851 -33188227 -61505434 -57639375 -26975443
43957 -26975443 -2680471 -1325261 -8634837 -10592242 -11895085 -16638543 -15725225 -4725629
43949 -4725629 6403686 12185218 20345744 31276543 30647736 15969167 7895467 17483190
43941 17483190 24259160 8922588 -12502379 -13643978 549460 7316846 7090084 16568644
43933 16568644 29894102 24595762 4253572 -3121683 6943849 7512627 -10330375 -19100807
43925 -19100807 -3238019 10400756 -4976766 -33514918 -45206907 -41469164 -40444473
43918 -40444473 -38158247 -20891338 -2071509 -7561293 -29464300 -32380214 -7142267
43911 -7142267 16595568 17126795 6970123 2538917 -539408 -6122848 -698818 20032193
43903 20032193 30865514 9935630 -23563508 -32063224 -11238004 8256610 7318099
43896 7318099 -659529 835410 6177865 3095439 -5125236 -8002814 -6970604 -10442416
43888 -10442416 -15218208 -7679569 15780913 40149470 47030718 32833889 9580530
43881 9580530 -7999971 -13405051 -8585034 3400658 22486613 45204457 57370094
43874 57370094 44019570 11852340 -8898720 2588807 28762407 32972569 6192518
43867 6192518 -22609983 -25831226 -8845399 6477961 12898239 17407999 21226289 17742102
43859 17742102 6013800 -7297176 -16555958 -18321061 -10649744 -1511803 -7970825 -32843814
43851 -32843814 -52640440 -46552951 -27066982 -19903198 -23942123 -19626481 -10044110 -17746089
43843 -17746089 -39408962 -42668844 -19050598 -2213477 -14515122 -30420802 -19405716
43836 -19405716 4838829 10148724 -2382858 -7227471 1126596 7108355 6563612 7142647
43828 7142647 3974293 -12581747 -30190861 -27959488 -13898085 -16537309 -38888028 -53021974
43820 -53021974 -43937937 -27120296 -15877341 -2395419 17675828 30049373 25593088
43813 25593088 16227499 13443141 11529308 4803874 1411929 6568607 10513641 6109647
43805 6109647 640644 -2099999 -12011149 -30480856 -37600878 -19994843 4796086 11396402
43797 11396402 959994 -7063647 -5943003 -3286328 381093 12703923 31066953 41090151
43789 41090151 34919600 19070594 4403714 -2407180 94858 6484015 6120012 -6025765
43781 -6025765 -22889521 -34418780 -37357319 -31524965 -15791939 4640924 16344161
43774 16344161 12650738 3138426 46466 3868481 10395739 20837994 33871995 38558288
43766 38558288 28699783 15121082 9803133 6963379 -4443682 -18145720 -19334393 -10507157
43758 -10507157 -8287386 -16094852 -20104842 -14251300 -9569395 -12603117 -12289747 1040133
43750 1040133 16874855 18142911 6258979 -1241405 3497838 7964625 -1178039 -17301768
43742 -17301768 -22433094 -13238505 -5746454 -10650469 -16742965 -9275147 5630964 10886100
43734 10886100 6941921 11410014 30675662 50681253 58483199 54626809 40719934 15396230
43726 15396230 -10380873 -15493462 2143309 17074265 9325470 -11570174 -27305358
43719 -27305358 -35278893 -37114521 -24283547 3370390 22609266 14640158 -5332916
43712 -5332916 -9845684 2176272 13183600 21006369 35886311 50866495 46071142 22366097
43704 22366097 3512210 1671116 4075465 -1806175 -10279596 -9943586 1630781 19386465
43696 19386465 34757630 38422953 30223422 22302630 21359516 16898975 1170605 -12446570
43688 -12446570 -10703670 -5634258 -12635732 -17330790 2429155 30506633 26982421 -12100177
43680 -12100177 -47492937 -53340494 -43690944 -34608297 -18196772 9881744 30519312
43673 30519312 29002683 17054420 9511609 2616427 -8202052 -12323243 -3143903 7347065
43665 7347065 9121909 9846800 16722463 23599118 28611641 40798460 55536869 50257256
43657 50257256 22015535 1599484 8899618 21861501 15331412 3652193 13051940
43650 13051940 34680540 41130372 33008332 31945838 38539781 34372440 19650306 12820243
43642 12820243 14671613 7236020 -9647575 -13178791 4871135 23837547 25608423 16391230
43634 16391230 9205683 6709061 9786919 22609962 39252184 43037003 29315112 13759778
43626 13759778 8984808 7828818 127842 -7903043 -4473582 6818065 10646493 990452
43618 990452 -12420750 -18344264 -16762990 -15231802 -17092417 -17596701 -11905835 -3137958
43610 -3137958 974379 -3216984 -14530878 -30581918 -43458039 -36728780 -2442116 38784001
43602 38784001 53033732 33685562 8993697 2658228 7313052 7428849 5286720 6870504
43594 6870504 3486839 -10029345 -16959164 -3674840 12976846 10825005 272975 5384888
43586 5384888 19169664 15039638 -2533424 743190 33461096 62530637 62710688 47339249
43578 47339249 35886876 23900846 4779033 -7058280 1017905 14809703 14767886 5995869
43570 5995869 3916052 4459237 -6079223 -20508195 -16466224 8295436 28631310 24714236
43562 24714236 6485302 -914040 13534922 37715715 51209524 44101840 22321795
43555 22321795 -1777988 -19683987 -26238752 -16355656 8163193 31598621 36244987
43548 36244987 22477576 6356601 -2996451 -10383658 -17047846 -12810903 6031461 24615408
43540 24615408 26661134 14580230 2150098 -5036865 -11109221 -17784733 -21705758 -21697269
43532 -21697269 -20530373 -20046442 -18975599 -14329131 -3630672 10614263 19219724 16171228
43524 16171228 9637181 12551934 21140585 16853256 -5159403 -24963675 -25676338 -18318782
43516 -18318782 -23224524 -36498440 -34672446 -10527240 14739787 19945546 10047189 4974739
43508 4974739 11618587 18578897 16291675 10422790 10085187 11142275 2493600 -12817480
43500 -12817480 -16474617 12098 21827487 32171758 34769955 40153670 40710473 22204417
43492 22204417 -3984281 -6540616 22682944 54370416 59882643 43296983 23979722
43485 23979722 7339036 -10414428 -24181075 -26188300 -21130363 -18720476 -18701131 -17184395
43477 -17184395 -18522331 -25071598 -24106591 -3493148 25149779 37545098 28353489 14876463
43469 14876463 11615938 18178464 30757652 46785638 56321066 47079912 23779117 8047040
43461 8047040 12969009 28943913 38457193 33024377 12948375 -14917039 -33837232 -27307485
43453 -27307485 -1783331 14308835 5502459 -9071743 -2659091 21224790 35466447
43446 35466447 27861021 13330367 7802355 9193524 10152527 12548894 17920680 16335999
43438 16335999 424006 -15857449 -9536679 19493513 43343443 37910941 8938897
43431 8938897 -19684115 -33380719 -33756653 -26917719 -18148717 -14809515 -21055096 -28500074
43423 -28500074 -23251642 -4853337 11767220 16697208 17189348 23650635 32825755 33539077
43415 33539077 22833645 7197020 -8219556 -22472322 -33388306 -38467523 -40541751
43408 -40541751 -43749385 -43562728 -30542504 -7135876 8923617 5144501 -8582440 -12707621
43400 -12707621 -4011384 2308348 -3880866 -14963125 -20987110 -24706679 -30499762 -28881772
43392 -28881772 -8826024 18883905 29369063 16198818 -1235605 -6372566 -2741183
43385 -2741183 3606110 16946675 34116495 35574989 14487505 -3352830 6452707 27763078
43377 27763078 28031591 10152453 5046895 17311907 18296668 -1146078 -11474483 5565107
43369 5565107 23305021 10892426 -20005620 -36828619 -33457055 -27087303 -23321035 -14188587
43361 -14188587 -1893373 3497748 5532938 15558829 28057014 25387501 7106985
43354 7106985 -6916164 -4507343 6399436 15189683 20705811 23202313 20533288 16071017
43346 16071017 16255278 17463636 9321162 -6106452 -12844773 -3070538 12679684 22431256
43338 22431256 27181869 31781200 32751146 24082084 8053804 -7550400 -18787492 -26450366
43330 -26450366 -30752136 -29844573 -22993281 -13425612 -7411105 -8240801 -10348594 -4189225
43322 -4189225 10512343 22816297 25974789 26453271 30805863 33238709 27222448 20946103
43314 20946103 26456993 38176123 37721997 18942896 -5489734 -22235675 -29664301 -31904331
43306 -31904331 -31599706 -29019173 -20388167 -871439 21918741 26077502 2350350 -25111097
43298 -25111097 -25783433 -6144050 -1391551 -22926675 -40788741 -27149562 6156819
43291 6156819 27198810 23255767 6384520 -6583083 -6369063 5387589 13872409 2594157
43283 2594157 -23392125 -37694063 -26252439 -7733117 -7197309 -21362314 -26251071 -11316851
43275 -11316851 10964974 25808630 31137621 31904488 30971829 27986274 21900041 14498966
43267 14498966 12192768 18603047 24782590 17884779 2953634 1048206 17183184 26699693
43259 26699693 8614800 -21543645 -31856455 -16864037 2023792 12720333 23534875
43252 23534875 37525420 41665627 30467283 19565978 22449291 28445231 18554678 -6224268
43244 -6224268 -26481558 -29197739 -19084430 -8273177 -5326678 -12859366 -25744439 -30996569
43236 -30996569 -18837600 3020928 13784674 3142853 -15371454 -21018112 -11666187
43229 -11666187 -3912074 -8010077 -13928587 -8331396 3846489 6556013 -2185094 -6015331
43221 -6015331 6151162 24413392 32782593 30259087 27050424 26019984 20268951 8012573
43213 8012573 -1998807 -3224674 -519253 -1183489 -3357165 -382703 7033990 11243546
43205 11243546 9690403 8075958 8946731 5921993 -3693653 -8352054 2732936 16930927
43197 16930927 7777981 -27336418 -55414907 -46390377 -11402504 13493612 13034722 2465501
43189 2465501 -3612184 -8121412 -13974673 -13240902 -4823746 -3734076 -17308243 -26705624
43181 -26705624 -10557751 21911058 40876115 35641705 25473988 28498847 36661375
43174 36661375 30549877 9056822 -7483846 -2697664 15631779 25400187 17572761 6694129
43166 6694129 10205741 23189236 23268533 -37974 -30995867 -45537910 -35074014 -9251716
43158 -9251716 16058307 28301614 23894205 11475669 4856352 8230110 13295617 13303074
43150 13303074 12004553 15036403 21239546 27349197 32650706 34450686 28755665 20234137
43142 20234137 19940046 27363311 28351036 18498876 12412186 17943466 18791748 1067919
43134 1067919 -17496399 -8410009 25662129 53252705 54304590 35991314 11164352
43127 11164352 -15244281 -36316584 -41914579 -33819971 -25517639 -22229222 -16466236 -6392231
43119 -6392231 -1354749 -3924112 -2968969 8175569 20649108 23867343 17695631 5494041
43111 5494041 -11334079 -25674096 -25520030 -10736231 2498373 1800923 -6839831 -10927208
43103 -10927208 -7687686 -2186992 1225588 -179219 -6907671 -14105072 -17317891 -21294350
43095 -21294350 -31654479 -40001250 -33890221 -20337569 -18036829 -24622350 -17338354 7070046
43087 7070046 21198500 8688430 -10172365 -12442059 -6256183 -8317939 -11925243 -4884342
43079 -4884342 1039471 -10297262 -25583581 -19811307 3509742 21621547 31608964 45714592
43071 45714592 55326475 38339562 1781413 -21136693 -20796525 -20917100 -31240675 -29350646
43063 -29350646 -4682500 15766637 8133417 -11297975 -14408905 -2692185 4817402
43056 4817402 5107769 6664484 6953113 -213700 -7064349 -5580973 -7789089 -27919167
43048 -27919167 -53436372 -59618698 -47600478 -42095024 -52520719 -61061361 -52638530 -35491310
43040 -35491310 -25595488 -26775593 -32530776 -35199605 -28425656 -10737708 9408628 19736340
43032 19736340 16677742 5914807 -6736258 -17324192 -21902323 -23008258 -31813610 -50784770
43024 -50784770 -61286407 -46364057 -21014872 -17177895 -37668860 -49386273 -30572909
43017 -30572909 -2353868 2304264 -15291056 -24641022 -10270763 9262417 10046762 -3506803
43009 -3506803 -5094677 15708838 34847666 23820028 -7599609 -18656811 6673575
43002 6673575 34158166 27722736 3012146 2345832 28286803 40817630 21026392 -3354475
42994 -3354475 -8489640 -11566711 -33391598 -56123036 -51092425 -27196811 -16501623 -24726700
42986 -24726700 -31060241 -30033157 -36963765 -50383748 -44622706 -11292268 20326138 21169260
42978 21169260 449226 -11851419 -5853123 3569991 4062958 -1486481 -7586997 -14664471
42970 -14664471 -20723847 -16802799 708977 19527070 23167804 11907826 1928477 1167291
42962 1167291 -1942953 -16637340 -28326315 -16488979 11308875 25242484 15004857
42955 15004857 3014817 8153913 19094564 17560746 7425939 2212880 1384525 312581
42947 312581 7898474 29377475 44649880 32032186 4719663 -6252765 613248 -422138
42939 -422138 -14550821 -17196827 669861 12866227 -1476487 -26366063 -35764755 -28569091
42931 -28569091 -18410553 -8700781 2558059 9044879 5991962 1228007 848788 -2630047
42923 -2630047 -12701149 -14943243 616194 16811411 10502534 -12945474 -27671837
42916 -27671837 -23496713 -13402251 -8511526 -5856954 -1732823 -509776 -6841372 -19512313
42908 -19512313 -33471336 -40571047 -32556718 -12415684 2901880 1355436 -8900907
42901 -8900907 -13789032 -14272105 -18755504 -22629638 -13888975 4381633 15673181 14120870
42893 14120870 10104584 10275517 7857191 -2983130 -15796907 -19805264 -10835806 7286723
42885 7286723 24455686 28377015 16331701 1761605 -435805 6707933 8065198 -465809
42877 -465809 -6778398 -462536 14938752 28027604 29314255 16677887 -408972 -5937639
42869 -5937639 4280184 15493483 15506697 13164027 19925945 24508692 8822612 -18334988
42861 -18334988 -30402796 -22680152 -14154967 -10595822 834699 15203324 5726088 -28274166
42853 -28274166 -45041934 -17499428 22428000 27943511 3942532 -5975527 14296629
42846 14296629 37215915 38097484 23540720 8874843 -4419718 -19208879 -30991582
42839 -30991582 -35159101 -32312803 -21891182 -4155471 9520188 4838929 -12974538
42832 -12974538 -21676894 -12861432 -3768880 -10176378 -23731887 -27938001 -22799558 -18975635
42824 -18975635 -17571870 -12025930 -4489927 -4098297 -9975229 -10189177 254821 11636857
42816 11636857 12930278 4105430 -7653406 -15005558 -10252143 11521071 41390736 57031749
42808 57031749 45262971 19893716 5556947 6145628 3303829 -12253472 -24553206
42801 -24553206 -16749709 2101809 10046903 4133066 1409456 10120398 18472548 16060886
42793 16060886 9693877 9147838 10494846 5140042 -4122252 -8787312 -9915825 -14238585
42785 -14238585 -18190712 -9850452 11917584 32271466 38515304 34083560 28845147 23327510
42777 23327510 11497253 -4069044 -10228021 -204438 13993035 13527637 -3897983
42770 -3897983 -20063587 -18279929 -2444864 11982248 19862724 28371226 38640372 38409416
42762 38409416 18706797 -10481795 -28818094 -26560352 -12108797 -1165986 -1664974
42755 -1664974 -7503565 -6009455 5959460 14874971 5234485 -19973957 -41741751 -47274844
42747 -47274844 -39243130 -23204565 -1237591 17293751 16248990 -4146237 -18944184
42740 -18944184 -8607219 13352883 19796714 8139979 -767081 3063917 7717539 3829316
42732 3829316 -702120 2985895 10210219 13185385 13604642 16226609 19456934 19995536
42724 19995536 18873083 16144693 7229894 -8476991 -21961076 -24617435 -18954185 -13610097
42716 -13610097 -12839316 -16179402 -22425109 -26903352 -20042345 2203622 28100422 38623289
42708 38623289 27928676 10405071 5250197 16698221 31139191 32153257 16295117
42701 16295117 -5973654 -22085715 -26567295 -19863654 -5025718 10873728 18076108
42694 18076108 13405195 4865389 1201829 672870 -3237048 -9492870 -11763664 -9557218
42686 -9557218 -7113418 -3606322 4797262 14769167 19226098 19855102 23820214 28439393
42678 28439393 22995986 6724357 -9641715 -21966899 -36235253 -51058089 -55050779
42671 -55050779 -47694469 -43589228 -47119385 -43346484 -26873592 -18287066 -32494213 -49197810
42663 -49197810 -39492331 -8739011 13756926 18913882 22605434 29519858 23119958 -2396101
42655 -2396101 -25988562 -26634572 -7964586 13456741 28697568 36178771 34979949 28466851
42647 28466851 24339234 23615622 18741453 7329261 -2903663 -7049381 -9207428 -12074810
42639 -12074810 -13414508 -16385854 -27421555 -38354327 -29343578 362809 23288641
42632 23288641 19905700 7195505 12652417 33394872 43143195 31817522 15598624
42625 15598624 10199279 14630522 22354399 30444645 34095045 26721487 10305549 -4847294
42617 -4847294 -13330665 -18428499 -22064334 -21224000 -15807631 -10535377 -7342581 -3689941
42609 -3689941 1488496 7432580 14482094 18312925 6355812 -25761195 -57184172 -59552595
42601 -59552595 -34152701 -13183284 -17581138 -31199417 -27961621 -9382970 1273891
42594 1273891 -6184255 -17086022 -14064728 2054513 16988226 21137699 18273555 17816233
42586 17816233 21751284 22634625 15780152 7889628 7179243 9512932 4693487 -5448214
42578 -5448214 -7925789 1062826 9723423 9005615 5334658 8613449 17751479 25074561
42570 25074561 26272514 19558300 3906783 -14968714 -25277268 -22605765 -15108754 -10292729
42562 -10292729 -6435176 -2552949 -4554297 -13031338 -17026548 -10200394 -1678923 263998
42554 263998 2981285 14348530 24901179 21698583 10408044 5742485 7794323 6750924
42546 6750924 4572537 11167073 22697138 25271701 19785639 21979755 35249013 43155055
42538 43155055 34352705 18267654 9767364 11721977 17829250 21098460 16133862 3521086
42530 3521086 -6973644 -7642162 -4512823 -5574055 -3899903 9337380 21818806 14681552
42522 14681552 -3449687 -6389209 5302784 4185490 -13150043 -13540191 16838579 41178426
42514 41178426 24955580 -9912722 -18161299 3522581 21217620 19360385 14001504
42507 14001504 17194218 22917789 26651946 28267274 16881975 -16465143 -50636609 -50520495
42499 -50520495 -16124573 14014221 15217458 3249611 -785407 -1765669 -10276088 -16981717
42491 -16981717 -9232400 3885037 3786646 -11485582 -29729601 -43070687 -49715767 -47149068
42483 -47149068 -37411405 -30485887 -30048342 -24746514 -5560902 17546469 28612841 25951905
42475 25951905 17186887 4701048 -9254591 -13438122 -2038172 8788798 -1389164
42468 -1389164 -25995770 -36906712 -21213917 5117631 22260999 28157575 30087358
42461 30087358 29293320 22131629 7711170 -11270514 -28834275 -34942177 -23175074 -1948203
42453 -1948203 10711370 7157258 -2776050 -7419788 -7337764 -9226716 -13181901 -11884433
42445 -11884433 1202598 25256416 49432817 56674849 37724521 3723418 -21920995
42438 -21920995 -26736104 -18310050 -10019152 -7252533 -10570408 -21140490 -34923227 -39114267
42430 -39114267 -24491200 545665 14974808 4960754 -22465046 -43825453 -38719756
42423 -38719756 -10128890 15870251 17144194 18651 -12108997 -10616487 -7122948
42416 -7122948 -8595305 -7336980 -469820 2491330 1426340 12239610 36231551 45934499
42408 45934499 24562666 -615473 5800767 32989248 40506899 20880581 6585374
42401 6585374 14426754 23479679 17929596 13065823 20473232 21722488 1892834 -18267746
42393 -18267746 -12607545 8599417 17022606 11247283 12491115 24733046 29749158 19381290
42385 19381290 6344177 1982225 4407383 8914902 11712770 5232372 -11573487 -21401906
42377 -21401906 -7466602 18485837 28825633 18662559 7960245 5896021 642754
42370 642754 -11448528 -15609949 -7517887 -4706998 -14247932 -14477964 10778573 40762745
42362 40762745 45091575 28326531 21181377 33965582 43920014 30210804 1501878
42355 1501878 -18290606 -19944212 -16404785 -23116323 -35639601 -32031828 -2184887 31589746
42347 31589746 37735812 18008956 6683970 21039642 35462500 20913105 -9666254
42340 -9666254 -19921265 -2623170 13897162 9680067 -2249473 -632409 15223461
42333 15223461 31274796 39459539 41753942 41155320 37435107 28988115 14814860 -2757160
42325 -2757160 -16250464 -18419993 -11403240 -6920551 -14916387 -32781706 -46155522 -41244614
42317 -41244614 -19430225 619296 1021129 -13939483 -21692025 -9137713 12500864
42310 12500864 25393400 27232988 26711771 25779870 18904095 6037746 -4917354 -7583398
42302 -7583398 -1465265 10776270 23525190 28796826 23498380 13355928 4309773 -5541342
42294 -5541342 -19937469 -35959715 -47681730 -52869444 -50708488 -39566977 -22248324
42287 -22248324 -5701048 8800351 24760515 36062345 29346340 8369326 -3134871
42280 -3134871 4249640 9072656 -4536493 -14859974 5921244 44078752 60300609
42273 60300609 44935982 25257289 21420251 26912185 32839216 40656762 46813566 42324217
42265 42324217 31460587 25295144 16599024 -8612764 -34464656 -27929292 4779997
42258 4779997 15807764 -13819625 -41534554 -26599009 9863778 21408016 4120030
42251 4120030 -10075741 -7983484 -3601149 -3593784 -2158113 -5237644 -24371361 -46290496
42243 -46290496 -41564341 -8781949 18647901 18111519 4697601 767582 1034306 -13759085
42235 -13759085 -41350337 -56483330 -44388318 -21697029 -16710010 -33734252 -47217060
42228 -47217060 -35373241 -9499145 3086492 -1685162 -3382090 5375441 7062666 -5478965
42220 -5478965 -9941779 9387153 30635042 26648254 9630151 10984019 28896471 33056055
42212 33056055 18174697 14035938 34646389 52170962 38002771 3274330 -21620483
42205 -21620483 -28691644 -31563513 -34607968 -25726171 545887 28921421 38592521 27062481
42197 27062481 13509248 16549335 30674396 31849320 9259602 -18783061 -29358367
42190 -29358367 -24799573 -23516831 -29311791 -29252908 -18932301 -9401255 -7881223 -10419045
42182 -10419045 -15638457 -26432485 -34993460 -27359895 -8878390 -3107255 -15698593 -21624984
42174 -21624984 -2971753 20941655 20718006 -1660200 -20572950 -24792661 -24007251 -23138552
42166 -23138552 -14716921 1501927 12090860 9294383 1713285 -622508 758345 1545518
42158 1545518 4865016 12837500 15661434 1086020 -26824506 -48333375 -49558417 -36301683
42150 -36301683 -23199155 -16267183 -13538835 -17609599 -34326742 -56928170 -65150548 -49239829
42142 -49239829 -24890348 -12466935 -9631654 -128125 15963934 21071302 10187099
42135 10187099 1344620 8702187 23086282 30037174 31160948 32993645 27797257 4605730
42127 4605730 -26434249 -39453516 -23601669 4852395 23328662 25853992 22696206
42120 22696206 24746252 31689816 32823735 19421402 -3033890 -19596231 -24761486 -27891886
42112 -27891886 -34108732 -31498239 -10474946 13202880 13928862 -7370941 -22500770 -15457743
42104 -15457743 -2916788 -5030800 -12905622 -2916894 25345502 45664778 40994847 26504626
42096 26504626 29025283 52764523 75435530 75967788 57430364 39902310 35910746 38638861
42088 38638861 34203573 20177301 7631750 6266373 12246052 13014491 2675273 -9417052
42080 -9417052 -6782205 15682462 41461397 45488725 21704018 -6566882 -11656451 4851254
42072 4851254 14702692 1503045 -17000468 -15026601 4548507 16872238 13342757 11700939
42064 11700939 24039124 35922093 30423641 16769028 15922340 26470154 26134206 5888691
42056 5888691 -17283585 -25638313 -21792645 -17494491 -14988134 -8789190 3352819 19023419
42048 19023419 32925812 34839643 15972717 -15481441 -35213085 -28179115 -5138586
42041 -5138586 13208599 18259166 11599255 -5455511 -26802797 -37465359 -31066953 -22534910
42033 -22534910 -25969743 -28692589 -8984618 25799100 43818524 32067946 10991037
42026 10991037 1326507 -113750 -2814063 -2695795 6335760 17431605 21639405 21483323
42018 21483323 21698657 18302359 8718280 746878 -1588927 -9351620 -30325805 -48998436
42010 -48998436 -42757484 -13260521 14801019 24190318 20060449 15644030 16857888 22489523
42002 22489523 28550672 30107380 26224890 23009204 24980844 25862337 16589365 417914
41994 417914 -9611246 -7378551 1673417 12021617 23588734 34123088 36371900 27919883
41986 27919883 17371805 15497417 23022697 30219038 27423654 15144543 3995029 3082170
41978 3082170 8748399 9545292 2806222 -2112711 -264343 717558 -2900643 1225582
41970 1225582 22101903 42937790 38608343 13248061 -1071942 12919742 36153181
41963 36153181 42588463 31959683 20238245 12190042 1280884 -10551933 -11531989 1072565
41955 1072565 14013100 13330040 -1334268 -19272588 -28751812 -23382792 -5586776 12851226
41947 12851226 18186436 6922704 -9810679 -15501644 -2740404 19729637 34031126
41940 34031126 30023468 15903782 7801873 8229457 3174590 -14745086 -30970868 -28747670
41932 -28747670 -16045732 -14569318 -24179389 -21014640 2118268 16984826 -648526
41925 -648526 -30580530 -32799203 -4068573 18480752 10585042 -10736371 -20045110 -17724737
41917 -17724737 -15220905 -8936534 7680580 20842300 11465867 -12913012 -25315927
41910 -25315927 -16271924 -1880675 4285399 5160151 3978521 -3531716 -14664016 -17788131
41902 -17788131 -13018344 -15943735 -31246909 -41313694 -33377376 -20307261 -18867941 -22629567
41894 -22629567 -15058297 1516532 9430227 1713479 -12558761 -24127103 -29199008 -23849602
41886 -23849602 -8494902 5123825 6084794 576022 1969649 8394385 6370133 -5306259
41878 -5306259 -12758143 -8981411 -2118016 747301 2587435 5828350 7896943 11752214
41870 11752214 25210698 42839415 43855740 19041067 -11972796 -22865729 -12267164
41863 -12267164 -847133 -1848976 -7643485 -5622526 3447478 7579547 -936131 -16730366
41855 -16730366 -27433471 -26137122 -16602648 -7317102 -3598400 -6345814 -14138528 -22902107
41847 -22902107 -26628575 -22743412 -14918267 -7788854 -2130895 2213212 3914733 4231920
41839 4231920 6831758 9149267 2880696 -10298504 -14758894 -3467958 7009550 -861533
41831 -861533 -18495289 -25671616 -22736272 -24226931 -26466348 -11429109 15525596 23605575
41823 23605575 2314901 -20119706 -19613528 -10152322 -13353319 -18745328 -4217641 19772104
41815 19772104 20248350 -8393918 -35125643 -35882593 -20664364 -9928578 -5953515 245436
41807 245436 8815177 11732738 6216514 -2458931 -7314183 -2810327 13294412 34915238
41799 34915238 48062459 42707042 23687245 6148390 531804 4443464 8600070 7562949
41791 7562949 2779050 -3239705 -11341715 -21714487 -28621720 -24676986 -10432217 5028777
41783 5028777 13913128 16198940 16163451 17027677 19466525 21266774 19116996 14936333 16896193
41774 16896193 26744785 31008840 17402052 -2900073 -6170798 9451811 19260721 7231936
41766 7231936 -13592161 -25582640 -31100880 -37340686 -35488171 -16783425 3771529 4438957
41758 4438957 -9141682 -10917624 6248278 20496860 12735488 -9835366 -26076800
41751 -26076800 -22986161 -3287750 16841241 17731171 -3541067 -24300903 -21044651 -303245
41743 -303245 10717008 1085226 -15026004 -24827587 -30472164 -33740928 -29075951 -17853257
41735 -17853257 -10064816 -5954162 4355318 17676101 17139924 2822997 -2431209 9280577
41727 9280577 13962844 -3878654 -18883820 -390334 37983731 55785752 42311171
41720 42311171 24072528 19908296 19801399 11107600 -2169991 -14500372 -30709175 -52273241
41712 -52273241 -68570855 -71503330 -65659615 -56669433 -42937210 -26853284 -20601639 -29474779
41704 -29474779 -39111565 -31890950 -11669259 -1559758 -16880278 -46346901 -62274646
41697 -62274646 -48779321 -18812186 -123762 -4010272 -15405428 -17614870 -14978685
41690 -14978685 -19625406 -27114194 -24147513 -14157230 -12483458 -16849313 -7091464 20454234
41682 20454234 41855467 38740923 21481700 7468833 -2657570 -11422618 -7765390
41675 -7765390 13936949 32704532 23399772 -7345463 -29619533 -29477432 -19650648 -15685641
41667 -15685641 -21313178 -33742162 -43356324 -31875743 6850758 46139651 51023199
41660 51023199 24836606 5761960 12664778 22571114 12667235 -4204140 -6129568 -1041916
41652 -1041916 -12077982 -36884222 -49000956 -36519041 -16488827 -8998892 -14528892
41645 -14528892 -21258915 -22019391 -18525909 -15771155 -15591627 -13567106 -4455684 7384356
41637 7384356 10196550 2318116 -2280037 5323606 13276271 6982234 -6475269 -9293293
41629 -9293293 -2291720 -2638264 -12863980 -13861408 4789033 25631022 25099860 2014329
41621 2014329 -26119772 -45470972 -53374869 -50318881 -37032785 -19277676 -7110391
41614 -7110391 -6355654 -12904324 -16534454 -10894766 -95279 6970308 10038885 19319525
41606 19319525 38610496 53386922 46273842 21013877 -703830 -5299779 1212692
41599 1212692 7086085 7469191 2119681 -6796444 -12338101 -9937409 -7772243 -16354751
41591 -16354751 -27510700 -21902199 -1177859 8399464 -6519004 -26237903 -29291216
41584 -29291216 -23775339 -28162061 -37841535 -35163943 -21776710 -14584112 -14620089 -6617661
41576 -6617661 9582500 12606616 -8120120 -33714234 -39905036 -25623237 -7569556
41569 -7569556 3145170 8665293 14442108 19921258 18718253 6744532 -8693971 -12014381
41561 -12014381 2801857 22320139 29794282 25828074 22122741 20252019 11518932 -4609650
41553 -4609650 -17866315 -22912545 -22481247 -15038737 3357546 22931432 24513601 5631169
41545 5631169 -14259636 -20766149 -20902258 -26365608 -37064953 -48185418 -56532607 -52968659
41537 -52968659 -28571732 2316902 8172885 -15955250 -34098663 -18976901 6358422
41530 6358422 3121393 -25535099 -43747132 -37554756 -24647287 -14653131 2936178 27317527
41522 27317527 37504909 26033112 13467801 16563519 25869764 27493043 24153944 20620198
41514 20620198 10302326 -7101847 -14679738 -3639835 7844655 795557 -14962377
41507 -14962377 -18104689 -9036246 -3492998 -4334790 -3423429 -2913943 -10116082 -17238945
41499 -17238945 -11155950 780931 211882 -9658454 -8400887 4958589 9674411 1733982
41491 1733982 2128917 16336329 19174144 -697338 -12492721 11744998 47937394 51037043
41483 51037043 21336676 1991706 14047774 31253714 26576620 10954243 9424608
41476 9424608 22349553 30853278 27233964 20580898 18128116 16647235 11137283 1473596
41468 1473596 -9658493 -18809629 -22287990 -19132988 -12341093 -4207667 6778133 20946940
41460 20946940 32084606 31368346 16530556 -4614021 -19988918 -23860916 -23016546 -29180656
41452 -29180656 -41987572 -45022169 -26650506 239314 11726540 4281516 -2330845
41445 -2330845 4472316 13631517 11672478 3760031 552867 -2623437 -16211241 -34057136
41437 -34057136 -39375222 -30723839 -24706733 -31409978 -42494842 -47305687 -46461326 -42663275
41429 -42663275 -30297844 -4978587 22912255 34714413 22786669 -2161367 -21644047
41422 -21644047 -23354944 -7536629 14124137 25916044 20567848 7445890 4497521
41415 4497521 17698300 31042348 23646432 -2731359 -21574699 -12115690 15400226
41408 15400226 33745642 32194041 23385169 19548678 18045274 13723379 9879908 9125306
41400 9125306 6413388 281581 -1031351 5277695 7975840 960773 -1779706 12696398
41392 12696398 30638820 27652185 4343366 -15676243 -20870227 -22344041 -27868584 -28215047
41384 -28215047 -16764338 -3643316 -41296 -2812770 -4492575 -6656424 -13722432 -22974485
41376 -22974485 -29083114 -30829126 -27563395 -17435508 -3973629 4804094 8290032 14343864
41368 14343864 24208851 27398697 16729835 -2231131 -20980054 -35563024 -40892313
41361 -40892313 -32486248 -19245372 -18236526 -29844676 -35890110 -30425705 -30290991 -41510065
41353 -41510065 -39813605 -7756255 29122875 33255648 9625407 -2707336 12048320
41346 12048320 30256135 31387762 25217543 27254822 32703578 28804560 15829359 3365525
41338 3365525 -2383644 589793 10753874 18798212 14548705 2663813 -1199954 6630262
41330 6630262 13850503 15511302 22680380 38211914 42353200 18802722 -17044050 -33298436
41322 -33298436 -18896495 8445831 26613255 27662612 14889879 -4593634 -21748534
41315 -21748534 -28939853 -25446232 -16930705 -8833597 -1568116 8581628 23366235 35536067
41307 35536067 32227774 12344898 -4599158 -80559 15401980 13336898 -12057252
41300 -12057252 -34761491 -35687188 -27723832 -27861024 -26846959 -9964613 8940695 4082010
41292 4082010 -19318467 -29374290 -14878706 673683 -1831352 -11126288 -10316546 -4209293
41284 -4209293 -4939159 -7665876 -459133 11735193 12427425 -852042 -12323486 -9166287
41276 -9166287 5200180 20112289 29962283 34321678 32093937 20052750 -2696591 -28614607
41268 -28614607 -41911666 -30586861 -438641 27916903 38501028 32144324 19509336
41261 19509336 10927604 15095515 35339959 59397847 63922348 40695837 10955445
41254 10955445 2016922 15683512 31506570 35011147 28536402 18535471 7949291
41247 7949291 130277 -3922901 -11430649 -27260796 -39987691 -34947743 -18968458 -11995723
41239 -11995723 -14568280 -8208385 8190313 11665359 -3557705 -8908369 12927203 33253458
41231 33253458 19189887 -10971368 -12358231 17958165 38285293 26961166 8524581
41224 8524581 6585013 9025527 -1120786 -11314901 -1316169 21139757 31148229 20256926
41216 20256926 -1191225 -24223573 -44329501 -53556804 -48473626 -39703095 -37237574 -33204018
41208 -33204018 -15854086 6105847 11891779 -1806864 -16983741 -19119077 -11099389
41201 -11099389 -3321116 -3112778 -12328735 -23113458 -19569729 2791284 24073015 23030961
41193 23030961 8843949 9282923 27747245 35853949 15738830 -12070468 -16702985 2153003
41185 2153003 17013770 8414004 -15617376 -33040863 -30842563 -14247214 1746481
41178 1746481 7883012 6819356 4356806 1259695 -1332444 2665521 12837972 15117356
41170 15117356 1976593 -7824539 8152427 36622665 38929355 5959608 -24931801
41163 -24931801 -20809013 4151193 15970220 9627174 5439415 10983838 14950672 13665813
41155 13665813 16855190 25107536 24429674 9632032 -5014152 -7083957 -3641360 -7120365
41147 -7120365 -14230618 -12034556 -588343 3846514 -9005706 -27729962 -33353727 -24169085
41139 -24169085 -15421882 -14127377 -8476687 9469995 24425611 17951430 -939664 -7013083
41131 -7013083 2545632 5659156 -5886617 -12719870 -3019562 6033947 -313733 -6327787
41123 -6327787 6198210 21936444 14516530 -7826661 -12599505 5756614 18745453
41116 18745453 10774932 1184814 8533093 19989155 13695742 -6850829 -19759325 -15891227
41108 -15891227 -6064084 -879890 2992744 13797221 28331607 30049212 7145176 -28560000
41100 -28560000 -50079633 -47252668 -38181220 -38517750 -34821650 -9472855 19929934 17321594
41092 17321594 -16350411 -37376452 -18777475 14068901 23724883 10770146 1120432
41085 1120432 3501042 7024993 9697246 20957057 37789691 41904052 24369247 -2928125
41077 -2928125 -22960896 -28188263 -19328351 -2768137 8893534 5105248 -11017483 -26974776
41069 -26974776 -35922300 -38695842 -33843029 -18671243 -598718 5964392 -2249461 -13093043
41061 -13093043 -15935999 -11872372 -3691180 11219857 30303985 39508272 28588720 6089493
41053 6089493 -11002486 -17563999 -20973981 -26544171 -33344080 -41179211 -49268876 -48861611
41045 -48861611 -30730243 -2578170 14493713 12767076 8279228 15184920 22370456 11121701
41037 11121701 -11788528 -18598798 1540611 27803487 36721560 29934188 23242003 21582902
41029 21582902 18882227 14222708 12624347 12948070 9110634 3333583 5876748 19240037
41021 19240037 32434740 34127995 23992340 8789833 -5099134 -11956270 -6775540
41014 -6775540 9109136 25211583 28848785 15520683 -6575624 -21078817 -16069009
41007 -16069009 3255117 17375787 13655079 1887912 1536381 16145974 30152466
41000 30152466 30899985 22936300 16612270 11552475 -1068764 -22996022 -41701583 -40819573
40992 -40819573 -18159612 8104550 16003610 3596981 -10741926 -14134333 -13772260 -18483902
40984 -18483902 -20247066 -9742163 1578287 -2971636 -14288280 -7355697 18893020
40977 18893020 38355823 38398746 36221635 45312203 52936342 46576724 37928050 40002108
40969 40002108 41569476 28992497 16791951 28779032 59669600 83893547 96681754
40962 96681754 118169810 158308670 205872252 255588258 318605435 396004185 464958869
40955 464958869 505760423 525952642 541816102 547142606 517462078 442442551 342100820
40948 342100820 249775129 184872675 143008862 109630237 80407274 64312093 65796039
40941 65796039 72801997 71235464 64456090 65065126 71141927 67197405 49450072 32702328
40933 32702328 26922944 23444141 12883337 1585610 -1565891 -2063334 -9486600 -19910426
40925 -19910426 -23412387 -21662653 -22219987 -21109928 -9077689 7390491 10932647 922206
40917 922206 -3733242 4642258 9283287 -1632515 -11590985 -1220844 16502631 11931145
40909 11931145 -15006887 -31155199 -17593373 3513929 2247111 -17355953 -26600491
40902 -26600491 -12664704 8124046 14272991 2707299 -11252929 -9180485 12832530
40895 12832530 36106858 35339230 9331011 -14178084 -14381013 -5394940 -12079351 -30086734
40887 -30086734 -34215494 -20615193 -12270593 -19646854 -23112674 -4686557 24616105 41812744
40879 41812744 39573132 25389867 8080243 -3941234 -4272200 1851469 1903739 -3502343
40871 -3502343 -426045 11657323 13455428 -2723294 -16666465 -10996094 2037731 3124319
40863 3124319 -3755615 -5071944 -4599734 -12293023 -20850149 -19071319 -16167940 -25554185
40855 -25554185 -34812416 -21131680 9939468 30170094 28599208 17584678 3892341
40848 3892341 -14574129 -25117577 -8386023 24831287 38177550 20322125 75259
40841 75259 -542662 2681805 -11068744 -32163516 -40373604 -38520784 -41871738 -49012519
40833 -49012519 -47131105 -36986935 -31193265 -32696384 -32838765 -27959252 -22918735 -19262647
40825 -19262647 -12105755 612348 14110408 22646952 24559890 21768273 16788758 9741597
40817 9741597 -584026 -10468622 -11100918 -1460022 4690210 -4181736 -18486539 -19738187
40809 -19738187 -7750282 827315 -1450484 -6743444 -10590512 -15798545 -16748290 -2751555
40801 -2751555 18314193 22488165 3171370 -19041697 -27179308 -26550851 -24793462 -17521137
40793 -17521137 -5034809 556720 -2230391 1231250 11201633 4997788 -22521485 -38263256
40785 -38263256 -16197430 21717315 39239277 37572108 39226786 40410587 21636461
40778 21636461 -5051765 -5217976 20356136 29828944 2676454 -28862516 -28240385 -5397803
40770 -5397803 2981493 -15337640 -38934514 -44545505 -29898670 -9086767 2173836
40763 2173836 -1568924 -10928367 -11064738 581966 10508156 7292685 -1437889 3227181
40755 3227181 27361762 52915003 54544956 28353247 -622131 -5176612 12663008
40748 12663008 25996940 17509201 -3437123 -20489989 -31064449 -38859619 -40401126
40741 -40401126 -32575886 -23565373 -22561552 -25492805 -22566780 -12950956 -1124959 13230586
40733 13230586 29768719 39451548 34137651 18016583 18104 -16300354 -26084128
40726 -26084128 -19572162 1158139 14806165 7023133 -7382547 -6423661 5867797 8547678
40718 8547678 -3060501 -14982868 -18853976 -17532411 -12020139 -3174408 -1040705 -12437962
40710 -12437962 -25408651 -26294053 -24083075 -34598479 -49176890 -46422114 -28542899 -16027585
40702 -16027585 -10814895 1844806 16070045 7215984 -22595975 -37151646 -17529440
40695 -17529440 10797594 18147223 9853981 7277213 13885570 19911492 21775846 19046298
40687 19046298 8059524 -6574938 -9940986 558867 7079416 -1624007 -12750297
40680 -12750297 -12312110 -6820137 -6984689 -8249188 -5113346 -7760504 -24480641 -41368282
40672 -41368282 -39800119 -23370899 -8628369 879835 11950972 21516333 19542559 8493489
40664 8493489 2063291 4786207 6313322 -2961257 -18777408 -25971120 -13003425 11434900
40656 11434900 18503087 -10198426 -51492317 -60211276 -26265605 10781959 16301355
40649 16301355 4894641 9598070 29402666 37187446 26617170 18488888 23381820 27430643
40641 27430643 19194736 6649681 -177201 -4898524 -13508672 -20351296 -15679928 -1201116
40633 -1201116 9753077 7330937 -2009340 -431814 19571002 40814253 38522381 12480615
40625 12480615 -10992899 -13379762 -5043469 -3568872 -6834637 -1622961 12812960 25376680
40617 25376680 29852566 27940538 22088950 15915458 14347494 14773704 8376319 -1881519
40609 -1881519 -53660 14724931 18136635 -3261714 -24522984 -15592886 12523114 24053706
40601 24053706 11760083 2208291 10155144 19246767 13086568 -1812805 -12911771 -19146275
40593 -19146275 -21701805 -15741910 -1582804 10415973 15022424 20101015 32253800 45386543
40585 45386543 49592952 41810730 23805492 194840 -17694812 -17281096 171411 18204204
40577 18204204 23270756 17396122 10876882 10209168 15333133 21748023 23694820 20718545
40569 20718545 20304488 28343547 39744428 44999444 42000431 34550775 25341878 18039220
40561 18039220 17128927 15590787 -4705432 -44614074 -72810443 -61445116 -26705335
40554 -26705335 -7441331 -10461844 -8727889 7483697 14121874 -2891688 -21962394
40547 -21962394 -21727525 -14092279 -18835799 -28311427 -24053088 -12402463 -14675926 -29415502
40539 -29415502 -32074096 -13004262 6647525 2936496 -21953406 -45274368 -48867679
40532 -48867679 -33658071 -14899441 -6948390 -10776031 -16103739 -16194620 -15818186 -20576646
40524 -20576646 -23874630 -13227958 11118959 32113547 34050482 20372441 8684680
40517 8684680 9747631 17298241 20321742 18050891 15275455 8897785 -6334652 -19089201
40509 -19089201 -7444850 27731704 53140542 42306033 10643842 -7632175 -5864341
40502 -5864341 -4264939 -10510350 -10547488 -695113 45287 -19228173 -40915749 -43892433
40494 -43892433 -32408951 -25304389 -28700354 -33865297 -33745837 -28680011 -21161886 -14989279
40486 -14989279 -14720120 -17672394 -11750849 9952854 35686762 44219369 27345424 -847095
40478 -847095 -17125057 -10684248 7264973 16606500 11977242 7641734 14657742 22772225
40470 22772225 16127384 -1228585 -11661354 -11285144 -12709264 -21559760 -29541469 -33087234
40462 -33087234 -39383407 -48193642 -46220325 -28509120 -10021054 -6033836 -13621840 -21416231
40454 -21416231 -25477055 -25766901 -17811907 727594 21392248 31541610 26616202 12673562
40446 12673562 1147185 1003927 9746755 14519172 9945429 8627462 21314164 34800228
40438 34800228 29007257 10151814 2311158 7737646 3494379 -18709145 -37702539 -36055818
40430 -36055818 -21456389 -5244143 13141036 27852817 20964133 -7080727 -26003380
40423 -26003380 -14667769 9244289 17200394 6744562 -8826576 -26437395 -46222734
40416 -46222734 -56566326 -49405411 -36310436 -29782067 -24319384 -14523902 -12515299 -25159896
40408 -25159896 -33450811 -20023170 169614 3124444 -6439350 -7561573 2370306 12856680
40400 12856680 23369018 31927579 19204106 -21260641 -54192203 -44089894 -12088519
40393 -12088519 -7222061 -31023743 -41054360 -26657524 -24856207 -49979253 -62668176
40386 -62668176 -34485488 2158406 2692620 -24167607 -36153498 -20587692 -1877195
40379 -1877195 2297500 -641039 -1650189 -5851081 -19058892 -33476889 -34207702 -16234998
40371 -16234998 7800545 19119105 14684798 11601765 21591542 29701707 14562189 -16134764
40363 -16134764 -32057276 -21532447 -3622464 4101427 6022380 9296733 7701589 -2254360
40355 -2254360 -7720133 2986931 22108018 33944629 33721710 25190550 10773758 -5707187
40347 -5707187 -15872420 -15455954 -9357250 -3277426 1744443 4716838 5323868 9841005
40339 9841005 23385228 36273373 33848238 19802700 10995326 9037959 497283 -11908441
40331 -11908441 -6724824 18231701 34729884 27553890 21626472 42644753 73352981
40324 73352981 77095681 49742844 19785478 6336856 4675029 8369638 18077401 26552882
40316 26552882 18641443 -6409744 -28497762 -29739304 -13863594 2140583 7750382
40309 7750382 6053824 6206903 12484048 20553967 24729026 26422210 29883377 31596259
40301 31596259 24006306 10349221 3258134 5224556 4066946 -6119815 -13655291 -8093056
40293 -8093056 2549866 4991422 889134 1588738 9909529 18066397 18667897 10116858
40285 10116858 -3246644 -11267332 -6207863 5024876 7171351 -1466712 -7261307 -5772706
40277 -5772706 -9889831 -24788210 -34570813 -27700237 -16837870 -15452687 -12088226 9411198
40269 9411198 37082746 43748238 26097169 6806740 131318 -2426147 -10885943 -20443081
40261 -20443081 -21116532 -11082741 2964080 10829023 5117016 -10170394 -20586217 -17400157
40253 -17400157 -7223501 207038 4123652 5401867 770474 -4541910 5968716 33908476
40245 33908476 52033665 37454720 6592144 -6746789 1488146 6961582 -684489
40238 -684489 -6511392 -2224148 -942811 -12267907 -25291251 -26838893 -20089668 -15455840
40230 -15455840 -14911919 -12869368 -4617957 9276476 20725167 18777251 4782654 -3573136
40222 -3573136 4664086 15204347 9551645 -4458327 -5155150 6156524 6997268 -8623655
40214 -8623655 -20966491 -16487995 -4199846 5175344 12510542 16374703 9905517 -216451
40206 -216451 4128278 20866680 22386643 -4251869 -34467237 -40548530 -28624364 -21569755
40198 -21569755 -22187133 -16261165 -1511709 8503412 4811738 -8776623 -23363122 -28275666
40190 -28275666 -13730678 16191460 39272478 37085669 16559449 -962104 -5181739
40183 -5181739 89065 10566021 22739937 27307876 18094954 5410822 4944319 13602441
40175 13602441 11645066 -8558572 -29722638 -31099032 -12459033 9306906 19373804
40168 19373804 14348155 -453495 -13949214 -12545091 9020995 36826437 45599050
40161 45599050 25071431 -4777280 -13825495 2921363 20253820 15738897 -4044175
40154 -4044175 -17765993 -18106257 -13129244 -7086473 3676353 18116249 28662897 32040237
40146 32040237 30204606 22606923 10243929 4092911 13749544 29173750 30226072 13584136
40138 13584136 -6735961 -23271104 -38097372 -42761977 -22267113 14484981 34983741
40131 34983741 25521989 9041046 7351695 11098463 5817944 2733163 17300194 36085972
40123 36085972 35438250 21867919 22776037 40923926 47709736 25569733 -6537479 -18006887
40115 -18006887 -1604232 23139887 32235680 19949846 4760667 9741530 31892264
40108 31892264 41108864 20462921 -5761884 -3538476 21584092 32446885 14451158
40101 14451158 -6977209 -8891341 -3140937 -10647175 -24221344 -19705711 4487539 20929654
40093 20929654 8689715 -19192869 -31112481 -13257880 17379639 35839212 37372091
40086 37372091 36632520 42690150 46226959 35332342 13686913 -5891918 -19173876 -30645604
40078 -30645604 -39194301 -35924624 -18381087 1954782 10868644 5908360 -3274574 -6439467
40070 -6439467 -1791372 5987622 13518224 20211088 21988476 11756996 -7489968 -18235748
40062 -18235748 -8990738 6901990 8797778 349652 2250905 13891193 8951643 -22178316
40054 -22178316 -51439897 -50328699 -27031430 -8609932 -4736914 -8475119 -15804576 -22653448
40046 -22653448 -17388983 1404292 13573957 6532013 380484 17230359 40333240
40039 40333240 36585334 9741436 -5226588 2767856 8833770 -2091548 -13487309
40032 -13487309 -10286028 -1588826 2033465 6301767 14955669 18282280 13554869 14530089
40024 14530089 26607935 33262118 21758547 3694277 -4314597 -2856894 1236357 10362456
40016 10362456 24811497 31461300 20715175 3017036 -6110873 -6424047 -5303370 -2125999
40008 -2125999 4814246 6748851 -3573638 -15635620 -12911677 2776677 12465682 4963791
40000 4963791 -9993608 -15592596 -9233844 -5657584 -16292553 -28028568 -14852507 22878615
39992 22878615 47550718 30540247 -5651201 -18319103 -6165226 -4333802 -22162304
39985 -22162304 -28962205 -10115149 5738464 -5226422 -24312630 -25326605 -15012338
39978 -15012338 -11446475 -11225275 -7677066 -14979464 -41084828 -59338211 -42545635 -7910676
39970 -7910676 6881126 -1949951 -8200651 -1721462 4461370 4671903 5282223 4977156
39962 4977156 -620343 -2846112 3487320 -110745 -27592060 -53743363 -45492865 -16379859
39954 -16379859 -7407126 -21193858 -21777301 1722224 20155674 18249573 15208733 20352770
39946 20352770 14778851 -6104605 -15267714 36928 14380855 8096831 -2151407
39939 -2151407 56390 613460 -12213733 -19701629 -7613006 2942292 -7795332 -20212882
39931 -20212882 -9048715 12016048 17643316 18221818 37093801 59454711 51234133 19292892
39923 19292892 5733732 22818894 36848902 23207952 -247944 -6112215 6088950
39916 6088950 18348254 16537992 -4097838 -35778993 -54997321 -42439443 -10727006
39909 -10727006 7313170 1415488 -6057166 3451064 21123223 30715342 29994614 22464156
39901 22464156 7850376 -7174783 -6349333 14163577 34118943 32474026 12864752
39894 12864752 -4108481 -5069229 8155703 25801020 36790444 34908455 24938106 17213103
39886 17213103 13598875 7041388 -3789816 -11024982 -11651124 -12284728 -15099947 -11621852
39878 -11621852 3010738 20708564 31516772 33856829 29271666 18812051 9344853
39871 9344853 10237030 18113345 18786685 10098587 6658307 14278338 18192763 8133089
39863 8133089 -3927950 -6488003 -10115597 -25959226 -39296912 -30099203 -8625573 -2533033
39855 -2533033 -14349466 -20304364 -10493621 -1558206 -4801446 -8565956 -2256710 4786087
39847 4786087 1321106 -6687022 -8293151 -4823985 -2361563 1037449 8146154 12030792
39839 12030792 4349133 -12178721 -27385863 -33027771 -24694483 -5818204 5754801
39832 5754801 -8791780 -40228909 -52772162 -28096322 8180299 20666841 9346514
39825 9346514 -233366 2086570 6167028 8590207 15224777 19620060 8424964 -9746977
39817 -9746977 -10254345 7030844 12943381 -4657319 -19811565 -10832166 4133127 -2076797
39809 -2076797 -21915949 -29049435 -21774881 -18804454 -20804432 -9213311 17397404 36419188
39801 36419188 35903277 29513411 28165238 21061597 -1221176 -23948174 -25933031 -8862452
39793 -8862452 6631958 8151628 2588988 3617832 17135792 36510034 46362508 34998453
39785 34998453 8489931 -11739895 -10464730 5965218 19597673 21084474 15098861
39778 15098861 10680707 12723501 20717477 30429480 36831740 37392972 31776014 19296276
39770 19296276 1047320 -15457344 -19904898 -10096455 4650539 12444437 7861043 -6918592
39762 -6918592 -24124307 -33804035 -31731473 -24224842 -19559287 -17068766 -13006951 -13017985
39754 -13017985 -24641113 -38325228 -33965374 -11594902 2465974 -8881794 -27039745
39747 -27039745 -22251973 5183285 25530877 18431720 -3649458 -12880846 2099866
39740 2099866 25413394 32463172 17872860 1829636 4146354 18149026 23526057 20977905
39732 20977905 31660767 57108095 65400493 34224259 -12205847 -31739942 -16887622
39725 -16887622 3978862 8528848 -504376 -12845248 -22791825 -24133207 -14237884 -4503848
39717 -4503848 -8308999 -18652142 -16836119 -2876508 4408128 -746903 -3048198 4075434
39709 4075434 5248399 -8451580 -19831489 -11298469 6333121 9969534 -1808073 -10511689
39701 -10511689 -7772788 -4602459 -10205240 -17066193 -12741016 2308009 14998310 14900136
39693 14900136 5215882 -1756130 1672411 11355682 17462348 14412891 3871566 -7091043
39685 -7091043 -8976606 1690449 13615109 10768475 -2923518 -3257049 18022330 33409122
39677 33409122 17280695 -10760860 -10664883 16198275 26287897 63906 -27756681
39670 -27756681 -20736309 7627925 19643033 8579773 -505538 6843576 18224489
39663 18224489 17421852 3766237 -11460724 -15333878 -2428740 17071200 23735369 11439020
39655 11439020 -4161465 -7102883 -85643 6603551 11157175 13481979 7488829 -4688517
39647 -4688517 -5694559 11787829 27318998 21286315 7064756 9327347 22521574 21362271
39639 21362271 5209122 -2000840 4940862 4712853 -8738225 -11111670 11198528 34485887
39631 34485887 31798164 11073527 -1595970 519980 4999432 5032592 3254432 -1013493
39623 -1013493 -10227997 -19682105 -24556971 -30027254 -41189858 -49963055 -46264424 -35797004
39615 -35797004 -31588501 -33241458 -30389884 -21996766 -14550792 -4360663 17472309 41123796
39607 41123796 41907886 17052787 -1440985 13613074 45936577 55850436 32235442
39600 32235442 4117969 -587461 11098632 13893623 1712565 -6459053 4799920
39593 4799920 26186272 35718736 24436154 3606406 -10357018 -11231132 -3278036 6741841
39585 6741841 13575698 13643174 7434810 1224692 1139215 5132350 6249604 4529881 7858093
39576 7858093 17146455 19691652 6212238 -12528895 -18700615 -12677780 -9669825 -12334572
39568 -12334572 -6451618 11116896 21585446 14042903 6569408 18494414 37651107
39561 37651107 40009983 30762263 36097403 57653046 66761393 48753079 23478381 11440841
39553 11440841 6549601 -2476889 -7863782 79230 10035026 5576278 -8448806 -15278336
39545 -15278336 -12676190 -12050307 -18294849 -25857239 -28590596 -21965982 -4805734 10794120
39537 10794120 5185701 -20228992 -36844914 -27843368 -14271214 -20134585 -31613859
39530 -31613859 -21551130 1633866 6809741 -7006583 -11028390 1387222 4383465
39523 4383465 -12498801 -25515065 -18626256 -8310429 -9531769 -10051259 94164 3583156
39515 3583156 -13363551 -29382274 -16727392 14912604 32159236 24872100 12703360
39508 12703360 11200347 16143938 19913655 21977762 20290692 7679438 -17909084 -46006120
39500 -46006120 -58444257 -42764075 -8003465 14489151 1045747 -31339522 -41171846
39493 -41171846 -16951681 8243709 7409891 -2875009 4351016 22244102 28055457 24219996
39485 24219996 27160462 29572962 11937942 -15183750 -19377860 2264121 16925689
39478 16925689 7496060 -4492751 1180787 12063226 8036716 -8098441 -22867833
39471 -22867833 -33436850 -38456617 -26281327 7659024 44883130 62984333 60394719
39464 60394719 48071860 29248246 3788942 -18551973 -27185853 -25352571 -20388731
39457 -20388731 -8503975 13458875 30067988 22700516 -830075 -13526268 -6318583
39450 -6318583 2383235 -2911337 -15038531 -21821716 -24808319 -28915227 -28279092 -17108944
39442 -17108944 -4800153 -4635279 -12738327 -13644876 -5162470 -2170828 -12375931 -22122762
39434 -22122762 -15023378 3992770 14166483 5764276 -7931395 -6700952 14631766
39427 14631766 42033794 55677416 46090729 21297628 406514 -2896786 7279511
39420 7279511 15277113 13043112 8386565 11568567 19298091 18679760 4952991 -11728132
39412 -11728132 -18375934 -13241204 -5781204 -5143129 -10213150 -10773615 8121 13444066
39404 13444066 10647654 -14441362 -41525172 -43451318 -19433879 2446155 491107
39397 491107 -13976903 -14889761 2324229 17649033 17177620 10122602 10124947 14229552 11610662
39388 11610662 3441921 -290178 657329 -3223111 -12147572 -13059102 -180833 13043405
39380 13043405 11359746 -2210190 -13631832 -17927731 -20428103 -22617141 -19668635 -11597709
39372 -11597709 -5229404 -2808796 1878778 12221783 20446430 14940399 -6891228 -34020287
39364 -34020287 -47844882 -35813109 -4490299 23665778 32956496 30445171 31848548
39357 31848548 37316218 34352524 21508780 11757128 9629563 2349825 -18253018 -39247683
39349 -39247683 -42953149 -29856961 -14398698 -5114299 564740 6182952 9987998 7360166
39341 7360166 -4683689 -22614741 -35195823 -33896245 -25560689 -25474439 -35909676 -42715211
39333 -42715211 -36221890 -22497094 -9232709 4512254 17045139 18688318 9301554
39326 9301554 6702425 23330441 45989859 53068335 41853110 25302633 12422401
39319 12422401 5933012 7777698 11108871 -818168 -28888881 -43413275 -18658039
39312 -18658039 26080075 45598963 25844142 -2883768 -9511502 5352632 23865029
39305 23865029 35018183 36494492 29637471 20638842 15850059 13191138 8056920 4880380
39297 4880380 9434151 14508475 10394593 4610725 10780791 22413751 21702361 11235989
39289 11235989 8984242 12073629 -1906368 -31613393 -44288896 -24862434 -678416
39282 -678416 1762694 -4585327 3729242 18136523 14213439 -6137796 -18658463 -14245973
39274 -14245973 -6443207 -5930214 -9306555 -10775894 -7611440 2909734 17604903 23832681
39266 23832681 16067655 9288047 20360349 42132081 51859465 40425936 18119510
39259 18119510 -3411496 -19226771 -25365116 -20841181 -13337744 -10257214 -7864670 -960052
39251 -960052 3601782 -2629751 -13014173 -16244000 -16619182 -24538484 -32047375 -20865089
39243 -20865089 5249175 19147649 6456538 -16390236 -26989290 -22415020 -11922169
39236 -11922169 -746093 7634991 6128681 -5628077 -13120615 -1833946 22232784
39229 22232784 36339889 25786193 -251048 -18593986 -15590679 266086 9624502
39222 9624502 4734105 -4054550 -5304812 -2142136 -4504075 -12137276 -14993307 -8057207
39214 -8057207 2917728 9433248 7007950 -4245133 -18459383 -24574474 -14809608 7412225
39206 7412225 31273920 46904809 47001881 28058021 -2221161 -25192495 -28491022 -19005331
39198 -19005331 -11436843 -10115802 -10506007 -11109799 -12621948 -11143631 -3590495 5043497
39190 5043497 9443248 11933513 13024554 4731510 -13247826 -22720616 -10446939 8418004
39182 8418004 11543964 3874781 5250188 12148545 3881085 -14892733 -13382041 16113167
39174 16113167 41391493 36940904 18479851 12847757 18487295 18092686 11242708 10038082
39166 10038082 14184101 12654476 3615805 -4641022 -7227278 -3628591 7920389 24245708
39158 24245708 32692244 25584543 12978087 9581852 15422967 19919274 17832108 10725018
39150 10725018 240668 -9632854 -11441814 -5303641 -2138732 -6141931 -5278695 8791233
39142 8791233 23667530 24272203 16429976 14674602 16850944 11560559 3105417 5570879
39134 5570879 15267385 12819082 -5964512 -23097257 -25881805 -20932942 -15345418 -4121000
39126 -4121000 14226777 27148730 25678257 19520404 21818601 29031282 29090312 21986957
39118 21986957 18051377 19301736 16526451 6154561 -1774364 2121933 12069689 14646328
39110 14646328 7516532 1935230 5334961 10317668 7432588 2028445 7347048 23383004
39102 23383004 35409210 34837037 28488646 23389581 16448798 6454760 2250679 8159253
39094 8159253 13697363 10351735 6542782 10876094 12512420 -2060668 -21517151 -22113611
39086 -22113611 -3945250 9005606 5719540 1177170 7084170 12067924 2106733 -16516291
39078 -16516291 -27456252 -25811849 -18484979 -11982267 -8832800 -9046625 -8563711 -2558691
39070 -2558691 6350616 10927937 11159000 12072746 9453562 -6328584 -28784979 -36312827
39062 -36312827 -23040426 -10099048 -13609451 -18964189 -4377919 23540064 38102741
39055 38102741 28825757 10323740 -1243402 -3747653 -2414874 -1409154 -2153824 -1182911
39047 -1182911 6959018 17733009 16722081 2280107 -4046134 13964236 39703624 46138472
39039 46138472 36580813 36550082 49310161 50305121 29354268 7272180 -272581 -6192030
39031 -6192030 -22364895 -33217845 -22871120 -8099827 -15217343 -36354804 -39085034
39024 -39085034 -15070507 10239270 18442567 21085236 32660560 43660862 35650810
39017 35650810 9114565 -18042525 -31162796 -26898924 -8954003 11895254 18922941
39010 18922941 3448399 -22905004 -38905786 -36217265 -24164935 -13953317 -7130200
39003 -7130200 -295971 7498406 15416769 22824865 27401032 26322928 22329101 23178177
38995 23178177 30627921 34834114 26240577 10428458 3630484 12873991 26780296 28530890
38987 28530890 13965958 -5225497 -12970284 -2314533 17794476 26987128 10446242
38980 10446242 -23740609 -48687505 -46196449 -26597397 -14457327 -18588287 -26358453
38973 -26358453 -25855822 -20275527 -16890908 -14681422 -10627264 -7778708 -7598906 -3867644
38965 -3867644 4117856 1742905 -21013581 -46111608 -44841760 -18714991 -639133 -8933000
38957 -8933000 -22557545 -15685434 3277137 8429591 -1912733 -6671705 216776 1179125
38949 1179125 -12817402 -27509695 -32752495 -41323219 -63112989 -78381700 -60255387
38942 -60255387 -15916689 18262903 22650819 14278789 15364109 21207724 13271746 -7024575
38934 -7024575 -15543329 2931957 33098175 46038044 32391424 11035242 4665578
38927 4665578 13910844 21102739 15343872 3899667 -2534222 -4538000 -6241584 -2087849
38919 -2087849 15401900 37972145 46281815 34356010 17049026 9190740 9391078 10727317
38911 10727317 14737299 23598733 28342902 19871422 6946886 7581173 22913477 34597530
38903 34597530 31217808 23234788 24845384 32904933 34298852 26593564 19465850 18289992
38895 18289992 16768454 6758530 -11594068 -30473563 -39897846 -32932996 -12008249
38888 -12008249 8434003 11866366 -3717809 -22260747 -25642128 -10854245 10513738
38881 10513738 25582451 28447747 18761007 492701 -16004279 -18497786 -6402545
38874 -6402545 3922940 -3769014 -23252866 -30295936 -13661174 7909929 8662331 -11119776
38866 -11119776 -27203145 -23037446 -5084660 13266854 26557239 30776787 18586701
38859 18586701 -7459796 -29167512 -33583148 -30227783 -33548795 -37530848 -25814215 -1361015
38851 -1361015 14421170 11603140 1590900 -4392119 -7260474 -6681737 4032310 21499146
38843 21499146 28724774 18023810 1626984 -9953883 -22416482 -38788879 -45852966
38836 -45852966 -37226416 -32309298 -49223546 -71782803 -68802614 -38263165 -6904852
38829 -6904852 8664893 14165317 14135224 4815547 -7514952 -8957694 -4082352 -12392807
38821 -12392807 -31318973 -32167179 -6567955 12110654 -4833593 -37451159 -45565596
38814 -45565596 -23669605 429268 9529588 10072361 7402389 -2252487 -14004302 -14696706
38806 -14696706 -6289947 -6531213 -19318110 -25165056 -11667076 4614806 1421791 -16202477
38798 -16202477 -22481807 -5477142 18991870 28376615 18568759 4828540 2769085 12769934
38790 12769934 22926386 23984303 17522629 10081895 5575064 6381572 14836864 27005415
38782 27005415 30648760 18273982 -1047174 -11602990 -10096988 -5759548 -4221649 -2344992
38774 -2344992 1353506 2333717 -2005975 -8864523 -15449118 -19238740 -13528405 6029067
38766 6029067 29501153 39658970 33926596 27198293 28602186 28526960 15931284 -3634167
38758 -3634167 -17505307 -24294263 -31604622 -41109283 -46341169 -42433462 -30236354 -13426694
38750 -13426694 2243028 9965611 7793753 668068 -7073372 -15924659 -23762570 -21698143
38742 -21698143 -5267445 15371718 24917037 20045758 10736200 7341552 11813994 18476618
38734 18476618 18524867 7468253 -7810914 -14511962 -9961323 -4380939 -2889699 3873542
38726 3873542 21026908 32233834 17399202 -16821586 -39977137 -31787335 -1952858
38719 -1952858 23565418 26329186 7343593 -14697066 -19014829 -5540945 2664787 -10022703
38711 -10022703 -27738554 -26510981 -13269014 -16452899 -39089050 -49941268 -29232726
38704 -29232726 3464718 20808569 23472611 25903664 26828826 17970329 8535657 15218920
38696 15218920 34107756 45590600 43756979 39213393 34643139 20755610 -393305
38689 -393305 -9974297 1168908 17130691 17752304 2886252 -12611289 -18086121 -13263097
38681 -13263097 -3652421 2504630 -866064 -9601823 -11734525 -2474083 9542424 14864333
38673 14864333 14667270 14939675 16917235 19088481 21974785 25139797 25581403 23820254
38665 23820254 24023615 22973337 8825439 -20571208 -47573317 -54607535 -46650090 -40350328
38657 -40350328 -37085706 -24667908 -4565135 3187188 -10063478 -23701836 -14504027
38650 -14504027 8249613 11911438 -15516653 -46258712 -45472622 -13110620 19256560
38643 19256560 29764283 28415592 32424594 35751300 21406283 -3021244 -7016588 19373271
38635 19373271 45790907 40545726 12614026 -6042477 -8538803 -16914906 -40424705
38628 -40424705 -58120526 -51188681 -29252108 -10348222 6812332 31617654 54571486
38621 54571486 54065615 28600018 3542994 715040 13350407 17934521 3614696 -17396168
38613 -17396168 -26504489 -20345105 -13786959 -22517342 -45109719 -64244510 -63888569 -42070732
38605 -42070732 -9119999 20283415 33824937 28798668 15870072 9473364 11758676
38598 11758676 12079529 4032156 -5399302 -7084433 -1117385 8013837 18540190 27417931
38590 27417931 28405427 22116597 19641852 27187157 34517691 27883984 7719348 -14781370
38582 -14781370 -30586861 -34030919 -22151352 -4268913 -360525 -15254842 -26330162
38575 -26330162 -14297945 6750461 12529661 8950245 19143423 38251192 38134061 17739387
38567 17739387 8605555 19736368 17608828 -17008789 -48583523 -35743038 4939136
38560 4939136 20975922 -4540946 -38755326 -49464262 -36918802 -16101565 3301726
38553 3301726 14238100 11951669 2235271 -5079847 -11390430 -23272101 -34507800 -32579127
38545 -32579127 -20714160 -13659667 -13182835 -9282101 -5014714 -15352622 -37578572 -47753813
38537 -47753813 -34852076 -15894451 -7294447 -3048784 5841947 10879025 2006610 -11252753
38529 -11252753 -11960387 1220618 17374570 30334655 39310051 40811478 32296073 18488891
38521 18488891 6496619 1200021 8023175 26932278 40414423 27099990 -4400821
38514 -4400821 -17937371 205634 18190636 6137454 -17546676 -17058379 2754277
38507 2754277 6439745 -13392826 -26638206 -15268349 4025720 13433686 17342737 20643684
38499 20643684 12930624 -9567678 -28698159 -27102959 -9530908 9903791 23842215
38492 23842215 25173370 6433902 -19794416 -22202463 7263143 31609832 13306108
38485 13306108 -33272678 -60256532 -48276213 -22174720 -7657709 -1139284 10655206
38478 10655206 25043499 31176617 29174183 27136369 25534545 16567393 -1690273 -18748363
38470 -18748363 -22684442 -14758171 -8464998 -12455573 -19330699 -17575155 -10514057 -11993016
38462 -11993016 -23327534 -28918729 -20056451 -8946377 -9549514 -16818860 -17395710 -11135621
38454 -11135621 -8119342 -11488703 -17262837 -25728912 -39090186 -51615970 -55027000 -50469284
38446 -50469284 -43744418 -33490709 -16637124 -577252 3824664 -2592061 -11557926 -20429981
38438 -20429981 -26933717 -20070368 3827594 23059923 12657251 -18287706 -36409540
38431 -36409540 -30635279 -21835152 -23525850 -23319788 -12865682 -6706898 -15472655 -25111192
38423 -25111192 -20742417 -9968598 -4793872 -1234114 4031739 -1748164 -22825926 -34440615
38415 -34440615 -14334496 19883798 33154130 21279653 8362079 6141096 7065315
38408 7065315 11050140 25228826 38094509 27579995 -1035494 -16758498 -8767974
38401 -8767974 357260 -3674606 -4235737 11729788 26493274 20504342 4887996 1414052
38393 1414052 8720090 12569919 14513841 25090059 39211504 42832646 36791457 31299268
38385 31299268 23567194 5219736 -12247179 -5819736 23340286 46555359 45658880 33322043
38377 33322043 27682351 26440633 18377227 5470656 -1281965 275223 2590079 1136476
38369 1136476 -1838155 -4192900 -7160902 -11908034 -16688318 -17823362 -13707791 -9006025
38361 -9006025 -11301467 -19115379 -18905543 -3257794 13293213 10833259 -6481925 -16334420
38353 -16334420 -15102215 -25513105 -56786531 -79582499 -61443373 -13063762 24475070
38346 24475070 31695369 26238735 27811052 31332415 21831729 -1152356 -23551879 -31423274
38338 -31423274 -20132934 2903777 21892899 27271096 26803176 32168655 37214510 26038110
38330 26038110 3463602 -3400533 17656873 43861220 46804801 26290240 1611191
38323 1611191 -15424372 -21941660 -12352957 13262144 36801652 38873288 24005205 11485509
38315 11485509 6440988 -88888 -6697097 -786360 16731834 28202009 25175212 18075342
38307 18075342 15388507 12723629 8260053 9125512 14664879 12846088 2345038 -1612213
38299 -1612213 5736937 6610694 -9841904 -25908321 -21622940 -5532551 1539564 -1359130
38291 -1359130 -2119253 -1638427 -7078297 -8015281 11660631 40110566 44295967 15338872
38283 15338872 -16456486 -19915375 2526841 26985488 38197389 36835712 28565416
38276 28565416 17177544 4586672 -7569312 -15102521 -13105048 -5764402 -7259714 -22450225
38268 -22450225 -34746190 -28636434 -16816815 -23884039 -46755006 -56251748 -40449332
38261 -40449332 -21165287 -19452398 -27947231 -29180463 -21006172 -9963824 3247311 16897571
38253 16897571 21706283 15819813 13071624 22230108 31254992 27159722 18177155 18629038
38245 18629038 23402070 17658992 4189442 254556 10398815 21168378 22471025 18275129
38237 18275129 15457659 15488808 17948499 21059596 19174198 10307026 4641057 14191803
38229 14191803 34728767 48759748 46085306 31423763 12732715 -6914600 -24788307
38222 -24788307 -35374639 -34409906 -21531463 -1008922 15227835 11348032 -16001869
38215 -16001869 -49006470 -66165170 -65200976 -59446050 -56534149 -52665141 -44667636 -34847118
38207 -34847118 -24630533 -14165948 -6998216 -5535967 -4722568 -36581 2759298 -3006703
38199 -3006703 -11576070 -13791344 -12748991 -14957363 -13509790 177739 14529495 12213682
38191 12213682 2823915 12417903 38630677 47641279 24742525 -3161677 -10594333 -9178827
38183 -9178827 -18343621 -26617283 -11505913 19260438 36908675 32535351 21306613 12586777
38175 12586777 2921168 -5040265 -3736297 -752185 -11796478 -30979896 -33556949 -14361430
38167 -14361430 1480667 -3128584 -11252280 -140917 22662371 30807913 15382054
38160 15382054 -9398461 -30186555 -45701841 -55556387 -54563820 -41833456 -24545716
38153 -24545716 -8981491 4260122 13658575 13842275 4264233 -5177494 -3701266 7317425
38145 7317425 16150886 15306783 9871419 9827845 17516740 25959345 27785024 21348419 8162670
38136 8162670 -9533408 -25133809 -27480777 -12221349 8429515 15675631 4959438
38129 4959438 -10825747 -20432900 -26361813 -32033464 -28055345 -5349436 22545164 27801559
38121 27801559 3485917 -24069541 -27707430 -12937440 -4958227 -9784686 -8096576 10530932
38113 10530932 27463959 20711862 -3133964 -18865388 -17081555 -10944348 -10856718 -11261864
38105 -11261864 -6709376 -3841624 -8203096 -12762167 -11162988 -11341790 -22299601 -36054064
38097 -36054064 -38415786 -31325944 -26582751 -21278763 -1111172 29898029 45791270 33784952
38089 33784952 13132643 6237327 9179596 7733000 5604714 13270281 20354039 7241706
38081 7241706 -19479156 -31512337 -20892686 -9580469 -10051838 -5055692 18443294 40808320
38073 40808320 36946278 13105891 -6795966 -16484687 -23817906 -24414842 -8113868 13983659
38065 13983659 18566857 6216349 1041617 12073642 22724205 23862241 28256572 41376480
38057 41376480 46129524 33332999 22477011 31279073 45334171 41722845 26078188
38050 26078188 20249948 25543770 26003898 20911332 25272975 38912038 41990374 26097789
38042 26097789 7527141 2319974 6139054 7028315 3326900 41455 -1770457 -4317344
38034 -4317344 -9129913 -17810705 -29448978 -35914946 -29127049 -14740319 -8291775 -14745463
38026 -14745463 -21587713 -15725035 1719751 20836205 34254465 38805557 33596757 21756446
38018 21756446 10086723 4388655 7170469 17236032 26341373 21349654 -177683 -19539760
38010 -19539760 -14391974 12845260 35158310 31215404 6075609 -19452656 -30730824
38003 -30730824 -28367065 -22625728 -21137167 -20357697 -13534753 -7941907 -19708797 -42889795
37995 -42889795 -43382226 -4130713 40692666 45897791 18105508 3281199 17132717
37988 17132717 29150858 20294810 12826152 25805142 39822300 31892936 15297903
37981 15297903 15941356 31342320 40508320 36578812 24432823 2976159 -24452409 -37359571
37973 -37359571 -22123388 3488356 13813439 10431001 9931763 11364615 3924215 -5238977
37965 -5238977 -1595619 6640789 -339273 -17902124 -22113400 -7978532 6359236 11560470
37957 11560470 14260125 13731320 2355176 -8646637 4263717 37598016 57223114
37950 57223114 44544276 20882270 14103596 23749649 32767107 34746564 34472586 33750414
37942 33750414 28557417 14120099 -9788167 -31171772 -29170954 -287879 26015262
37935 26015262 19740909 -7510742 -19236979 -7957008 361568 -4976996 -5259601 5197005
37927 5197005 3200595 -19335225 -33025525 -16492848 8324000 13179725 6273004 7904227
37919 7904227 10609121 -983152 -12160684 616808 24141988 23739600 -2037600 -18920872
37911 -18920872 -8254156 12414407 22071726 19098469 7053390 -13960706 -34036897
37904 -34036897 -35991746 -20388100 -8236936 -10974535 -15973022 -9083820 6230335 20321960
37896 20321960 31342149 38841263 38186555 31051124 28988550 37112396 44926349 42183394
37888 42183394 33884447 30336430 30981075 27869871 18844341 8174637 -1067902 -6846440
37880 -6846440 -4372885 8409698 22911274 26063299 15923930 3962411 -2118026 -11338905
37872 -11338905 -36238197 -68629933 -81652584 -62698956 -32778468 -20120924 -23374336
37865 -23374336 -19667241 -4016611 4499354 -1245686 -2000712 13856637 26929325 16550984
37857 16550984 -6119559 -16603604 -12347239 -6711712 -2958337 496020 -7261006 -32644560
37849 -32644560 -53641466 -44063289 -14679870 1996150 2001429 8664379 23584920 20719933
37841 20719933 -4183418 -20576041 -14195768 -11063468 -28997982 -42845695 -27721418
37834 -27721418 -5384310 -11259555 -37082427 -44438549 -23213954 -1046817 154123
37827 154123 -13641368 -27723730 -33377611 -24659108 -4022503 10270189 4294207 -7010013
37819 -7010013 1054948 22294542 25436762 2232841 -18835750 -14784287 2256225 10182478
37811 10182478 8647458 8890132 9929562 4625810 -1701702 2256047 14409487 22469420
37803 22469420 23247302 24077100 26076479 20581975 5768044 -5097131 331271 15881790
37795 15881790 24285053 20301327 16950501 25053325 34915260 28518641 7153418 -6342713
37787 -6342713 2748618 20793466 24254858 9751309 -5838246 -9570308 -3438076 6512394
37779 6512394 17848814 25922124 22124133 4354535 -16318626 -23860262 -10818500 14729169
37771 14729169 32540475 25214489 -3179841 -27538084 -28614340 -14276373 -4392168
37764 -4392168 -2405935 2213721 9176420 7014645 -1906476 391621 17367146 28442417
37756 28442417 20834093 9363817 8743069 6894731 -11392143 -30583500 -23077995 6246684
37748 6246684 24803840 21288162 18904394 31770141 38254249 16953689 -13017515 -14422520
37740 -14422520 15265350 39901634 33345064 8813236 -7018698 -9156035 -9504081 -10661346
37732 -10661346 -4349017 7239648 8186170 -6882618 -19825590 -11391607 12386285 28937652
37724 28937652 28854821 21996691 15351730 2519667 -18048755 -29587169 -15613093 15269967
37716 15269967 36864460 35414022 20628766 7499725 -736763 -8058487 -14102615 -14332091
37708 -14332091 -7570457 2103898 9750538 13483518 15440898 19550854 25910549 27610796
37700 27610796 17731883 610852 -9609769 -5321769 4768393 7804454 4336538 4890049
37692 4890049 10362803 7756578 -9117187 -25215413 -22344204 -6240775 -408671 -12637688
37684 -12637688 -24879709 -23529601 -21909191 -36278354 -53089841 -44944992 -15425635
37677 -15425635 -611239 -19151344 -45339786 -45861170 -23136034 -3078193 4827453
37670 4827453 11941999 23726557 32737287 35909477 37062703 32505111 16014447 1692
37662 1692 7514277 35209389 47581467 22412222 -17088769 -33417096 -22919972 -11772482
37654 -11772482 -14322715 -19792462 -17720121 -12866092 -10192122 -4475595 6588508 13892351
37646 13892351 11758261 9927713 19287561 33388647 36080485 23488434 7644829 221521
37638 221521 2398817 9894248 17741674 18782739 7921765 -7318642 -9162289 10029997
37630 10029997 35126307 43806978 31535231 13505070 4624583 6828902 15269045 25673941
37622 25673941 31728349 24949763 4529156 -18405004 -32829241 -39314020 -43091103 -40972548
37614 -40972548 -24777801 3229430 26661127 28959503 7888250 -22776540 -43197235
37607 -43197235 -42947688 -31238658 -27276627 -35288396 -36571634 -15760041 13177473 22662609
37599 22662609 8843803 -5795586 -7464799 -7279869 -15859269 -23108195 -16890115 -4178987
37591 -4178987 3762388 12552364 29721713 39863981 21390254 -15225764 -33767336
37584 -33767336 -21497818 -6212542 -13260055 -29346426 -27651709 -10817207 -4153028
37577 -4153028 -14656788 -22465672 -13164851 4360764 17780890 28278251 36733404 30389837
37569 30389837 396622 -36877334 -53622828 -42343679 -19472052 -318313 13464268
37562 13464268 21690683 19586432 10643390 9989991 24186074 38600674 35901463 18239225
37554 18239225 -46764 -13090341 -23352606 -27816992 -20871449 -8883182 -5790462
37547 -5790462 -12210398 -12606028 2738934 23838382 33608472 26306711 10314345 -797455
37539 -797455 1032096 9939306 9852942 -5104874 -17611598 -6914290 21547510 42460350
37531 42460350 45158564 41468668 36791941 18759572 -13168597 -30427227 -9445010
37524 -9445010 30998140 49390781 31971929 3635879 -8210702 -1792639 7783846
37517 7783846 9469605 3809966 -1270048 821539 6705772 5557209 -5440555 -14750888
37509 -14750888 -12656311 -5456086 -3188312 -1715649 8640432 22440725 23502987 8288109
37501 8288109 -9898874 -19813196 -21538814 -16791316 -4768941 9081885 13084598 3655490
37493 3655490 -9020200 -13492911 -8520271 -399551 4547430 4238904 3417279 10023633
37485 10023633 22239607 24080521 5125506 -19373685 -23234673 -4271207 11353135
37478 11353135 3762567 -16336090 -25607185 -18235222 -7252963 -2635190 225633 10050580
37470 10050580 25219576 34253093 30230352 20785041 18868434 24866181 26140036 16224308
37462 16224308 4236786 -14308 669959 397294 1784862 7666895 12064371 11133967
37454 11133967 11696464 16016629 12135506 -3845556 -11829716 2468675 16383686 -561249
37446 -561249 -35863440 -47433740 -24912871 -819549 2706318 397097 6884259 9915838
37438 9915838 -1783489 -14996525 -16796928 -16159770 -19965084 -13082194 13239959 35516383
37430 35516383 28251747 3571148 -6860139 2361708 9267302 1644683 -9537360 -11321116
37422 -11321116 -4050902 3777906 3568158 -6663234 -15928573 -10556263 2537002 387472
37414 387472 -17522306 -18868575 13718954 48269001 45903497 18914116 11160921 32040692
37406 32040692 49085222 43753270 34772327 38351981 40953430 27795032 10776349 7676191
37398 7676191 12334520 6379253 -10314240 -20194308 -15090358 -6568864 -6705085 -9482797
37390 -9482797 255311 21809747 33251522 18446480 -8667820 -21814537 -20100207
37383 -20100207 -25523601 -40234266 -35487514 1488225 37483009 35856717 7330008
37376 7330008 -12429842 -17891624 -28763333 -41437757 -29959448 2246439 14566591
37369 14566591 -12671810 -46896060 -49355583 -25301126 -6722478 -6184224 -11557435 -13415192
37361 -13415192 -14484509 -16514071 -15551769 -10747139 -7308755 -9492491 -15446089 -19017284
37353 -19017284 -15687185 -7845724 -1737101 3002738 13617308 28367000 31444600 15767095
37345 15767095 -328957 3269470 17461786 18540231 7265806 7173008 24557851 36856330
37337 36856330 26017889 692724 -20706628 -28790511 -20964011 -1712606 10668066
37330 10668066 -263104 -22303888 -26628579 -10225676 908740 -3250807 -1162830
37323 -1162830 17252967 24966229 -1387639 -40624461 -53604911 -33393306 -5013321
37316 -5013321 10729651 11576903 4601031 2436849 17214788 41652137 50074852 34013653
37308 34013653 18476525 23352409 29765783 12090586 -14858109 -15043677 12327869 31576890
37300 31576890 24456617 11757349 15528449 28462148 31680829 22035413 10364524 6281041
37292 6281041 12181539 21963032 22551734 7167193 -12263152 -16968200 -4421206 12638975
37284 12638975 27113038 41180586 50079591 41595552 16932789 -4013251 -6110255
37277 -6110255 3882652 10433592 9200443 6094795 3852481 -1631439 -12912062 -23728200
37269 -23728200 -22458623 -4846936 17853224 29810788 30328729 32475023 39333438 37129193
37261 37129193 21107886 10479707 20202258 33460222 26610753 10666174 17577971
37254 17577971 47791018 63986561 44198243 11672713 -2179206 617593 -253375
37247 -253375 -6001110 -1486827 13572892 20565912 10165499 -3385341 -1869022 13881893
37239 13881893 26922709 24718424 11472165 1567689 4035981 14391409 20911962 17220552
37231 17220552 7656164 1594031 3935155 10152863 10165938 -602889 -13992443 -17509671
37223 -17509671 -10798746 -6877249 -14211208 -25935253 -32102686 -33443507 -34792516 -33708497
37215 -33708497 -26570695 -18723993 -16206335 -13560736 -3609285 5930937 1529752 -13209961
37207 -13209961 -20397581 -13519449 -3978757 -641852 605352 3357423 2923107 -1967723
37199 -1967723 -3894234 144936 3109752 1682057 2429391 6909189 4473692 -9702129
37191 -9702129 -21302433 -13868535 9159005 30209713 38000326 32748739 20051555 10806044
37183 10806044 17805102 38084472 46699511 25499304 -7340795 -17216149 -1659071
37176 -1659071 4428780 -21066261 -54751627 -60449530 -37356535 -14811543 -9513954 -11831697
37168 -11831697 -11739658 -13536456 -19451412 -20542936 -14808684 -16473571 -33394355 -49817970
37160 -49817970 -47113232 -29051274 -9824032 9881792 33461009 46778414 33853330
37153 33853330 8963826 3138948 18291231 25388040 12205969 -479578 -136693 -4286978
37145 -4286978 -22593443 -31436565 -13988903 3332043 -11093015 -41109463 -45827081
37138 -45827081 -21700851 -2302468 -2766034 -3527004 9629239 24903637 29951962 27950688
37130 27950688 21303095 6231518 -9498643 -9074215 5740814 13841496 8859393 8969162
37122 8969162 23551828 35128488 27273647 9015312 -1658309 188804 12403094
37115 12403094 34780269 59945970 72367820 67587167 56576966 43897453 22226191
37108 22226191 -3106378 -9448391 9214841 27937966 27423479 21032732 25434840 28850633
37100 28850633 14396401 -6049239 -11558315 -9978345 -23949676 -49359587 -59970732
37093 -59970732 -48508747 -32769437 -22657318 -10551879 3731882 6260734 -6340130
37086 -6340130 -18015085 -16052352 -5107011 5421439 11019613 7103170 -7430507 -19736051
37078 -19736051 -14850770 125687 3594866 -6858127 -10898402 514796 12666513
37071 12666513 16263731 21681895 30475516 20669034 -17091475 -51790170 -49123396 -20813892
37063 -20813892 -5892099 -12492978 -13024275 3500364 11100915 -8751677 -32929040 -29366542
37055 -29366542 -4700079 6654574 -7548120 -23376260 -17128595 5486945 23700136
37048 23700136 29303691 28313233 24337136 14077987 -1663435 -13174359 -12165771 -2326576
37040 -2326576 4328639 586283 -8659959 -12466382 -6094737 4258743 9435146 7722092
37032 7722092 4376181 2242495 -1996282 -10932243 -20517433 -23943440 -18440631 -6504443
37024 -6504443 5635944 9145415 -1584265 -20034286 -30683503 -27100622 -20967886 -25084648
37016 -25084648 -33360072 -29594247 -13255880 -1942088 -5578437 -11967761 -5698926 8887441
37008 8887441 14632784 6368582 -2968454 -1754746 4414197 1964345 -10255935 -18107483
37000 -18107483 -11368435 1391212 4149036 -4077835 -8219934 913800 15031552 22879170
36992 22879170 24689288 24436681 19379572 9331708 6310709 18726683 31921229 22475497
36984 22475497 -9470023 -38918968 -47288604 -38575215 -23377642 -5799546 7726818
36977 7726818 4629859 -17051348 -39700092 -44981690 -34157191 -21708066 -16725374 -18793134
36969 -18793134 -25156310 -32715631 -36635025 -34116098 -28001903 -23294305 -22243701 -23585268
36961 -23585268 -23270975 -17460570 -9812204 -11777332 -26820294 -38636086 -27831803 1665724
36953 1665724 26688227 33890005 29249587 19842368 5733316 -7195254 -7174131 3500390
36945 3500390 7433003 -403162 -2833017 11538157 28761280 30602546 18809675 5381118
36937 5381118 -5418330 -11473519 -5246935 12352065 24739046 22049326 16440873 18783494
36929 18783494 16452933 -4491594 -29244102 -31695216 -13222845 1073256 -321982
36922 -321982 -6496005 -10236752 -18139438 -31906752 -41042105 -39803994 -34799785 -30832670
36914 -30832670 -23625451 -11145116 610483 7701603 13659362 21354589 28447150 33141016
36906 33141016 36150550 35487591 27081448 12036252 -2555527 -9831510 -5870879 10040037
36898 10040037 31282739 43863967 38249751 19667448 2327961 -3015336 5855330
36891 5855330 21084006 25129869 5320755 -25650024 -38035385 -22660252 -4228538
36884 -4228538 -5209448 -14613447 -10366850 4361449 10409508 5405788 1749343 175159
36876 175159 -8745278 -21248368 -23241145 -14378412 -6766182 -2076641 7347040 16779065
36868 16779065 12589448 -2609590 -12007008 -13020323 -19970749 -35645894 -44252787 -38354339
36860 -38354339 -30257995 -28692359 -24280606 -7690664 14088696 28257237 30041391 20677482
36852 20677482 4355383 -9076737 -10859575 -5095009 -2165860 -1547380 5068916 16168309
36844 16168309 22018633 21036236 17486887 7394324 -13083647 -29869381 -25159611 -6680906
36836 -6680906 1900810 -2888101 -4879288 -2187286 -8476226 -19127159 -11176609 16056987
36828 16056987 34313133 29878179 20079189 15605656 2911091 -19709817 -25544826 -2178499
36820 -2178499 21521203 16920247 -4137821 -16225885 -19483412 -23646120 -20014579 -2201438
36812 -2201438 7883825 -9891772 -35405150 -35111717 -13329118 -1513477 -7529988 -12070590
36804 -12070590 -9350891 -15250591 -35025993 -54440329 -65122112 -71275055 -69487309 -48717732
36796 -48717732 -14604411 9792788 12597902 3202645 -8082321 -20315386 -29839082
36789 -29839082 -28779518 -20514002 -18853703 -26968984 -32599093 -27916576 -19586429 -15977153
36781 -15977153 -18030115 -25056140 -36079805 -43269847 -37007483 -19828582 -4125103 4479611
36773 4479611 10142494 14334681 13380719 8234122 3921243 -639597 -9723357 -18430138
36765 -18430138 -16716607 -5862761 2601653 4971715 8541192 15170421 15925377 6406776
36757 6406776 -4612819 -7673287 -5175101 -6006805 -12748682 -18038691 -12426029 3327194
36749 3327194 13872434 3959039 -20036195 -33591715 -24881449 -9708952 -6269101 -9170997
36741 -9170997 -3580988 7214380 8032152 -1829978 -8320804 -5441800 -1093427 -2216049
36733 -2216049 -8273434 -16124768 -19471822 -10824273 3375973 1383664 -23468479 -45054975
36725 -45054975 -38709073 -18045269 -9667616 -6117492 18387571 53732245 60253033 32452653
36717 32452653 11457117 21059814 33827918 22119497 4148248 9104612 26626141
$$ [...]
##END NTUPLES=NMR SPECTRUM
##END=
