##TITLE=31Pdec_SR126_DCC+d6
 DMSO-d6, 24 sc
 13.5.2022
##JCAMPDX= 6.0         $$ Bruker NMR JCAMP-DX V2.0
##DATA TYPE= NMR SPECTRUM
##DATA CLASS= NTUPLES
##ORIGIN= UXNMR, Bruker Analytische Messtechnik GmbH
##OWNER= root
$$ XWIN-NMR		Version 3.5
$$ Fri May 13 14:06:54 2022 Russian Standard Time (UT+4h)  she@DPX200
##.OBSERVE FREQUENCY= 81.013821
##.OBSERVE NUCLEUS= ^31P
##.ACQUISITION MODE= SIMULTANEOUS
##.ACQUISITION SCHEME= undefined
##.AVERAGES= 8
##.DIGITISER RES= 16
##SPECTROMETER/DATA SYSTEM= spect
##.PULSE SEQUENCE= zgpg30
##.SOLVENT NAME= CDCl3
##.SHIFT REFERENCE= (INTERNAL, CDCl3, 0, 248.564)
##AUDIT TRAIL= $$ (NUMBER, WHEN, WHO, WHERE, WHAT)
$$ ##TITLE= Audit trail, XWIN-NMR		Version 3.5
$$ ##JCAMPDX= 5.01
$$ ##ORIGIN= Bruker BioSpin GmbH
$$ ##OWNER= she
$$ F:/spectra/data/she/nmr/P31/1/pdata/1/auditp.txt
$$ ##AUDIT TRAIL=  $$ (NUMBER, WHEN, WHO, WHERE, WHAT)
(   1,<2022-05-13 14:06:00.09 +0400>,<she>,<DPX200>,
      <created by zg, POWCHK disabled, PULCHK disabled
       configuration hash MD5:
       00 E9 B6 7A A2 85 ED C7 34 08 36 98 17 FE 4E 26
       data hash MD5: 32K
       F2 6F CC 20 EE 0D DA 99 88 34 FD B9 7A 62 5E 85>)
(   2,<2022-05-13 14:06:04.26 +0400>,<she>,<DPX200>,
      <Start of raw data processing
       efp BC_mod = 2 LB = 1 FT_mod = 6 PKNL = 1 PHC0 = -10043.29 PHC1 = 412.4539 SI = 64K 
       data hash MD5: 64K
       6D BC EC 6D A4 01 CB 5D 14 8C 88 0E D9 1A D3 6E>)
(   3,<2022-05-13 14:06:28.92 +0400>,<she>,<DPX200>,
      <pk PHC0 = 224.4273 PHC1 = -559.8002 
       data hash MD5: 64K
       AD B4 4C 74 85 26 E0 06 F2 2A FD 7E 86 5C 6B 22>)
$$ ##END=
$$ 
$$ hash MD5
$$ 9D 2F 44 6C A7 38 DA 96 8D 95 60 83 72 9B BB 58
##$RELAX= 
##$RELAX= 
##$RELAX= 
##$RELAX= 
##$RELAX= 
##$RELAX= 
##$RELAX= 
##$RELAX= 
$$ Bruker specific parameters
$$ --------------------------
##$DU= <F:/spectra>
##$EXPNO= 1
##$NAME= <P31>
##$PROCNO= 1
##$TYPE= <nmr>
##$USER= <she>
##$AMP= (0..31)
100 100 100 100 100 100 100 100 100 100 100 100 100 100 100 100 100 100 
100 100 100 100 100 100 100 100 100 100 100 100 100 100 
##$AQSEQ= 0
##$AQ_mod= 1
##$AUNM= <au_zg>
##$AUTOPOS= <>
##$BF1= 81.014009
##$BF2= 200.13
##$BF3= 200.13
##$BF4= 200.13
##$BF5= 200.13
##$BF6= 200.13
##$BF7= 200.13
##$BF8= 200.13
##$BYTORDA= 1
##$CFDGTYP= 0
##$CFRGTYP= 5
##$CHEMSTR= <none>
##$CNST= (0..31)
1 1 145 1 1 1 1 1 1 1 1 1 1 1 1 1 1 1 1 1 1 1 1 1 1 1 1 1 1 1 1 1 
##$CPDPRG= <waltz16>
##$CPDPRG1= <>
##$CPDPRG2= <waltz16>
##$CPDPRG3= <>
##$CPDPRG4= <mlev>
##$CPDPRG5= <mlev>
##$CPDPRG6= <mlev>
##$CPDPRG7= <mlev>
##$CPDPRG8= <mlev>
##$CPDPRGB= <>
##$CPDPRGT= <>
##$D= (0..31)
0 1 0 0 0 0 0 0 0 0 0 0.03 2e-05 3e-06 0 0 0 0 0 0 0 0 0 0 0 0 0 0 0 0 
0 0 
##$DATE= 1652436359
##$DBL= (0..7)
120 120 120 11 120 120 24 19 
##$DBP= (0..7)
150 150 150 150 150 150 150 150 
##$DBP07= 0
##$DBPNAM0= <>
##$DBPNAM1= <>
##$DBPNAM2= <>
##$DBPNAM3= <>
##$DBPNAM4= <>
##$DBPNAM5= <>
##$DBPNAM6= <>
##$DBPNAM7= <>
##$DBPOAL= (0..7)
0.5 0.5 0.5 0.5 0.5 0.5 0.5 0.5 
##$DBPOFFS= (0..7)
$$ [...]
##$SUBNAM2= <"">
##$SUBNAM3= <"">
##$SUBNAM4= <"">
##$SUBNAM5= <"">
##$SUBNAM6= <"">
##$SUBNAM7= <"">
##$SUBNAM8= <"">
##$SUBNAM9= <"">
##$SW= 501.771253377433
##$SWIBOX= (0..15)
0 1 3 0 0 0 0 0 0 0 0 0 0 0 0 0 
##$SW_h= 40650.406504065
##$TD= 32768
##$TD0= 1
##$TE= 0
##$TE2= 300
##$TE3= 300
##$TEG= 300
##$TL= (0..7)
0 120 53 12 22 120 120 120 
##$TP= (0..7)
150 150 150 150 150 150 150 150 
##$TP07= 0
##$TPNAME0= <>
##$TPNAME1= <>
##$TPNAME2= <>
##$TPNAME3= <>
##$TPNAME4= <>
##$TPNAME5= <>
##$TPNAME6= <>
##$TPNAME7= <>
##$TPOAL= (0..7)
0.5 0.5 0.5 0.5 0.5 0.5 0.5 0.5 
##$TPOFFS= (0..7)
0 0 0 0 0 0 0 0 
##$TUNHIN= 0
##$TUNHOUT= 0
##$TUNXOUT= 0
##$USERA1= <user>
##$USERA2= <user>
##$USERA3= <user>
##$USERA4= <user>
##$USERA5= <user>
##$V9= 5
##$VALIST= <valist>
##$VCLIST= <CCCCCCCCCCCCCCC>
##$VD= 0
##$VDLIST= <DDDDDDDDDDDDDDD>
##$VPLIST= <PPPPPPPPPPPPPPP>
##$VTLIST= <TTTTTTTTTTTTTTT>
##$WBST= 1024
##$WBSW= 4
##$XGAIN= (0..3)
0 0 0 0 
##$XL= 0
##$YL= 0
##$YMAX_a= 632
##$YMIN_a= -1244
##$ZGOPTNS= <>
##$ZL1= 120
##$ZL2= 120
##$ZL3= 120
##$ZL4= 120
##$ABSF1= 0
##$ABSF2= 0
##$ABSG= 0
##$ABSL= 0
##$ALPHA= 0
##$AQORDER= 0
##$ASSFAC= 0
##$ASSFACI= 0
##$ASSFACX= 0
##$ASSWID= 0
##$AUNMP= <proc_1d>
##$AZFE= 0.1
##$AZFW= 0.5
##$BCFW= 0
##$BC_mod= 2
##$BYTORDP= 0
##$COROFFS= 0
##$CY= -3
##$DATMOD= 1
##$DC= 0
##$DFILT= <>
##$DTYPP= 0
##$F1P= 0
##$F2P= 0
##$FCOR= 1
##$FTSIZE= 65536
##$FT_mod= 6
##$GAMMA= 0
##$GB= 0
##$INTBC= 1
##$INTSCL= 5.30512e-09
##$ISEN= 30
##$LB= 1
##$LEV0= 0
##$LPBIN= 0
##$MAXI= 10000
##$MC2= 0
##$MEAN= 0
##$ME_mod= 0
##$MI= 50
##$NCOEF= 0
##$NC_proc= -10
##$NLEV= 6
##$NOISF1= 182.463
##$NOISF2= 159.3651
##$NSP= 0
##$NTH_PI= 0
##$NZP= 0
##$OFFSET= 248.5645
##$PC= 4
##$PHC0= -9818.862
##$PHC1= -147.3463
##$PH_mod= 1
##$PKNL= yes
##$PPARMOD= 0
##$PSCAL= 0
##$PSIGN= 0
##$REVERSE= no
##$SF= 81.014009
##$SI= 65536
##$SIGF1= 159.3651
##$SIGF2= -187.1042
##$SINO= 113.3802
##$SIOLD= 16384
##$SREGLST= <1H.CDCl3>
##$SSB= 0
##$STSI= 65536
##$STSR= 0
##$SW_p= 40650.406504065
##$SYMM= 0
##$S_DEV= 0
##$TDeff= 32768
##$TDoff= 0
##$TI= <>
##$TILT= no
##$TM1= 0
##$TM2= 0
##$TOPLEV= 0
##$USERP1= <user>
##$USERP2= <user>
##$USERP3= <user>
##$USERP4= <user>
##$USERP5= <user>
##$WDW= 1
##$XDIM= 65536
##$YMAX_p= 382520082
##$YMIN_p= -128279781
$$ End of Bruker specific parameters
$$ ---------------------------------
##NTUPLES= NMR SPECTRUM
##VAR_NAME=  FREQUENCY,     SPECTRUM/REAL,   SPECTRUM/IMAG
##SYMBOL=    X,             R,               I
##VAR_TYPE=  INDEPENDENT,   DEPENDENT,       DEPENDENT
##VAR_FORM=  AFFN,          ASDF,            ASDF
##VAR_DIM=   65536,         65536,           65536
##UNITS=     HZ,            ARBITRARY UNITS, ARBITRARY UNITS
##FACTOR=    0.620285442955139, 1,           1
##FIRST=     20137.2065510759, 0,            0
##LAST=      -20513.1999529892, 0,           0
##MIN=       -20513.1999529892, -128279781,  0
##MAX=       20137.2065510759, 382520082,    0
$$ Real data points
##PAGE= N=1
##DATA TABLE= (X++(R..R)), XYDATA
$$ [...]
43731h859824n539123M919935N319971k244509m703239R52754L373136k722348
43723i503247o561663J67812Q557655P788833L351954N588271R545815L401182
43715B2336612q775328j1146846j602520M769698k3312n492091j055790P811777
43707F822200R342465J511283q681614j4452189j2243652k578266P083084P125039
43699f071650j830694q030248m546870J481914J285935j781375Q48205Q211461
43691a0433322J1523647P676106K169576m06409j146307k011207k739274l273265
43683A359545m060697l529421j02294L174373J348911m407412p091579l781357
43675a7089931M46365J205075J449947M621690O368226O91392p968106p690390
$$ y = [-8859824, -14398947, -9479012, -4159041, -6403550, -11106789, -10154035, -6780899, -9503247, -16064910, -15897098, -7339443, 449390, 3801344, 9389615, 18935430, 22336612, 13561284, 2414438, 811918, 5581616, 5558304, 66213, -989577, 6822200, 16164665, 17675948, 8994334, -5457855, -17701507, -20279773, -13196689, -6071650, -7902344, -15932592, -20479462, -18997548, -17711613, -19492988, -18644783, -10433322, 1090325, 8766431, 10936007, 10529598, 9383291, 7372084, 4632810, 1359545, -2701152, -6230573, -6332867, -3158494, -1809583, -6216995, -13308574, -17089931, -16643566, -15438491, -13988544, -9366854, -2998628, -2307236, -10275342, -17965732]
43667a7965732M175030J4879609J1575324k242817j1349112p327993L272270Q909794
43659C926373O046827N81632o50502K425492L666212j362344q790242j0254847
43651d411399l844863K684112K156696k639557m047114m53579L412646M480190
43643b662868L392234K70652m953529q667932o399341N56790O651196R120550
43635b692248Q159448L016763m547572o310298K602181J2228261Q567308m659853
43627A6363990r251326O51274J0336181P767890n61819m478027n588873p748873
43619G490417o215702J093768L993490l977602j0677654k414550J2679302J5419200
43611A7390669L800661o812903q118560o324377o299957m560605L86927M109471
$$ y = [-17965732, -13790702, 1088907, 12664231, 10421414, -927698, -8255691, -4983421, 3926373, 9973200, 10554832, 9904330, 12329822, 15996034, 14633690, 5843448, -4411399, -8256262, -5572150, -3415454, -6055011, -10102125, -10555704, -7143058, -2662868, 729366, 1000018, -3953511, -12621443, -19020784, -18463994, -11812798, -2692248, 5467200, 8483963, 3936391, -2373907, 228274, 12456535, 21023843, 16363990, 7112664, 7763938, 18100119, 25868009, 25306190, 20828163, 15239290, 7490417, 1274715, 2368483, 6361973, 2384371, -8293283, -10707833, 1971469, 17390669, 21191330, 14378427, 6259867, -64510, -6364467, -10925072, -10538145, -6428674]
43603f428674M579240L854630J553799l097831m568291K108953R950819Q188083
43595A6140728k05494k965675J045228J193044n185606q523803m588696o77713
43587c767987q27477L01972M568941N624633J808550L18571L761136N496494K566899
43578A9851732k1018j417533o644127j2648426r321064Q80078K928816m715025
43570a1106567m969961P202418J1859358k905775j7234720r916171O439732O322537
43562a4309149o774163q198445O183546J5744872J0592784L379595L035638K205883
43554A1860561l143156m357820J426769L423880k868138o030537N27794N290908
43546F130261j177005p998591j489808J0705540J0455550k497045j0368277l982092
$$ y = [-6428674, -1849434, 2005196, 3558995, 461164, -4107127, -1998174, 7952645, 16140728, 15935234, 12969559, 14014787, 15207831, 10022225, 1498422, -3090274, -3767987, -4595464, -4293492, 275449, 5900082, 7708632, 8027203, 11788339, 17284833, 19851732, 19830714, 18413181, 11769054, -879372, -10200436, -9320358, -6391542, -11106567, -16076528, -8874110, 2985248, 79473, -17155247, -27071418, -20631686, -14309149, -21083312, -29281757, -23098211, -7353339, 3239445, 6619040, 9654678, 11860561, 8717405, 4359585, 5786354, 9210234, 6342096, 311559, 839353, 6130261, 4953256, -3045335, -4535143, 6170397, 16625947, 14128902, 3760625, -221467]
43538b21467N710458N520195k184726n356242M78587P285027O042617j032175
43530A6242274l398564K455656O315233j235556j2446641j1706919K2796M783242
43522A031521m260615j0376864M00527J4942306J1893278m697621j1210220m75235
43514b752923R789641P035589R54152K079673K757214o184796j4672454p758789
43506h752693Q020078J2287762J486759p385809m737003j169006o213449j1184644
43498a7648005m400009Q694570J3875752Q973053L106863o7833m610393r507186
43490a583188p574426P26412M790796Q7468l688966K199109J0811938R537951
43482A5307094n64620o314729j806288M402684L543144j417394l298629k690803
$$ y = [-221467, 5488991, 11009186, 8824460, 3468218, 3946805, 11231832, 17274449, 16242274, 12843710, 15299366, 21614599, 20379043, 7932402, -3774517, -3751721, 1031521, -3229094, -13605958, -13205431, 1736875, 13630153, 8932532, -2277688, -2752923, 7036718, 14072307, 15026459, 17106132, 19863346, 13678550, -993904, -8752693, -732615, 11555147, 13041906, 5656097, 919094, -249912, -6463361, -17648005, -22048014, -13353444, 522308, 9495361, 12602224, 12534391, 7923998, -1583188, -9157614, -8431202, -3640406, -3552938, -7241904, -5042795, 5769143, 15307094, 14742474, 8427745, 6621457, 11024141, 14567285, 13149891, 9851262, 7160459]
43474G160459m419855o504467k552621N425247O962011q92819p129428k792612
43466d744085M885581M083352k184327j281465P022788Q914162q64866r879621
43458E951519p929081k203251k567077m105207J918035R210621N478474m856649
43450H97384n317265N623133J0353140p32759j4140094j3492164j994253N547925
43442a3254953L881042m94190k323440k089442l87417K899240M661786J282335
43434e825039m608239o045598r75066N182826P027366N298479M102286M772620
43426H929635M499277M77035n640490q264286l710435M782548R323763N109197
43418A5506244m713896j1681930r341842M03167P628328M005829o367586j0065893
$$ y = [7160459, 2740604, -3763863, -6316484, -891237, 6070774, 5177955, -1951473, -4744085, 141496, 4224848, 2040521, 759056, 7781844, 16696006, 15831140, 5951519, -1977562, -4180813, -6747890, -10853097, -8935062, 275559, 5754033, 897384, -4419881, 1203252, 11556392, 10823633, -3316461, -16808625, -18802878, -13254953, -9373911, -9868101, -12191541, -14280983, -14668400, -11769160, -7107374, -5825039, -10433278, -16478876, -17453942, -12271116, -5243750, 54729, 4157015, 8929635, 13428912, 13905947, 8265457, 1171, -3709264, 1073284, 10397047, 15506244, 10792348, -889582, -10231424, -9828257, -2199929, 1805900, -4561686, -14627579]
43410a4627579j465166Q672065P747289r12749m169645M63963K418322l556561
43402e430061q874311n005876M341709J0481374J0843460P128874P1415p557174
43394E999410r530604m643796o38443k677789l993383L391421J3671329J3626283
43386A5204428K173271p042748m135334M737585P339211J206937n798168p534833
43378F150349o254483o557771p179465l034067N368528R983263N834323q26559
43370C484118p92218M315120M315919l594615r850799o493749J419554L672841
43362c523829j150145n607468m366938L80221L627547L496497J856254R79446
43354d308415P75883J59961O63082M963977R917712O739853o143389j5946603
$$ y = [-14627579, -16092745, -7420680, 326609, -586140, -4755785, -4291822, -1873500, -5430061, -14304372, -19310248, -14968539, -4487165, 6356295, 13485169, 13556584, 5999410, -3531194, -8174990, -8813433, -11491222, -15484605, -12093184, 1578145, 15204428, 17377699, 10334951, 6199617, 10937202, 18276413, 19483350, 13685182, 6150349, -104134, -6661905, -13841370, -16875437, -11506909, -1523646, 4310677, 3484118, 2691900, 7007020, 11322939, 7728324, -2122475, -8616224, -7196670, -3523829, -4673974, -10281442, -14648380, -14268159, -10640612, -7144115, -5287861, -4308415, -3532532, -3372571, -2709489, 2254488, 12172200, 18912053, 12768664, -3177939]
43346c177939j0461498L574294Q599308J120583m956808j115929M309856K576926
43338D68793j407274l6532L213421J284632l344580l456047N86566K772735J847816
43329A929530J612727L334814M262216K250029j679042l610886N19762Q114341
43321A6733491Q271762m286724j6504454j1818856L543312P301852l802281q058338
43313h620236M460641J3942945M521264p958721l380557Q160999N987687l732033
43305A3381989j106138Q543969L099634j4236242j6794959J00358J0310253R39493
43297D238357p603026J533420J4215759J2011772J368161l388817n167302j1180605
43289F027719j2685923o06876J2101060P427891p548114j0783876K88343P525916
$$ y = [-3177939, -13639437, -10065143, -1465835, -345252, -5302060, -6417989, -2108133, 468793, -938481, -975013, 2238408, 3523040, 178460, -3277587, -2691021, 81714, 1929530, 3542257, 6877071, 11139287, 13389316, 11710274, 8099388, 8619150, 16733491, 25005253, 20718529, 4214075, -7604781, -4061469, 3240383, -561898, -8620236, -4159595, 9783350, 14304614, 6345893, 2965336, 11126335, 17114022, 13381989, 12275851, 20819820, 23919454, 9683212, -7111747, -7011389, 3298864, 4238357, -3364669, -1831249, 12384510, 24396282, 25764443, 22375626, 17208324, 6027719, -6658204, -7265080, 4835980, 12263871, 4715757, -6068119, -5779776, 1746140]
43281A746140L025940j501094J376509K607462m562284j0629474m916720O977474
43273e876047J1456165N665924j446035k969193r43943n73870l259955o005684
43265c952638n014276L27581N994852O717450J703293m186847n736911k522158
43257f669654J935717M426464M072959J530934j753656l945572m349302m303370
43249i055480m539123k187997N790294J5215503J5959194M863220p016485o854501
43241A2174625K917702Q307917L370176l756199n449824m128004l205255J83780
43233A0414918O406871P433371r89352r539788p994567q11943Q50951l227221
43225B543240m448916o88100K508954L015790L258530K899944O47070j82992J902517
$$ y = [1746140, 4772080, 3270986, 4647495, 7254957, 2692673, -7936801, -12853521, -5876047, 5580118, 11246042, 9800007, 6830814, 5886871, 5313001, 2053046, -3952638, -8966914, -8639333, -2644481, 4072969, 5776262, 1589415, -4147496, -6669654, -4733937, -307473, 3765486, 5296420, 3542764, -402808, -4752110, -9055480, -13594603, -15782600, -9992306, 5223197, 21182391, 26045611, 19029126, 12174625, 15092327, 23400244, 26770420, 23014221, 17564397, 13436393, 10231138, 10414918, 16821789, 24255160, 23265808, 13726020, 5731453, 4919510, 5770461, 2543240, -1905676, -2593776, -84822, 2930968, 6189498, 9089442, 9736512, 9553520, 11456037]
43216A1456037k2120r424914j4513943l879757J1803541J2435571p04220p798243
43208f48048k987680n23818n698985m809898P529053J5099334P150581k445039
43200A2665500Q03961P295414J547207r773589r388793P78926L046955o969510
43192F071j4217850p389622O790834J4551468J0239014o81828p445872m071104
43184b218889K570177K4886j0843694j4067430k309512R887995P732392j008579
43176a0232654k07506P525284O839503l021818p112265J0097O869307N043594
43168E713542j73631k870215n210790p944321n710313J834982N730920J407662
43160g222164l232702o10583M420903L554127o43508J114241R392809J3614091
$$ y = [11456037, 11433917, 2009003, -12504940, -16384697, -4581156, 7854415, 7150195, -648048, -3635728, -4159546, -9858531, -14668429, -7139376, 7959958, 15110539, 12665500, 13469461, 20764875, 22312082, 12538493, 3149700, 3928626, 6975581, 6071, -14211779, -21601401, -14810567, -259099, 9979915, 9298087, 1852215, -2218889, 351288, 376174, -10467520, -24534950, -26844462, -16956467, -9224075, -10232654, -10440160, -2914876, 3924627, 902809, -6209456, -6199359, 669948, 5713542, 5539911, 2669696, -2541094, -10485415, -16195728, -14360746, -8629826, -7222164, -10454866, -11065449, -6644546, -3090419, -3733927, -2619686, 6773123, 20387214]
43152B0387214O082778p205585j2868961n578242N778748Q691989J547398o333854
43144A0501485q115510o393984n190323k871227K094355N407975L673165Q77841
43136a6223R34763r3367n683455q967930k260203P959563Q153832k060501r264122
43127a1297643n716507K365223O973412P211879L982469k997415r409754p726411
43119a6614747J338275P572284N564455J809843L151705O487956N625623J362926
43111A6298320j490699j997798k348686l052092l440955l873008m044967k172134
43103f122019J592110M068621L280484N51565k596016n687295o854960m059646
43095a5827156K65590R83337k079481l521431p79332K385147K551809J372586
$$ y = [20387214, 26469992, 19264407, 6395446, 817204, 6595952, 15287941, 16835339, 10501485, 2385975, -4008009, -9198332, -12069559, -9975204, -4567229, -894064, -16223, 918540, 825173, -4858282, -13826212, -16086415, -8126852, 26980, -2033521, -11297643, -17014150, -14648927, -7675515, -463636, 3518833, 521418, -8888336, -16614747, -15276472, -7704188, -2139733, -329890, 2821815, 9309771, 14935394, 16298320, 14807621, 12809823, 10461137, 7409045, 3968090, 95082, -3949885, -6122019, -4529909, -461288, 2819196, 3370761, 774745, -4912550, -11767510, -15827156, -15561566, -14578229, -16657710, -20179141, -20958473, -18573326, -16021517, -14648931]
43087a4648931J579900L096755M783553N594541L419017k101529n827996k690094
43079f794784L300718L602228j164433j890186L090820M262892k414954o822421
43071d830120l91388R534049J0957744N045417J462730J385846k386295j0248004
43063A0529979j2802122n180432M707994O311245n53683o649496m594832L674685
43055d556662R997464Q891371K447791l675750o874231p707930n844589r93884
43047h316420L193613K466533p28542j43185L659656L778270n66121j719690K954928
43038D579042N675017J633994k594866j169437R20966j119244j251426N277567
43030A1951613Q788578j030643j5233924j6221541m178399M431213K981351Q56398
$$ y = [-14648931, -13069031, -9972276, -5188723, 405818, 3824835, 1723306, -4104690, -6794784, -3494066, 108162, -1056271, -2946457, 144363, 4407255, 1992301, -4830120, -5221508, 4312541, 15270285, 20315702, 21778432, 23164278, 20777983, 10529979, -2272143, -7452575, -2744581, 3566664, 3012981, -3636515, -8231347, -4556662, 5440802, 14332173, 16779964, 13104214, 6229983, -1477947, -7322536, -8316420, -5122807, -2656274, -3384816, -3528001, 131655, 3909925, 3343804, 1624114, 4579042, 10254059, 11888053, 9293187, 8123750, 9044716, 7925472, 6674046, 11951613, 20740191, 19709548, 4475624, -11745917, -15924316, -11493103, -8511752, -7655354]
43022g655354K441223m80325r566974j1548438P53264J3809850J2118469L66010
43014B37725n916448l138445L30006Q77156K579990N934876O019506K073499o69590
43005H328275M97902K643973K642568k42297n921239j1556709j0447219k24530
42997a4279276R927013Q743928j474705p535885l312890M356456Q222199Q702273
42989A3349113P054359J185173o792341q374675p58469O613298M779895k221726
42981A4834627n275203m218843m630903n604470j812129M346453L998770l869752
42973b231450r327170n577776K150843N560648M116004K313672J710429R48148
42965c36652L5798l11880j210555l310897l880776j21330N840460Q837479O859320
$$ y = [-7655354, -5214131, -5694456, -15261430, -26809868, -26056604, -12246754, -128285, 237725, -5678723, -8817168, -8487162, -7610006, -5030016, 904860, 6924366, 8997865, 8328275, 8826177, 11470150, 14112718, 13870421, 7949182, -3607527, -14054746, -14279276, -4352263, 4391665, 2916960, -4618925, -7931815, -3575359, 4646840, 13349113, 20403472, 21588645, 14796304, 6421629, 5663160, 12276458, 17056353, 14834627, 9559424, 5340581, 709678, -4894792, -6706921, -2360468, 1638302, -2231450, -11558620, -17136396, -14985553, -9424905, -5308901, -2995229, -1284800, -336652, -300854, -612734, -1823289, -5134186, -9014962, -9136292, -3295832, 5541647, 12400967]
42956A2400967K343849k034059n497156o950436m267602K032008O468717L386316
42948G882604n348059j0250966m459908P254659J3265624Q761754K57727m691060
42940A2672375o608964r040935r814539m444254M372589Q370084M578692j971870
42932a886822o308756p596932n161061J722168Q456016P469735q95429o860100
42924a1061181m157260K161538M677230L331395J417847j107206m230048m202641
42916a3170326j69760J408300l341976p011617j364940Q043916Q609353j54328
42908g151378n597290n21521P964938J0614026P329056K238094l806045r713459
42900A356421r817892q80063R695493J0196630p44563j1505609j1181157j789004
$$ y = [12400967, 14744816, 12710757, 7213601, 263165, -4004437, -1972429, 4496288, 7882604, 2534545, -7716421, -12176329, -4921670, 8343954, 17105708, 17363435, 12672375, 6063411, -2977524, -12792063, -17236317, -12863728, -4493644, 85048, -1886822, -8195578, -15792510, -20953571, -19231403, -10775387, -3305652, -4201081, -11061181, -15218441, -13056903, -8379673, -5048278, -3630431, -4737637, -8967685, -13170326, -13340086, -11931786, -15273762, -22285379, -23650319, -15606403, -6997050, -7151378, -12748668, -13270189, -5305251, 5308775, 12637831, 14875925, 11069880, 1356421, -8461471, -9341534, 353959, 10550589, 9806026, -1699583, -12880740, -14669744]
42892a4669744O197827P499039O001648N407435K866282l704461p895231k870359
42884a167564N640460M917252n756342j2930990q873489j637760O83380L108364
42876a6016689J0900962J4953093M814253j0867751j3452990j029141R815824
42869h82439Q651109K267210r07091k536958n600609o658343l554035r65781j977618
42860a2164555k425671Q04911L803538L484904L757237P782783J0797995O993980
42852B2835122j693695r075198j2186497j0801013m742992L465303P929516N978186
42844A708732J682251l37439j49492R49489L572426O841782P334802M422392J376575
42835B7401518q35793m500113q296860p430239k769616p84621j639345J975225
$$ y = [-14669744, -8471917, -972878, 5028770, 10436205, 13302487, 9598026, 1702795, -1167564, 4472896, 9390148, 3633806, -9297184, -18170673, -19808433, -19125053, -16016689, -5115727, 9837366, 14651619, 3783868, -9669122, -10698263, -882439, 7768670, 10035880, 9128789, 6591831, 991222, -5667121, -9221156, -10186937, -12164555, -14590226, -13785315, -9981777, -6496873, -2739636, 5043147, 15841142, 22835122, 21141427, 12066229, -120268, -10921281, -15664273, -12198970, -4269454, 1708732, 3390983, 3053544, 2904052, 3853541, 7425967, 14267749, 21602551, 26024943, 27401518, 26565725, 22065612, 13768752, 6338513, 3568897, 2784276, 1144931, 3120156]
42827C120156R995167J1112513M64408j0867836j2643404r755671r373137o339697
42819b4287501M578336J2886715O254102p134862q702611K112040Q380321L323348
42811b590112j626030J414306M997148J980167k323903j169606K298415K135885
42803E116270j253181m917806p834753p301438l75892O963340L413496q929837
42795a5119801j1862282L336451J8977192J3239597q178086j8596385o302195
42788b4505509J1713240J4916742M668757l142265j796302P77140k354275o418110
42780f140582l423527N064704R848955O507066l77795n310495p706780p858183
42772i396637m035357K191337M150153m54241l964233J45348O160586N112286
$$ y = [3120156, 13115323, 24227836, 24692244, 13824408, 1181004, -8574667, -17947804, -24287501, -19709165, -6822450, -568348, -7703210, -16405821, -14293781, -5913460, -2590112, -4216142, -2801836, 2195312, 4175479, 1851576, 681970, 2980385, 5116270, 3863089, -1054717, -8889470, -16190908, -16566800, -9603460, -6189964, -15119801, -26982083, -23645632, -4668440, 8571157, 393071, -18203314, -24505509, -12792269, 2124473, 6793230, 3650965, 1854663, 2631803, 277528, -6140582, -9564109, -4499405, 5349550, 11856616, 11478821, 6168326, -1538454, -9396637, -13431994, -11240657, -7090504, -7544745, -11508978, -11363630, -5203044, -90758]
42764i0758k15648n59357L253381K446452k457533j476521O393220R919732M602737
42755B1815705l93239J40152j194622p358568p695769K492581R066339J211549
42747A8084128p735941p77262J3010680J1800124l571077j2442982r261286q852532
42739B53852j4947661j1464898N990584J6252159N356402q960019m811394R508448
42731b822527J1213448J87017m482558J777090M382259k061628n066966J371644
42723D497779N120573k453453j0578293o280746N445900J0656270O275932l73408
42715A2310554m630186o307631m133292J292047L504042r58473l995667K926206
42707G600J2559155R640612n455030j4355393n902472Q125814R927491m14239
$$ y = [-90758, -306406, -865763, 2387618, 4834070, 2376537, 900016, 7293236, 17212968, 21815705, 21422466, 21562618, 20367996, 13009428, 5313659, 7806240, 16872579, 18084128, 10348187, 9570925, 22581605, 34381729, 30810652, 18367670, 9106384, 253852, -14693809, -26158707, -20168123, -3915964, 1440438, -7519581, -12330975, -2822527, 8390921, 8577938, 4095380, 5872470, 10254729, 8193101, 3126135, 4497779, 9618352, 7164899, -3413394, -9694140, -4248240, 6408030, 12683962, 12310554, 7680368, 1372737, -2760555, -1468508, 2035534, 1077061, -2918606, 7600, 12566755, 22207367, 16752337, 2396944, -3505528, 4620286, 14547777, 14133538]
42699A4133538p655649l419998M870264O942403K555862k000847l956406m828541
42691F640626m184482M79878O922535P627439J09068o911169l975512M874314
42683A1582697O392699k804862j0298853n178104O375613R979784K452970o227723
42675A2274221q055490n195753k543770k02337L272228N673839L782904j091422
42667G914420l911612k227103L48338j624634p684090j0266186l976236N865761
42659a5561342R263152N402974K867182M886042M354242k049383n984152k076972
42651A101743N78132o106538j2121613m332749Q678414P310302o202036q828448
42643a9922793O041885J6099294M841572j2278670j1917665L080273J1905802
$$ y = [14133538, 6477889, 3057891, 7928155, 14870558, 17426420, 15425573, 11469167, 6640626, 2456144, 2936022, 9858557, 17485996, 17595064, 10683895, 6708383, 11582697, 17975396, 15170534, 4871681, -306423, 6069190, 16048974, 18501944, 12274221, 4218731, -977022, -3520792, -3723129, -450901, 5222938, 9005842, 7914420, 4002808, 1775705, 2124043, 499409, -7184681, -17450867, -21427103, -15561342, -6298190, -895216, 1971966, 6858008, 11212250, 9162867, 3178715, 1101743, 1679875, -4426663, -16548276, -20881025, -12202611, -4892309, -11094345, -19922793, -13880908, 2218386, 7059958, -5218712, -17136377, -14056104, -2150302]
42636b150302P265269r3755k209918j623345o64118J751245L090600l25575m163558
42627H76543r15675O504215P470161L23700m988737k640822J449056R51260j351376
42618G678325j12959L489762M328232Q74954l595974n190048l100867n54470j536029
42609B280926m987537m906593Q36705N674767L254423k601930l363415J555758
42601b256896M867117K654447j463923k906934r10039K716282M724780J897569
42593I322403m104761o300783j681930L382414K899627O97623K366724M292638
42585A0873955J065099k466423N94944M403719p47603q798382n601819M994550
42577D318040L936662j0701375j6521272j402397J5423275J1793924m730295j1298510
$$ y = [-2150302, 5114967, 5021212, 2811294, 1187949, 523831, 2275076, 5365676, 5040101, 876543, -39132, 6465083, 13935244, 14258944, 9270207, 6629385, 8078441, 9029701, 7678325, 7565366, 11055128, 15383360, 16258314, 12662340, 7472292, 4371425, 3816955, 2280926, -2706611, -7613204, -6776499, -1101732, 2152691, -449239, -3812654, -2256896, 2610221, 5264668, 3800745, 893811, -16228, 2700054, 7424834, 9322403, 5217642, -1083141, -2765071, 617343, 3516970, 4214593, 6581317, 10873955, 11939054, 9472631, 10067575, 14471294, 13723691, 4925309, -676510, 4318040, 8254702, -2446673, -18967945, -20370342, -4947067, 6846857, 2116562, -9181948]
42569i181948m834560j354420n930210n189754Q224034K1611962J9687382M638428
42561B7670914q898351j2103802q276557m291508j986140J233343O142910Q724686
42553H215495M717433m088712j0871299j0989141n334621K806243R770869J0742474
42545D968741L327850o442929q189766k67078P289741O436862J384551L34853
42537H842825K989548K908313j751998o662756q252379o468200k196750L097547
42529g493850O262524N153899J719148m64123l66159J004062K977571M498132
42521A3291204L403043p42222m986947o416844n347566l578715j881616n54273
42513f813936J40418R58375K204444J416353l154069o975869l307280N939479
$$ y = [-9181948, -14016508, -15370928, -21301138, -26490892, -18266858, 3345104, 23032486, 27670914, 18772563, 6668761, -1607796, -5899304, -7885444, -6652101, -509191, 8215495, 12932928, 8844216, -2027083, -13016224, -18350845, -15544602, -5773733, 4968741, 8296591, 1853662, -6336104, -6603182, 686559, 7123421, 8507972, 8842825, 11832373, 14740686, 12988688, 6325932, -1926447, -8394647, -10591397, -7493850, -1231326, 3922573, 5641721, 5177598, 4811439, 5815501, 8793072, 13291204, 16694247, 15952025, 10965078, 4548234, -799332, -4378047, -6259663, -6813936, -6673518, -5715143, -3510699, -2094346, -5248415, -12224284, -15531564, -9592085]
42505i592085J0107302L587530o008645p276570J409539J0876440J1116521J241960
42497A5461992q218128m982209Q961341J5736732L889520j3405380j5119806k698298
42489c74236L920816r33986j800870P805414J2175968J342517r946278p303369
42481D885976j172269o184080j2878352m287370J1315178J1167868m465168j2304029
42473a3922246k908569P457764N348735j798620l047002q72710j712760l393619
42465a4849027p96881N096282R737766R878142M062553m628149p596298j457214
42457e52826L548671k304959r942442l353688J2739404J6574079K362968j0691844
42449H379363q152202K76892L39766n039852n504431r87797K699206N256361P486333
$$ y = [-9592085, 515217, 4102747, -1905898, -9182468, -7772929, 3103511, 14220032, 15461992, 7243864, 2261655, 11222996, 26959728, 30849248, 17443868, 2324062, -374236, 3546580, 2612594, 811724, 8617138, 20793106, 22135623, 12189345, 4885976, 3713707, -2470373, -15348725, -19636095, -8320917, 2846951, -1618217, -13922246, -16830815, -9373051, -4024316, -5822936, -8869938, -9742648, -11455408, -14849027, -15645908, -10549626, -811860, 9066282, 13128835, 8500686, 904388, -552826, 2995845, 690886, -9251556, -12605244, 134160, 16708239, 19071207, 8379363, 227161, 504053, 843819, -4196033, -9700464, -10688261, -7989055, -2732694, 4753639]
42440D753639M951455l206483p897077l239538K138612j765512r144610o811897
42432b0221411M790744J1607469O013223l606999n128452K264095Q343721M791371
42424H853761m508326q244320l222817L91101n392840j2126938o666823P416120
42416b3501082J4039575Q490660J728429M59901l78743k727387p80002L869067
42408A200418P81807q633643q081477O217048J4527108L418518j1614285r922399
42400a2106905L662828J0470510P157248L716951K767945L50550p47579L105134
42392A8376682M555751l194224j1042022p948415j217202l192777p155206N54586
42384a0262827J2315660R378008m419961p271561L076306N761756n537364j0794469
$$ y = [4753639, 9705094, 6498611, -1398466, -4638004, -2499392, -4264904, -13409514, -20221411, -15430667, -3823198, 2190025, -1416974, -6545426, -4281331, 4062390, 8853761, 4345435, -3898885, -7121702, -6730601, -12123441, -24250379, -30917202, -23501082, -9461507, -970847, 757582, 1217483, 838740, -1888647, -2668649, 1200418, 1982225, -6651418, -14732895, -8515847, 6011261, 9429779, -2184506, -12106905, -8444077, 2026433, 9183681, 12900632, 15668577, 16019127, 15271548, 18376682, 22932433, 19738209, 8696187, 747772, -469430, -3662207, -10817413, -10262827, 2052833, 11430841, 7010880, -260681, 2815625, 8577381, 3040017, -7754452]
42376g754452J465541J4397377J1143625P5397l141584M24547J965651J586641
42368B0162743J476292k808874j0584954j0221982J151042P470823j174593q973726
42360c503229R02619J6022173J2525329o123208j4048603l511423N096165k864874
42352D494949j5041672j3309937R21330J3174068J5773628J1156785L676867k575257
42344A8270761l195115J407715L813305j270251q632083r122740k517540K202756
42336I56808n53582n437297l688425M874683J1323117Q880001Q31864m937716
42328A2249453n859911m717006k238740L385390R357169Q565711L30116o310669
42320A4761513n137989j960692m324777q109532m359398M057076M891877l648452
$$ y = [-7754452, -6288911, 8108466, 19252091, 19327488, 16185904, 16610451, 18576102, 20162743, 21639035, 18830161, 8245207, -1976775, -825733, 6645090, 5470497, -3503229, -2600610, 13421563, 25946892, 19823684, 5775081, 2263658, 7359823, 4494949, -10546723, -23856660, -22935330, -9761262, 6012366, 17169151, 20846018, 18270761, 15075646, 16483361, 20296666, 19026415, 10394332, 1271592, -1245948, 956808, 403226, -5034071, -8722496, -3847813, 7475304, 16355305, 17187169, 12249453, 6389542, 1672536, -566204, 2819186, 12176355, 20742066, 21072182, 14761513, 9623524, 7662832, 3338055, -4771477, -9130875, -5073799, -181922, -3830374]
42312c830374q044784J19612R602732N128822r142756j4231157l144831R496249
42304a4046487Q648554r14925l859443L096971Q731868N259726k297842o233603
42296a615181n892834l433288J669590Q234046J0281483M720998l118643p319246
42288C526925q926908r589690m970177O388617J4089253P597316o774862j2798562
42280a1458088o241460K242298M629313K764856j497293q681722j2316070k716052
42272c3274218J4864383K0823150P576023q196424q973424M23748M402975L82741
42264a971046k749909k237049k801120m245565j272301N254473Q072710M772596
42256B822789K80086j986437l443640m630880l461155J6510K910490M032772M452297
$$ y = [-3830374, -11875158, -11755546, -2152814, 2976008, -6166748, -20397905, -23542736, -14046487, -5397933, -6312858, -10172301, -7075330, 1656538, 6916264, 4618422, -1615181, -7508015, -10941303, -9271713, -1037667, 9243816, 13964814, 10846171, 3526925, -5399983, -14989673, -19959850, -13571233, 518020, 8115336, 1340474, -11458088, -17699548, -15457250, -10827937, -8063081, -9560374, -18242096, -30558166, -33274218, -18409835, 2413315, 9989338, 1792914, -7180510, -6756762, -2353787, -1971046, -4720955, -6958004, -9759124, -14004689, -15276990, -10022517, -1949807, 2822789, 3102875, 1116438, -2327202, -6958082, -10419237, -10402727, -7492237, -3459465, 992832]
42247I92832L847601R53978k605649l200373j67910K969077K373273k126816n922107
42238b886094l047621O084694J1801075O054352m941900p875785k079025Q383
42230C118079n260414n322231O468042J6232532R717917n130225j0950086o827239
42222B046375m570718o252360l945269J815858K096727k301486n50251Q324864
42214c336260J1723370L618742o223851q277124n539656m079392k809392Q73784
42206a4049779M623932O222488P377311Q000911M381629k933606o963832l948471
42198B710583J460913L528061J416119l721639j0045599j2105380n162684N814420
42190a6105206J0214254O376691K703190K876765J202429m384427o548354r45493
$$ y = [992832, 4840433, 5794411, 3188762, -11611, -179521, 2789556, 5162829, 3036013, -2886094, -5933715, 150979, 11952054, 18006406, 13064506, 5188721, 3109696, 3118079, -2142335, -7464566, -996524, 15236008, 24953925, 19823700, 8873614, 2046375, -2524343, -8776703, -12721972, -10906114, -8809387, -11110873, -11661124, -3336260, 8387110, 12005852, 5782001, -2495123, -8034779, -12114171, -14923563, -14049779, -9425847, -3203359, 4173952, 12174863, 16556492, 13622886, 6659054, 2710583, 4171496, 7699557, 9115676, 5394037, -4651562, -16756942, -21919626, -16105206, -5890952, 485739, 3188929, 6065694, 7268123, 2883696, -3664658, -4610151]
42182d610151O109106P863582N428328J064633o299186j3228779j0618740K075666
42174a2215541J1503981P752719j842714m812161j210892J82944l436760p401419
42166a1479843q034406m992416P07513N406907M509370l24524k027351O40020
42158a5594730J310268j368827p43321L517655J838965p084973r573150Q33904
42150b6864209R694015M384201m077475K56177J0461018Q906355k145131n505138
42142d890187P49205K186691m402835o223064O31988M053246j307338m666494
42134a3868788P04346O437504N780273M190454N254098K703418m615940o267610
42126C17755R83152M070622m434792j1000831k930585Q468442M923009q790468
$$ y = [-4610151, 1498955, 9362537, 14790865, 15855498, 9556312, -3672467, -14291207, -12215541, -711560, 7041159, 5198445, 386284, -824608, -641664, -4078424, -11479843, -19514249, -24506665, -23799152, -18392245, -13882875, -14207399, -16234750, -15594730, -14284462, -15653289, -16396610, -12878955, -11039990, -18124963, -27698113, -26864209, -17170194, -12785993, -16863468, -16607291, -6146273, 2760082, 614951, -4890187, -4140982, -1954291, -6357126, -12580190, -11948202, -7894956, -9202294, -13868788, -13164442, -6726938, -946665, 3243789, 8497887, 11201305, 6585365, 317755, 1300907, 5371529, 936737, -10064094, -12994679, -4526237, 396772, -8393696]
42118h393696j2116289o42602R215018O600584o72423j922839K297227O051969
42110D16949O504424K833005l773685o580720N06442J0904446J0158715l509562
42102A7460014j4435019j0996014j129833J907516n17309J567634P508765P122655
42094H488409p80244n329898j756349L42197o603208j4079481r661504L515563
42086b5864515J0700833O203088p16324q60814L727512O107595M110429K58083
42078C665887k196870p58733L384204L198822n887403j4754882q532841J0391582
42070a1490234J9908603P139665j1905642j3987086m36834Q204891L173230m535553
42062c928960n371249k716675q61650K621568P687459Q395523L866838P13017
$$ y = [-8393696, -20509985, -21152587, -11937569, -5336985, -6009408, -7932247, -5635020, 416949, 6921373, 9754378, 5980693, -600027, -93585, 10810861, 20969576, 17460014, 3024995, -7971019, -9100852, -7193336, -7710645, -6143011, 1365754, 8488409, 7708165, 2378267, 621918, 964115, -5639093, -19718574, -29380078, -25864515, -15163682, -8960594, -9676918, -10537732, -6810220, -702625, 3407804, 3665887, 1469017, 710284, 4094488, 7293310, 1405907, -13348975, -21881816, -11490234, 8418369, 15558034, 3652392, -10334694, -10771528, -2566637, 606593, -3928960, -9300209, -12016884, -12878534, -10256966, -2569507, 5826016, 9692854, 10405871]
42054A0405871J18102m588072j2348220j1087095J716190R865728J847123r493608
42046a3563981n753134Q485185J3323479L889373n187152m067517R02132K302978
42038C31363K710385N312593N733478J98439o670791q551045n632731j242325
42030g810634L767891Q369765Q606711L064563k859413l440044m92717J51107
42022I357229k206823k764818N92589L599229J505167m353552p999305n544589
42014g814873J467518Q915695J3705899J3685836P223589l664367j1855736j1763268
42006I900293o690071l993122l597559P72367Q153366Q871748J112360k727496
41998A1801886M695172J1060866K643264j1544007j1739887Q69359N240747n518278
$$ y = [10405871, 10523973, 5935901, -6412319, -17499414, -15783224, -5917496, -4070373, -13563981, -19317115, -10831930, 2491549, 6380922, 1193770, -2873747, -1971615, 331363, 3041748, 8354341, 14087819, 14286258, 7615467, -935578, -6568309, -7810634, -4042743, 4327022, 12933733, 15998296, 13138883, 9698839, 9206122, 9357229, 7150406, 4385588, 4978177, 8577406, 10082573, 5729021, -2270284, -7814873, -6347355, 2568340, 16274239, 29960075, 37183664, 33519297, 21663561, 9900293, 3210222, -782900, -4380459, -3608092, 4545274, 13417022, 14529382, 11801886, 16497058, 27557924, 30201188, 18657181, 6917294, 7786653, 13027400, 7509122]
41990G509122j2893207l230173J0594865J0542773K12823n724892o186470r074011
41982h249170j0752996j237314J3138103J3386416l054639j5450375q419562P856668
41974a2782869J4588141R002193J810480n85565k23068N44344J278111L94605
41966A4026372k498694l522883K26594N130504O068497L556518N81566l317567
41958B0250907q370143r506745l113442M450133M007226k743601n791179j926525
41950b743369K309157K819399L030463M984638N011904J620522p85582Q9981L18657
41941A6655770k637614n510377n833488n203088k840348M550178J2235188Q397414
41933A9813635o799791j4995014l821857J3092074J4713678K918079l153823J815673
$$ y = [7509122, -5384085, -8614258, 1980607, 12523380, 12736203, 7011311, 824841, -8249170, -19002166, -20239480, -7101377, 6285039, 3230400, -12219975, -20639537, -12782869, 1805272, 10807465, 12617945, 12032380, 11809312, 12353656, 13631767, 14026372, 11527678, 8004795, 8231389, 13361893, 19430390, 22986908, 23568474, 20250907, 11880764, 2374019, -739423, 3710710, 7717936, 4974335, -816844, -2743369, -434212, 2385187, 5415650, 10400288, 15412192, 17032714, 16247132, 16337113, 16655770, 14018156, 8507779, 2674291, -2528797, -5369145, -818967, 11416221, 19813635, 13013844, -1981170, -5803027, 7289047, 22002725, 24920804, 21766981, 23582654]
41925B3582654L672438n217899j3691393j1152304l049528J003033J401022K033482
41917a418495P25098m267827p107831l011847L251281N696444O518467Q897698
41909I282988Q356625J029958o556385o616301k814032k724171l637075J286047
41901b392346P564301M748520n194332r929526o653653m385316n227600l75340
41893b1845292J0465538J2978467R07693j0225779m948234Q273112R999831j187417
41885D417919q877420m356013L890289O386238M312988K109216J18224j369713
41877F631728l77157N71862m246119j1996677j0743621K735745J3983600R384853
41869E944214l316362m961315P888031J8500451J3474898r82597j0455448j0455537
$$ y = [23582654, 27255092, 22037193, 8345800, -2806504, -5856032, -4852999, -3451977, -1418495, -693397, -4961224, -12069055, -15080902, -11829621, -6133177, 385290, 9282988, 17639613, 18669571, 12113186, 5496885, 2682853, -41318, -3678393, -2392346, 5171955, 9920475, 4726143, -5203383, -11857036, -16242352, -21469952, -21845292, -11379754, 1598713, 2506406, -7719373, -12667607, -4394495, 5605336, 4417919, -4459501, -8815514, -4925225, 1461013, 5774001, 7883217, 8001441, 6631728, 6254571, 6826433, 2580314, -9416363, -20159984, -17424239, -3440639, 5944214, 2627852, -2333463, 5554568, 24055019, 37529917, 36547320, 26091872, 15636335]
41861A5636335o594856l388686r33268M00984o68723k862787l517138k851614
41853d779753k647381j551371K990015P986118O057296m201348j3674171j2460936
41845b2281531j759798P626925P704425J175934l166939p32655M356489M689543
41837b387607j443345q019685q974402n690174l901886m710206l546947J476033
41829c7198219N737320N364118L383330M119571N317786J973761l924234m542161
41821a9768728K117712Q029974N689355j613371m149919J829623R881204J1166805
41813A3182655L877934n459642q821277m590978J150445J753624j959317k776307
41805c642863L192928J0496728J0401786J620286p861379r848040m761619m34016
$$ y = [15636335, 9041479, 5652793, 4719525, 5120509, 4451786, 1588999, -1928139, -4779753, -7427134, -8978505, -5988490, 1997628, 8054924, 3853576, -9820595, -22281531, -24041329, -16414404, -8709979, -7534045, -10700984, -11433639, -7077150, -2387607, -3830952, -11850637, -20825039, -26515213, -30417099, -35127305, -38674252, -37198219, -31460899, -26096781, -22713451, -18593880, -13276094, -11302333, -15226567, -19768728, -17651016, -9621042, -3931687, -5545058, -9694977, -7865354, 2015850, 13182655, 17060589, 11600947, 2779670, -1811308, -660863, 1092761, -866556, -3642863, -449935, 10046793, 20448579, 22068865, 14207486, 4359446, -402173, -836189]
41797h36189k856164r045822r915771r11909J1268522J5204896Q190725n57960
41789A0540328k018063J633165K425316q90050k899206k442722m420747r022430
41781g094409q530664M0090P447341N189762p16323Q40889P409843O468055l209223
41772G845361p592776J030105J0966072P795664m896403j1597322o230905L020004
41764C39800P895905Q924965R150877P185147K06054r959388j6609809j3541388
41756f407837j397491J0504949J1642706J998586p058000o612862n37024K321410
41748D454437Q69780k64977q68201l974696p094380m741498P34513J033518m285783
41739a4137287n993548J72422O800100O857181L437053K117339J765067m43542
$$ y = [-836189, -3692353, -12738175, -22653946, -23565855, -12297333, 2907563, 11098288, 10540328, 8522265, 10155430, 12580746, 11690696, 8791490, 6348768, 1928021, -7094409, -15625073, -15584983, -8137642, -2947880, -3664203, -2823314, 4586529, 11054584, 7845361, 252585, 1282690, 12248762, 20044426, 15148023, 3550701, -2680204, 339800, 8235705, 17160670, 26311547, 33496694, 33702748, 23743360, 7133551, -6407837, -7805328, 2699621, 14342327, 16340913, 9282913, 2670051, 2133027, 4454437, 5324217, 5059240, 4191039, 216343, -6878037, -11619535, -10885022, -9851504, -14137287, -20130835, -19958413, -13158313, -6301132, -2864079, -746740, 1018327, 574785]
41731E74785j737057R72230L709255J113236m065395m702247l71457K526596J095411
41722h84643l8505L678255R338750R035427j002312j4182200j7886444o869761
41714a8811433Q578405J2805148L450638o271772n584285J011954L004569j142725
41706b959501m769067l833938r0938L511692M846098K642791p72605p0528N253800
41697C757804P948703L230197k883299k179285L247410N007435J408924k183460
41689A7354429l448728m464656m449930n99674M113778L475038q64972m98682
41681A0616603N341829O435517k610264j1831933q595096M389438J1681721M386996
41673A9814811r406665j4675598o463692N548678R059780L372038j326638J517575
$$ y = [574785, -1162272, -190042, 3519213, 4632449, 567054, -4135193, -4506650, -1980054, -884643, -923148, 2755107, 12093857, 21129284, 20126972, 5944772, -11941672, -18811433, -10233028, 2572120, 6022758, -249014, -5833299, -4821345, -1816776, -2959501, -7728568, -11562506, -11653444, -8141752, -3295654, -652863, -1425468, -1495996, 3757804, 11706507, 14936704, 12053405, 9874120, 13121530, 18128965, 19537889, 17354429, 13905701, 9441045, 4991115, 4391441, 8505219, 11980257, 11115285, 10616603, 15958432, 22393949, 19783685, 7951752, -643344, 3746094, 15427815, 19814811, 10408146, -4267452, -10731144, -5182466, 3877314, 7249352, 5922714, 7440289]
41665G440289O357848M786907j928672n772050m135999j498242l53317J504794
41657F401558M323024M837067K993753K908384M734429K826488m409798r700832
41649A4914073o971920n57295J594262n54046j272906J52785j267243o116604
41641g8894p391889p82308P185478O793159j076147m959992J769984J0783323
41633A2242714Q970747l884441j4233797j2147871k931994K005662K58933j402409
41625a1122456J242187M758546M705348K067016J083951L216549N105268K528151
41617A3584560l657769o865607k580200M367730N114331p34839m436127j504666
41609C287413J964077J43574l361231l146515j405063k149552k516375J501379
$$ y = [7440289, 13798137, 18585044, 16656372, 10884322, 6748323, 5250081, 4896764, 6401558, 10724582, 15561649, 18555402, 21463786, 26198215, 29024703, 24614905, 14914073, 7942153, 7384858, 8979120, 8425074, 7152168, 7304953, 6037710, -78894, -7470783, -8253091, -1067613, 5725546, 4649399, -310593, 1459391, 12242714, 21213461, 17329020, 3095223, -9052648, -11984642, -9978980, -9720047, -11122456, -9880269, -5121723, -416375, 1650641, 2734592, 5951141, 11056409, 13584560, 9926791, 3061184, 480984, 4848714, 9963045, 9228206, 4792079, 3287413, 5251490, 5395064, 2033833, -1112682, -2517745, -4667297, -7183672, -5682293]
41601e682293N975629M771808j71797l203333m754516p194030o253466J872244
41593a4639754R370438N863936m256015p195216p52259M237906K897143J871435
41585b602386M705315O296879M506756L448642K587199l254313j0206605p217524
41577a736037M081551P748336j788314r942224n547335K073312R85985l465497
41569g590223o60303N839169O181221K136774J855176L879385J059115n002069
41561G698245p121262n775556o392907p323181k950844M211552O236003K318345
41553i099605j566447k674727j765771K421973Q858518R250496j076398j1633709
41545g285670q673042M518252J1957164P192803j655323p101791r017686p030340
$$ y = [-5682293, 293336, 5065144, 4893347, 1690014, -3064502, -10258532, -16511998, -14639754, -5269316, 594620, -3661395, -10856611, -11608870, -7370964, -4473821, -2602386, 2102929, 8399808, 12906564, 16355206, 18942405, 15688092, 5481487, -1736037, 2345514, 10093850, 8305536, -1636688, -7184023, -5110711, -4124726, -7590223, -8250526, -2411357, 3769864, 5906638, 7761814, 11641199, 12700314, 7698245, 576983, -5198573, -11591480, -18914661, -21865505, -17653953, -11417950, -9099605, -10666052, -13340779, -15106550, -12684577, -3826059, 5424437, 4348039, -7285670, -15958712, -11440460, 516704, 7709507, 6054184, -1047607, -10065293, -17095633]
41537a7095633k8603O156025L768817l108924k854961M481412O411765q20138
41529c090240n227984J023285Q434847N203037n409041j1680683r228358j983224
41521b1958361N803932J0810222R520558K999421j655307l81916J949285p3193
41513G014641l384582j955493L170693N922563M134827M47485l176430o144650
41505F029054o386454k349011K999541M811907K730649Q92844J711948K954666
41497A3395144J502065k435702n902538o790841n685564m025772j580775K392816
41489i131167N739211M538877p73426m161102j899661J949441K085436N3212Q6531
41480a512648N86794k560735o493761m196288L496120P762432M728934l07101
$$ y = [-17095633, -17124236, -10968211, -7199394, -10308318, -13163279, -8681867, -2270102, -3090240, -8318224, -7294939, 1139908, 6342945, 933904, -10746779, -19975137, -21958361, -16154429, -5344207, 4176351, 7175772, 5520465, 5138549, 7087834, 7014641, 3630059, 1674566, 4845259, 10767822, 14902649, 15350134, 12173704, 6029054, -357400, -2706411, 293130, 5105037, 7835686, 8728530, 10440478, 13395144, 14897209, 12461507, 6558969, -231872, -5917436, -9943208, -11523983, -9131167, -3391956, 1146921, 373495, -3787607, -5687268, -3737827, -1652391, -1599179, -1512648, -925854, -3486589, -9980350, -14176638, -10680518, -2918086, 1810848, 1503747]
41472A503747l256530o116197q064977k213084J1792888K0721670J3067279l884232
41464B3550564j2577047q288757l161071o400110j0794227m600918R710742J7092551
41456D531727R478424l758590q229538k330505L294719J744230k411823k638604
41448c19960j7351J054074P34107J567878K877386L068322L483730M300301J507931
41439A8256418n249424p684421q90176N444009K6949j0204477q464572M977284
41431c788410J1419654K073294r495794r886467m344780k535689q56042O933212
41423a0481022J3147387P225021l714975l043624R179353J5035777N128970q794610
41415B3682277j1887977m520014L513621P143749O867015K652986m537425r039053
$$ y = [1503747, -1752783, -7868980, -15933957, -18147041, -6354153, 14367517, 27434796, 23550564, 10973517, 2684760, -476311, -6876421, -17670648, -22271566, -12560824, 4531727, 14010151, 10251561, 2022023, -308482, 2986237, 4730467, 2318644, -319960, -337311, 716763, 1450870, 3018748, 5896134, 8964456, 12448186, 16748487, 18256418, 13006994, 5322573, 4432397, 9876406, 9903355, -301122, -8765694, -3788410, 7631244, 9704538, 208744, -9677723, -14022503, -16558192, -17414234, -10481022, 2666365, 9891386, 6176411, 3132787, 12312140, 27347917, 32476887, 23682277, 11794300, 7274286, 10787907, 17931656, 24798671, 27451657, 22914232, 13875179]
41407A3875179o122979R1680J011310m274123p458378l270603K559974J820457
41399a767483l655583m295683L203329J0877896J0545095L998248j624268l551136
41391A3730415l186146n85438L944334N636627N05855o576080p064683j450731
41383D954153J704801l97889j427127J931217M502231K886155J333657K231446
41375A7718644M50704n801097p808911M23975R248344N226051q426196j5188725
41367d157211p786462L622102O970725K585409j164367L43579M435075N692515
41359A0541365J614892m335751n321708Q80539P828071P861400J947002k593869
41351A8421941k852798k825797m900441n368100j286173L094815J299841n969373
$$ y = [13875179, 7752200, 7843880, 8855190, 4581067, -2877311, -6147914, -3587940, -1767483, -5423066, -9718749, -6515420, 4362476, 14907571, 18905819, 17281551, 13730415, 10544269, 9958831, 13903165, 19539792, 20045647, 13469567, 6404884, 4954153, 6658954, 6261065, 4833938, 6765155, 11267386, 14153541, 15487198, 17718644, 18169348, 12368251, 4559340, 4983315, 14231659, 19457710, 11031514, -4157211, -11943673, -8321571, -1350846, 1234563, 70196, 413775, 4848850, 10541365, 12156257, 7820506, 2498798, 3379337, 11207408, 19068808, 21015810, 18421941, 15569143, 12743346, 7842905, 2474805, 1188632, 4283447, 5583288, -386085]
41343c86085j0637984o947711J411186N820453L322861k95082R83202N247442
41335a481718O614266M725113M471093O880039P117168L037617j043741k063861
41327B8255976l196897o960849r337168o054294J93435M187899N326344N084019
41319A7498465K412728k181267l151895K127369O740463M016593o08283K302707
41311B9156880R731325J0072164K502372o39776O960306J6572195J9443063J9792214
41303A13590743K6110509L8547614N1808895O1492382N9223961L1745978k0754411
41296C61765671p0582633q4021978n9467648l0238375k4087396l2808195l1201561
41289B9357885j4418061m99120n08790m559914j409442L918911J930895l306173
$$ y = [-386085, -11024069, -17971780, -16560594, -10740141, -7417280, -7712362, -6729160, -1481718, 5132548, 9857661, 14328754, 21208793, 28325961, 31363578, 30319837, 28255976, 25059079, 18098230, 8761062, 2706768, 2900203, 7088102, 12414446, 17498465, 19911193, 17729926, 14578031, 16705400, 23445863, 27462456, 26854173, 29156880, 38888205, 48960369, 51462741, 50822965, 57783271, 74355466, 93798529, 113590743, 139701252, 178248866, 230057761, 291550143, 350774104, 382520082, 361765671, 291183038, 207161060, 147693412, 117455037, 93367641, 60559446, 29357885, 14939824, 14440704, 13931914, 9372000, 7962558, 11881469, 13812364, 10506191]
41281A0506191j287678N903693O134907k574063q119797k961768N207721O163660
41273A8972866P73241l854566m891772l419730k54854J999556r76027p276936
41265A071778p465562K104110J1090093Q264993k723009r501467q250403n054096
41257a0463563l198575J95528N324465P089553K963478l283667o850867o001559
41249a4225207j478969L456343M201907Q62082r3709M179340O225090k96507p830477
41240e000107m864989M907531O774650k500538j0406262q506810k606506N82845
41232b1620186L323068P535019Q121938L150071j54658K441920M195938l734l365637
41223C623739K99037L706144j652405q625151m705949O110883Q167417r19436
$$ y = [10506191, 9218513, 15122206, 21257113, 18683050, 10563253, 7601485, 12809206, 18972866, 19746107, 15891541, 10999769, 7580039, 7325185, 9324741, 8348714, 1071778, -6393784, -4289674, 6800419, 15065412, 12342403, 2840936, -5409467, -10463563, -13662138, -13466610, -8142145, -1052592, 1910886, -1372781, -8223648, -14225207, -15704176, -12247833, -8045926, -7183844, -7277553, -3098213, 3126877, 2830370, -5000107, -9865096, -4957565, 1817085, -683453, -11089715, -19596525, -22203031, -21620186, -18297118, -10762099, -2640161, 509910, 355252, 2797172, 6993110, 6989376, 3623739, 3922776, 7628920, 5976515, -2648636, -7354585, -1243702, 6923715, 6004279]
41215F004279o959542k915778M91620n484203j1526842m938554R089557J4026873
41207b212590N791257k767124j716066K961623J111617n220842n638082J817298
41199e872909P172652L352588l709687n004984k352958m075368r646502q882767
41191b9019935J910984J2386356J1726855K791038l404983k020508L281822P854840
41183E506469Q720190L355172o140293j0315909k741193Q273125Q153025l421426
41175A1389160j1112216n782673L048065K504255n286617q662792l619116L934288
41167a3587646Q870238J0190085O119910m197106j4197104j4280006m536083M272385
41159b1345327M365381j004494m669931l597049K216529J1108410J6707537J1527377
$$ y = [6004279, -955263, -3871041, -3379421, -8863624, -20390466, -25329020, -16239463, -2212590, 3578667, 811543, -904523, 2057100, 3168717, -2052125, -7690207, -5872909, 1299743, 4652331, 942644, -4062340, -6415298, -10490666, -20137168, -29019935, -27108951, -14722595, -2995740, -204702, -3609685, -5630193, -2348371, 5506469, 14226659, 17581831, 11441538, 1125629, -1615564, 6657561, 14810586, 11389160, 276944, -5505729, -2457664, 46591, -5240026, -13902818, -17521934, -13587646, -4717408, 5472677, 11592587, 7395481, -6801623, -21081629, -25617712, -21345327, -16979946, -17984440, -22654371, -26251420, -24034891, -12926481, 3781056, 15308433]
41151A5308433j491713q637450k819526N949854N078826k662236n719727k595939
41143B410522j540301l879887j384350P953272J3795746P916871m415815j2589910
41135H266148j2808765p492719M70694P543654R238472N235093P35204o99175
41127A0488606q78723j001307J474952O195123P266517K353712k511803k976896
41119B0410181l716611q343073r863005j792663P278662L534017r993951j5201264
41111a7687707m467795Q613109R300840J416281j589595K434726L585510k328594
41103g23225o790291k733413L333887J294867n451254l959919O782070J0993456
41095B746178m41096j3057969q293969P755702J2455766J207501o081108K625897
$$ y = [15308433, 13816720, 5179270, 2359744, 8309598, 13388424, 10726188, 5006461, 2410522, 870221, -3009666, -4394016, 3559256, 17355002, 25271873, 20856058, 8266148, -4542617, -12035336, -11564642, -4020988, 5217484, 10452577, 11187781, 10488606, 9609883, 8608576, 10083528, 16278651, 23545168, 25898880, 23387077, 20410181, 16693570, 8350497, -1512508, -3305171, 3973491, 7507508, -2486443, -17687707, -22155502, -13542393, -4241553, -2825272, -4414867, -1980141, 1605369, -723225, -7513516, -10246929, -6913042, -5618175, -11069429, -15029348, -8247278, 2746178, 2305082, -10752887, -19046856, -11291154, 1164612, 2372113, -3708995, -1083098]
41087a083098J2445492N848745j0061146j5456714o189899M958168Q430705N299994
41079D192247n41455n198931l842162K679409N412774O79075k199061K694841
41071C876737M541225n847857j5046542m966136J5329726J9402314K810946j1358906
41063H741507q154229J651605N037179N217164P277602N009195n690094j5202213
41055C887716j3740098n172724J758142N256109O145149K963227j887393k306362
41047c096234k4410l147065q855514l858089J1335843J7028084L536991j2269611
41039F49995j2703389m191805r64925l94798O400118J3101163Q534532j404363
41031I026528l134774Q51312j608108q112869n394301N734976J0118819K889870
$$ y = [-1083098, 11362394, 17211139, 7149993, -8306721, -14496620, -9538452, -1107747, 4192247, 3650792, -1548139, -5390301, -2710892, 2701882, 3380957, 1181896, 3876737, 8417962, 2570105, -12476437, -17442573, -2112847, 17289467, 20100413, 8741507, 587278, 2238883, 7276062, 12493226, 19770828, 24780023, 19089929, 3887716, -9852382, -15025106, -13266964, -8010855, -1865706, 1097521, -789872, -3096234, -3120644, -6267709, -15123223, -18981312, -7645469, 9382615, 12919606, 649995, -12053394, -16245199, -17210124, -17604922, -11204804, 1896359, 10430891, 9026528, 5891754, 6743066, 5134958, -2977911, -8372212, -2637236, 7481583, 10371453]
41023A0371453m653803n115650l510057l468653j096716L998258N619395K364528
41015D508755O583L39882p11447k719794o92752L534819K449860l229250m678475
41006a191819p30816p0818m945226o428126l75410M894099K689186j773643j647761
40997i580334P82233J27387l213051n688503n694069k643953K557464M739893
40989a8612933O0385n313380j989968O948856R093272K669157q20619K928200
40981e037030L642359m061197r520660l970732M351022M563659L80273L07413
40973i344893J544513k148283n580388n06186P841482Q229502K602711J954409
40965D592867O269097N152386k348492n438619j169670Q7972o041898q458487
$$ y = [10371453, 5717650, 602000, -2908057, -6376710, -7473426, -3475168, 2144227, 4508755, 4515338, 4855220, 4143773, 1423979, 731227, 4266046, 6715906, 3486656, -1191819, -1922635, -1993453, -6938679, -13366805, -13742215, -8848116, -6158930, -7932573, -9580334, -8798101, -8670714, -11883765, -17572268, -23266337, -25910290, -23352826, -18612933, -18552548, -23865928, -25855896, -18907040, -9813768, -7144611, -7965230, -5037030, -1394671, -5455868, -14976528, -18947260, -14596238, -10032579, -9652306, -9344893, -7800380, -9948663, -15529051, -16035237, -8193755, 35747, 2638458, 4592867, 10861964, 16014350, 13665858, 8227239, 7057569, 7145541, 1103643, -7354844]
40957g354844Q13576J1026739P344284o982122j5293904j0391968j249592K372253
40949a9715578J663776K547870N491352O377901L604476l03245k871984m118877
40941g324309m801794m444287j903205K788581P431775Q581281M498012j980181
40933B845873m884077j496620L538028L471713j207496k695312L148433R892445
40925A2612987Q510535m71080p757107p221153k111490J011907j6094k789227
40917A769278m215247k537474J981678O413458O875748K506525l258280o222305
40909C313381n371808l025293k059964l080783l714237j405833K550551L850002
40901h943984J622732J079758O189723J2180223J0567274R48851p734859q597000
$$ y = [-7354844, -6541268, 4485471, 11829755, 4847633, -10446271, -20838239, -22087831, -19715578, -18051802, -15503932, -10012580, -3634679, -30203, -333448, -3205432, -7324309, -12126103, -16570390, -18473595, -15685014, -8253239, 328042, 4826054, 2845873, -2038204, -3534824, 3204, 3474917, 2267421, -427891, 2720542, 12612987, 21123522, 20652442, 12895335, 5674182, 3562692, 4574599, 4558505, 1769278, -2445969, -4983443, -3001765, 3411693, 10287441, 12793966, 9535686, 3313381, -2058427, -5083720, -7143684, -10224467, -13938704, -15344537, -12793986, -8943984, -7321252, -6241494, -51771, 12128452, 22695726, 23644577, 15909718, 7312718]
40893G312718m504679k452236m418463o804092o396207l748423j282329n0502
40885b2344213J040968L047462M901002N055418M675099N838347O190379O96111
40877I100573q730572j1776538l475720O523751O527404k02465j508666L592927
40869E0694L915794m127882r513361m351839L574084M137891Q38785K972707Q624939
40860F121812P489453j846141q669757n259444L421381P708534M583922j948429
40852A1601331p083895q396324n767788j352394J726031K576364L102102L965690
40844C71117K390449k890074o338023p20629J1364023J6953616Q152632o428775
40836B2854336j2247948p633097l210920l955094l320178K263757N499122J671612
$$ y = [7312718, 2808039, 355803, -4062660, -10866752, -17262959, -21011382, -22293711, -22344213, -21303245, -18255783, -13354781, -8299363, -3624264, 2214083, 8404462, 9100573, 370001, -11406537, -14882257, -8358506, -1831102, -2033567, -3542233, 50694, 3966488, -161394, -9674755, -14026594, -10452510, -6314619, -5475834, -2503127, 6121812, 13611265, 11765124, 3095367, -2164077, 1257304, 8965838, 13549760, 11601331, 4517436, -3878888, -9646676, -10999070, -9273039, -6696675, -3594573, 371117, 2761566, -128508, -6466531, -7187160, 4176863, 21130479, 29283111, 22854336, 10606388, 2973291, -237629, -4192723, -7512901, -5249144, 249978, 1921590]
40828A921590j206194M260032J0661288P246127j797218m712631k488735n588399
40820H295860j2748581j0737626K767490J2825973R034004p21012m815056l223072
40812F77980q09533K717254P225932O823019k91606n204516j094293N014381L205550
40803A8264168l503035n118299j170431K46855k980069m628636j971242r9435
40795i60124k541381n019409j900135N321811R336031N975642j13118p96215M153157
40786A3456259N396846k160408r447481n843011K852643K162046p239246j0011872
40778a0834224k395139J289774m529954l936583J2508844K5848852J5123714p986041
40770B5089243j4793262j943606P128402N23242p959547o302249j962245l402752
$$ y = [1921590, 715396, 4975428, 15636716, 22882843, 21085625, 16372994, 13884259, 8295860, -4452721, -15190347, -12422857, 403116, 9437120, 8716108, 3901052, 677980, -131553, 2585701, 9811633, 16634652, 16343046, 11138530, 10044237, 15058618, 18264168, 14761133, 9642834, 8472403, 8719258, 5739189, 1110553, -860689, -960124, -3501505, -8520914, -10421049, -5099238, 4236793, 10212435, 10099317, 9303102, 13456259, 18853105, 16692697, 7245216, 1402205, 4254848, 6416894, -822352, -10834224, -13229363, -11939589, -16469543, -20406126, -7897282, 17951570, 33075284, 25089243, 10295981, 8352375, 15480777, 16004019, 8044472, 1742223, -220022, -3622774]
40762c622774m160837K391318Q027376L206680n710352o606723q54863J171278
40754f158897j616828r09832M864996P059715R45251o792955q097761l699181
40746a4405492P55180L133346M600605M660454J847344k051898l677191l995638
40738i133290o967313j0584135n801744R943385K3306860J8492097r90470j4231803
40730D033587q892233M603652R689439M751293p32990l187087o314894r188027
40722e237260n567369L847263R042620M409354k753308k284830N301203J0416080
40714A7173753O952780j412404p107036p138503l973730j61388M023759O784511
40706A5141742L495527o077779j2593777o681266O812040J2360755L472508r016977
$$ y = [-3622774, -7783611, -5392293, 2635083, 5841763, 131411, -6475312, -7330175, -6158897, -7775725, -8685557, -3820561, 3239154, 4184405, -2608550, -10706311, -14405492, -13650312, -10516966, -5916361, -1255907, 591437, -1460461, -5137652, -9133290, -16100603, -26684738, -32486482, -22543097, 763763, 19255860, 18265390, 4033587, -4858646, -254994, 9434445, 14185738, 13452748, 10265661, 3950767, -5237260, -10804629, -6957366, 2085254, 6494608, 3741300, 1456470, 6757673, 17173753, 24126533, 22714129, 15607093, 8468590, 4494860, 4333472, 8357231, 15141742, 18637269, 12559490, -34287, -6715553, 96487, 12457242, 15929750, 6912773]
40698F912773j1852817n330749L97825q76065o299639q530675k335769R190142
40690a8724974J4373795N727161p253468q396045J347536M577619m447373r791140
40682b2586889q17309R008607N074407k952316J537294J1928862R041824n410964
40674D823516j0896240j669374N771126J396318m300798j196673M519274L998064
40666B445213M45335J038891N001585P243329N709669N39779o366670r032029
40658G025102l546085L097569R12497o752047p730496j710150m80624n403032
40650a4587266k798323J1503651K0550704J0371917q082968j4086028m636865
40643a765178N776830O681848J337313k360966k013822j529682n009779r589146
$$ y = [6912773, -4940044, -10270793, -9872968, -10749033, -17048672, -25579347, -27915116, -18724974, -4351179, 1375982, -5877486, -14273531, -12925995, -8348376, -12795749, -22586889, -23404198, -14395591, -9321184, -12273500, -10736206, 1192656, 10234480, 4823516, -6072724, -7742098, -1970972, -574654, -4875452, -6072125, -1552851, 2445213, 2890548, 3929439, 8931024, 16174353, 21884022, 22423801, 16057131, 7025102, 3479017, 6576586, 7489083, 737036, -6993460, -8703610, -9184234, -14587266, -17385589, -5881938, 14668766, 25040683, 16957715, 2871687, -1765178, 4011652, 10693500, 12030813, 9669847, 7656025, 6126343, 1116564, -8472582]
40635h472582o826954M185379J0250823Q49137j2941126j1225991M713527J3231765
40627f236022N109521m023601l24991Q336450R167218M215257J129937j457514
40619A5916255o378425p920319k041847L905222L019804n950J59280o93370m668427
40610A292223l298931O327070J0655547L59823j0987502o856544N029917N743774
40602H265377l428050m985020M059001Q125596j16208r128063q142837j106939
40594f457143L451997L849878K563966J466132J782925J993110k515161j0652654
40586d516950j1698750J996J2561180J1353033P81174l257693J833305M427373
40578A1484668J09294l145794j419171j13833j025933O67914M163394K238322
$$ y = [-8472582, -15299536, -11114157, -863334, -14197, -12955323, -24181314, -19467787, -6236022, -1126501, -5150102, -5475093, 2861357, 12028575, 16243832, 17373769, 15916255, 9537830, 1617511, -424336, 3480886, 6500690, 6494740, 6654020, 5960650, 1292223, -2006708, 4320362, 14975909, 15335732, 4348230, -2508314, 2521603, 8265377, 4837327, -147693, 3911308, 12036904, 11920696, 2792633, -5350204, -6457143, -3005146, 844732, 3408698, 4874830, 6657755, 8650865, 6135704, -4516950, -16215700, -16213704, -3652524, 7700509, 8481683, 5223990, 7057295, 11484668, 11593962, 8448168, 7028997, 6915164, 5889231, 6557145, 10720539, 12958861]
40570A2958861m554731o895216k896421j380448n389117o489598m74672M681580
40562a0439762K817125m76350J159325M265470K995477j432178m899486o605674
40554a2616053o187135j799293M716314P611178N473324K940252K254139R98773
40546C391499j72711L115461R271072R884189K218081n969116p542414m086328
40538A0109733l69573J231003r64473o501328q579318j188891Q746136Q107385
40530A0590674j986522o049348J991266R467224N668447k230740k784112K243348
40522A6910237M021259P28742l890560p847072q657830k147423Q665862J2026057
40514A9809272K743062r262012j3088406j0316079o763492j578935N695995P861922
$$ y = [12958861, 8404130, 1508914, -1387507, -2767955, -8157072, -14646670, -15121342, -10439762, -7622637, -8098987, -6939662, -2674192, 321285, -1110893, -6010379, -12616053, -18803188, -20602481, -15886167, -8274989, -2801665, 138587, 2392726, 3391499, 3218788, 6334249, 15605321, 25489510, 27707591, 21738475, 14196061, 10109733, 9740160, 10971163, 10006690, 3505362, -5073956, -6262847, 2483289, 10590674, 8604152, 2554804, 4546070, 14013294, 19681741, 17451001, 14666889, 16910237, 20931496, 21660238, 17769678, 9922606, 1264776, -882647, 7783215, 19809272, 22552334, 13290322, 201916, -10114163, -16877655, -18456590, -12760595, -4898673]
40506d898673J713747k520081L524322J0087655L122111j2010143j6688423n795814
40498b3465299O895271R567151N073251J629529K053347M443671N527993K455214
40490A4180128k912271l626000K292455O055200N59484o986478n654520J191771
40482E099769J682618m345864n930409o52323K039686j288364k499844J840110
40474d054621L768653j47312m55590Q439016J5406303Q195810o764902j2792399
40466A1594958o166409J175065K22865m864079o254274l488568j542837k746167
40458a2069446m250307k310027K477396M874208J314602l915959k543200O302339
40450a0120394J3140085J0060556J484312k198540J111708L894200J228264k692735
$$ y = [-4898673, -3184926, -5705007, -2180685, 7906970, 11029081, -981062, -17669485, -23465299, -16570028, -7002877, -1929626, -300097, 1753250, 6196921, 11724914, 14180128, 11267857, 7641857, 9934312, 15989512, 16548996, 9562518, 3907998, 5099769, 6782387, 2436523, -3493886, -4146209, -2106523, -3394887, -5894731, -4054621, -285968, -433280, -888870, 7550146, 22956449, 31152259, 24387357, 11594958, 5428549, 6603614, 6826479, 1962400, -4291874, -7780442, -9323279, -12069446, -16319753, -18629780, -16152384, -11278176, -9963574, -13879533, -16422733, -10120394, 3019691, 13080247, 14564559, 12366019, 13477727, 17371927, 18600191, 15907456]
40442A5907456k366975M59505J34946m450353r204453j0886756r583893n877170
40434b5867693L4193N732566P267494M447715K165709L797430O073858M047417
40426G698689q50789k210013K196893O887402N497378j775904q936851j0549253
40418b042448o449012j408620k98275k619106k914464J794960P167342P356394
40410E86771L474286J279699J683103l1721m819855o422295l51382Q719466J2264103
40401A6382175P341477j932347r124945r496668k952453M461441N578388J068304
40393A1325372p69043L821825P088897L87591j1869478j6200937p710384L167444
40385a0758713M436656j947801l859373L312827R932405O524884j372526j341294
$$ y = [15907456, 13540481, 13999986, 14134932, 9684579, 480126, -10406630, -19990523, -25867693, -25833500, -20100934, -12833440, -8385725, -6220016, -2422586, 3651272, 7698689, 6847900, 4637887, 6834780, 13722182, 19219560, 17443656, 8506805, -2042448, -8491460, -9900080, -10198355, -12817461, -15731925, -13936965, -6769623, 586771, 4061057, 5340756, 7023859, 6992138, 2172283, -4250012, -4601394, 4118072, 16382175, 23723652, 21791305, 12666360, 3169692, 217239, 4678680, 10257068, 11325372, 10556329, 14378154, 21467051, 21854642, 9985164, -6215773, -13926157, -10758713, -6322057, -8269858, -12129231, -8816404, 1116001, 7640885, 6268359, 4927065]
40377D927065N697883N571690o403459j6213733j2400224l543623k138964k925585
40369b7428950N214769J4987602J0617447k534082l617962P885264R314554o014276
40361H424366j5145338l778723R078609L960803o080534l23430J1919922Q146811
40353A6202486o834229r384207J852960O028292j311512k546475O398967P152604
40345A7558886n896149j1885508R65835J2861292M091065j2692246j3601288o19737
40337i217850N785960Q28260j294870N696914J1057671O364103k148095m626692
40329A2445401k08316M927209N066187j076862q670137r497111j453928O431319
40321G963762M287856n132641r770639m008903N385040R113048N359557r94138
$$ y = [4927065, 10624948, 16196638, 9793179, -6420554, -18820778, -22364401, -24503365, -27428950, -22214181, -7226579, 3390868, 856786, -2761176, 5124088, 14438642, 8424366, -6720972, -10499695, -1421086, 2539717, -3540817, -3864247, 8055675, 16202486, 9368257, -15950, 1837010, 7865302, 6553790, 4007315, 10406282, 17558886, 11662737, -222771, 743064, 13604356, 17695421, 5003175, -8598113, -9217850, -3431890, -2603630, -3898500, 1798414, 12856085, 19220188, 17072093, 12445401, 12237085, 17164294, 22230481, 21153619, 12483482, 2986371, 1532443, 7963762, 12251618, 7118977, -2651662, -6660565, -1275525, 7837523, 13197080, 12202942]
40313A2202942m689186m243855k321025k370524l819016k553638J893275L180826
40305b720201l385215j1774649j0763882J325890J3065622J3311915M015524l874582
40297g99578m689710k968911l591386l036638L958656J2355853J0609065j791573
40289A0045778j0203919m443070N923417N682608l077827n361022K243942O837161
40281G647068J088515n125409j577614O225678P126119J264848l335231m611674
40273H702300o217757p372851l470100M211298Q203784M913327j510832n915695
40265A543474p160739n679351j341568M172429O578065L371084k509648n726332
40257f752586n059246m540106o416526n445628M500761J8055372K0599877P573765
$$ y = [12202942, 7513756, 3269901, 948876, -1421648, -5240664, -7794302, -5901027, -2720201, -6105416, -17880065, -28643947, -27318057, -14252435, -940520, 3075004, -799578, -5489288, -8458199, -12049585, -15086223, -11127567, 1228286, 11837351, 10045778, -158141, -4601211, 1322206, 7004814, 3926987, -1434035, 809907, 7647068, 8735583, 3610174, 2032560, 8258238, 15384357, 16649205, 13313974, 8702300, 2484543, -4888308, -8358408, -4147110, 4056674, 8970001, 7459169, 1543474, -5617265, -11296616, -12638184, -8465755, -1887690, 1483394, -1026254, -6752586, -11811832, -16351938, -22768464, -28214092, -23713331, -5657959, 14941918, 22515683]
40249B2515683o394093o236834K382047K663126p097340j2022769m865237M360073
40241d695344O215255M046231K614780j080501p753915r565024l003800L375601
40233i846717L071493J967460N059779N313723k417507q378073k960876N766310
40225b424408N157705p02001O1994M742111J820685n912986m261346P697686J4995751
40216B1175191J0027230J183630l748011o639600q785919o831348k176247p31364
40208C473562j166408K688977O945040J555280r153662q657336M444017J0986997
40200A1116467J120815r729367o139123L886721N064986p74692k648948p09584
40192A187275j745689l539273j09729M416472K637372j395510P90082N764605
$$ y = [22515683, 16121590, 9884756, 12266803, 14929929, 7832589, -4190180, -9055417, -4695344, 1519911, 5566142, 8180922, 7100421, -653494, -10218518, -13222318, -9846717, -6775224, -4807764, 252015, 5565738, 3148231, -5229842, -8190718, -2424408, 2733297, 2031296, 2093290, 6835401, 8656086, 2743100, -1518246, 6179440, 21175191, 31202421, 32386051, 28638040, 21998440, 13212521, 6381173, 4204926, 3473562, 2307154, 4996131, 11941171, 13496451, 4342789, -4314547, 129470, 11116467, 12237282, 2507915, -3631208, 255513, 5320499, 4545807, 1896859, 1187275, -558414, -4097687, -4207416, 209056, 2846428, 1450918, 2241000, 8005605]
40184H005605M066257k148033k821258J975052L376164Q65592K061327O044736
40176B1425442L189307o808517j2208971p799944j969738j012026J04903N546452
40168D66908R280163N079010l330147q336367p311837j575225N422030O372767
40160F067302l280187j4091983j0133962P492687J8127132R840467l838582n975643
40152D207231q58516j614924n336767k77604R104838O342294q446317j5340852
40144a2220617m668510Q335049P339533k058248m371487K329194P785828O970170
40136I440912L555996m6078m653982p714140m623333K896268P498850O164352
40128A2518845L085835J853220P79593k425544o358921q340147p559958m405045
$$ y = [8005605, 12071862, 9923829, 7102571, 9077623, 12453787, 13319379, 15380706, 21425442, 24614749, 17806232, 5597261, -2202683, -4172421, -5184447, -5079544, 466908, 9747071, 14826081, 11495934, 3159567, -4152270, -5727495, -305465, 6067302, 2787115, -11304868, -21438830, -13946143, 4180989, 14021456, 10182874, 4207231, 3348715, 1733791, -3602976, -3880580, 5224258, 11566552, 3120235, -12220617, -16889127, -8554078, -1214545, -3272793, -7644280, -5315086, 2470742, 9440912, 12996908, 12950830, 8296848, 582708, -4040625, -1144357, 6354493, 12518845, 15604680, 17457900, 18237493, 15811949, 9453028, 1112881, -6447077, -10852122]
40120a0852122L20807M498231N713692L888871Q32738k294917m449868l129438
40112e472006K389117P215410N688527J51123j204933L374248N652195m72826
40104A7320855r160898j0197209k523542N392024O642596K209953k890194n195008
40096A598577m152111j131539J858362L537177L439713R24918l794683p525692
40088e245278o525697k194318k01857k045936k337233K429652P671254P795453
40080f53960M420371J886284m52860m354699n708944m04356N985557M574583k245607
40071C046369l565647K372777M943100j600470q922828p923735j449305K895428
40063a0204311M253782N355037M885326J216067j633433J08603K353217o83393
$$ y = [-10852122, -10531315, -6033084, -319392, 3569479, 4402217, 2107300, -2342568, -5472006, -3082889, 4132521, 9821048, 9972171, 8767238, 12141486, 17793681, 17320855, 8159957, -2037252, -4560794, 831230, 7473826, 9683779, 6793585, 1598577, -2553534, -3685073, -1826711, 1710466, 5150179, 6075097, 2280414, -5245278, -11770975, -13965293, -14167150, -16213086, -18550319, -16120667, -8449413, -653960, 3766411, 5652695, 5199835, 845136, -4863808, -5268164, 717393, 5291976, 3046369, -519278, 1853499, 6796599, 5196129, -3726699, -11650434, -13099739, -10204311, -5950529, -595492, 4289834, 5505901, 3872468, 3981071, 6334288, 5650895]
40055E650895o240706o853950j802369K919252M166538L993865L920420L594853
40047I348798L943450N461572M946800R8893m605891l290389K008497M345340
40039B2257070K153347q64313l802706q040373j0699550q100417m181259n090998
40031a6369199o844640o76703R760952J1271649L279380P46303R265982J4251485
40023B4685209M981884o679904n911971M49679k956566j2162178j0146511L531510
40015d208848J0889442M117069l819789j749865M147764M704859K405215K049415
40007A8535262n76389r154914j5184791q280045P075253J6138444J2548229L164704
39999B4265753l767017o569996o561600m236820q10419J228016Q44587o17799
$$ y = [5650895, -589811, -7443761, -9246130, -6326878, -2160340, 1833525, 5753945, 9348798, 13292248, 18753820, 23700620, 23799513, 19193622, 15903233, 17911730, 22257070, 24410417, 23546104, 19743398, 11703025, 1003475, -7096942, -11278201, -16369199, -23213839, -23890542, -14129590, -2857941, 421439, 1167742, 10433724, 24685209, 29667093, 22987189, 17075218, 17524897, 14568331, 2406153, -7740358, -4208848, 6680594, 10797663, 6977874, 5228009, 9375773, 14080632, 16485847, 18535262, 17958873, 8803959, -6380832, -14660877, -7585624, 8552820, 21101049, 24265753, 20498736, 13928740, 7367140, 3130320, 2319901, 3547917, 4392504, 3774705]
39991C774705j508694j238334k11368M35294J15930K2636R28064M72686l285386
39982d94467o343387l001079M120719O280796K448583J202308N066789M447383
39974A3727645n237168j1934381m473545P534373O580662n567300j0548235j762337
39966a1680286P066321M300766m013606o483882j777564M683326R239699R238969
39958A0573743K886458m698836m239869L636738O588842j270167r443576o902191
39950b868858J740512N194096K358882j08687m99748j650590k641558p88765J909574
39941B644858K699127L641968N196111R20271j1271987j9519594j2269671L376936
39933b4581981J1112370Q363074M962384L405810j945973q003446m674272N310582
$$ y = [3774705, 2266011, 1027677, 816309, 1251603, 1367533, 1390169, 2318233, 2790919, -494467, -6837854, -9838933, -5718214, 562582, 3011165, 4213473, 9280262, 13727645, 8490477, -3443904, -7917449, -383076, 6197586, 630286, -9917949, -11680286, -4613965, -313199, -4326805, -10810687, -12588251, -7904925, 1334774, 10573743, 13460201, 8761365, 4521496, 8158234, 14747076, 13476909, 4033333, -2868858, -1128346, 4065750, 6424632, 6315945, 5816197, 4165607, 1524049, 735284, 2644858, 5343985, 8985953, 14182064, 15102335, 3830348, -15689246, -27958917, -24581981, -13469611, -5106537, -144153, 3261657, 1315684, -6687762, -11362034, -6051452]
39925f051452P643292O69008j638392M003410K844216r587887j4403070L12309
39917a6208566J6253550J1697883m686171r321083p21131L606542n56461p65479
39909g00916N730411O994635n02249n725254l419001p56751k16048M259324R849239
39900A5513390M741908q295717j0357930K246603P943152n154595j6888049p026730
39892a7277968J0300433R011598o551463j0028779L685713J2727099N357561m372454
39884B851740l248038K197074K072674o73960o19103j083627m839444o257922
39876i600606k153670Q83673j192625j505376M376279P802457R94208p950877
39868h346537o550587K856441Q190545O411633M140345L104534j517845q716042
$$ y = [-6051452, 1591840, 2260848, 622456, 4625866, 7470082, -2117805, -16520875, -16208566, 44984, 11742867, 7056696, -2264387, -2985518, 621024, 64563, -700916, 5029495, 12024130, 11521881, 5796627, 2377626, 1620875, 1404827, 5664151, 15513390, 20255298, 11959581, 1601651, 3848254, 11791406, 6636811, -10251238, -17277968, -6977535, 2034063, -4517400, -14546179, -10860466, 1866633, 7224194, 2851740, -396298, 1800776, 3873450, 3199490, 2580387, 1496760, -3342684, -9600606, -11754276, -10870603, -12063228, -13568604, -9192325, -1389868, -395660, -8346537, -14897124, -12040683, -3850138, 2561495, 6701840, 9806374, 8288529, -427513]
39860d27513r863039j588249Q608582J2154721Q294154J787207k583293k335427
39852A4047143J000608K323333q16583l943611k386381M62684j576820o204234
39844B906139n339959J179503L994917j334333o834357l805376M270062O541190
39836A577786n87602r159226r716792k123306N014181M655185q75991l883896
39828a5099661j448674K507115N050970P857679J0629298Q030761j396043r347344
39820F784101p847600m60173M013406M393871N168836N973935L024417j872491
39812A9178302l991714m857200p965500q289930P56317J1507433Q871891n493513
39804I716086j2394865l430743O314536K462056o928780o169031L287928P475156
$$ y = [-427513, -10290552, -11878801, -3270219, 8884502, 17178656, 18965863, 16382570, 14047143, 15047751, 17371084, 16554501, 12610890, 10224509, 10687193, 9110373, 2906139, -2433820, -1254317, 2740600, 1406267, -5428090, -9233466, -4963404, 1577786, 990184, -8169042, -17885834, -20009140, -14994959, -10339774, -11215765, -15099661, -16548335, -14041220, -8990250, -1132571, 9496727, 17527488, 16131445, 6784101, -1063499, -1523672, 2489734, 6883605, 12052441, 18026376, 21050793, 19178302, 15186588, 10329388, 2363888, -5926042, -5169725, 6337708, 15209599, 9716086, -2678779, -6109522, 205014, 2667070, -4261710, -10430741, -7142813, 332343]
39796C32343K120051m029932m668914k407380r19153m21090p37904j570220n49996
39787a2852195L221281N861971M410773K550307M496410O819225L525296l731976
39779A4301092q143272q144342p467910o302432p75165Q200990J2959000Q437516
39771A3065477r90045o266277l217073L264127M086403l511263j0593985o153991
39763a0316627P124126J3660797N110942p695112r207779P47194R337819Q631445
39755A7392805K327373k920413m396132k085894K430774N336776L549202j641452
39747A9993039o587246q983146p458223j671713M107544K858738n431022j1279036
39739a4451065p691999J006194O841537P784003M733314k428197r134682o185621
$$ y = [332343, 2452394, -1577538, -6246452, -8653832, -9572985, -9994075, -10731979, -12302199, -12852195, -9630914, -3768943, 641830, 3192137, 7688547, 14507772, 18033068, 14301092, 6157820, -1986522, -9454432, -15756864, -16532029, -8331039, 4627961, 13065477, 12075432, 5809155, 2592082, 5856209, 9942612, 6431349, -4162636, -10316627, -3192501, 10468296, 15579238, 7884126, -1323653, -576459, 8761360, 17392805, 19720178, 16799765, 12403633, 10317739, 12748513, 18085289, 21634491, 19993039, 13405793, 4422647, -3035576, -4707289, -599745, 2258993, -3172029, -14451065, -22143064, -21136870, -14295333, -6511330, -1778016, -4206213, -13340895, -19526516]
39731a9526516N787726J1938703L850307n993025l372174M979146M510510j210362
39723I64315J525179R283158N927105p526519j2037382k252306M809998n66391
39715A27157n180820K258518J0895939O757825l791096n666251R92984M237794
39707A0632050N71833k460349l09929L352129L925336P97284l429399m326551
39699H752404K79348M993932J506271q770319j4325295r288175q96095L159892
39691a4588037N185596Q927208J0036861L798677m668337o851052k709480J376089
39683E07525K401705J958742J306114Q72087J653941K974523J937057k209738
39675A1401956o652809q941144p889323j678305P842287J0859993J11731j4850160
$$ y = [-19526516, -13738790, -1800087, 2050220, -3942805, -7314979, -2335833, 2174677, 964315, 2489494, 11772652, 17699757, 10173238, -1864144, -4116450, 693548, 127157, -5053663, -2795145, 8100794, 14858619, 11067523, 5401272, 6394256, 10632050, 11203883, 8743534, 8433605, 11785734, 15711070, 16508354, 13078955, 8752404, 9031752, 14025684, 15531955, 6761636, -7563659, -16851834, -17747929, -14588037, -9402441, -475233, 9561628, 13360305, 8691968, 1840916, -868564, 507525, 2909230, 4867972, 6174086, 7046173, 8700114, 11674637, 13611694, 11401956, 4749147, -4191997, -12081320, -13759625, -5917338, 4942655, 5054386, -9795774]
39667i795774j6346788k536626J0634940J2877689R596246N896254j386357r767076
39659h27492q139193L049233O916217l365710j1417215m253640O431172N804604
39651e802024P18346L390409O753389q65483r970436m216349R367157J0726389
39643A0101398M91940l487448R71913r24018r710125p659831Q903180J9324962
39635A8011971R842436o582614j2168890p822499l594170q93551L734306P767672
39627H294661O187024m73328p293604q927333j835398R641640J1796508k214442
39619A5175728j7467028j3830395M220991J2465526K174852r624260q710184j558869
39611a7153639K124101M318930O732191L158754n227967n247536N776575J1416024
$$ y = [-9795774, -26142562, -28679188, -18044248, -5166559, 4429687, 10325941, 8939584, -827492, -8966685, -5917452, 998765, -2366945, -13784160, -18037800, -11606628, -5802024, -5083678, -1693269, 5060120, 4194637, -5775799, -9992148, -624991, 10101398, 10593338, 7105890, 8077803, 7153785, -2556340, -10216171, -1312991, 18011971, 27854407, 21271793, 9102903, 1280404, -2313766, -3207317, 526989, 8294661, 14481685, 14008357, 6714753, -2212580, -4047978, 5593662, 17390170, 15175728, -2291300, -16121695, -11900704, 564822, 2739674, -6884586, -15594770, -17153639, -15029538, -10710608, -3978417, -819663, -6047630, -11295166, -5518591, 5897433]
39603E897433L522388j375704R570158J9908533R288058j1082814j5036865l207881
39595A7483306P21937q821924j1807170Q01943J0854376L277051j0102427j0729822
39587h322730o01648N670024M420680L274955M737773L680605j191565m777095
39579F890999m441068l065410k820512k449743j229384r6710J546612M922115
39571g43101P321734M168948k847639n553457k75484O348008O920117L468431
39563A8807557J851419P57920m502501r793338n538175O213183J0392233J50655
39555A8338953j1433621r393707K265446Q165599L378571l880392p072352p037157
39547f668660m929134m07403L738221M335013L973957O032682O632474J387332
$$ y = [5897433, 9419821, 8044117, 17614275, 37522808, 46810866, 35728052, 20691187, 17483306, 18205243, 9383319, -2423851, -1621908, 9232468, 12509519, 2407092, -8322730, -8924378, -3254354, 1166326, 4441281, 9179054, 12859659, 11668094, 6890999, 2449931, -615479, -3435991, -5885734, -7115118, -7211828, -5665216, -743101, 6578633, 10747581, 7899942, 2346485, 2071001, 8419009, 15339126, 18807557, 20658976, 21416896, 16914395, 7121057, 1582882, 7796065, 18188298, 18338953, 6905332, -2488375, -222929, 7942670, 11321241, 7440849, 368497, -6668660, -11597794, -12005197, -8266976, -3931963, 41994, 6074676, 12707150, 14094482]
39539A4094482l776925q47031M665308J093356q260887q430441J824297O390736
39531F752895j718483q635672l007048N577971L544976m601961n012066L843577
39523c255811J1578576J2201801Q530504L993001p19227n077927q758479j1492261
39515G000177j0266234k596383N510904M017592n464549r277210j691568O759718
39507f007553P101840M692864N618181M344755l326912q170170k707918L170012
39499D715099j902245r307763l602549J0070730J2266464l9409r443202n950985
39491c193860J69369j674127n752770j725661P841551J0819137J730108j1235901
39483c022154j4412165k928150J2531142J6200976O105044l668138k937611J461273
$$ y = [14094482, 10317557, 9470526, 14135834, 15229190, 6968303, -1462138, 362159, 6752895, 5034412, -3601260, -6608308, -1030337, 2514639, -2087322, -7099388, -3255811, 8322765, 20524566, 29055070, 33048071, 32328844, 27250917, 18492438, 7000177, -3266057, -5862440, -351536, 3666056, -1798493, -11075703, -12767271, -6007553, 1094287, 5787151, 11405332, 15750087, 12423175, 4253005, 1545087, 4715099, 2812854, -6494909, -10097458, -26728, 12239736, 12200327, 2757125, -3193860, -3024491, -4698618, -10451388, -12177049, -4335498, 6483639, 8213747, -3022154, -17434319, -20362469, -7831327, 8369649, 14474693, 10806555, 7868944, 9330217]
39475I330217l91572m662181k364929L550918L815241j04248O60159N470376N222515
39466B0526496j550890p213138q234845p169193l582083L947639R420462O757547
39458A2901995K246132M550353O594202l904055j8765827j6659979K725575J5457073
39450E145469R560419P61722K849145N570306l584895j5465672j4781660m605340
39442a4550506K213498M169233O571310O335584r47481o776329m24540J1509091
39434H099860J3064524K727729o514419q063626p023223o137620j977670M096183
39426a728262N195204J057001j236081k47550j839226n865119l778676O385762
39418b056947J4041242J0774531J877056k635421q48853K692672M568624K932908
$$ y = [9330217, 8938645, 4276464, 1911535, 5462453, 9277694, 9173446, 9833605, 15303981, 20526496, 18975606, 11762468, 3527623, -3641570, -7223653, -3276014, 6144448, 12901995, 15148127, 19698480, 26292682, 22388627, 3622800, -13037179, -10311604, 5145469, 14705888, 15467610, 18316755, 23887061, 20302166, 4836494, -9945166, -14550506, -12337008, -8167775, -1596465, 4739119, 3791638, -2984691, -3409231, 8099860, 21164384, 23892113, 17377694, 9314068, 2290845, -3846775, -5824445, -1728262, 3466942, 4523943, 3287862, 3040312, 1201086, -4664033, -8442709, -2056947, 11984295, 22758826, 24635882, 22000461, 21151608, 23844280, 28412904, 31345812]
39410C1345812l522138j1633623j4132309q885012k477643J01910K999341J0387370
39402D183708J6041999J0846483k823102j3032172j2840378n175227M487549J1203734
39394A2892594Q249267o529137k0938143j7665632K184993J6962406J2865170
39387H021518K034280J582449O836876K224876r399179r768560L590687J1365935
39379A6488882L248204n648219n4343J0971653R920342j424441p291894l205270
39371B3004914J168956M93720r73980j420517m288716q322964p375244j665728
39363F20441J700108P88767J070933M253291N049489J107594l068397l983184
39355G539042k526132J194515P174963R318948O62306j3415487j7977560p441240
$$ y = [31345812, 27823674, 16190051, 2057742, -6827270, -9304913, -9203003, -6203662, 4183708, 20225707, 31072190, 28249088, 15216916, 2376538, -2798689, 1688860, 12892594, 21141861, 14612724, -6325419, -23991051, -21806058, -4843652, 8021518, 10055798, 11638247, 18475123, 20699999, 11300820, 1532260, 5122947, 16488882, 19737086, 14088867, 14034524, 25006177, 34926519, 33502078, 26210184, 23004914, 24173870, 24667590, 23693610, 22273093, 17984377, 9661413, 2286169, 620441, 2320549, 3109316, 4180249, 8433540, 13483029, 14590623, 11522226, 7539042, 5012910, 6207425, 13382388, 22701336, 23363642, 9948155, -8029405, -15470645]
39347a5470645Q133202J7879583K0342272J6195642L603320j2998637k0771581
39340A6913156j3345010M8815O899211N635317K233621P23396K706688Q208724
39332C0023918J1366042L872874j1200458j8249225r081859M989988R241059M727722
39324B5690061J537370J110764k440509q342643q811953j440869P255412J0208402
39316B4766035N684797l058983r101654o634548Q87393K753539l819051p916486
39308C561042j368428P448936O438764q41474j472964N540673Q236243J286850
39300B8829642o159663m588884L798594J0367899J0290729M593252k873268p927098
39292C6331203q258509m376545J822222P301623P125636o89771q460124n178004
$$ y = [-15470645, -7337443, 10542140, 30884412, 47080054, 50683374, 37684737, 16913156, 3568146, 3616961, 10516172, 16151489, 18385110, 19108506, 21815194, 30023918, 41389960, 45262834, 34062376, 15813151, 6731292, 11721280, 20962339, 25690061, 27227431, 28338195, 25897686, 17555043, 8743090, 7302221, 14557633, 24766035, 30450832, 27391849, 18290195, 11655647, 12543040, 15296579, 11477528, 3561042, 2192614, 9641550, 16080314, 15238840, 13765876, 19306549, 27542792, 28829642, 22669979, 18081095, 21879689, 32247588, 42538317, 47131569, 44258301, 36331203, 28072694, 23696149, 25518371, 32819994, 39945630, 39255859, 30795735, 25617731]
39284B5617731P431564J4964322J1057484O253696Q795958J0103457J281368q755202
39276G6750378p489799n03569q23361n317914k041611N628183M834012j012811
39268G0023508K887177J3182009J0643547m690305q837454O751959J8697209R095543
39260A17753193n777027l736789P825043Q513090N06166Q30282Q424868O675543
39252A41014369n124712r373764n49195O007676R23877m932632j545929L234466
39244A29654156p88492q243215r028277o102330p931879j0552801l215625J0344913
39236I4136450J2332368l632209k0377385j8660224k390476P933918K958963o119958
39228F6181447o980048l346820n614917j2346941j2308904k820383N181035L103442
$$ y = [25617731, 33049295, 48013617, 59071101, 65324797, 74120755, 84224212, 85505580, 76750378, 69260579, 68757010, 67933649, 62615735, 60574124, 66202307, 71036319, 70023508, 72910685, 86092694, 96736241, 92045936, 83208482, 89960441, 108657650, 117753193, 111976166, 108239377, 116064420, 124577510, 125083676, 125913958, 134338826, 141014369, 135889657, 126515893, 125966698, 131974374, 132898251, 127965619, 126419690, 129654156, 128865664, 120622449, 111594172, 105491842, 97559963, 87007162, 83791537, 94136450, 106468818, 102836609, 82459224, 63799000, 61408524, 69342442, 72301405, 66181447, 59201399, 55854579, 50239662, 37892721, 25583817, 22763434, 27944469, 31047911]
39220C1047911l228513l004429L937291P681345K195076p059642r973719l233144
39212A8362176O124794Q209331J312069n919087n123483J132068L429868j370075
39204B6157661o881735o964912k472836K692181N919919M892072j072756o841640
39196A5427954n718507J87300K056666q92869O29586Q538831J0265840j641794
39188B8853007j4110864j0868990L169338R957236N110160m5680n08384l438932
39180A8116891j0261315j0785965j366302O332303L279575k894786j721760L063224
39172C761865J903096l318102l206229K627696N425829K059679r43953J344790
39164I654671N688060O680661K757503m551789j1722292j3433939p208544J987963
$$ y = [31047911, 27819398, 24814969, 28752260, 36433605, 38628681, 31569039, 21595320, 18362176, 24486970, 32696301, 34008370, 28089283, 22965800, 24097868, 27527736, 26157661, 19275926, 12311014, 9838178, 12530359, 18450278, 23342350, 22269594, 15427954, 9709447, 9896747, 11953413, 11060544, 11690130, 20228961, 30494801, 28853007, 14742143, 3873153, 7042491, 16999727, 22109887, 22064207, 21555823, 18116891, 7855576, -2930389, -4296691, 2035612, 5315187, 2420401, 698641, 3761865, 5664961, 2346859, -859370, 1768326, 7194155, 9253834, 8309881, 9654671, 15342731, 22023392, 24780895, 20229106, 8506814, -4927125, -12135669, -10147706]
39156a0147706O768774O339837N177695M281088J117102k299041m58431M558980
39148A5338298K720211q096570j4486718m310799J4101520J9728907N304487j2990361
39140A7308975j5396088j969429R340557N727113n581999q183759J581824J0211035
39132A3038229O019183m388010n550677M566048J1593509N193536p168770j1845783
39124A1457265o776907m67348J659978J661144K143763K667239K885565L201634
39116A8432333J938907l140441j0016003j3264027j0217786l315677L024430N064642
39108a1493622J359207m330203m213827M153567J1903219Q852836j814246o617279
39100b200348j04084P841665N976529l603730r563779o430585n15424o92892n978638
$$ y = [-10147706, -3378932, 2960905, 8138600, 12419688, 13536790, 11237749, 10779318, 15338298, 18058509, 9961939, -4524779, -8835578, 5265942, 24994849, 30299336, 17308975, 1912887, -56542, 9284015, 15011128, 9429129, 1245370, 2827194, 13038229, 19057412, 14669402, 9118725, 13684773, 25278282, 30471818, 23303048, 11457265, 4680358, 4213010, 5872988, 7534132, 9677895, 12345134, 15230699, 18432333, 20371240, 17230799, 7214796, -6049231, -16267017, -19582694, -16558264, -11493622, -10134415, -14464618, -18678445, -14524878, -2621659, 6231177, 4416931, -2200348, -2304432, 5537233, 11513762, 7910032, -1653747, -8084332, -8599756, -9292648, -15271286]
39091a5271286n389654P181914K0566446J7109719k265177j4995267o429132R087269
39083I594832R834132q50715l140486M259034K213681j3846285k2389896r103559
39075b3429262R960725J2958015K624692m253270l653588k646116j387496M690115
39067e136185J1274190J0689541O361873O630385Q721443L905987n498422r589981
39059B7358831q166479r266826j2747315j0703355l223232J206947Q35895J958466
39051a2747068N125868M231414j01125k66845L988781M513618n19744l855492
39043C69407k456281q07070j37451K514090M202155p00991o910599l565343N959425
39034a532658O921655j833794m752217L768837R180223J302553r400168j0454635
$$ y = [-15271286, -20660940, -13479026, 7087420, 24197139, 21931962, 6936695, 507563, 9594832, 19428964, 18578249, 15437763, 19696797, 21910478, 8064193, -14325703, -23429262, -13468537, -510522, 2114170, -2139100, -5792688, -8438804, -9826300, -5136185, 6138005, 16827546, 23189419, 29819804, 38541247, 42447234, 36948812, 27358831, 19192352, 9925526, -2821789, -13525144, -16748376, -15541429, -14705534, -12747068, -7621200, -3389786, -3490911, -3757756, 231025, 4744643, 4224899, 369407, -2086874, -2893944, -3031395, -517305, 3684850, 2983859, -3926740, -7492083, -1532658, 5388997, 3555203, -1197014, 2571823, 11752046, 13054599, 3654431, -6800204]
39026f800204n764081l897340k884658J182320L597917J058378J55479M704215
39018h647974O790582J413827k932856K5124J896589l766607o652659K439098
39010i434876J2041684P041306n319303o628650L069342P418943J029936n348264
39002C870118n213927l462127k820284M53190N544516N666500l8638m256729k631941
38993b889322J638301M052174K415318l100121p036541j732045R344296J0568972
38985A3261032l331077j4906159q117339O652398R614546K814314K129741O317758
38977A4435214M51910j2712796j2651611M603454J7707650J2242959r18613p388957
38969A5769210q416272r020981o305203j71789J109831l821194m212304L418097
$$ y = [-6800204, -12564285, -16461625, -19346283, -18163963, -14566046, -13507668, -13352189, -8647974, -1857392, -443565, -3376421, -3351297, -1454708, -5221315, -11873974, -9434876, 2606808, 9648114, 4328811, -2299839, 769503, 8188446, 9218382, 3870118, -1343809, -4805936, -7626220, -7173030, -1628514, 4037986, 3999348, -257381, -2889322, -1251021, 2801153, 5216471, 2116350, -4920191, -6652236, 2692060, 13261032, 9929955, -4976204, -13093543, -6441145, 3173401, 5987715, 8117456, 14435214, 14887124, 2174328, -10477283, -5873829, 11833821, 24076780, 23158167, 15769210, 7352938, -1668043, -7973246, -8145035, -7035204, -10856398, -15068702, -11650605]
38961a1650605O858613o83022p393948k673398N321943N282153J558619K493077
38953h86568K751432n778068j5124898j1160232K999485J0029157L004480o714834
38945b0880046o581702K506975J0284716R476274K635902j445947J050388L284117
38937C30677j432991o686450j682421R165653J0533592J039996l994616J053538
38929H326978K699037o145022j1553422k758086P664678M476537n286729o525755
38921i101784j441054r22784k524344J890090O397741R86677o639730k181849
38913a3537037Q204228O017639p500088j2033748j432161P628311M097527k245022
38905a0800351n34597N179147P384140O852783N794924K752943l1860K969348
$$ y = [-11650605, -4791992, -5475014, -12868962, -15542360, -10220417, -4938264, -3379645, -886568, 1864864, -3913204, -19038102, -30198334, -27198849, -17169692, -14165212, -20880046, -27461748, -24954773, -14670057, -5193783, -2557881, -4003828, -2953440, 330677, -1102314, -7788764, -9471185, -305532, 10228060, 11268056, 7273440, 8326978, 11026015, 4880993, -6672429, -9430515, -1765837, 2710700, -2576029, -9101784, -10542838, -11465622, -13989966, -12099876, -5702135, -4715458, -11355188, -13537037, -5332809, 684830, -6815258, -18849006, -20281167, -12652856, -8555329, -10800351, -11334948, -6155801, 1228339, 8081122, 13876046, 16628989, 16597129, 19566477]
38897A9566477Q351424N290129o459219j3780861r850339k567434J135068M242744
38889E927989P187465K627136q757026j2561268j739988R737644O455185o107012
38881B770125j1375080n087540L620441P845769P645980L842008k167023n462739
38873A631941k975345J188478K270763K210045M014129M340888n49209o256925
38865E874765o034931j724299r11590n210125q347093n150249K400211P481988
38857a1621323M661609l910961q227887j353017R456372J0486377J142312m979313
$$ y = [19566477, 27917901, 33208030, 26748811, 12967950, 3117611, 550177, 1685245, 5927989, 13115454, 15742590, 6985564, -5575704, -7315692, 2421952, 8877137, 2770125, -8604955, -13692495, -10072054, -2226285, 5419695, 9261703, 7094680, 1631941, -1343404, -154926, 2115837, 4325882, 8340011, 12680899, 12131690, 5874765, -160166, -1884465, -2796055, -8006180, -16353273, -21503522, -19103311, -11621323, -6959714, -10870675, -19098562, -20451579, -10995207, -508830, 633482, -4345831]
$$ [...]
##END NTUPLES=NMR SPECTRUM
##END=
