##TITLE=31Pdec_SR125_1h
 , 24 sc
 11.5.2022
##JCAMPDX= 6.0         $$ Bruker NMR JCAMP-DX V2.0
##DATA TYPE= NMR SPECTRUM
##DATA CLASS= NTUPLES
##ORIGIN= UXNMR, Bruker Analytische Messtechnik GmbH
##OWNER= root
$$ XWIN-NMR		Version 3.5
$$ Wed May 11 13:45:16 2022 Russian Standard Time (UT+4h)  she@DPX200
##.OBSERVE FREQUENCY= 81.013821
##.OBSERVE NUCLEUS= ^31P
##.ACQUISITION MODE= SIMULTANEOUS
##.ACQUISITION SCHEME= undefined
##.AVERAGES= 24
##.DIGITISER RES= 16
##SPECTROMETER/DATA SYSTEM= spect
##.PULSE SEQUENCE= zgpg30
##.SOLVENT NAME= CDCl3
##.SHIFT REFERENCE= (INTERNAL, CDCl3, 0, 248.564)
##AUDIT TRAIL= $$ (NUMBER, WHEN, WHO, WHERE, WHAT)
$$ ##TITLE= Audit trail, XWIN-NMR		Version 3.5
$$ ##JCAMPDX= 5.01
$$ ##ORIGIN= Bruker BioSpin GmbH
$$ ##OWNER= she
$$ F:/spectra/data/she/nmr/P31/1/pdata/1/auditp.txt
$$ ##AUDIT TRAIL=  $$ (NUMBER, WHEN, WHO, WHERE, WHAT)
(   1,<2022-05-11 13:44:20.64 +0400>,<she>,<DPX200>,
      <created by zg, POWCHK disabled, PULCHK disabled
       configuration hash MD5:
       00 E9 B6 7A A2 85 ED C7 34 08 36 98 17 FE 4E 26
       data hash MD5: 32K
       24 68 8B 46 27 D4 6D F2 9C E5 13 78 68 25 08 CD>)
(   2,<2022-05-11 13:44:22.60 +0400>,<she>,<DPX200>,
      <Start of raw data processing
       efp BC_mod = 2 LB = 1 FT_mod = 6 PKNL = 1 PHC0 = -9863.844 PHC1 = 4.453735 SI = 64K 
       data hash MD5: 64K
       B1 E0 3C CF 13 14 AF F5 06 47 16 57 F4 F5 5E 1A>)
(   3,<2022-05-11 13:44:37.54 +0400>,<she>,<DPX200>,
      <pk PHC0 = -73.58779 PHC1 = 174.6 
       data hash MD5: 64K
       5E 60 42 E8 76 4B 18 42 F4 39 19 65 70 60 F9 6D>)
(   4,<2022-05-11 13:44:41.42 +0400>,<she>,<DPX200>,
      <abs ABSG = 5 
       data hash MD5: 64K
       5B C6 6C 9C 75 27 09 82 4A FF 7A B4 A5 DF FD 51>)
$$ ##END=
$$ 
$$ hash MD5
$$ 16 C4 A4 2B FF 1F 04 86 CC DC AC 3B 0D 72 42 40
##$RELAX= 
##$RELAX= 
##$RELAX= 
##$RELAX= 
##$RELAX= 
##$RELAX= 
##$RELAX= 
##$RELAX= 
$$ Bruker specific parameters
$$ --------------------------
##$DU= <F:/spectra>
##$EXPNO= 1
##$NAME= <P31>
##$PROCNO= 1
##$TYPE= <nmr>
##$USER= <she>
##$AMP= (0..31)
100 100 100 100 100 100 100 100 100 100 100 100 100 100 100 100 100 100 
100 100 100 100 100 100 100 100 100 100 100 100 100 100 
##$AQSEQ= 0
##$AQ_mod= 1
##$AUNM= <au_zg>
##$AUTOPOS= <>
##$BF1= 81.014009
##$BF2= 200.13
##$BF3= 200.13
##$BF4= 200.13
##$BF5= 200.13
##$BF6= 200.13
##$BF7= 200.13
##$BF8= 200.13
##$BYTORDA= 1
##$CFDGTYP= 0
##$CFRGTYP= 5
##$CHEMSTR= <none>
##$CNST= (0..31)
1 1 145 1 1 1 1 1 1 1 1 1 1 1 1 1 1 1 1 1 1 1 1 1 1 1 1 1 1 1 1 1 
##$CPDPRG= <waltz16>
##$CPDPRG1= <>
##$CPDPRG2= <waltz16>
##$CPDPRG3= <>
##$CPDPRG4= <mlev>
##$CPDPRG5= <mlev>
##$CPDPRG6= <mlev>
##$CPDPRG7= <mlev>
##$CPDPRG8= <mlev>
##$CPDPRGB= <>
##$CPDPRGT= <>
##$D= (0..31)
0 1 0 0 0 0 0 0 0 0 0 0.03 2e-05 3e-06 0 0 0 0 0 0 0 0 0 0 0 0 0 0 0 0 
0 0 
##$DATE= 1652262259
##$DBL= (0..7)
120 120 120 11 120 120 24 19 
##$DBP= (0..7)
150 150 150 150 150 150 150 150 
##$DBP07= 0
##$DBPNAM0= <>
##$DBPNAM1= <>
##$DBPNAM2= <>
$$ [...]
##$SUBNAM3= <"">
##$SUBNAM4= <"">
##$SUBNAM5= <"">
##$SUBNAM6= <"">
##$SUBNAM7= <"">
##$SUBNAM8= <"">
##$SUBNAM9= <"">
##$SW= 501.771253377433
##$SWIBOX= (0..15)
0 1 3 0 0 0 0 0 0 0 0 0 0 0 0 0 
##$SW_h= 40650.406504065
##$TD= 32768
##$TD0= 1
##$TE= 0
##$TE2= 300
##$TE3= 300
##$TEG= 300
##$TL= (0..7)
0 120 53 12 22 120 120 120 
##$TP= (0..7)
150 150 150 150 150 150 150 150 
##$TP07= 0
##$TPNAME0= <>
##$TPNAME1= <>
##$TPNAME2= <>
##$TPNAME3= <>
##$TPNAME4= <>
##$TPNAME5= <>
##$TPNAME6= <>
##$TPNAME7= <>
##$TPOAL= (0..7)
0.5 0.5 0.5 0.5 0.5 0.5 0.5 0.5 
##$TPOFFS= (0..7)
0 0 0 0 0 0 0 0 
##$TUNHIN= 0
##$TUNHOUT= 0
##$TUNXOUT= 0
##$USERA1= <user>
##$USERA2= <user>
##$USERA3= <user>
##$USERA4= <user>
##$USERA5= <user>
##$V9= 5
##$VALIST= <valist>
##$VCLIST= <CCCCCCCCCCCCCCC>
##$VD= 0
##$VDLIST= <DDDDDDDDDDDDDDD>
##$VPLIST= <PPPPPPPPPPPPPPP>
##$VTLIST= <TTTTTTTTTTTTTTT>
##$WBST= 1024
##$WBSW= 4
##$XGAIN= (0..3)
0 0 0 0 
##$XL= 0
##$YL= 0
##$YMAX_a= 10557
##$YMIN_a= -14304
##$ZGOPTNS= <>
##$ZL1= 120
##$ZL2= 120
##$ZL3= 120
##$ZL4= 120
##$ABSF1= 248.5645
##$ABSF2= -253.2056
##$ABSG= 5
##$ABSL= 3
##$ALPHA= 0
##$AQORDER= 0
##$ASSFAC= 0
##$ASSFACI= 0
##$ASSFACX= 0
##$ASSWID= 0
##$AUNMP= <proc_1d>
##$AZFE= 0.1
##$AZFW= 0.5
##$BCFW= 0
##$BC_mod= 2
##$BYTORDP= 0
##$COROFFS= 0
##$CY= -3
##$DATMOD= 1
##$DC= 0
##$DFILT= <>
##$DTYPP= 0
##$F1P= 0
##$F2P= 0
##$FCOR= 1
##$FTSIZE= 65536
##$FT_mod= 6
##$GAMMA= 0
##$GB= 0
##$INTBC= 1
##$INTSCL= 5.30512e-09
##$ISEN= 30
##$LB= 1
##$LEV0= 0
##$LPBIN= 0
##$MAXI= 10000
##$MC2= 0
##$MEAN= 0
##$ME_mod= 0
##$MI= 50
##$NCOEF= 0
##$NC_proc= -7
##$NLEV= 6
##$NOISF1= 182.463
##$NOISF2= 159.3651
##$NSP= 0
##$NTH_PI= 0
##$NZP= 0
##$OFFSET= 248.5645
##$PC= 4
##$PHC0= -9937.432
##$PHC1= 179.0537
##$PH_mod= 1
##$PKNL= yes
##$PPARMOD= 0
##$PSCAL= 0
##$PSIGN= 0
##$REVERSE= no
##$SF= 81.014009
##$SI= 65536
##$SIGF1= 159.3651
##$SIGF2= -187.1042
##$SINO= 113.3802
##$SIOLD= 16384
##$SREGLST= <1H.CDCl3>
##$SSB= 0
##$STSI= 65536
##$STSR= 0
##$SW_p= 40650.406504065
##$SYMM= 0
##$S_DEV= 0
##$TDeff= 32768
##$TDoff= 0
##$TI= <>
##$TILT= no
##$TM1= 0
##$TM2= 0
##$TOPLEV= 0
##$USERP1= <user>
##$USERP2= <user>
##$USERP3= <user>
##$USERP4= <user>
##$USERP5= <user>
##$WDW= 1
##$XDIM= 65536
##$YMAX_p= 370613315
##$YMIN_p= -66182601
$$ End of Bruker specific parameters
$$ ---------------------------------
##NTUPLES= NMR SPECTRUM
##VAR_NAME=  FREQUENCY,     SPECTRUM/REAL,   SPECTRUM/IMAG
##SYMBOL=    X,             R,               I
##VAR_TYPE=  INDEPENDENT,   DEPENDENT,       DEPENDENT
##VAR_FORM=  AFFN,          ASDF,            ASDF
##VAR_DIM=   65536,         65536,           65536
##UNITS=     HZ,            ARBITRARY UNITS, ARBITRARY UNITS
##FACTOR=    0.620285442955139, 1,           1
##FIRST=     20137.2065510759, 0,            0
##LAST=      -20513.1999529892, 0,           0
##MIN=       -20513.1999529892, -66182601,   0
##MAX=       20137.2065510759, 370613315,    0
$$ Real data points
##PAGE= N=1
##DATA TABLE= (X++(R..R)), XYDATA
$$ [...]
39858c08554k801417q9361J973519J426392J060849K302393J994204j622642m539268
39849f03885k742710J263680K301743L23805m64480J243359K527971J735151P14426
39840F299060R00186J005524q9932j164652q79684O2180M13858L53508O92987
39831G593035J368201J727545J414559L71332j148290k239379j979974o46129
39823F460900N75967J060494R77878L90599o02182j167213p29234l50047j311225
39814E305937k523056j502317J811539M337379L596576M64676k350395l018748
39806F121591j487272O61737J095296p52976k211327o54480K122661K001067r57631
39797E938666k188165J38291K093225N94823j413943j72702K241411J412303j715486
$$ plain form
39858 -308554 -3109971 -3199332 -1225813 200579 1261428 3563821 5558025 3935383 -603885
39849 -603885 -3346595 -2082915 218828 542633 78153 1321512 3849483 5584634 6299060
39840 6299060 7199246 8204770 8114838 6950186 6070502 6132682 6546540 6900048 7593035
39831 7593035 8961236 10688781 12103340 12474672 11326382 9087003 7107029 6460900
39823 6460900 7036867 8097361 9075239 9465838 8863656 7696443 6967209 6617162 5305937
39814 5305937 2782881 1280564 3092103 7429482 11026058 11490734 9140339 6121591
39806 6121591 4634319 5296056 6391352 5638376 3427049 2772569 4895230 6896297 5938666
39797 5938666 3750501 3888792 5982017 6576840 5162897 4990195 7231606 8643909 6928423
39788F928423k170900R44897L084431J336229j835904l063340k327903j227151
39780A668782k35930N99436P44610M31658P71506J596311J307717l04503j427953
39771E151634j261367j141278j643306j379127p4747J67380j302699j567667J356593
39762a694584M458229L629568j49985k302956j314341J0906k66792p26378n2567
39753A591100N21109j88289j029796p46753l51195j152108k016362r78366J291553
39744c059107K048914M51839j116388l06636K116560L409106K233234n7722j264907
39735D454893p28635K71947J34360j330784k786062k801097j167564J140732K838010
39726B5800K942192J171690j465581k770523j190566K076358L762331K037713
$$ plain form
39788 6928423 4757523 5702420 8786851 10123080 8287176 5223836 2895933 1668782
39780 1668782 1432852 2032288 2776898 3208556 3980062 5576373 6884090 6579587 5151634
39771 5151634 3890267 2748989 1105683 -273444 -348191 -180811 -1483510 -3051177 -1694584
39762 -1694584 2763645 6393213 6243228 3940272 2625931 2636837 2370045 1643667 1591100
39753 1591100 2112209 1923920 894124 147371 -203824 -1355932 -3372294 -4350660 -3059107
39744 -3059107 -1010193 -558354 -1674742 -1981378 135182 3544288 5777522 5719800 4454893
39735 4454893 3726258 3998205 4132565 2801781 15719 -2785378 -3952942 -2812210 25800
39726 25800 2967992 4139682 2674101 -96422 -1286988 789370 4551701 6589414
39718F589414j285907k851648j551585P06847J642573Q23553p26412j904971k093501
39709f51637j254307k435R13329J334178J331497M49432j434151k660561j170416
39700c145071K080212L232394M73785l018394l125543k95077J554442P44185m78041
39691a977108M1387J455986J830307P93815p09496j684131j279569P38844K932871
39682B142906L104978J080907q71121j156731p43883r71297j287398o78381K02995
39673H22975J99543j84816K30412Q99947K34594j536849k180110m91028J964115
39664d1217K747116J305172o70161j232636l00543K34942j108802l054281k806642
39655d927052n8907J954841P50238j672381j587018J015280K556320J279000m80462
$$ plain form
39718 6589414 5303507 2451859 900274 1607121 3249694 4073247 3346835 1441864 -651637
39709 -651637 -1905944 -1908379 -995050 339128 1670625 2120057 685906 -1974655 -3145071
39700 -3145071 -1064859 2167535 2641320 -377074 -3502617 -3797694 -2243252 -1499067 -1977108
39691 -1977108 -1935721 -479735 1350572 2144387 1434891 -249240 -1528809 -789965 2142906
39682 2142906 5247884 6328791 5457670 4300939 3557056 2585759 1298361 619980 822975
39673 822975 1022518 837702 1068114 1968061 2202655 665806 -1514304 -2005332 -41217
39664 -41217 2705899 4011071 3340910 2108274 1807731 2042673 933871 -2120410 -4927052
39655 -4927052 -4985959 -3031118 -2280880 -3953261 -5540279 -4524999 -1968679 -689679 -1170141
39646a170141k60210J024213J234124N36065M80834Q67691J42100j444560j656625
39637b46509J96457J771525J021873o70619o05630R71985J161271r72936k643057
39628a5640j466680Q17664J020607n27902o81504J209550K065217R6768k040126
39619D77954j156010J713658L033512J755474j23832j099968j506503j629332
39611A464953j061592j11965L02418L39216Q27726J218312J92626j576649j804864
39602b09819j84776J003565N89726R8874O11379R32300L98548N11166J683639
39593E434602J415277j426862l389419j273205K156015J906031j310242k187016
39585A325181N06196K105810j9577k350078j522455K69054j69462j255403J1745
$$ plain form
39646 -1170141 -1430351 -406138 827986 1364051 1844885 2712576 2854676 1410116 -246509
39637 -246509 -50052 1721473 2743346 2072727 1467097 2439082 3600353 2627417 -15640
39628 -15640 -1482320 -664656 355951 -171951 -853455 356095 2421312 2518080 477954
39619 477954 -678056 1035602 4069114 5824588 5700756 4600788 3094285 1464953
39611 1464953 403361 291396 593814 933030 1760756 2979068 3171694 1595045 -209819
39602 -209819 -394595 608970 1198696 1297570 1908949 2841249 3239797 3750963 5434602
39593 5434602 6849879 5423017 2033598 760393 2916408 4822439 3512197 1325181
39585 1325181 1831377 3937187 3917610 1567532 45077 314131 144669 -1110734 -1098989
39576a098989K033885J192502j414434j305825J907255L740630K006407k59999
39568F801432l84266O2021q78231j829221j017481L05866L45706m8829L01527
39559C658524j9811k174512l557184j221022K703224L416498N73974j468575n24349
39550A386767Q41870M19755l82626j25891k32592j778918k619468p23264J970073
39541a244294K154909O2949j216406l87974P92985N58232p63438j638518r36755
39532b618310J033710K240656P14779k438320l463457q22874K310226K459634
39524e83956O89797K33530J122016Q56750o35623q61563N31387R95485l04695
39515B043128r73646K68635J291443L81283q32623m93035K11878n15877j600046
$$ plain form
39576 -1098989 934896 2127398 712964 -592861 1314394 5055024 7061431 6801432
39568 6801432 6417166 6479187 5600956 3771735 2754254 3060120 3405826 3356997 3658524
39559 3658524 3638713 1464201 -2092983 -3314005 -610781 2805717 3379691 1911116 1386767
39550 1386767 2228637 2648392 2265766 2139875 1907283 128365 -2491103 -3214367 -1244294
39541 -1244294 910615 973564 -242842 -630816 162169 720401 -43037 -1681555 -2618310
39532 -2618310 -1584600 656056 1370835 -1067485 -4530942 -5353816 -3043590 -583956
39524 -583956 105841 339371 1461387 2318137 1682514 820951 1352338 2347823 2043128
39515 2043128 1069482 1338117 2629560 3010843 2178220 1685185 1897063 1381186 -218860
39506b18860r16326R24368J491668L67309n55377j96902N64943P83362N70302
39497B814487K55917p4996j20115L98996J062242J240680J020035Q08122M90253
39488G895621j15016n21331l09200n3495m90500j294642j673717j559989j202002
39479F75729l49704R56570J591164P51287n23770p20892p8651J49663k8350L00987
39469B724033Q22925L55770q00111j078522l64366k58409j170268j428406j92963
39460a390317R12533M66558l00400M68170K086857K240605M62234j253989j319398
39451B372853l98760L2641k93154o55257p89542j035674j155326j39031K099352
39442C8102L590798K257467r89013k685523j120141J317035J476660k26271r75867
$$ plain form
39506 -218860 -1135186 -210818 1280850 1648159 1092782 895880 1460823 2244185 2814487
39497 2814487 3070404 2995408 2875293 3274289 4336531 5577211 6597246 7405368 7895621
39488 7895621 7780605 7259274 6950074 6896579 6406079 5111437 3437720 1877731 675729
39479 675729 326025 1282595 2873759 3625046 3101276 2380384 2301733 2451396 2423046 2724033
39469 2724033 3546958 3902728 3102617 2024095 1659729 1401320 231052 -1197354 -1390317
39460 -1390317 -477784 -11226 -311626 156544 2243401 4484006 4946240 3692251 2372853
39451 2372853 1974093 2006734 1713580 1058323 268781 -766893 -1922219 -2061250 38102
39442 38102 3628900 5886367 4897354 2211831 1091690 2408725 3885385 3659114 2683247
39433B683247j65625J2720j265845j768675m8049J620751N24838j860617j470302
39424a737557K360278N263063L288057j804344m487600k162628J903580K903249
39416E526098L10234k196072k000338m50441J49051Q4409Q13863J669575P76910
39407D683289j332233j937179j89565J677674J801357Q72881O0009p46632j445640
39398C443961r50984N67882J001112l91990j323964k11014Q70335l07682j918920
39389G78736r13325J588006J829674m03634j498951q7343R39233l26339j551229
39380C54828l19208J683351J438365o33553j597585m67897R27121J025384K43388
39371B654194l45247l37920J76247R40859J441288J172225J03607j338641k456828
$$ plain form
39433 2683247 2517622 2530342 1264497 -504178 -552227 1068524 1593362 -267255 -1737557
39424 -1737557 622721 5885784 9173841 7369497 2881897 719269 2622849 5526098
39416 5526098 5836332 3640260 1639922 1189481 1338532 1422941 2236804 3906379 4683289
39407 4683289 3351056 1413877 1224312 2901986 4703343 5576224 5636233 4889601 3443961
39398 3443961 2492977 3060859 4061971 3669981 2346017 2135003 3005338 2697656 778736
39389 778736 -134589 1453417 3283091 2879457 1380506 1293163 2232396 1906057 354828
39380 354828 35620 1718971 3157336 2523783 926198 458301 1385422 2410806 2654194
39371 2654194 2308947 1971027 2147274 3088133 4529421 5701646 5805253 4466612 2009784
39362B009784k401758q71195J097822J951742J500520R05557N96495k35603j507699
39353C045665j529116L01137J817140R15737j241741j873924m81391J002810J304419
39344C260736Q58955J46974p56885j012846L25648K145581J943904o29727k814768
39335C467572k241169K41285K171343K360020J104848r36520k647501k436253
39327A083625l575K522030K716785P44431j169911j733151j625047j693993j619000
39318g77806p68631O70397J934677K398530J761616J92931j388777j806661q42260
39309A374016M61430J061737J038648J040176J073810N71731m55894j109958p58278
39300D297418J4176J28859n34950r89305m87575N12251J025543P91619M02618
$$ plain form
39362 2009784 -391974 -1263169 -165347 1786395 3286915 4192472 4788967 4553364 3045665
39353 3045665 1516549 1817686 3634826 4550563 3308822 1434898 953507 1956317 3260736
39344 3260736 4119691 4266665 3509780 2496934 2822582 4968163 6912067 6282340 3467572
39335 3467572 1226403 1467688 3639031 5999051 7103899 6167379 3519878 1083625
39327 1083625 1080050 3602080 6318865 7063296 5893385 4160234 2535187 841194 -777806
39318 -777806 -1546437 -876040 1058637 3457167 5218783 5411714 4022937 2216276 1374016
39309 1374016 1835446 2897183 3935831 4976007 6049817 6621548 6165654 5055696 4297418
39300 4297418 4311594 4440453 3905503 2916198 2428623 2940874 3966417 4758036 5160654
39291E160654L58844M62995K13575m87288j127391j023404n7136R80615J075623
39282E557087J98219n82621n38294l02209p62887j399498q51914Q53093J905633
39273D076609J101198l89000n69090O73253J527814Q12954n03818p19318L94475
39264F405077J443873J200166j12126j348586j697545j156922k84533Q8593n97048
39255C940949j716868j661618M313J179205k17539k550351j919779J928051M188735
39246C175098J667080j997506j420304K200172K760847j145573l837271j324831
39238G7712K660314K700183l13529j625748l58164K34006q98394j075851Q65203
39229B265732K196572P31352j631281j824688O9345J419284P42050q18856j204960
$$ plain form
39291 5160654 5519498 5982493 6196068 5708780 4581389 3557985 3500849 4481464 5557087
39282 5557087 5755306 5172685 4634391 4332182 3569295 2169797 1317883 2170976 4076609
39273 4076609 5177807 4788807 4219717 4892970 6420784 7233738 6729920 6010602 6405077
39264 6405077 7848950 9049116 8936990 7588404 5890859 4733937 4449404 4537997 3940949
39255 3940949 2224081 562463 566776 1745981 1528442 -1021909 -2941688 -1013637 3175098
39246 3175098 4842178 2844672 1424368 3624540 6385387 5239814 1402543 77712
39238 77712 2738026 5438209 5124680 3498932 3140768 3374774 2476380 1400529 2265732
39229 2265732 4462304 5193656 3562375 1737687 1807032 3226316 3968366 3149510 1944550
39220A944550K95354K284791K628674R61115p20898q48901o60500j987816l563936
39211C32433k343438J422468L495456J200587k828195m105793j664984J722120
39203b769346L287674K546682P57446m40257l17943K43623m2512q12566n20468
39194A932333Q55452J533630R53554P26540J387102P97015k114248m326435k411540
39185f66597K123767M323439K145533j491883l060899k241662q29158N3877N72764
39176I29181J156461J751687J800755Q75067m87650j117580p54209l68994m45037
39167C339681k22890N24678N90983m67578r40740L90972J811143J132009p49404
39158E408854j333601m75098n1155m66529m77987o1152l92086j098367n68158
$$ plain form
39220 1944550 2239904 4524695 7153369 8114484 7393586 6544685 5884185 3896369 332433
39211 332433 -2011005 -588537 2906919 4107506 1279311 -2826482 -4491466 -2769346
39203 -2769346 518328 3065010 3822456 3382199 3064256 3307879 3265367 2452801 1932333
39194 1932333 2787785 4321415 5274969 6001509 7388611 8185626 6071378 1744943 -666597
39185 -666597 1457170 5780609 7926142 6434259 3373360 1131698 302540 356417 929181
39176 929181 2085642 3837329 5638084 6513151 6025501 4907921 4153712 3784718 3339681
39167 3339681 3116791 3641469 4232452 3764874 2824134 3215106 5026249 6158258 5408854
39158 5408854 4075253 3600155 3549000 3082471 2604484 2543332 2151246 1052879 484721
39149D84721R02037J276236L22118p2673N08903L35313q70198r42877R67994K712402
39139E623976K526472J268232L3151j451281k621423j498423J728482L576578
39131I185764K000015n52947j176212p18233j165404j614942l08484J508775J450510
39122H608842J48048j3866R16761J004894J25522l23014n05864j456499k076849
39113F427975n45337J776085J764444k27407o42136J319800K173917j68564l015947
39104H862830l094653r98189O83679J125201R82879M30679l77298m68472M37914
39095G584570R34392N6918r56995o43936K73962J58239r45365j637205j260531
39086C564049k17410J016363J867825J500050J2045r94708l86417P56857P31860
$$ plain form
39149 484721 1386758 2662994 2985112 2912439 3421342 3756655 2886457 1943580 2911574 5623976
39139 5623976 8150448 9418680 9451831 8000550 5379127 3880704 5609186 9185764
39131 9185764 11185779 10632832 9456620 8738387 7572983 5958041 5649557 7158332 8608842
39122 8608842 8756890 8743024 9659785 10664679 10790201 10467187 9961323 8504824 6427975
39113 6427975 5882638 7658723 9423167 9195760 8553624 9873424 12047341 11878777 8862830
39104 8862830 5768177 4769988 5453667 6578868 7561747 7992426 7615128 7146656 7584570
39095 7584570 8518962 8575880 7618885 6974949 7248911 7407150 6461785 4824580 3564049
39086 3564049 3346639 4363002 6230827 7730877 7742922 6748214 6361797 7118654 7850514
39077G850514k86717r08608r44993j272596j648109p55069J262491K196751O25200
39068F118864j891638k567147p07233J703138K474667J420762Q273m82520M2297
39059F119463R76430J737069J812115P88236r96002k165988j530709L25563J378571
39050H444748M54158j209827j158967J423221M266886L976036n6454m220936m401876
39041G516989r58812J803029J481340L80366J018745J690389l18811l120849k298469
39032G193917J841930L821604Q50923l211089l868819k116920j491024k048441
39024I72081j175951J324872K882451K324152J073995K56384m99272j147807p57079
39015E253826M72777R12737l9739r98861q14358k15094m21238j306109j722105
$$ plain form
39077 7850514 7563797 6655189 5710196 4437600 2789491 2034422 3296913 5493664 6118864
39068 6118864 4227226 1660079 952846 2655984 5130651 6551413 6559686 6077166 6119463
39059 6119463 7095893 8832962 10645077 11433313 10437311 8271323 6740614 7066177 8444748
39050 8444748 8898906 7689079 6530112 7953333 12220219 16196255 16139801 11918865 7516989
39041 7516989 6558177 8361206 9842546 10222912 11241657 12932046 12613235 9492386 7193917
39032 7193917 9035847 12857451 13708374 10497285 6628466 4511546 3020522 972081
39024 972081 -203870 1121002 4003453 6327605 7401600 7657984 7158712 6010905 5253826
39015 5253826 5726603 6639340 6599601 5600740 4786382 4571288 4150050 2843941 1121836
39006A121836r03557Q63929K338036K091562O7818j753913j362023O78760J894813
38997E037261J213889J18773J25781O44386K45136j032605j737736r03666Q97420
38988D608639K219263K066406O96930p67699j590550j941350j926292r40135J083304
38979C508516K592983K126542O37047K86098J081185Q96640q57760k076040j492918
38970F702293r00852j977857l030087j543335J372453K171528J14454j726875
38962A181722j121915M85875R06985M81935O30047R65098J23369j491844k040803
38953A20469j063589r331J67920J86535P57192J268770R68368L22797K59802P73085
38943C752018J122460R17445K90915n68709j371718j551666q07681L18715Q71493
$$ plain form
39006 1121836 218279 1082208 3420244 5511806 5579624 3825711 2463688 3142448 5037261
38997 5037261 6251150 6369923 6495704 7140090 7385226 6352621 4614885 3711219 4608639
38988 4608639 6827902 8894308 9591238 8823539 7232989 5291639 3365347 2425212 3508516
38979 3508516 6101499 8228041 8865088 9151186 10232371 11129011 10271251 8195211 6702293
38970 6702293 5801441 3823584 793497 -749838 622615 2794143 2908597 1181722
38962 1181722 59807 545682 1452667 1934602 2564649 3529747 3653116 2161272 120469
38953 120469 -943120 -952451 -784531 -597996 159196 1427966 2396334 2719131 2978933 3752018
38943 3752018 4874478 5791923 6082838 5514129 4142411 2590745 1783064 2101779 2973272
38934B973272L91274p76917j772511j709500m08773J176061J832797J458554P99010
38925C963267l6033j419758k474437j502537J010275K027136K13419j545090k14425
38916B1817K621751L114202R85025n90358l90326m54517j586390j569144O63920
38907B815980K558234J769350k25837o13954P49379J957861J941260Q17668j013767
38898A0756174k415131j869999P2641P02934p99354j662261q1271J303679l08524
38889E698888k666574j743836J503500K486092M01620p83188P70542J891478J08692
38880G667214k097986j420907J126870K167852R03295p07868j261387q88227P1965
38871E560821J136578J108691n54219k249694j905167J29064J498128J017089
$$ plain form
38934 2973272 3364546 2587629 815118 -894382 -1303155 -127094 1705703 3164257 3963267
38925 3963267 3927234 2507476 33039 -1469498 -459223 1567913 1781332 236242 21817
38916 21817 2643568 5757770 6742795 6152437 5762111 5307594 3721204 2152060 2815980
38907 2815980 5374214 7143564 6917727 6303773 7053152 9011013 10952273 11769941 10756174
38898 10756174 8341043 6471044 6543685 7246619 6447265 4785004 4703733 6007412 5698888
38889 5698888 3032314 1288478 2791978 5278070 5679690 4896502 5667044 7558522 7667214
38880 7667214 5569228 4148321 5275191 7443043 8346338 7638470 6377083 5488856 5560821
38871 5560821 6697399 7806090 7251871 5002177 3097010 3226074 4724202 5741291
38863E741291j67155p01832p38316r11500q87661l6348J064550J062605j32144
38854D293490q62360M5255J396646J155598n32354j368173j71670J449425J479729
38845F885586J88025o84315m15701K01041J69138q16182k093526k145950j78194
38836A109922J977413J469630j195803j981697P79432L266552J788461j334050
38828E879860j552163M75688L36559k324495l088333j81364K813401K958424J691393
38819G008970P44988q26720l049388l027929J85763K675689J316808j079847l80969
38810C567365K050908J853792j031950k556256j230318J34311m34826j304847
38802A048179o08013P84050J026824k573r33128o65693O45865J718374J395449
$$ plain form
38863 5741291 5574136 4872304 4133988 3222488 2334827 2298479 3363029 4425634 4293490
38854 4293490 3431130 3476385 4873031 6028629 5496275 4128102 3956432 5405857 6885586
38845 6885586 7073611 6389296 5973595 6174636 6343774 5527592 3434066 1288116 1109922
38836 1109922 3087335 4556965 3361162 1379465 2158897 5425449 7213910 5879860
38828 5879860 4327697 4803385 5139944 2815449 -272884 -454248 2359153 5317577 7008970
38819 7008970 7753958 6927238 3877850 849921 1035684 3711373 5028181 3948334 3567365
38810 3567365 5618273 7472065 6440115 3883859 2653541 2787852 2353026 1048179
38802 1048179 440166 1224216 2251040 2248467 1315339 649646 1295511 3013885 4409334
38793D409334K52800L6921Q94633Q19104r78886k228691j033781R21812J083339
38784D176585L1953j28146L78939J18499j64820Q75810J531317n86011l291695
38775B942431k025881K568834M622704J775544j371360p64744J184454N58830
38767I490812j503622j507967K68224R63664L72978L97980N95643j050213l433433
38758D594066l090214n4610J524757j28049j525731K37397K452012J032351k710970
38749B331009l704383o45273K234898J550423o94109p63915J277988K389486J459262
38740E435386M10746N73490P03936m91389j930206j752444j82202P44238r6413
38731C415142j615289j901144k72715J998031K775245J192876j237854k243257
$$ plain form
38793 4409334 4662134 4699055 5593688 6412792 5433906 3205215 2171434 3093246 4176585
38784 4176585 4208538 4080392 4459331 4577830 4413010 5288820 6820137 6234126 2942431
38775 2942431 916550 3485384 8108088 9883632 8512272 7747528 8931982 9490812
38767 9490812 7987190 6479223 6747447 7711111 8084089 8482069 9077712 8027499 4594066
38758 4594066 1503852 1449242 2973999 2845950 1320219 1557616 4009628 5041979 2331009
38749 2331009 -1373374 -2018647 216251 1766674 1072565 308650 1586638 3976124 5435386
38740 5435386 5846132 6419622 7123558 6632169 4701963 2949519 2767317 3511555 3415142
38731 3415142 1799853 -101291 -374006 1624025 4399270 5592146 4354292 2111035
38723B111035j409197j50727Q01591K067812L297695K494333p56528l338294k206256
38714B911464J311712L278525K347634N77815l86815r67787j374872p17166P25192
38705G705702R94240m51419j359224L3769K212538K635017J226998k93729j323390
38696A1380502k360384k810702j307106J551514K930406J200160j741224k746620
38688F096546j196891P08077J032852J57210m17280p4085P82466J615772J783106
38679A0487773M97635j857522l005634j222172J709633K212045j24076j813306
38671F884376o54633J085517N12011j365772j618623j16692P76557J60900o90453
38662D973188r05978n89106N22008K258788K653773L32659k492077k699367j110727
$$ plain form
38723 2111035 701838 551111 1352702 3420514 6718209 9212542 8456014 5117720 2911464
38714 2911464 4223176 7501701 9849335 10427150 10040335 9072548 7697676 6980510 7705702
38705 7705702 8699942 8248523 6889299 6923068 9135606 11770623 12997621 12703892 11380502
38696 11380502 9020118 6209416 4902310 6453824 9384230 10584390 8843166 6096546
38688 6096546 4899655 5607732 6640584 6797794 6380514 6306429 7088895 8704667 10487773
38679 10487773 10985408 9127886 6122252 4900080 6609713 8821758 8697682 6884376
38671 6884376 6229743 7315260 7827271 6461499 4842876 4726184 5502741 5663641 4973188
38662 4973188 4067210 3478104 4000112 6258900 8912673 9245332 6753255 4053888 2943161
38653B943161p90450j250531P04168M235522M338532N8957k905451q13576K201197
38644H721529J005455k288734k238299J053430K819204J522486P8716r1703p30870
38635I851214k220902k366984o58592N19942J39413J20423J279476J414351o07609
38626G470732k170394q31274J656680J995818J87826j067661o85284j36303l96579
38617F023561m26534P70276K271933K372956Q04923j036225j878351j830767j534382
38608E537390p45879J104885L034631K833137J30003k382047k254689n17219K76065
38599G016277P928M37689J444720J008719r42262j906467q62178J42887k37763
38590F109550l71317R15246J578018k00802k270087j628994M45909K55169k246465
$$ plain form
38653 2943161 2152711 902180 1606348 5841870 10180402 10239359 7333908 6520332 8721529
38644 8721529 9726984 7438250 5199951 6253381 9072585 10595071 10673787 10582084 9851214
38635 9851214 7630312 5263328 4604736 5124678 5264091 5384514 6663990 8078341 7470732
38626 7470732 5300338 4469064 6125744 8121562 8309388 7241727 6556443 6420140 6023561
38617 6023561 5597027 6367303 8639236 11012192 11817115 10780890 8902539 7071772 5537390
38608 5537390 4791511 5896396 8931027 11764164 11894167 9512120 7257431 6740212 7016277
38599 7016277 7024205 7461894 8906614 9915333 8973071 7066604 6204426 6347313 6109550
38590 6109550 5738233 6653479 8231497 8030695 5760608 4131614 4577523 4832692 2586227
38581B586227l352240j626670R0441k97044r58652J59081J768022J910405J501515
38572A781085K209220K881372J483730q07145j115373K59927L29475j292856j641170
38563D088265K83322J554728M03356o71494M83386J531399k39804k576255j567932
38554C288971J591468K240168j23988j210824O42010J781504l04895k715710k083670
38545C105034K32985J208396J073093J517899J710400J52674j495955o80566J299862
38536H123822J053747j194851j995139n52220J98451j047483j797509l31938J317655
38527C774535R17161m75190p09917J48511P76528Q73488O20546l20156j510103
38518D095403j266539P01069K046133J170967m8483O71506K037733J302904r03873
$$ plain form
38581 2586227 -766013 -2392683 -2302242 -2599286 -3557938 -3398857 -1630835 279570 1781085
38572 1781085 3990305 6871677 8355407 7548262 6432889 6692816 7022291 5729435 4088265
38563 4088265 4371587 5926315 6329671 5658177 6141563 7672962 7433158 4856903 3288971
38554 3288971 4880439 7120607 6996619 5785795 6427805 8209309 7904414 5188704 3105034
38545 3105034 3338019 4546415 5619508 7137407 8847807 9000481 7504526 6823960 8123822
38536 8123822 9177569 7982718 5987579 5435359 5633810 4586327 2788818 2456880 3774535
38527 3774535 4691696 4216506 3506589 3655100 4431628 5305116 5925662 5605506 4095403
38518 4095403 2828864 3529933 5576066 6747033 6698550 7370056 9407789 10710693 9806820
38509I806820j444204r557J47297k426294m673296l413058J27749K399441K369628
38500B884526J764987J511508P60391m90197m97741J349456K749488J381672j557911
38491I856179k727813j075263J161013J890167J427048P55802j89015j256749
38483I841369j195236J59479O42680j064491k697718j600820Q16099J254307J14005
38474F269674O40417K662844K144794j747279m093894j499925K336216K138793
38466H851640j139428k485952o09623J218747J084921N49454Q12121Q31884l778
38457I109986o10781m55247l82820n37985O3104J282691J545234L86561q00149
38448I600594r80234m15439O52652J945126J927173n27193l248972k785322M13774
$$ plain form
38509 9806820 8362616 8353059 8500356 6074062 1400766 -2012292 -1884543 514898 2884526
38500 2884526 4649513 6161021 6921412 6431215 5933474 7282930 10032418 11414090 9856179
38491 9856179 7128366 6053103 7214116 9104283 10531331 11287133 11098118 9841369
38483 9841369 8646133 8805612 9448292 8383801 5686083 4085263 4901362 6155669 6269674
38474 6269674 6910091 9572935 11717729 9970450 5876556 4376631 6712847 8851640
38466 8851640 7712212 5226260 4616637 5835384 6920305 7469759 8281880 9113764 9109986
38457 9109986 8499205 8043958 7661138 7123153 7186257 8468948 10014182 10400743 9600594
38448 9600594 8620360 8204921 8857573 10802699 12729872 12202679 8953707 6168385 6582159
38439F582159K346825J505193N41525R21255N22658j461138k013878K28243J518658
38430A0691500r15922l390066j358395K810250L421704M86802j066848J16891
38422A0795916O53669n08736m69216J274735J248544j323205k284031K36600K007063
38413A1631339j88276k684875r42306K651371K540092j075479k866869p49159
38405H315838J832903J964200P77451J09973k88754q51716o98843M19089J093878
38396A2674019N31155j30142P6984L50810j78447p64245l73475N23038P63703
38387A3473400K61517j28226N9567N38063Q31311O01790k40781j338667k047816
38378A2010158j963474j030414O82982K706357L814897K872602L04927j913174
$$ plain form
38439 6582159 8928984 10434177 10975702 11896957 12419615 10958477 8944599 9172842 10691500
38430 10691500 9775578 6385512 5027117 7837367 11259071 11745873 10679025 10795916
38422 10795916 11449585 10940849 10471633 11746368 12994912 11671707 9387676 9624276 11631339
38413 11631339 11443063 8758188 7815882 10467253 13007345 11931866 9064997 8315838
38405 8315838 10148741 12112941 12890392 13000365 12711611 11859895 11161052 11580141 12674019
38396 12674019 13205174 13075032 13152016 13502826 13324379 12560134 12186659 12709697 13473400
38387 13473400 13734917 13606691 13666258 14204321 15035632 15637422 15396641 14057974 12010158
38378 12010158 10046684 9016270 9699252 12405609 16220506 19093108 19398035 17484861
38370A7484861k090927l58008J648238K254063R66891j275071k884874k829777
38362A2915396j206192J041393K543233K064868k76509k389703k098825J31289
38354A2724950J766055J705080J330732J536100J095486p24757k298340k180713
38346A4954593j308251o66919P79897L294492M129605J503548j540432j316446
38338A9830087N32241J830k091437j638007R85392J191104j480620k180278N67403
38329A5717715J973486m23063k108277L28541K833714J024396j862559o74847
38321A6809106K464078K031091j035087j304455J144439J029964k099200k514736
38313A6525200J538135M164018J334103k659967k388174N77482J511032K93359
$$ plain form
38370 17484861 15393934 15035926 16684164 18938227 19905118 18630047 15745173 12915396
38362 12915396 11709204 12750597 15293830 17358698 17082189 14692486 12593661 12724950
38354 12724950 14491005 16196085 17526817 19062917 20158403 19433646 17135306 14954593
38346 14954593 13646342 12979423 13759320 17053812 21183417 22686965 21146533 19830087
38338 19830087 20362328 20364158 18272721 16634714 17620106 18811210 17330590 15150312 15717715
38329 15717715 17691201 17268138 15159861 15488402 18322116 19346512 17483953 16809106
38321 16809106 19273184 21304275 20269188 18964733 20109172 21139136 19039936 16525200
38313 16525200 18063335 22227353 23561456 20901489 18513315 19090797 20601829 20895188
38305B0895188Q7104J088178Q43712o86732j137614j90909J25711n49718l93383
38296B0081537Q26532J014505l77432j007696L97020J606445M52978j447974j157264
38287B0388651Q84374J604635K09596q03350J657P16623l25022j385905k78570
38278B1012689J469364P00528k033657k856107m63966J892877J407988m83811
38270B0645905j016946j10267O20758P05326N17347p8078p92854l89844J046984
38261B1148331J355987j63154r06403P18337J826700m50412l355439k039347K601225
38252B0735825M679478J786636k098825k863926j069133P37021J664978J786408
38244B5358462Q99287l56294n57777J97511L01745m59687n81292J49350K24593
$$ plain form
38305 20895188 20982292 22070470 22914182 22227450 21089836 20898927 21024638 20474920 20081537
38296 20081537 20908069 21922574 21545142 20537446 20934466 22540911 22993889 21545915 20388651
38287 20388651 21273025 22877660 23087256 22283906 22285563 23002186 22677164 21291259 21012689
38278 21012689 22482053 23182581 21148924 18292817 17828851 19721728 21129716 20645905
38270 20645905 19628959 19518692 20139450 20844776 21362123 21284045 20491191 20101347 21148331
38261 21148331 22504318 22341164 21434761 22153098 23979798 23529386 20173947 18134600 20735825
38252 20735825 25415303 27201939 25103114 22239188 21170055 21907076 23572054 25358462
38244 25358462 26257749 25901455 25343678 25541189 25842934 25383247 24801955 24951305 25175898
38235B5175898m87161l72508N76916M27498r13436j217900k18144l86608k043087
38226B0541468j972976R44727K968474J207576j716012k013280l66172L61848
38218A9955653J27867N81546J227541N15006q90511j251616p33124m24358l2272
38209A9075732Q79426J249086N33368Q1197J81765j190291l885018l652935J289358
38200A4561688N574090L733595j310719k776309l75984O41266r39555j149352
38192A7958720J083857K077887M56312p27235k81047q22004k701694k400227P11966
38183A5356535K294588N79027k51732K155332L337032l45075m523631l235010
38175A5367066J563747L250341O15862j608833q33049O99891R01396M06853m5149
$$ plain form
38235 25175898 24688737 24316229 24893145 25320643 24407207 23189307 22971163 22584555 20541468
38226 20541468 18568492 19513219 22481693 23689269 21973257 19959977 19593805 19955653
38218 19955653 20083520 20665066 21892607 22407613 21517102 20265486 19532362 19108004 19075732
38209 19075732 19955158 21204244 21737612 21818809 22000574 20810283 16925265 13272330 14561688
38200 14561688 20135778 23869373 22558654 19782345 19406361 20047627 19108072 17958720
38192 17958720 19042577 21120464 21576776 20849541 20568494 19746490 17044796 14644569 15356535
38183 15356535 17651123 18230150 17978418 20133750 23470782 23125707 18602076 15367066
38175 15367066 16930813 20181154 20797016 19188183 18355134 19055025 19956421 20363274 20318125
38166B0318125o09946n13696J115060K589568J386039j495337k476606q46109
38158A9467098M30525j62665n15572R83075K556679K063550K61150q50927r44546
38149B3288367q49750p20246l56600j43050k55522K8557J017317J611329Q41967
38140B4462369m81685r17817m83997l05199o13189m58274N52316J385922R44078
38131B4084524l40799q96062Q6581J607534J994442Q41864o84546j475973j680247
38122B3537318j853977j664691m25325J343513K067646J208120K79865R55940
38114B5448409K572561K626259R7654k688637k648289l7722J610308J59150k179501
38105B4960192j995402M89663J900293N22422j715078k271161q27551J415114
$$ plain form
38166 20318125 19708179 19194483 20309543 22899111 24285150 22789813 20313207 19467098
38158 19467098 19897623 19734958 19219386 20202461 22759140 24822690 25083840 24232913 23288367
38149 23288367 22438617 21718371 21361771 21218721 20963199 20991756 22009073 23620402 24462369
38140 24462369 23980684 23062867 22578870 22273671 21660482 21202208 21754524 23140446 24084524
38131 24084524 23743725 22847663 22934244 24541778 26536220 27378084 26693538 25217565 23537318
38122 23537318 21683341 20018650 19593325 20936838 23004484 24212604 24492469 25448409
38114 25448409 28020970 30647229 30744883 28056246 25407957 25370235 26980543 27139693 24960192
38105 24960192 22964790 23454453 25354746 25877168 24162090 21890929 21063378 22478492
38097B2478492L186767L194196Q55110k032548k463583k34799J408836N09013
38089B6901484p30876J76336J808713J447207j63250k34745J124016J207978m77166
38080C1059697j455223n55602N24070N52256L96912M24593n10262k111476j759156
38071B6565809J434568M261931L491102L91387j267571l61502R32881Q16960k15837
38062C6049728j030072j429660j676152j646799r71060M17467J918327K396509
38054C4028288J191728q39681k006817j702870q11557j26625M47876R17031Q50867
38045C1948240M54400N13350Q32739M12194l66927J15298J577613J414291j088516
38036C5812682k778286j131856J708007K227754P35914j14708j96121j259347
$$ plain form
38097 22478492 25665259 28859455 29714565 27682017 25218434 24983635 26392471 26901484
38089 26901484 26170608 26346944 28155657 29602864 29439614 29204869 30328885 31536863 31059697
38080 31059697 29604474 29048872 29572942 30125198 30522110 30946703 30436441 28324965 26565809
38071 26565809 28000377 32262308 35753410 36144797 34877226 34515724 35448605 36265565 36049728
38062 36049728 35019656 33589996 31913844 30267045 29295985 29713452 31631779 34028288
38054 34028288 35220016 34380335 32373518 30670648 29859091 29732466 30180342 31097373 31948240
38045 31948240 32402640 32915990 33748729 34160923 33793996 33909294 35486907 36901198 35812682
38036 35812682 33034396 31902540 33610547 35838301 36574215 36459507 36263386 35004039
38028C5004039k546952j572708R18256J386221n12952r90445J438292L156642
38020C6280393J463575q21667j57160J741943R05636k150182l164882o83782K233989
38011C5647863K822765J648640M26785k54810l14655L60258J080182P87449k65382
38002D1939095r18057j167315j855408k389747j244384R81171J748962O30740
37994C7725057L24365K186841L531886J662709j618909k429081m14322J098913
37986D2067459J65405j420058j264065L85902J514305J055086k08592p83493J3912
37977D1525861J328775J558760K49402j201617j338789m94846J01742K86069N94246
37968D2609603N89555n21350j796096j271817Q60227J995820Q92383m42481l0968
$$ plain form
38028 35004039 32457087 30884379 31802635 33188856 32675904 31685459 33123751 36280393
38020 36280393 37743968 36922301 36765141 38507084 39412720 37262538 34097656 33413874 35647863
38011 35647863 38470628 40119268 40546053 40291243 39976588 40336846 41417028 42204477 41939095
38002 41939095 41021038 39853723 37998315 35608568 34364184 35345355 37094317 37725057
37994 37725057 38049422 40236263 43768149 45430858 43811949 41382868 40968546 42067459
37986 42067459 42232864 40812806 39548741 39934643 41448948 42504034 42295442 41511949 41525861
37977 41525861 42854636 44413396 44662798 43461181 42122392 41627546 41729288 42015357 42609603
37968 42609603 43199158 42677808 40881712 39609895 40470122 42465942 43358325 42915844 42884876
37959D2884876Q97249R2246j784828k011435m1506J717198J595943P42288O19068
37950D4711099N01645q93395k569464k092038Q64397L483776K973921j24014k600322
37941D4255605k254003j30086J129006N47259l55303L0441J157188J259187k7764
37932D5611530j189791j081526m75262o83053j459839j340224J69017J743612
37924D1294464J841470N01900q48868j057400l26375K75350J01169m21833m35371
37915D0924506K13861P91423P06826L09868K89892O19202O76295K59678k04213
37906D4587338m68000p31187r33029n87185K77945Q03102N43620L04230Q74197
37897D4671031J546112J045508l79448j105513m35878N13961N97490J46914Q3035
$$ plain form
37959 42884876 43782125 43874371 42089543 40078108 40036602 41753800 43349743 44092031 44711099
37950 44711099 45212744 44319349 41749885 39657847 40522244 44006020 46979941 46855927 44255605
37941 44255605 42001602 41871516 43000522 43547781 43192478 43222919 44380107 45639294 45611530
37932 45611530 44421739 43340213 42864951 42181898 40722059 39381835 39550852 41294464
37924 41294464 43135934 43637834 42788966 41731566 41405191 41680541 41781710 41359877 40924506
37915 40924506 41138367 41929790 42636616 42946484 43236376 43855578 44531873 44791551 44587338
37906 44587338 44119338 43388151 42455122 41867937 42145882 42948984 43492604 43796834 44671031
37897 44671031 46217143 47262651 46883203 45777690 45341812 45855773 46453263 46600177 46683212
37888D6683212M77803P77241P38065L89029l27663j149806j330833o35608J13210
37879D5734650K88133N15992J391893J863044M78762k009381l064933j719257
37871D3478903N9132Q1130j230107j730692m69383J364978K103467J384498K60362
37862D5302288j09621K17619J35743p74355j269319j96263J250159P44146j533692
37853D3766705k538327o15348J895911K059103O45688N53175J957964K129153
37845D9854024J12931j540478q43478N64782L61683n80492P5573J754436J470981
37836E1229962j278737l170782j745711J026454J797450O10627R555M31670k27291
37827D8683197k230997k656033j22527K108795P00326k176228j662487K267057
$$ plain form
37888 46683212 47161015 47938256 48676321 49065350 48737687 47587881 46257048 45621440 45734650
37879 45734650 46022783 46538775 47930668 49793712 50272474 48263093 45198160 43478903
37871 43478903 43538035 43619165 42389058 40658366 40188983 41553961 43657428 45041926 45302288
37862 45302288 45192667 45410286 45546029 44771674 43502355 43306092 44556251 45300397 43766705
37853 43766705 41228378 40613030 42508941 44568044 45213732 45766907 47724871 49854024
37845 49854024 49966955 48426477 47582999 48147781 48509464 47928972 48004545 49758981 51229962
37836 51229962 49951225 46780443 45034732 46061186 47858636 48469263 48478818 48910488 48683197
37827 48683197 46452200 43796167 43673640 45782435 46482761 44306533 42644046 44911103
37819D4911103M511793K563673k3865J73611J078346o05507l140080k510617N02766
37810D7461223J266386j147766k589469q12631J174874O73182l46990N84260J731386
37801D7994455M59407j608703j140517R64892Q46361j752179k838454o04212J787680
37792D4108730J370797l14323m12673N50129J64896j313235j183890J187762K954466
37783D7112659J777336p88756j510410l7998Q12132n08137j729153k50555K368124
37774D7245242K249121p37842k211257J65989K791182J534615j725355j970094
37766D7341601J119901K831804P92887j910027k051394o09818J01672K09090P91427
37757D8617143J307640R72507N77953O88822M0813k004227l420962k407969m25216
$$ plain form
37819 44911103 49422896 51986569 51962704 52136315 53214661 52609154 49469074 46958457 47461223
37810 47461223 48727609 47579843 44990374 44177743 45352617 46025799 45678809 46263069 47994455
37801 47994455 48453862 46845159 45704642 46669534 47515895 45763716 42925262 42321050 44108730
37792 44108730 45479527 45165204 44752531 45302660 45467556 44154321 42970431 44158193 47112659
37783 47112659 48889995 48101239 46590829 46552831 47364963 46856826 45127673 44877118 47245242
37774 47245242 49494363 48756521 46545264 46711253 49502435 51037050 49311695 47341601
37766 47341601 48461502 51293306 52086193 50176166 48124772 47514954 47616626 47825716 48617143
37757 48617143 49924783 50897290 51475243 52164065 52204878 50200651 46779689 44371720 43946504
37748D3946504L00859M55496J760848L045684J803333j199421k549205j223881
37740D6340217M03350P12993O66835R65849N84825p72692j468297n28901O82079
37731D7586258O84603J5127m6795N57405R97466P17443l84509j872025k592102
37722D5662871j799887m81284j06155k78551M63607J707476J481901k68896j237169
37713D5143913m79765J53459n34797r33453L83187J888770J467833k24834r38522
37704D5925791j27452Q61585R81626K13032j128840k410952k663433j620144j34867
37695C9896346J065820K034749K541581J811505K1440j423383j771384j550099
37687D2626575r47305L74084J433084N58036j345372j215890J198650K216412
$$ plain form
37748 43946504 44247363 44702859 46463707 49509391 51312724 50113303 47564098 46340217
37740 46340217 46743567 47456560 48123395 49089244 49674069 48901377 47433080 46904179 47586258
37731 47586258 48270861 48285988 48239193 48796598 49794064 50511507 50126998 48254973 45662871
37722 45662871 43862984 43381700 43275545 42996994 43460601 45168077 46649978 46381082 45143913
37713 45143913 44664148 44817607 44282810 43349357 43732544 45621314 47089147 46864313 45925791
37704 45925791 45798339 46659924 47641550 47854582 46725742 44314790 41651357 40031213 39896346
37695 39896346 40962166 42996915 45538496 47350001 47371441 45948058 44176674 42626575
37687 42626575 41679270 42053354 43486438 44044474 42699102 41483212 42681862 44898274
37679D4898274M630k127883j031033J153524Q10123j165444j470620k13224l6311
37670D0822036r91138r06571J17048Q5135o78113j07930J256534R55088n95036
37661C9957053n51620J043418J134176p03206j324277K81997J162434j98976j290778
37652C9510221l96739M10287m30087q16255Q80539K215565O32643j940227k004640
37643C8061307K30814J792079J392578j0230j537271k569675k075788j94924J005356
37634C6094246N14178K02596J342337J705691o66508l015256j350191K809490
37626C7636583L721531m14486m704056m184584j3922K759395J536328j612251
37618C4724538l107241j734032O25393J461505M14623p38427o15394K64837P23036
$$ plain form
37679 44898274 44902904 42775021 41743988 42897512 43707635 42542191 41071571 40858347 40822036
37670 40822036 39830898 38924327 39041375 39126510 38448397 38340467 39597001 40552089 39957053
37661 39957053 39405433 40448851 41583027 40879821 39555544 39837541 40999975 40800999 39510221
37652 39510221 39113482 39523769 39093682 38277427 39157966 41373531 42006174 40065947 38061307
37643 38061307 38292121 40084200 41476778 41466548 39929277 37359602 35283814 35088890 36094246
37634 36094246 36608424 36811020 38153357 39859048 39192540 36177284 34827093 37636583
37626 37636583 41358114 40943628 36239572 32054988 32041066 34800461 36336789 34724538
37618 34724538 31617297 29883265 30508658 31970163 32384786 31646359 31030965 31295802 32018838
37609C2018838M59172j95383r02867j112957m13670M63184L77320k11634J50976
37600C0632979J036485M46010j314445j267286J262496K749832Q65640j609684
37592C2802027j344679K56875J51339p99288J4559J402473J80831k692860l176545
37583B6794732r86431l4240j607639k368321m31480J447020Q21763n04033m7896
37574B3083475J222843J090244r6302m46675K99856P79367J09365j328253k285731
37565B2428189j433205R29759K226762P49881j164233j63948K453920K296421
37557B8323546p63371j869035Q19514K878876J119679r99387L93471K588724R28293
37548C3420310k954906l570059l34577K032531J079950r63883k203811l194062
$$ plain form
37609 32018838 32478010 32282627 31379760 30266803 29853133 30316317 30693637 30482003 30632979
37600 30632979 31669464 32115474 30801029 29533743 30796239 33546071 34411711 32802027
37592 32802027 31457348 31714223 31865562 31066274 31080833 32483306 32664137 29971277 26794732
37583 26794732 25808301 25774061 24166422 21798101 21366621 22813641 23635404 23131371 23083475
37574 23083475 24306318 25396562 25300260 24853585 25153441 25932808 26042173 24713920 22428189
37565 22428189 20994984 21924743 24151505 24901386 23737153 23573205 26027125 28323546
37557 28323546 27560175 25691140 26510654 29389530 30509209 29509822 29903293 32492017 33420310
37548 33420310 30465404 26895345 26560768 28593299 29673249 28709366 26505555 23311493
37540B3311493l577128j696250J323460J820767n24302j523586P93931K654276
37532B2582661O04738k754529k865679j98339J101211j09255r68524J29894J267630
37523A8789808O75964n15364n72897O2524o9238r22785j213118n46172J33452
37514A5822174J46620M5027N76207J285914Q75037r40387k537174k068520Q8406
37505A3293304J515473P65666p52898p96444N20956R24530p30425k800592l003276
37496H936294j126581J161133K368418K157900R47085l62863o34461L70235J230794
37487A5047954L96218j524595k249129q22157J175805J875617J224026J58034
37479A5281773q51646j338609m03724J628481K354418J92821k690542k810199
$$ plain form
37540 23311493 19734365 18038115 19361575 21182342 20658040 19134454 19928385 22582661
37532 22582661 23187399 20432870 17567191 17368852 18470063 18360808 17392284 17522178 18789808
37523 18789808 19465772 18950408 18377511 18440035 18370797 17448012 16234894 15688722 15822174
37514 15822174 15968794 16013821 16590028 17875942 18750979 17810592 15273418 13204898 13293304
37505 13293304 14808777 15574443 14821545 14025101 14546057 15470587 14740162 11939570 8936294
37496 8936294 7809713 8970846 11339264 13497164 14444249 14081386 13446925 13817160 15047954
37487 15047954 15444172 13919577 11670448 10848291 12024096 13899713 15123739 15281773
37479 15281773 14430127 13091518 12687794 14316275 16670693 16863514 14172972 11362773
37471A1362773l61130R66611n23571k161560j233012R77348J497982R2861j052700
37462I565602r10894m08030j47954L19619Q87858N79464o74869j515978j025178
37453F669640P4189O40727N36967K78628J25036J01583K67113M54926K98711r9556
37443I347964j22644L61746O27988K28700j92634M2603L96181o1117r29698q63086
37433H836003K40343P92779r3568j002826k06142J560376J894227P2529k036782
37424A0056939k620061j874869q00078L11107J191296R65180l96898j260077n51265
37415E021274L61800j18326q48970L94809K980506L943769K423089P19998M18922
37406A5296871K64370r87099k136525j564974K34357J698929K215394J820507
$$ plain form
37471 11362773 11001643 11968254 11444683 9283123 8050111 9027459 10525441 10618302 9565602
37462 9565602 8654708 8246678 8098724 8418343 9306201 9885665 9210796 7694818 6669640
37453 6669640 6743829 7384556 7921523 8200151 8325187 8426770 8693883 9148809 9447520 9347964
37443 9347964 9225320 9587066 10215054 10443754 10251120 10293723 10689904 10628787 9699089 8836003
37433 8836003 9076346 9869125 9775557 8772731 8566589 10126965 12021192 12093721 10056939
37424 10056939 7436878 5562009 4761931 5073038 6264334 7229514 6832616 5572539 5021274
37415 5021274 5383074 5264748 4415778 4810587 7791093 11734862 14157951 14877949 15296871
37406 15296871 15561241 14574142 12437617 10872643 11107000 12805929 15021323 16841830
37398A6841830N05728r28630r92386K84180J010127M26164M7754M85346j07233
37389A7572880k298621l074012m21957K374168J065719k785921l917016j249615
37381G265625J133643P79659k16106J28308O52969K28278l4375L75830j34790
37372A0179041j895921k432330n59864J107138K85589j248922q95590M69195N63606
37363E571942k44639l15662j52104q65274j025320R82771K867449J170348k580968
37354E408543l231413K39048L066291J993137l22326l29069R96821Q15968n34025
37345H102975p34389J82847K56422o35942p40659J48796K69360q17101j200304
37336D832005K48509J911207J850409N87869n9489J17816k81171j632156k335473
$$ plain form
37398 16841830 17347558 16418928 15426542 15710722 16720849 17147013 17194767 17680113 17572880
37389 17572880 15274259 12200247 11778290 14152458 15218177 12432256 8515240 7265625
37381 7265625 8399268 9178927 8962821 9091129 9744098 9972376 9938001 10313831 10179041
37372 10179041 8283120 5850790 5290926 6398064 6683653 5434731 4539141 5008336 5571942
37363 5571942 5327303 5011641 4859537 3994263 2968943 3951714 6819163 7989511 5408543
37354 5408543 2177130 2416178 5482469 7475606 7153280 6824211 7821032 8637000 8102975
37345 8102975 7368586 7551433 7807855 7171913 6431254 6580050 6849410 6032309 4832005
37336 4832005 5080514 6991721 8842130 9429999 9370510 9488326 9207155 7574999 5239526
37327E239526j121079Q52662J402005L92688n2761J205457K344597J114717j610313
37318I767499k703395j044281J078343J314173J08578q02821j028843j082008
37310E607245o21280Q78584K349310J995477j34728k026166k165144q18340R67644
37301F032602K176853J844136J8643j299279j55061K171021K221845o35467k708434
37292I666859j058435K097040K450892l46334k522177j620584O41651J421151
37284A0730063M24569n23595j84258R50630J572804R43648k86056n21920R57483
37275A4063368K746316K759557R06568p62349p37479L01218R30980R26018J007871
37266B2142068J513051K156263K631806K779730K490428J946460J716206K294815
$$ plain form
37327 5239526 4118447 4971109 6373114 6765802 6713041 7918498 10263095 11377812 9767499
37318 9767499 7064104 6019823 7098166 8412339 8520917 7718096 6689253 5607245
37310 5607245 4985965 5864549 8213859 10209336 10074608 8048442 5883298 5064958 6032602
37301 6032602 8209455 10053591 10072234 8772955 8617894 10788915 13010760 12375293 9666859
37292 9666859 8608424 10705464 13156356 12810022 10287845 8667261 9308912 10730063
37284 10730063 11154632 10631037 10446779 11397409 12970213 13913861 13627805 13105885 14063368
37275 14063368 16809684 19569241 20475809 19713460 18975981 19277199 20208179 21134197 22142068
37266 22142068 23655119 25811382 28443188 31222918 33713346 35659806 37376012 39670827
37258C9670827L709446N525739O899544O974777O010108N746850P485455J0043316
37250I2066062J1153532J0822849J1327641J3531812J5584879J6350327J7636407
37243A88473509K1032439K4649137K5715780K4917907K4900889K5102984K1612965
37236C56405610J2707525J500180q099942j5591213k2489513k8720285l2437783
37229B63274579l2544925k9779988k5670258k1454303j7753411j4622000j2098607
37222A09351087j0718889j0711801j0774707r094119o019831m143046m821943
37215E3066751o146659n659466l768707k734395l144602l393093k470866j420942
37207B4328021j524264k305627k179685o59392P25217N9676k330056l555030j486741
$$ plain form
37258 39670827 43380273 48906012 55805556 62780333 68790441 74537291 82022746 92066062
37250 92066062 103219594 114042443 125370084 138901896 154486775 170837102 188473509
37243 188473509 209505948 234155085 259870865 284788772 309689661 334792645 356405610
37236 356405610 369113135 370613315 362513373 346922160 324432647 295712362 263274579
37229 263274579 230729654 200949666 175279408 153825105 136071694 121449694 109351087
37222 109351087 98632198 87920397 77145690 68051571 62031740 57888694 53066751
37215 53066751 46920092 41260626 37491919 34757524 31612922 28219829 25748963 24328021
37207 24328021 22803757 20498130 18318445 17659053 18384270 18443946 16113890 12558860 11072119
37198A1072119J990438K807135J0179k940959l099584j779810j494280j582343
37190D982895n585K120972J711760r49319k022340M8867K138573J308222j098558
37181H235487k183508j638345q33601N5943J365649J926313M91857j647192j939459
37172C833144n6097J915661K370441J483043Q9775r48458p36832N61549J161942
37163I674168p5435j571209j231681J78058M26142j98754M58823J996077J483645
37154A1139834j319387k680151o24408J607820N36266k079695k158338L66920
37146D788861J950332J121364q5955k67633n55293j625130j966781o17329P57423
37137C499859K83873j256180j731833p10539M81672J005898J131319R31280O1116
$$ plain form
37198 11072119 13062557 15869692 15879871 12938912 9839328 8059518 6565238 4982895
37190 4982895 4977310 7098282 8810042 7860723 5838383 5887250 8025823 9334045 8235487
37181 8235487 6051979 4413634 3580033 3635976 5001625 6927938 7419795 5772603 3833144
37172 3833144 3777047 5692708 8063149 9546192 9635967 8687509 7950677 8512226 9674168
37163 9674168 9598733 8027524 6795843 6973901 7400043 7201289 7660112 9656189 11139834
37154 11139834 9820447 7140296 6515888 8123708 8659974 6580279 4421941 4788861
37146 4788861 6739193 7860557 7774602 7506969 6951676 5326546 3359765 2742436 3499859
37137 3499859 3783732 2527552 795719 85180 566852 1572750 2704069 3635349 3696465
37128C696465q97974m13182J734975L192837J546796k086411l692080j386502
37120A694924J677651J215533k192706l572497m22405L603820L651163K16114
37112E871597k026459r77087N78919j24416j676547j144668J071994J779683k2951
37103C330065j422578N6107K417055J805402j630819l428918j129298J997579
37095A994595J805346m86080n23905J915848K524891k13794k121850O1197L333671
37086H289919L085716p0180k072605j734032j054693p05653M31391J857196J687672
37077I714731J80204n77350l52311o72360j381513j020579l27376j241749k565332
37068A756365j207686J984404K676648J74377j226568M45510J707795J86589j225486
$$ plain form
37128 3696465 2798491 2385309 4120284 7313121 8859917 6773506 3081426 1694924
37120 1694924 3372575 4588108 2395402 -1177095 -1599500 2004320 5655483 5871597
37112 5871597 3845138 2868051 3446970 3322554 1646007 501339 1573333 3353016 3330065
37103 3330065 1907487 1963594 4380649 6186051 4555232 1126314 -2984 1994595
37095 1994595 3799941 3313861 2789956 4705804 7230695 7016901 4895051 4956248 8289919
37086 8289919 11375635 11305455 9232850 7498818 6444125 5738472 6169863 8027059 9714731
37077 9714731 9894935 9317585 8965274 8292914 6911401 5890822 5563446 4321697 1756365
37068 1756365 548679 2533083 5209731 5384108 4157540 4603050 6310845 6497434 5271948
37059E271948n8075J159178N5252p70763J140053K724150O73325j864657k00065
37050H130346L377620K956573j076859k720547k29432J832539Q03044n63435j30467
37041A2379382K00055q53784j238751R7494Q51352j44457l64932J732677L371009
37032A6030045J860167r32177j737341q71964p99729j654002j422735L86137J884174
37023A2742575J341063r14688k852526k460429J25983K239336J735189j7692k41113
37014A1697698Q13036N49099j140037j529651k4363O29016p23451j608004n77311
37005H086032J72975q68865j548384k22443Q01239o60474k470567j734518L15716
36996A870711Q59735L78832R43229J758304P02857j257290j408153O8039P53134
$$ plain form
37059 5271948 5213873 6373051 6428303 5657540 6797593 9521743 10195068 8330411 8130346
37050 8130346 11507966 14464539 13387680 10667133 10437701 12270240 13073284 12509849 12379382
37041 12379382 12579437 11725653 10486902 10584396 11435748 11291291 10926359 12659036 16030045
37032 16030045 17890212 16958035 15220694 14348730 13549001 11894999 10472264 10858401 12742575
37023 12742575 14083638 13168950 10316424 7855995 7981978 10221314 11956503 11938811 11697698
37014 11697698 12510734 13059833 11919796 10390145 10365782 10994798 10271347 8663343 8086032
37005 8086032 8259007 7390142 5841758 5619315 6420554 5760080 3289513 1554995 1870711
36996 1870711 2730446 3109278 4052507 5810811 6513668 5256378 3848225 3916264 4669398
36987D669398L89089P56792J852683J933842R32939L26973J2329j300755k948872
36978F624418k880604j081438O01819J530511K148772J690177n51432k550077
36970E532146j913824r7391j75148j269054K5362L082650L534826N85549j489266
36961G815850m27430Q54927J23726m63643P69682J403999l73764j827486l92302
36952G483559J398605P0369k712864k853162m54199Q89816J30477l30191P60041
36943D382451J931298K050654J681618J131816j44690j828327k566819j855633
36935D782368n50743M23665O28341r7373j106349r75114O12927J943116J533794
36926G194632J80533n91862p06318p04487l88338R5332l07686j311759q22058
$$ plain form
36987 4669398 5058487 5815279 7667962 9601804 10534743 10861716 10874045 9573290 6624418
36978 6624418 3743814 2662376 3264195 4794706 6943478 8633655 8082223 5532146
36970 5532146 3618322 3520931 3345783 2076729 2102091 5184741 8719567 9305116 7815850
36961 7815850 7388420 8243347 8367073 7903430 8673112 10077111 9703347 7875861 7483559
36952 7483559 8882164 8952533 6239669 3386507 2932308 3822124 3952601 3622410 4382451
36943 4382451 6313749 8364403 10046021 11177837 11033147 9204820 6638001 4782368
36935 4782368 4231625 4655290 5283631 5186258 4079909 3104795 3717722 5660838 7194632
36926 7194632 7375165 6783303 6076985 5372498 4984160 5079492 4771806 3460047 2637989
36917B637989J221861J512596j176165k625040M13623L709452J453914l626870
36909C521360l490356K400125N634456J896678k593310j485602J989754J407580
36901I280685k209238k991104j54444J644439M32240r87570q16138m98673p19962
36892B980235j47002R59503M22158j422453j328544J285299K640744O30346j555317
36883D464969p83113P49627m78208k874477k073278J699043L554876J309684j598769
36874C970354j718431k20730J36823l72363L25758K066762K549904R03253j145241
36865F496089j688448o87288M64620L87478j095586k419235j511574J482053L587544
36856E015653K473605l69028j699820r44026k14555m57185m94272o4956n55882
$$ plain form
36917 2637989 3859850 5372446 4196281 1571241 1984864 5694316 7148230 3521360
36909 3521360 31004 2431129 8065585 9962263 7368953 5883351 7873105 9280685
36901 9280685 7071447 4080343 3925899 5570338 6002578 5015008 4198870 3700197 2980235
36892 2980235 2833233 3792736 4214894 2792441 1463897 2749196 5389940 6020286 4464969
36883 4464969 3681856 4431483 3953275 1078798 -994480 704563 4259439 5569123 3970354
36874 3970354 2251923 2031193 2168016 1795653 2121411 4188173 6738077 7641330 6496089
36865 6496089 4807641 4120353 4584973 4972451 3876865 1457630 -53944 1428109 5015653
36856 5015653 7489258 7120230 5420410 4476384 4261829 3804644 3310372 3245416 2689534
36847B689534j693007q39755K444090M222076J464723k877922l608780n22581
36839A278378J911827J303041k71034o96173o18428p81506j69779J464622K174329
36830E595277R22529l40907J79638J123355M97693p26716l54587J047082R53821
36821H897185r03516k078062j255690M1447J83284l05593j48953O12960R97767
36812F040829N34141m29414j186512j037227Q4518J086617O73135q33809j499383
36803C432895j49594J942109K434177O82997j470161j750319J8758J768891J683129
36794H592882L19463m94603m41036q45349j870110j673234M24348J970174P37626
36785F720161j504776j402276P51305J530611j7126r63227M26232J794644P53367
$$ plain form
36847 2689534 996527 156772 2600862 6822938 8287661 5409739 1800959 1278378
36839 1278378 3190205 4493246 4222212 3526039 2907611 2126105 1956326 3420948 5595277
36830 5595277 6517806 6176899 6356537 7479892 7977585 7250869 6896282 7943364 8897185
36821 8897185 7993669 5915607 4659917 4701364 4884648 4579055 4430102 5043062 6040829
36812 6040829 6574970 6145556 4959044 3921817 4006335 5092952 5766087 4932278 3432895
36803 3432895 3283301 5225410 7659587 8342584 6872423 5122104 5140862 6909753 8592882
36794 8592882 8912345 8417742 7976706 7131357 5261247 3588013 4012361 5982535 6720161
36785 6720161 5215385 3813109 4564414 6095025 6077899 5114672 5540904 7335548 8088915
36776H088915j245901j639158q44860o38734m51456J171139K715719J337174j910872
36767F581966k610487L85942K702899P55111k896130l335737k65295K134063J330540
36758D782872q31432j605485p11586N76535J474927J613538N94800r84199j302161
36749C607809M14656K268076J868113m45094k126474j799398m11394Q41569J788666
36740F006529K103247Q77039j565630l084578k333667o46852J33367M03658J499811
36731C392924K721466K068078l75809k161425j818860m49448L85543M63001J37372
36722D362842l57606l29626Q08096J932491J246306n64336p49466R88452J380295
36713H717448j210440l497842j997812J475469K586910R66896q0486O38743R85951
$$ plain form
36776 8088915 6843014 5203856 4358996 3720262 3268806 4439945 7155664 8492838 6581966
36767 6581966 3971479 4357421 7060320 7815431 4919301 1583564 1318269 3452332 4782872
36758 4782872 3951440 2345955 1634369 2210904 3685831 5299369 5894169 4909970 3607809
36749 3607809 4022465 6290541 8158654 7713560 5587086 3787688 3376294 4217863 6006529
36740 6006529 8109776 8986815 7421185 4336607 2002940 1356088 1489455 1893113 3392924
36731 3392924 6114390 8182468 7806659 5645234 3826374 3376926 3762469 4225470 4362842
36722 4362842 4005236 3675610 4483706 6416197 7662503 7098167 6348701 7337153 8717448
36713 8717448 7507008 4009166 2011354 3486823 6073733 7040629 6960143 7598886 8584837
36704H584837j4036o12722P458K96190l07019j03084J306122J593920k46731j681103
36694H823832q32320J76549r23743k111934k87926L022254L476006N80004j746669
36685A0176053j320687k52572m77894o78127M60608J244817p1817j711060q85516
36676F483805J482169J864356l94704j968588o84358J080372K0268k955568l794412
36667A133340r70156K488492L209849J537379j2778o40362j385029k177664j487197
36658A695874O52066J726082K21986j831511j682074O7276N13695r17493j476120
36649a030219O66231L346151L165065J67513k119545j260817J128344J837566
36641E900289L83377p12879J31909J219312K97087j809743k313129n94749J138613
$$ plain form
36704 8584837 8570801 7958079 7965537 8261727 7954708 7851624 9157746 10751666 10504935 8823832
36694 8823832 7991512 8168061 7244318 5132384 4844458 7866712 11342718 11922722 10176053
36685 10176053 8855366 8602794 8124900 7446773 7907381 9152198 9080381 7369321 6483805
36676 6483805 7965974 9830330 9435626 7467038 6782680 7863052 7883320 4927752 1133340
36667 1133340 163184 2651676 5861525 7398904 7386126 6745764 5360735 3183071 1695874
36658 1695874 2347940 4074022 4296008 2464497 782423 849699 1363394 445901 -1030219
36649 -1030219 -363988 2982163 6147228 6314741 4195196 2934379 4062723 5900289
36641 5900289 6283666 5570787 5702696 6922008 7219095 5409352 3096223 2501474 3640087
36632C640087J434745J296213J511110R11816j041130k251358r25666J182750
36624E758567J137449p48337j633516n43598Q20478J261430J179643O20295q07692
36615G044719j905064q10581J581924K188630M00450r95380m89360K5474p40611
36606F300201j030983J50672M07520j779859l394451j364063J925773K070017
36598C284827k80349p14388J524674K609912P61076j187844r50809n9062k88553
36589D699484p36229m69521o01868j515699j249802Q88077K153039O07553j304317
36580B470717o52934J074231P54740p60658k19718K054229K470244K97190j146776
36571F341265j89886O91596l20744j090465M50669K275877J463075r15541j622736
$$ plain form
36632 3640087 5074832 6371045 7882155 8793971 7752841 5501483 4575817 5758567
36624 5758567 6896016 6147679 4514163 3970565 4791043 6052473 7232116 7852411 7044719
36615 7044719 5139655 4329074 5910998 8099628 8500078 7504698 7015338 7040812 6300201
36606 6300201 5269218 5419890 5827410 4047551 653100 -710963 1214810 3284827
36598 3284827 3004478 2290090 3814764 6424676 7185752 5997908 5047099 4988037 4699484
36589 4699484 3963255 3493734 2891866 1376167 126365 1014442 3167481 3775034 2470717
36580 2470717 1817783 2892014 3646754 2886096 2666378 4720607 7190851 7488041 6341265
36571 6341265 6151379 6842975 6522231 5431766 5882435 8158312 9621387 8705846 7083110
36562G083110n37663m28472j959489k613873j108967M79192L93606J36132J552433
36553B996009L149417K229136m24125j243547O94850K139422O77801j580132j492406
36544G146425J36389Q4991j942542k967214j711917m72088r73669j473345P8507
36535b094463K411881K884819J386039j23092o94341o29268K16399J726705K045778
36526G130457k21731k838843k211808J134863K774742P12855j992995k312109
36518B175431j473113j755264k030069R3119L400032M066523J206966j748272
36510C935353j761662J99481J271301N85056l71860l36069K81074N14073L02369
36501D619116J56204p7642r74802j973501j509941M44580J537249L62549q54879
$$ plain form
36562 7083110 6545447 6116975 4157486 1543613 434646 913838 1307444 1443576 2996009
36553 2996009 6145426 8374562 7950437 6706890 7401740 9541162 10218963 8638831 7146425
36544 7146425 7282814 7367805 5425263 2458049 746132 274044 -699625 -2172970 -2094463
36535 -2094463 317418 3202237 4588276 4465184 3770843 3141575 3357974 5084679 7130457
36526 7130457 6908726 4069883 1858075 2992938 5767680 6480535 4487540 2175431
36518 2175431 702318 -1052946 -3083015 -2989896 410136 4476659 5683625 3935353
36510 3935353 2173691 2373172 3644473 4229529 3857669 3521600 3802674 4316747 4619116
36501 4619116 4775320 4697678 3722876 1749375 239434 684014 2221263 2583812 1728933
36492A728933N58351L013538K626547m50509j859815J2416J387050n69843l042904
36483C403764k408641j32825K06430j031921r81872K55122K80962o96328l30778
36474a436087J133437J174168k04819m50116P11669Q61119m08697q65778k20107
36465B94789o42367j879724q62237K361242L449200P41351j631904n07240J314224
36456B637334M67556j130356l11895J326770N23875j477121j136378J092002J841791
36447C833578O99278L3367J94425k02211k82734J611739L223920P62110m071969
36438E801503n248523j412230J998339J211966q78820o53304N33745O4479q57044
36429E60111Q3592J713866J563103K72376j6119K71589n58491j690164j137816
$$ plain form
36492 1728933 2287284 5300822 7927369 7476860 5617045 5629461 7016511 6446668 3403764
36483 3403764 995123 862298 1068728 36807 -945065 -689943 -408981 -1105309 -1436087
36474 -1436087 -302650 871518 666699 216583 928252 1789371 1380674 514896 294789
36465 294789 -347578 -2227302 -3089539 -728297 2720903 3462254 1830350 1323110 2637334
36456 2637334 3104890 1974534 1662639 2989409 3513284 2036163 899785 1991787 3833578
36447 3833578 4532856 4566223 4760648 4558437 4275703 5887442 9111362 9873472 5801503
36438 5801503 552980 -859250 1139089 2351055 1472235 818931 1352676 1417155 560111
36429 560111 643703 2357569 3920672 4193048 4176929 4448518 3890027 2199863 1062047
36420A062047K50108n6542j716069j847693J41509J574496P81803p68690j315974
36411a895005r52909p2287J627094L384301L112474N00754j642152r46736J205344
36402D320878J804600L70459j070200j298184r61032n72999L18935J514018J588797
36393F015272j6749j631429j352638L00408J068919O5669j133766q42802M34260
36384B907144R31696K12372l47265L21078J461006J641517O42083o45281j671861
36375E452489k426653k315241l99155K524377L519398Q27661l110605m012262
36367F0009j231790J300898N03200j714749j630341P11436J946245P26101n91571
36358G9438l5826J185959J287482P48506O93649N00262o86858j626537p73931
$$ plain form
36420 1062047 1312155 1255613 -460456 -2308149 -2166640 -592144 189659 -579031 -1895005
36411 -1895005 -2847914 -2920201 -1293107 2091194 5203668 5704422 4062270 3115534 4320878
36402 4320878 6125478 6495937 5425737 4127553 3166521 2593522 2912457 4426475 6015272
36393 6015272 5998523 4367094 3014456 3314864 4383783 4449452 3315686 2472884 2907144
36384 2907144 3838840 4051212 3703947 4025025 5486031 7127548 7769631 7124350 5452489
36375 5452489 3025836 710595 311440 2835817 6355215 7182876 4072271 60009
36367 60009 -1171781 129117 632317 -1082432 -2712773 -2001337 -55092 671009 79438
36358 79438 43612 1229571 2517053 3265559 3959208 4459470 3772612 2146075 1372144
36349A372144O35442J38799j732358j757655J069735L696533L147814L21878j781219
36340E111113j966990j335649r24117n68455J55390J069321J580125J226752J46652
36331D494142q43274j051822q63964j165774j709569j135600Q53251K445742J836469
36322B859601l50058j859545j629181o87649l15902l92094L0565J147802K006644
36313H10183J640503K97424p01094m16595O02566J024232M44539j69732O8261
36304C600287O93507O24931k16447q43466p81077p96531j457584j690479l2145
36295h99004K718141L642607J359203j767997k555262j159266k65928o91738n32842
36286a52086R51963J635624J68383j359965o63505R92195J034328j12062j68850
$$ plain form
36349 1372144 2007586 2146385 414027 -1343628 -273893 3422640 6570454 6892332 5111113
36340 5111113 3144123 1808474 884357 315902 471292 1540613 3120738 4347490 4494142
36331 4494142 3650868 2599046 1735082 569308 -1140261 -2275861 -1422610 1023132 2859601
36322 2859601 2509543 649998 -979183 -1666832 -1982734 -2374828 -2344263 -1196461 810183
36313 810183 2450686 2748110 2047016 1630421 2232987 3257219 3701758 3532026 3600287
36304 3600287 4293794 4918725 4702278 3858812 3077735 2281204 823620 -866859 -899004
36295 -899004 1819137 5461744 6820947 5052950 2497688 1338422 1072494 380756 -152086
36286 -152086 799877 2435501 2603884 1243919 580414 1572609 2606937 2494875 2326025
36277B326025O71896J96071j408544j389330P62202J992329N09027j354020j049604
36268A256052K31780N4513j008112o32879R97060J332004l90919j925125j462377
36259a548003n1486M59251K02981N30968J421068J415695J56980o31706M15617
36250B371365J975965J606826p50165k526474k028788m89879J53795k5832K98277
36241E85090J397849K282887K077052O46077j323472k298645j299447K03810j50168
36232B121033j575149p66624K126835K338839j837515m764293j605255L377095
36224e85034L135833p82049j211579K094779K300424j877295l397100N79867L195749
36215C453595k20193l753452j182081K985938J163930m306629n071855k04070
$$ plain form
36277 2326025 2997921 3193992 1785448 396118 1158320 3150649 3659676 2305656 1256052
36268 1256052 1487832 1542345 534233 -98646 898414 2230418 1839499 -85626 -1548003
36259 -1548003 -1599489 -1140238 -937257 -406289 1014779 2430474 2587454 1955748 2371365
36250 2371365 4347330 5954156 5203991 2677517 648729 158850 312645 286813 585090
36241 585090 1982939 4265826 6342878 6988955 5665483 3366838 2067391 2271201 2121033
36232 2121033 545884 -220740 1906095 4244934 2407419 -2356874 -3962129 -585034
36224 -585034 2550799 1768750 557171 2651950 4952374 3075079 -322021 257846 3453595
36215 3453595 3233402 -520050 -1702131 1283807 2447737 -1858892 -6930747 -7134817
36207g134817L441728K590336O88072J73289m67069j402538l15441K271727K662687
36198B507974L01609j060200K24576J320026L26892q54915o92596n13510j122208
36189D37648j022881L31858J207127Q29759M26398J34755j256224k700019j379315
36180b990894K057437L277714Q47531j481296r58315K35252l52952j194079j37504
36171f97106J674262K239557J872148J282112l54790k802479l421101j151636
36163a359033J132613Q66523n87826j023409q41954q06486K00976K229943K577262
36154B388609K80702j283887J50387J480872l56055k498719q96295K249928J801155
36145C316697j676342k891055m69797J521250P14501n42888q9700R88619J316054
$$ plain form
36207 -7134817 -3693089 -1102753 -414681 -241392 -708461 -2110999 -2426440 -154713 2507974
36198 2507974 2809583 1749383 1973959 3293985 3620877 2765962 2073366 1559856 437648
36189 437648 -585233 -253375 953752 1783511 2209909 2344664 1088440 -1611579 -2990894
36180 -2990894 -933457 2344257 3191788 1710492 752177 987429 634477 -559602 -697106
36171 -697106 977156 3216713 5088861 6370973 6016183 3213704 -207397 -1359033
36163 -1359033 -226420 640103 52277 -971132 -1813086 -2619572 -2418596 -188653 2388609
36154 2388609 2669311 1385424 1535811 3016683 2660628 161909 -734386 1515542 3316697
36145 3316697 1640355 -1250700 -1720497 -199247 515254 -27634 -117334 871285 2187339
36136B187339J217999P83175n60782j878043j443829Q837J22180q61902l87250
36127h12276J628054K233579L81398j458819j620283j405365j689155j079719
36119c822586Q57326J935968Q66018n07896m35400j9026o61703j180373J60029
36110b807643K405516K901307O69298k537250l891469j792094K395333M911542
36102B254540L421996l4093j752290j257295q49676j121349n91430M56431L999
36093E30833j446436j106897P68592O28137j847216k199172J349301M136928K320077
36084C134147r47652j041064O61859Q9211k062799j980738K83485J243226K41602
36075c78723j09246P60844O34937r61766k010702j939609k165299k515419j130246
$$ plain form
36136 2187339 3405338 4188513 3627731 1749688 305859 314696 436876 -425026 -812276
36127 -812276 815778 3049357 3430755 1971936 351653 -1053712 -2742867 -3822586
36119 -3822586 -2965260 -1029292 -163274 -671170 -1106570 -1125596 -1787299 -2967672 -2807643
36110 -2807643 -402127 2499180 3168478 631228 -3260241 -5052335 -2657002 2254540
36102 2254540 5676536 5642443 3890153 2632858 1783182 661833 70403 526834 530833
36093 530833 -915603 -2022500 -1253908 -625771 -2472987 -4672159 -3322858 814070 3134147
36084 3134147 2186495 1145431 1807290 1896501 -166298 -2147036 -1863551 -620325 -378723
36075 -378723 -487969 272875 907812 -53954 -2064656 -4004265 -6169564 -8684983 -9815229
36066i815229J696461L338635K885678J876375R13808p06447j930262o81339J857821
36057e64499J998077n12958j609486O51485K967332K015766r70889k992813l287815
36048b305800k422077n06366J529729J743027K15670n02605M07656O60106o32310
36039a812970r41259Q71759J820799o3484j843006o38375J308808Q81036j80202
36030e96894J101027K683000Q22495k579273k418535R93868K410324N35671l21653
36021B630030J626109K523322K3782k420543j534860N07562L38157j182550j490656
36012A020353q83303q21614m83934J208662K375017P49426k154422k940903j146722
36003c077440R60892K141476K603293J854249m72602k371760j437392J193690
$$ plain form
36066 -9815229 -8118768 -4780133 -1894455 -18080 895728 189281 -1740981 -2422320 -564499
36057 -564499 1433578 920620 -688866 -37381 2929951 4945717 3974828 982015 -2305800
36048 -2305800 -4727877 -5234243 -3704514 -1961487 -1745817 -2248422 -1840766 -1180660 -1812970
36039 -1812970 -2754229 -1882470 -61671 -125155 -1968161 -2606536 -1297728 -416692 -596894
36030 -596894 504133 3187133 4009628 1430355 -988180 5688 2416012 2951683 2630030
36021 2630030 4256139 6779461 6803243 4382700 2847840 3355402 3693559 2511009 1020353
36012 1020353 137050 -684564 -1168498 40164 2415181 3164607 1010185 -1930718 -3077440
36003 -3077440 -2116548 24928 2628221 4482470 4009868 1638108 200716 1394406
35995A394406K083012O23243l29696O53987J350875k37649k520869k660732n35823
35986a79246J430505J491950K24695o73835l48459M15385K03484j062321j650706
35977a48548k53741J884758K352622P72848r00521j254827q65309n16390J62248
35968A233140J253893J324744o91710l184070l297572p22641J590295J209847
35960a284074n77664p09396J208034K335568Q24569j400876j494430K08875J065192
35951A75798K21418o71172o09815m35783n58418j67443N79915L15490o18689K6168
35941a742531K266410K819006L11774j836601p88599P61975q43948l473987k266946
35932d793447K114630M086404J793781n88522j53425O45528p03532k230145j310841
$$ plain form
35995 1394406 3477418 4100661 3770965 4424952 5775827 5538178 3017309 356577 -179246
35986 -179246 1251259 2743209 2967904 2294069 1945610 2360995 2564479 1502158 -148548
35977 -148548 -402289 1482469 3835091 4607939 3707418 2452591 1587282 1070892 1233140
35968 1233140 2487033 3811777 3120067 -64003 -3361575 -4084216 -2493921 -1284074
35960 -1284074 -1861738 -2571134 -1363100 972468 1797037 396161 -1098269 -889394 175798
35951 175798 397216 -273956 -883771 -1319554 -1877972 -2045415 -1465500 -1150010 -1768699 -1742531
35941 -1742531 523879 3342885 3654659 1818058 1029459 1791434 947486 -2526501 -4793447
35932 -4793447 -2678817 1407587 3201368 2612846 2459421 3104949 2401417 171272 -1139569
35923a139569O93869J025194N4081o9394O49142N60394m55035j020688o85872
35914c87878j90046Q1668L12645N44553Q27709J229805J089585l10049j826100
35905A371892j302539Q74417J632302r1124j364031R7503K215397K120430P56290
35896F310537O33084J213175L34386j355409j455611l77706p09835k338535k375465
35887a21379l01073Q89508k73977j340847l01690R99721K14790j356467q59736
35878b451150J446526K583514J323903m24455r06685q32980j390618j745173l69419
35869b766537J880655K230330j3738j954602j018873J247956J514098k95446j192304
35860c68461n5716R57374N19984K23120J130404J522065J94769r60408k69022
$$ plain form
35923 -1139569 -445700 579494 633575 564181 1213323 1773717 1318682 297994 -387878
35914 -387878 -577924 -496256 -183611 360942 1188651 2418456 3508041 3197992 1371892
35905 1371892 69353 943770 2576072 2484948 1120917 1218420 3433817 5554247 6310537
35896 6310537 6943621 8156796 8491182 7135773 5680162 5302456 4592621 2254086 -121379
35887 -121379 -422452 467056 193079 -1147768 -1449458 -449737 -234947 -1591414 -2451150
35878 -2451150 -1004624 1578890 2902793 2478338 1571653 738673 -651945 -2397118 -2766537
35869 -2766537 -885882 1344448 1330710 -623892 -1642765 -394809 1119289 823843 -368461
35860 -368461 -424177 533197 1053181 1276301 2406705 3928770 4123539 3163131 2894109
35851B894109N44319n12356j834418r30568J071419J381535L29479K31939Q64410
35842D039868K96189p84601j12241J350841M11138k515272l380582r87135J182364
35833d99431P68297l23872j77406K3457p78099j014172L75251J562926R33285
35824H70236k51478l27559L16841R60633J809294K013921j53837l391922l507723
35815a661594K12659K865651J142936j502241p47862J542026J045794j459530
35807A437839j872653J0207P81038k23243m36922M68705K4078j830206j992574
35798c633731M38029K485630K127490Q32065R7444p24144j737944j289149P76700
35789f27610J813987K82599j724238j707751j45386J087032J462441J265219L35877
$$ plain form
35851 2894109 3438428 2926072 1091654 161086 1232505 2614040 2943519 3175458 4039868
35842 4039868 4336057 3551456 3439215 4790056 5201194 2685922 -694660 -1681795 -499431
35833 -499431 268866 -55006 -232412 -208955 -987054 -2001226 -1625975 -63049 870236
35824 870236 618758 291199 608040 1568673 3377967 5391888 5238051 1846129 -1661594
35815 -1661594 -1448935 1416716 2559652 1057411 309549 1851575 2897369 1437839
35807 1437839 -434814 -424607 356431 133188 -303734 164971 189049 -1641157 -3633731
35798 -3633731 -3195702 -710072 1417418 2249483 2346927 1622783 -115161 -1404310 -627610
35789 -627610 1186377 1468976 -255262 -1963013 -2108399 -1021367 441074 1706293 2042170
35780B042170r64308j308801l83346M16441M31211P97127J754800J351947j207555
35771B929686l186870j829514J413235K865331J702155L16663K44358M65275j19416
35762D800903q31705n03838Q61096K286356K734168J615438o87159k588983k401865
35753E284411m4891K661538L542312J900834q61533k364366j511872K37173N46842
35744I390448p90562j628905o04015Q76009P16975r19041k030452j444075J29229
35735C695611J237517Q69489r95684k980806k983230m55432K347173K648128M86787
35726C869553j488793j497481m74015j03484l89740j39539R26178J722943J403517
35717C829139N06848J16389L58171L37847m91826j510144j735715r65925K81164
$$ plain form
35780 2042170 1077862 -230939 -614285 -197844 233367 1030494 2785294 4137241 2929686
35771 2929686 -257184 -2086698 -673463 2191868 3894023 4210686 4455044 4920319 4800903
35762 4800903 3969198 3465360 4326456 6612812 9346980 10962418 10275259 7686276 5284411
35753 5284411 5239520 7901058 11443370 13344204 12482671 10118305 8606433 8843606 9390448
35744 9390448 8599886 6970981 6366966 7242975 7959950 7040909 5010457 3566382 3695611
35735 3695611 4933128 5802617 4806933 1826127 -1157103 -1612535 734638 3382766 3869553
35726 3869553 2380760 883279 409264 305780 -83960 -223499 702679 2425622 3829139
35717 3829139 4335987 4452376 4810547 5148394 4656568 3146424 1410709 444784 725948
35708G25948J466771K108870J708381M90933j76757P62923K385961K813555J829929
35699A4116514R83980R45208N93618n75883j098400j1036R63759k47857k563163
35690A3106740k944786q73001P75833j40700k139223k546661j201712j8160J62902
35681D181232K27884M95594l4044j387707j544773O81800L021473K266385j094514
35672F813330l228670k115612J88255J152074R52893O71028L3372q77653k33745
35663C355272K304883L265304r065m197933l932724J59663K351567N44267j382473
35654B458761q07918k06322j530610k188528m9844K125934J311052n66881l17638
35645B28006R59458O11111k89208N83546J625257Q5449k008060o95829K451324
$$ plain form
35708 725948 2192719 4301589 6009970 6500903 6324146 7087069 9473030 12286585 14116514
35699 14116514 15100494 16045702 16639320 16063437 14965037 14954001 15917760 15669903 13106740
35690 13106740 10161954 9288953 10064786 9924086 7784863 5238202 4036490 4018330 4181232
35681 4181232 4409116 4904710 4870666 3482959 1938186 2619986 5641459 7907844 6813330
35672 6813330 3584660 1469048 1657303 2809377 3762270 4433298 4466670 3589017 3355272
35663 3355272 5660155 8925459 8916394 4718461 785737 945400 3296967 3841234 2458761
35654 2458761 1650843 1444521 -86089 -2274617 -2324461 -198527 1112525 545644 228006
35645 228006 1187464 1798575 1509367 2092913 3718170 3803619 1795559 1099730 3551054
35636C551054K147495j653181l227913l13705K544492J686967n62369j098811
35628C074029r40007j614746j366978J105368K889908J016018k394309l110583
35620a341300r00815R22005M71535j327913k938910l098631r78428K143573L116989
35611c931895J143513m37772Q03057K263386P57060j588204o06376K511361K573776
35602C487906j247664l864597j960034J607539K738458J308247n74836j940797
35594d45778k251913m33865K734228L785014R22426k747841l116878n47051J429914
35585f71744J463278J105293R68541j35352j911629j960495K48804J731448L22557
35576A160701j668304p64442K250318L337118J181725j054371o47373Q99693O64983
$$ plain form
35636 3551054 5698549 4045368 817455 503750 3048242 4735209 4172840 3074029
35628 3074029 2134022 519276 -847702 257666 3147574 4163592 1769283 -1341300
35620 -1341300 -2242115 -1320110 -848575 -2176488 -5115398 -8214029 -9192457 -7048884 -3931895
35611 -3931895 -2788382 -3226154 -2423097 -159711 597349 -990855 -1597231 914130 3487906
35602 3487906 2240242 -1624355 -3584389 -1976850 761608 2069855 1495019 -445778
35594 -445778 -2697691 -3131556 -397328 3387686 4310112 1562271 -1554607 -2101658 -671744
35585 -671744 791534 1896827 2865368 2730016 818387 -1142108 -893304 838144 1160701
35576 1160701 -507603 -1272045 978273 4315391 5497116 4442745 3795372 4695065 5360048
35567E360048j173399j887471k67819J942571K402060M86986k465723m113183
35559B84070k882389Q5592J620680L95552j157328n06619J048603P78887o31561
35550i64513l25530J405851J394351o35934j238628O81573J713436p7973j675425
35541B77208n97356N97257p36520j904407N42367L941089L140900q84118k294344
35532B082076L42859K291304P95574r84818j07983J283317J61501k257293k856686
35523G49851j410086n4823J58144k73201q28113r73162J8860J671041K163026
35514A221537R86466O2375P13792J399540L54791j297256j407875l67265j61794
35505A504311p54300k66732J391043J924637L60232j121660m62596R99577N20722
$$ plain form
35567 5360048 4186649 2299178 2031359 3973930 6375990 6862976 4397253 284070
35559 284070 -2598319 -2512727 -892047 -496495 -1653823 -2160442 -1111839 -332952 -964513
35550 -964513 -1290043 115808 1510159 874225 -364403 317170 2030606 1952633 277208
35541 277208 -320148 277109 -459411 -2363818 -1821451 2119638 5260538 4376420 2082076
35532 2082076 2424935 4716239 5511813 4526995 4419012 5702329 5863830 3606537 749851
35523 749851 -660235 -715058 -556914 -830115 -1658228 -2631390 -2612530 -941489 1221537
35514 1221537 2208003 2270378 2984170 4383710 4738501 3441245 2033370 1666105 1504311
35505 1504311 750011 483279 1874322 3798959 4159191 3037531 2574935 3574512 4095234
35496D095234j754510k829579j308143M75956q394j654985j552287L96164J426534
35487b714010L95385o62827k44839L26759j10073j34298J348295K325825Q32029
35478A362246j219895q91625P08822K34747k022850k507018m84588P94400k40707
35469d266468j032793L31897J807561J078142n41912l98436J507608L026145K736209
35460D247953O85705k141922l790991k518544P06502K607216J619490k98831q42398
35451B74180k02287M34339R25136J155698J30273k071879l208402j655763J041815
35442c176890K065996P38722j198241j745968k59582K056835K854753J088314
35434B423939j284686j702103o04097k22624m29665P42760K639299K260159m04091
$$ plain form
35496 4095234 2340724 -488855 -1796998 -1321042 -1329436 -2984421 -4536708 -4140544 -2714010
35487 -2714010 -2318625 -2981452 -3226291 -2899532 -3009605 -3143903 -1795608 530217 1362246
35478 1362246 142351 -749274 -40452 194295 -1828555 -4335573 -4820161 -4025761 -4266468
35469 -4266468 -5299261 -4967364 -3159803 -2081661 -2623573 -3022009 -1514401 1511744 4247953
35460 4247953 4933658 2791736 -999255 -3517799 -2811297 -204081 1415409 1116578 274180
35451 274180 71893 506232 1431368 2587066 2717339 645460 -2562942 -4218705 -3176890
35442 -3176890 -1110894 -372172 -1570413 -3316381 -3575963 -1519128 1335625 2423939
35434 2423939 1139253 -562850 -1166947 -1389571 -1819236 -1076476 1562823 3822982 3418891
35425C418891j761980n12301M30394n08889r27847M44713R76995o88457j616630
35416g45111j01302P46338j124282k224043L39962L023147J654567j251029j121893
35407h03646O41639L6307j528211o1602K685775J690413k048489k743475K36408
35398a894881J674378l6332p15612J246161K091666J92809q94321N84656J252638
35389C501162p56190k063990l53490J325649K65548j105719r1502J346350O89287
35380B757105l58311M56330J223711n97654l013776k482297K30110J542261O98564
35371D56043j07733K0473M0406j89672L20306J358197J439391K985j884120k699785
35361a243509j574347Q35739K235906J052977r74183q70339Q93289J047202p75388
$$ plain form
35425 3418891 1656911 1144610 1575004 1066115 138268 582981 1559976 871519 -745111
35416 -745111 -846413 -100075 -1224357 -3448400 -3108438 -85291 1569276 318247 -803646
35407 -803646 -162007 -125700 -1653911 -1715513 970262 2660675 612186 -2131289 -1894881
35398 -1894881 -220503 -256835 -972447 273714 2365380 2558189 1663868 2248524 3501162
35389 3501162 2744972 680982 327492 1653141 1918689 812970 721468 2067818 2757105
35380 2757105 2398794 2855124 4078835 3481181 467405 -2014892 -1784782 -242521 456043
35371 456043 348310 368783 409189 219517 539823 1898020 3337411 3340396 1456276 -1243509
35361 -1243509 -2817856 -1982117 253789 1306766 332583 -537756 355533 1402735 627347
35352F27347j170059R09219J797555o41906k954829j761919N56394J50148j639194
35343d127244q44066K155968L310785J415211p13349j163260r41407j026841r06308
35334b840511l49121J19065O34713J579420J987809O51870j492031k279662j332110
35325c320558j66972K68491K59692M7286k20769K03750J600471K573111J619326
35316B863828o33884k230572k223259r81740P53698J863501J253651l80672p79303
35307d94752N31125J137484l32620j616069m96385J323526J009393p75810j337776
35298a051884m24012J82025K34314P47672J196423M02700o53099k68007O01170
35289I67302j27760j547751r52161J330123K206156Q76415k88272k46008p12218
$$ plain form
35352 627347 -542712 366507 2164062 1522156 -1432673 -3194592 -2638198 -2488050 -4127244
35343 -4127244 -4971310 -2815342 495443 1910654 1197305 34045 -907362 -1934203 -2840511
35334 -2840511 -3189632 -3070567 -2435854 -856434 1131375 1783245 291214 -1988448 -3320558
35325 -3320558 -3487530 -3219039 -2959347 -2912061 -3132830 -2929080 -1328609 1244502 2863828
35316 2863828 2229944 -628 -2223887 -3205627 -2451929 -588428 665223 284551 -494752
35307 -494752 36373 1173857 841237 -774832 -1271217 52309 1061702 285892 -1051884
35298 -1051884 -1475896 -1293871 -1059557 -311885 884538 1287238 634139 366132 967302
35289 967302 839542 -708209 -1660370 -330247 1875909 2752324 2464052 2218044 1505826
35280A505826k180243k265886L01522K980638K679330j94572k540925k200423
35272a914733K11584K223854J881358j40249j201534k43808O29333m50796j930556
35263i35547j421167K30664N63058j76077Q4585J001114M32208j176058j186489
35254b583709M16684Q17294n63488r96529O27899J901158J293757N94944J246465
35245B754475J784913Q93817j72083k17693k41915r51642r57325M23926J182704
35236D499177k98765k441748k914400j829628n35882O78676J661494J285623n36311
35227d31764j595045l10679J795310K588126K432274K576488K280665K78960k198884
35218G415451k691527j130263K51334K26334l80908p29734j050022j571000j865993
$$ plain form
35280 1505826 -674417 -2940303 -2638781 341857 3021187 2826615 285690 -1914733
35272 -1914733 -1703149 520705 2402063 2261814 1060280 816472 1445805 995009 -935547
35263 -935547 -2356714 -2126050 -1562992 -1739069 -1654484 -653370 -221162 -1397220 -2583709
35254 -2583709 -2167025 -1349731 -1913219 -2909748 -2281849 -380691 913066 1508010 2754475
35245 2754475 4539388 5433205 5261122 5043429 4801514 3849872 2892547 3316473 4499177
35236 4499177 4200412 1758664 -1155736 -2985364 -3521246 -2842570 -1181076 104547 -431764
35227 -431764 -2026809 -2337488 -542178 2045948 4478222 7054710 9335375 9614335 7415451
35218 7415451 4723924 3593661 3844995 4071329 3690421 2960687 1910665 339665 -1526328
35209a526328j531425o72698K64542P05191M37568J86030Q36779J810691J474093
35200A984443l25944j627273j037410M51605J258694J261349R46690J35309j036275
35191B011188j311583j07603J048381M84253j156692j939616j298172k08277N98773
35182a879348J170884J524642J467312R71952R0580j004728j610017j113720l10495
35173f92938o75213j872547j745178M17031K492489K573798J542462J157033J322954
35164D519891R62837Q4744p70429j773624k798325k595202q00726O64070K19812
35155b286952p26327j2569J653972J867872M37324n60626j96367M05713M16997
35146I99037J55238l99225j591397k441621j345405J137919K417486J489463L29706
$$ plain form
35209 -1526328 -3057753 -3730451 -3465909 -2760718 -2323150 -2137120 -1300341 510350 1984443
35200 1984443 1658499 31226 -1006184 -554579 704115 1965464 2912154 3047463 2011188
35191 2011188 699605 592002 1640383 2124636 967944 -971672 -2269844 -2478121 -1879348
35182 -1879348 -708464 816178 2283490 3255442 3346022 2341294 731277 -382443 -692938
35173 -692938 -1368151 -3240698 -4985876 -4568845 -2076356 497442 2039904 3196937 4519891
35164 4519891 5482728 5567472 4797043 3023419 225094 -2370108 -3170834 -2506764 -2286952
35155 -2286952 -3013279 -3025848 -1371876 495996 933320 372694 176327 582040 999037
35146 999037 1154275 755050 -836347 -3277968 -4623373 -3485454 -1067968 421495 751201
35137G51201O73486J376240N29785j256116j682785l11343P04560j80380j535111
35128i30463r77185J222034K257141P47240j179313r92759M77545N00347j086327
35119C8260j556573L12756K243452J943732L09531l93357K43263R76838R29272
35110E047174m8352j671070k609111j185212J901034L347134J488076j084360
35102E185313j228209K94003O68601l17079o32861L6063L7196r59787j604007
35093A479233j695497k293815k895796j674817R73126K264319J282321L43008
35085b217918Q96440J190920r7899q99538P75661K677397J212798k580071l793735
35076b835945o60083K751892K350116l57037j050005Q02320J562162o00060k885521
$$ plain form
35137 751201 1424687 2800927 3330712 2074596 391811 80468 785028 604648 -930463
35128 -930463 -1907648 -685614 1571527 2318767 1139454 146695 624240 1124587 38260
35119 38260 -1518313 -1205557 1037895 2981627 3291158 2897801 3141064 4117902 5047174
35110 5047174 4998822 3327752 718641 -466571 1434463 4781597 6269673 5185313
35102 5185313 3957104 4251107 4919708 4602629 3969768 4005831 4043027 3083240 1479233
35093 1479233 -216264 -2510079 -5405875 -7080692 -6107566 -3843247 -2560926 -2217918
35085 -2217918 -1321478 -130558 -228457 -1127995 -352334 2325063 3537861 957790 -2835945
35076 -2835945 -3496028 -744136 1605980 1248943 198938 1001258 2563420 1963360 -922161
35067i22161k361448l45025J52109p28649n93661O16519O22410p28922q12207
35058e101035J073055K016906L09954j335901M4633K862156L368817J130155r50367
35049C418373j064916j98701J06113n22471j459309j505087O5023J800967J116960
35040A756952j601616k391293N82082L479934K201701j250346k043469j40690
35032E93255L69971j488456k412714r00455P16797J048203J499052K182461Q60849
35023B468963k237972l179902k96979K696105K213286k37038j340469p98320L3408
35014f78918J076929K006262Q52257k523703m386035k097503J476223K242505
35006b031983R73483R16535J684129N03079j944593k213713j12623J019339J15200
$$ plain form
35067 -922161 -3283609 -3628634 -3476525 -4205174 -4798835 -4182316 -3559906 -4288828 -5101035
35058 -5101035 -4027980 -2011074 -1701120 -3037021 -2992388 -130232 3238585 4368740 3418373
35049 3418373 2353457 2154756 2260869 1738398 279089 -1225998 -1160975 639992 1756952
35040 1756952 155336 -2235957 -1653875 1826059 4027760 2777414 733945 593255
35032 593255 963226 -525230 -2937944 -3838399 -3121602 -2073399 -574347 1608114 2468963
35023 2468963 230991 -2948911 -3245890 -549785 1663501 1426463 85994 -712326 -678918
35014 -678918 398011 2404273 3256530 732827 -3653208 -5750711 -4274488 -2031983
35006 -2031983 -1058500 -141965 1542164 2045243 100650 -2113063 -2225686 -1206347 -1091147
34997a091147m00654L22631J43557j368028j587846J39767P69947q78173j361555
34988e311501J445511L840333J864162j999828k618866l21880L13413j379814
34980d168470j244112J907082L466603M13913l300490k429637J861736M183727
34972F90352K784979P78127K87172j24748j541320k200457p55758R16347N42964
34963A377658q99544r10781L97032N82549j035347k090926n74857K251095L360916
34954B457795J508431j566556l154515k302032m76272M33347M43992J071116K609324
34945A024630L202660J491373j075450k036026j178696l41681n13850r73339j067934
34936a468313r30256l62801J057361K436967K043030o7277j672247j420088n33855
$$ plain form
34997 -1091147 -1491801 -1169170 -1025613 -2393641 -3981487 -3841720 -3071773 -3949946 -5311501
34988 -5311501 -3865990 -25657 1838505 -161323 -2780189 -3102069 -2788656 -4168470
34980 -4168470 -5412582 -3505500 -38897 375016 -2925474 -5355111 -3493375 690352
34972 690352 3475331 4253458 4540630 4415882 2874562 674105 -81653 834694 1377658
34963 1377658 478114 -432667 -35635 546914 -488433 -2579359 -3154216 -903121 2457795
34954 2457795 3966226 2399670 -754845 -3056877 -3533149 -3099802 -2655810 -1584694 1024630
34945 1024630 4227290 5718663 4643213 2607187 1428491 1086810 572960 -400379 -1468313
34936 -1468313 -2398569 -2761370 -1704009 732958 2775988 2708711 1036464 -383624 -917479
34927i17479n39666j001592q38847m19912o85919j189611p34985N37253J257067
34918d533691Q78151L82102Q38133K081823K935475K337583L92218j489335j899839
34909A922620j061900n24814j078769j849763j766520q92778J53981R91877J124514
34900b981552P7241j325113j168834R51852K796202K254296J49304j183142j057901
34891a487647n14374j46766K12616K33596m80510r79499M2344J880689K378312
34882A138761J042687k43344l9415Q67685J138258P71106M48424K28847j45580
34873E207429m69501m06795q1431J22629q7610q25811j663886j573815k38689
34864a7480Q28539r8294k252728k988707j395799N45467J063476Q84213J267163
$$ plain form
34927 -917479 -1457145 -2458737 -3297584 -3717496 -4403415 -5593026 -6328011 -5790758 -4533691
34918 -4533691 -3655540 -3273438 -2435305 -353482 2581993 4919576 5311794 3822459 1922620
34909 1922620 860720 335906 -742863 -2592626 -4359146 -5251924 -5097943 -4106066 -2981552
34900 -2981552 -2904311 -4229424 -5398258 -4446406 -1650204 604092 753396 -429746 -1487647
34891 -1487647 -2002021 -2148787 -1936171 -1702575 -2183085 -3162584 -3120240 -1239551 1138761
34882 1138761 2181448 1938104 1898689 2766374 3904632 4675738 5124162 5353009 5207429
34873 5207429 4737928 4331133 4249702 4372331 4284721 3458910 1795024 221209 -17480
34864 -17480 811059 712765 -1539963 -4528670 -5924469 -5379002 -4315526 -3431313 -2164150
34855b164150J614899P87471n29243p36495J35467O08686Q2947o04799p15051
34846a520268l29175K78341Q03790P00384j07291o70750k63819L88329L72773
34837c47686L30293J270393K295787J599079n17598j844098j563821j072645j167024
34828a017320q64201J87041N71030l38880r22151k2096R10131L08594o73717j28913
34818a990482J202238J071443n59225j550557j053145m75999p72614q96170L68084
34809d656427K478099L699351K852858M03194j681481j650973j44888L90620p28525
34800I61828j153455O34540K268607R94678j537934j592561O06144J298900n92092
34791A888655k111590j652454j120410j437921n18178K077802K900005J41432
$$ plain form
34855 -2164150 -549251 238220 -291023 -1027518 -892051 -283365 -200418 -805217 -1520268
34846 -1520268 -1849443 -1571102 -767312 -66928 -174219 -844969 -1108788 -720459 -347686
34837 -347686 -17393 1253000 3548787 5147866 4630268 2786170 1222349 149704 -1017320
34828 -1017320 -1881521 -1694480 -1123450 -1462330 -2384481 -2406577 -1496446 -1187852 -1861569 -1990482
34818 -1990482 -788244 283199 -276026 -1826583 -2879728 -3355727 -4128341 -5024511 -4656427
34809 -4656427 -2178328 1521023 4373881 4777075 3095594 1444621 1299733 1690353 961828
34800 961828 -191627 442913 2711520 3706198 2168264 575703 1181847 2480747 1888655
34791 1888655 -222935 -1875389 -2995799 -4433720 -4951898 -2874096 25909 167341
34783A67341k494608j277013J459283J104246j774928k594818l8379K549391K695220
34774b04265J503043N74033j42321p94267q40272m09467j84608J51753J175708
34765H29337J811335O85501j038223r92745N39015J095971J53647m61345k55263
34756B367230o68321j639348j236708M28219N76319j578923k988922j391738J299846
34747d832346K265282J663682J029628K68786j212627k273640j484584L76905
34739d198914J305806O37835p61514j772385j438325M64615K367617K162782L47715
34730h84768k85700R41767J298859o90566k371718j180416J081377J270325j09491
34721i30331l82168O14798R55542N05131P19210J302895N99578j056147j713292
$$ plain form
34783 167341 -2327267 -3604280 -2144997 -1040751 -2815679 -5410497 -5448876 -2899485 -204265
34774 -204265 1298778 1872811 1730490 936223 95951 -313516 -498124 -346371 829337
34765 829337 2640672 3326173 2287950 1295205 1834220 2930191 3083838 2622493 2367230
34756 2367230 1698909 59561 -1177147 -748928 -172609 -1751532 -4740454 -6132192 -4832346
34747 -4832346 -2567064 -903382 126246 395032 -817595 -3091235 -4575819 -4198914
34739 -4198914 -2893108 -2255273 -3016787 -4789172 -6227497 -5762882 -3395265 -1232483 -884768
34730 -884768 -1170468 -228701 1070158 379592 -1992126 -3172542 -2091165 -820840 -930331
34721 -930331 -1312499 -697701 257841 762972 1482182 2785077 3384655 2328508 615216
34712F15216j312585j505258k027700p73035K043830L243187J315555j252034
34704C47176j668628l59808P01167J014187J188121J158103M58604o71303j644399
34695E23220k216615k095473q22470J246876K750392K740649J572587R8507j105063
34686B692610j560543j077706l35490j38514l1080R56874K140795J600793p37168
34677C510571k365789j536991L50604R94566L97492K53052J061201J520478N29985
34668D715169j414071k813477k514515o69711J227479J656824O91406k92133o47318
34659f0347j110035j967427j982051l22634J506062J313391n97084j541975M1851
34650d720249K554360L314520J788231j31110o96240k01764j1049l93775k66806
$$ plain form
34712 615216 -697369 -2202627 -4230327 -5003362 -2959532 283655 1599210 347176
34704 347176 -1321452 -1681260 -980093 34094 1222215 2380318 2838922 2167619 523220
34695 523220 -1693395 -3788868 -4611338 -3364462 -614070 2126579 3699166 3797673 2692610
34686 2692610 1132067 54361 -281129 -419643 -450723 506151 2646946 4247739 3510571
34677 3510571 1144782 -392209 -41605 952961 1350453 1603505 2664706 4185184 4715169
34668 4715169 3301098 487621 -2026894 -2696605 -1469126 187698 879104 586971 -60347
34659 -60347 -1170382 -3137809 -5119860 -5442494 -3936432 -2623041 -3220125 -4762100 -4720249
34650 -4720249 -2165889 1148631 2936862 2805752 2109512 1907748 1896699 1502924 1236118
34641A236118Q68149J746446Q73874j321226k850466k504855r28867N58535J240833
34632a081459J015882J29176p61169r93890o52457l03111l472N61137J000769
34623a088594N03840n74318p87055J75362P54645l2079p71993K68685K183219
34614F31712K314474j09531k803420l164436j075130J400299K308160J382072
34606H84200j34973q21139l71719L13037L24846k55137p54423q66995p31643l70691
34596b784637L41015J226112J793573J682233Q87455k80801j260586j534986j064821
34587i95443j35748J154983K537069K782529P03413k524588l710037j595910J098199
$$ plain form
34641 1236118 2104267 3850713 4724587 3403361 552895 -1951960 -2880827 -2322292 -1081459
34632 -1081459 -65577 63599 -697570 -1691460 -2343917 -2647028 -2650500 -2089363 -1088594
34623 -1088594 -584754 -1159072 -1946127 -1770765 -1016120 -1048199 -1820192 -1551507 631712
34614 631712 2946186 2836655 33235 -3131201 -4206331 -2806032 -497872 884200
34606 884200 749227 -71912 -443631 -130594 194252 -60885 -815308 -1682303 -2413946 -2784637
34596 -2784637 -2443622 -1217510 576063 2258296 3145751 2864950 1604364 69378 -995443
34587 -995443 -1131191 23792 2560861 5343390 6046803 3522215 -187822 -1783732 -685533
$$ [...]
##END NTUPLES=NMR SPECTRUM
##END=
