##TITLE=31Pdec_SR125_1d
 , 124 sc
 12.5.2022
##JCAMPDX= 6.0         $$ Bruker NMR JCAMP-DX V2.0
##DATA TYPE= NMR SPECTRUM
##DATA CLASS= NTUPLES
##ORIGIN= UXNMR, Bruker Analytische Messtechnik GmbH
##OWNER= root
$$ XWIN-NMR		Version 3.5
$$ Thu May 12 10:51:03 2022 Russian Standard Time (UT+4h)  she@DPX200
##.OBSERVE FREQUENCY= 81.013821
##.OBSERVE NUCLEUS= ^31P
##.ACQUISITION MODE= SIMULTANEOUS
##.ACQUISITION SCHEME= undefined
##.AVERAGES= 124
##.DIGITISER RES= 16
##SPECTROMETER/DATA SYSTEM= spect
##.PULSE SEQUENCE= zgpg30
##.SOLVENT NAME= CDCl3
##.SHIFT REFERENCE= (INTERNAL, CDCl3, 0, 248.564)
##AUDIT TRAIL= $$ (NUMBER, WHEN, WHO, WHERE, WHAT)
$$ ##TITLE= Audit trail, XWIN-NMR		Version 3.5
$$ ##JCAMPDX= 5.01
$$ ##ORIGIN= Bruker BioSpin GmbH
$$ ##OWNER= she
$$ F:/spectra/data/she/nmr/P31/1/pdata/1/auditp.txt
$$ ##AUDIT TRAIL=  $$ (NUMBER, WHEN, WHO, WHERE, WHAT)
(   1,<2022-05-12 10:46:23.20 +0400>,<she>,<DPX200>,
      <continue with go, POWCHK disabled, PULCHK disabled
       configuration hash MD5:
       00 E9 B6 7A A2 85 ED C7 34 08 36 98 17 FE 4E 26
       data hash MD5: 32K
       57 EE D1 08 53 49 D1 44 CC 33 1C 5E D4 60 08 0E>)
(   2,<2022-05-12 10:49:54.12 +0400>,<she>,<DPX200>,
      <Start of raw data processing
       efp BC_mod = 2 LB = 1 FT_mod = 6 PKNL = 1 PHC0 = -9937.432 PHC1 = 179.0537 SI = 64K 
       data hash MD5: 64K
       DF 9E AA F5 92 8B 81 AD 0E 38 66 BF 5D CD 81 02>)
(   3,<2022-05-12 10:50:21.10 +0400>,<she>,<DPX200>,
      <pk PHC0 = -0.04140472 PHC1 = 0 
       data hash MD5: 64K
       8D D4 E2 1F 17 4D F9 C5 A2 75 F8 29 18 49 F9 8C>)
(   4,<2022-05-12 10:50:32.14 +0400>,<she>,<DPX200>,
      <abs ABSG = 5 
       data hash MD5: 64K
       DD 30 ED 32 3C CE 6B 73 C0 6A 55 52 1B B8 D9 57>)
$$ ##END=
$$ 
$$ hash MD5
$$ 8D EE 14 C0 2D 4A 62 02 A6 7A 06 17 47 A6 11 EE
##$RELAX= 
##$RELAX= 
##$RELAX= 
##$RELAX= 
##$RELAX= 
##$RELAX= 
##$RELAX= 
##$RELAX= 
$$ Bruker specific parameters
$$ --------------------------
##$DU= <F:/spectra>
##$EXPNO= 1
##$NAME= <P31>
##$PROCNO= 1
##$TYPE= <nmr>
##$USER= <she>
##$AMP= (0..31)
100 100 100 100 100 100 100 100 100 100 100 100 100 100 100 100 100 100 
100 100 100 100 100 100 100 100 100 100 100 100 100 100 
##$AQSEQ= 0
##$AQ_mod= 1
##$AUNM= <au_zg>
##$AUTOPOS= <>
##$BF1= 81.014009
##$BF2= 200.13
##$BF3= 200.13
##$BF4= 200.13
##$BF5= 200.13
##$BF6= 200.13
##$BF7= 200.13
##$BF8= 200.13
##$BYTORDA= 1
##$CFDGTYP= 0
##$CFRGTYP= 5
##$CHEMSTR= <none>
##$CNST= (0..31)
1 1 145 1 1 1 1 1 1 1 1 1 1 1 1 1 1 1 1 1 1 1 1 1 1 1 1 1 1 1 1 1 
##$CPDPRG= <waltz16>
##$CPDPRG1= <>
##$CPDPRG2= <waltz16>
##$CPDPRG3= <>
##$CPDPRG4= <mlev>
##$CPDPRG5= <mlev>
##$CPDPRG6= <mlev>
##$CPDPRG7= <mlev>
##$CPDPRG8= <mlev>
##$CPDPRGB= <>
##$CPDPRGT= <>
##$D= (0..31)
0 1 0 0 0 0 0 0 0 0 0 0.03 2e-05 3e-06 0 0 0 0 0 0 0 0 0 0 0 0 0 0 0 0 
0 0 
##$DATE= 1652337805
##$DBL= (0..7)
120 120 120 11 120 120 24 19 
##$DBP= (0..7)
150 150 150 150 150 150 150 150 
##$DBP07= 0
##$DBPNAM0= <>
##$DBPNAM1= <>
##$DBPNAM2= <>
$$ [...]
##$SUBNAM3= <"">
##$SUBNAM4= <"">
##$SUBNAM5= <"">
##$SUBNAM6= <"">
##$SUBNAM7= <"">
##$SUBNAM8= <"">
##$SUBNAM9= <"">
##$SW= 501.771253377433
##$SWIBOX= (0..15)
0 1 3 0 0 0 0 0 0 0 0 0 0 0 0 0 
##$SW_h= 40650.406504065
##$TD= 32768
##$TD0= 1
##$TE= 0
##$TE2= 300
##$TE3= 300
##$TEG= 300
##$TL= (0..7)
0 120 53 12 22 120 120 120 
##$TP= (0..7)
150 150 150 150 150 150 150 150 
##$TP07= 0
##$TPNAME0= <>
##$TPNAME1= <>
##$TPNAME2= <>
##$TPNAME3= <>
##$TPNAME4= <>
##$TPNAME5= <>
##$TPNAME6= <>
##$TPNAME7= <>
##$TPOAL= (0..7)
0.5 0.5 0.5 0.5 0.5 0.5 0.5 0.5 
##$TPOFFS= (0..7)
0 0 0 0 0 0 0 0 
##$TUNHIN= 0
##$TUNHOUT= 0
##$TUNXOUT= 0
##$USERA1= <user>
##$USERA2= <user>
##$USERA3= <user>
##$USERA4= <user>
##$USERA5= <user>
##$V9= 5
##$VALIST= <valist>
##$VCLIST= <CCCCCCCCCCCCCCC>
##$VD= 0
##$VDLIST= <DDDDDDDDDDDDDDD>
##$VPLIST= <PPPPPPPPPPPPPPP>
##$VTLIST= <TTTTTTTTTTTTTTT>
##$WBST= 1024
##$WBSW= 4
##$XGAIN= (0..3)
0 0 0 0 
##$XL= 0
##$YL= 0
##$YMAX_a= 40331
##$YMIN_a= -65120
##$ZGOPTNS= <>
##$ZL1= 120
##$ZL2= 120
##$ZL3= 120
##$ZL4= 120
##$ABSF1= 248.5645
##$ABSF2= -253.2056
##$ABSG= 5
##$ABSL= 3
##$ALPHA= 0
##$AQORDER= 0
##$ASSFAC= 0
##$ASSFACI= 0
##$ASSFACX= 0
##$ASSWID= 0
##$AUNMP= <proc_1d>
##$AZFE= 0.1
##$AZFW= 0.5
##$BCFW= 0
##$BC_mod= 2
##$BYTORDP= 0
##$COROFFS= 0
##$CY= -3
##$DATMOD= 1
##$DC= 0
##$DFILT= <>
##$DTYPP= 0
##$F1P= 0
##$F2P= 0
##$FCOR= 1
##$FTSIZE= 65536
##$FT_mod= 6
##$GAMMA= 0
##$GB= 0
##$INTBC= 1
##$INTSCL= 5.30512e-09
##$ISEN= 30
##$LB= 1
##$LEV0= 0
##$LPBIN= 0
##$MAXI= 10000
##$MC2= 0
##$MEAN= 0
##$ME_mod= 0
##$MI= 50
##$NCOEF= 0
##$NC_proc= -5
##$NLEV= 6
##$NOISF1= 182.463
##$NOISF2= 159.3651
##$NSP= 0
##$NTH_PI= 0
##$NZP= 0
##$OFFSET= 248.5645
##$PC= 4
##$PHC0= -9937.473
##$PHC1= 179.0537
##$PH_mod= 1
##$PKNL= yes
##$PPARMOD= 0
##$PSCAL= 0
##$PSIGN= 0
##$REVERSE= no
##$SF= 81.014009
##$SI= 65536
##$SIGF1= 159.3651
##$SIGF2= -187.1042
##$SINO= 113.3802
##$SIOLD= 16384
##$SREGLST= <1H.CDCl3>
##$SSB= 0
##$STSI= 65536
##$STSR= 0
##$SW_p= 40650.406504065
##$SYMM= 0
##$S_DEV= 0
##$TDeff= 32768
##$TDoff= 0
##$TI= <>
##$TILT= no
##$TM1= 0
##$TM2= 0
##$TOPLEV= 0
##$USERP1= <user>
##$USERP2= <user>
##$USERP3= <user>
##$USERP4= <user>
##$USERP5= <user>
##$WDW= 1
##$XDIM= 65536
##$YMAX_p= 390555303
##$YMIN_p= -33653023
$$ End of Bruker specific parameters
$$ ---------------------------------
##NTUPLES= NMR SPECTRUM
##VAR_NAME=  FREQUENCY,     SPECTRUM/REAL,   SPECTRUM/IMAG
##SYMBOL=    X,             R,               I
##VAR_TYPE=  INDEPENDENT,   DEPENDENT,       DEPENDENT
##VAR_FORM=  AFFN,          ASDF,            ASDF
##VAR_DIM=   65536,         65536,           65536
##UNITS=     HZ,            ARBITRARY UNITS, ARBITRARY UNITS
##FACTOR=    0.620285442955139, 1,           1
##FIRST=     20137.2065510759, 0,            0
##LAST=      -20513.1999529892, 0,           0
##MIN=       -20513.1999529892, -33653023,   0
##MAX=       20137.2065510759, 390555303,    0
$$ Real data points
##PAGE= N=1
##DATA TABLE= (X++(R..R)), XYDATA
$$ [...]
$$ plain form
40030 1378503 2656809 2789787 1164327 -415761 -283100 1070066 2186007 2611370 2783524
40021 2783524 2865019 2699402 2399329 2108081 1578611 791844 570950 1581048 2918901
40012 2918901 2834504 1049401 -667162 -711067 423666 1133115 956335 835040 1374727
40003 1374727 1954567 1827805 1212080 737886 460979 110254 -170484 -186884 -492168 -1740037
39993 -1740037 -3210410 -3196491 -1369610 344183 154661 -1171072 -1453921 -122323 1301409
39984 1301409 1568280 1080780 656555 340327 99106 463415 1480006 1928758 759846
39975 759846 -1206330 -2160075 -1608497 -705040 -394563 -394193 -223764 -144484 -467008 -689439
39965 -689439 -133932 867942 1169636 243892 -1083375 -1570771 -974012 -217586 -207278
$$ packed form
40030A378503J278306J32978j625460j580088J32661J353166J115941M25363J72154
40021B783524Q1495j65617l00073k91248n29470p86767k20894J010098J337853
40012B918901q4397j785103j716563m3905J134733P09449j76780j21295N39687
40003A374727N79840j26762o15725m74194k76907l50725k80738j6400l05284j247869
39993a740037j470373J3919J826881J713793j89522j325733k82849J331598J423732
39984A301409K66871m87500m24225l16228k41221L64309J016591M48752j168912
39975G59846j966176r53745N51578R03457L10477L70J70429P9280l22524k22431
39965f89439N55507J001874L01694r25744j327267m87396N96759P56426J0308
$$ plain form
39956 -207278 -809260 -1190643 -885862 -132321 686805 1360426 1570027 959656 -198958
39947 -198958 -995588 -1006879 -931022 -1507994 -2254688 -2079250 -934986 38305 101643 -186574
39937 -186574 4564 517803 532006 -169793 -837690 -712275 21639 496375 294064 -7720
39927 -7720 350811 1190263 1551834 944602 -113870 -899605 -1194669 -975448 -147658 916133
39917 916133 1290043 637918 -153960 -227924 1863 -220309 -477943 154394 1391642 2131919
39907 2131919 2333506 2874960 3540421 3025487 1436775 832553 2180329 3499650 2632709
39898 2632709 537796 -181087 727681 879344 -1020742 -3260868 -3636578 -2273800 -876528
39889 -876528 -253515 153234 832014 1546871 2097734 2737724 3492502 3689374 2660675
$$ packed form
39956b07278o01982l81383L04781P53541Q19126O73621K09601o10371j158614
39947a98958p96630j1291P5857n76972p46694J75438J144264R73291O3338k88217
39937a86574J91138N13239J4203p01799o67897J25415P33914M74736k02311l01784
39927g720L58531Q39452L61571o07232j058472p85735k95064K19221Q27790J063791
39917I16133L73910o52125p91878p3964K29787k22172k57634O32337J237248P40277
39907B131919K01587N41454O65461n14934j588712o04222J347776J319321q66941
39898B632709k094913p18883R08768J51663j900086k240126l75710J362778J397272
39889h76528O23013M06749O78780P14857N50863O39990P54778J96872j028699
$$ plain form
39880 2660675 691280 -1133320 -2004303 -2030557 -1742758 -1259544 -286661 1086755 2021164
39871 2021164 1735083 579767 -143501 347128 1354650 1632375 1108065 1019585 2088878
39862 2088878 3225833 2772653 727948 -1181613 -1707096 -1421988 -1480230 -1900832 -1824254
39853 -1824254 -902562 397589 1540079 2173061 1905607 705098 -566049 -845400 -141009
39844 -141009 621180 1000144 1441110 2177535 2677249 2562952 2284547 2342231 2439719 1985950
39834 1985950 1035639 195586 -168550 -207217 -194340 -132691 297148 1404753 2911765 3824993
39824 3824993 3330038 1822299 584696 372829 734255 727632 -140863 -1625832 -2827141
39815 -2827141 -2672449 -1009698 856109 1502250 1173205 1266565 2112860 2571623 2091736
$$ packed form
39880B660675j969395j824600q70983k6254K87799M83214R72883J373416R34409
39871B021164k86081j155316p23268M90629J007522K77725n24310q8480J069293
39862B088878J136955m53180k044705j909561n25483K85108n8242m20602P6578
39853a824254R21692J300151J142490O32982k67454j200509j271147k79351P04391
39844a41009P62189L78964M40966P36425M99714j14297k78405N7684R7488m53769
39834A985950r50311q40053l64136l8667J2877O1649M29839J107605J507012R13228
39824C824993m94955j507739j237603k11867L61426o623q68495j484969j201309
39815b827141J54692J662751J865807O46141l29045R3360Q46295M58763m79887
$$ plain form
39806 2091736 1704921 2232241 2812018 2297136 1130715 609068 936483 1212510 953472
39797 953472 546955 438392 784851 1688510 2907468 3523635 2766238 1155873 161830
39788 161830 685502 2281493 3731332 4048917 3190266 2082823 1633343 1584716 991446
39779 991446 -67959 -360024 438694 858552 -181027 -1506455 -1397578 -198164 475118
39770 475118 519776 1416543 3542204 5199991 4835814 2985140 1444066 1268903 1982221
39761 1982221 2309472 1591047 635201 733377 1624074 1509433 -207846 -1609430 -1004186
39752 -1004186 463645 883290 891532 2254324 4072368 3728190 1518137 787876 2701358
39743 2701358 4332211 3418989 1760774 1737740 2353131 1547431 175541 404795 1632893
$$ packed form
39806B091736l86815N27320N79777n14882j166421n21647L27415K76027k59038
39797I53472m06517j08563L46459R03659J218958O16167p57397j610365r94043
39788A61830N23672J595991J449839L17585q58651j107443m49480m8627n93270
39779I91446j059405k92065P98718M19858j039579j325428J08877J199414O73282
39770D75118M4658Q96767K125661J657787l64177j850674j541074j75163P13318
39761A982221L27251p18425r55846R8176Q90697j14641j717279j401584O05244
39752a004186J467831M19645Q242J362792J818044l44178k210053p30261J913482
39743B701358J630853r13222j658215k3034O15391q05700j371890K29254J228098
$$ plain form
39734 1632893 1442748 -63909 -267407 1576379 3031878 2282328 652632 210674 860896
39725 860896 1209377 951906 968772 1706991 2584282 2846226 2461497 2173188 2663965 3528838
39715 3528838 3506344 2215811 1011589 1180729 1924223 1474852 -177981 -1290398 -1003444
39706 -1003444 -253694 174145 700788 1450076 1424147 201224 -936672 -725973 341074
39697 341074 1105532 1489740 1930605 2087150 1593588 1335347 2339113 3832331 4078839
39688 4078839 3016175 2419188 3261160 4456671 4709079 4238340 3884937 3528106 2385597
39679 2385597 400474 -1459234 -2152863 -1467522 -142944 794114 1066803 1369973 2109546
39670 2109546 2380061 1273684 -67000 634665 3434177 5482099 4688857 2478371 1447005
$$ packed form
39734A632893j90145j506657k03498J843786J455499p49550j629696m41958O50222
39725H60896L48481k57471J6866P38219Q77291K61944l84729k88309M90777Q64873
39715C528838k2494j290533j204222J69140P43494m49371j652833j112417K86954
39706a003444P49750M27839N26643P49288k5929j222923j137896K10699J067047
39697C41074P64458L84208M40865J56545m93562k58241J003766J493218K46508
39688D078839j062664n96987Q41972J195511K52408m70739l53403l56831j142509
39679B385597j985123j859708o93629O85341J324578R37058K72689L03170P39573
39670B109546K70515j106377j340684P01665K799512K047922p93242k210486j031366
$$ plain form
39661 1447005 1718188 1609177 870507 791961 1464404 1547969 1006839 1471141 3061056 3386476
39651 3386476 1193701 -1192017 -1080944 648758 1214984 303360 41539 1126547 1850673
39642 1850673 1312610 976539 2008095 3142206 2623608 824011 -519127 -662333 -104089
39633 -104089 726353 1626728 1974996 1335454 544795 893912 2135605 2511826 1156500
39624 1156500 -548765 -700381 750766 2214290 2693905 2772777 3205797 3529969 2880327
39615 2880327 1663379 1303619 2254642 3308398 3332776 2773114 2689683 3093322 3266442
39606 3266442 3191652 3419073 3715864 3142694 1634894 375055 232660 742157 1011728
39597 1011728 881230 830980 1382349 2768967 4516647 5348265 4468390 2998199 2902596
$$ packed form
39661A447005K71183j09011p38670p8546O72443Q3565n41130M64302J589915L25420
39651C386476k192775k385718J11073J729702N66226r11624k61821J085008P24126
39642A850673n38063l36071J031556J134111n18598j799597j343138j43206N58244
39633a04089Q30442R00375L48268o39542p90659L49117J241693L76221j355326
39624A156500j705265j51616J451147J463524M79615P8872M33020L24172o49642
39615B880327j216948l59760R51023J053756K4378n59662q3431M03639J73120
39606C266442p4790K27421K96791n73170j507800j259839j42395N09497K69571
39597A011728j30498n0250N51369J386618J747680Q31618q79875j470191r5603
$$ plain form
39588 2902596 4212072 4733049 3166925 1074322 655890 1780661 2587450 2201470 1393933
39579 1393933 1018995 1185842 1796249 2694395 3294289 3033155 2224684 1716154 1771962 1925970
39569 1925970 1716560 951149 -364586 -1604183 -1489130 522943 3079343 4158316 3336800
39560 3336800 1970995 1323671 1481255 1998398 2557982 2880965 2833535 2727325 2835825
39551 2835825 2719263 1817393 575466 84696 657695 1628188 2469135 3152838 3456613
39542 3456613 2981116 2018233 1480069 1771671 2456670 3013961 3144380 2526461 1264874
39533 1264874 382136 707194 1463957 1302562 548281 759520 2025395 2663638 2031483
39524 2031483 1543957 2000464 1987542 403849 -1225484 -872441 830322 1616431 998773
$$ packed form
39588B902596J309476N20977j566124k092603m18432J124771Q06789l85980q07537
39579A393933l74938J66847O10407Q98146N99894k61134q08471n08530N5808J54008
39569A925970k09410p65411j315735j239597J15053K012073K556400J078973q21516
39560C336800j365805o47324J57584N17143N59584L22983m7430j06210J08500
39551B835825j16562r01870j241927m90770N72999R70493Q40947O83703L03775
39542C456613m75497r62883n38164K91602O84999N57291J30419o17919j261587
39533A264874q82738L25058P56763j61395p54281K11239J265875O38243o32155
39524B031483m87526M56507j2922j583693j629333L53043J702763P86109o17658
$$ plain form
39515 998773 596009 1365018 2414344 2675621 2223244 1691188 1542635 2034601 2882751
39506 2882751 3006732 1714191 87014 -34168 1468754 2785472 2693281 1977903 1813203
39497 1813203 1941164 1398171 280229 -268271 398990 1678520 2562585 2766808 2838897
39488 2838897 3309636 3956771 4110328 3626967 3112141 2984595 2904703 2619708 2755675 3898432
39478 3898432 5283032 5489077 4392011 3386062 3537721 4482281 5355804 5838987 5945263
39469 5945263 5749406 5791960 6794335 8360929 8914430 7766498 6430809 6819597 8725334
39460 8725334 10255748 10374281 9704790 8923248 7786966 6170500 4855296 4515245 4694829
39451 4694829 4577567 4213190 4179204 4407862 4214324 3384185 2498545 2162192 2490911 3307050
$$ packed form
39515I98773m02764P69009J049326K61277m52377n32056j48553M91966Q48150
39506B882751J23981j292541j627177j21182J502922J316718r2191p15378j64700
39497A813203J27961n42993j117942n48500O67261J279530Q84065K04223P2089
39488B838897M70739O47135J53557m83361n14826j27546p9892k84995J35967J142757
39478C898432J384600K06045j097066j005949J51659R44560Q73523M83183J06276
39469E945263j95857M2554J002375J566594N53501j147932j335689L88788J905737
39460H725334J530414J18533o69491p81542j136282j616466j315204l40051J79584
39451D694829j17262l64377l3986K28658j93538q30139q85640l36353L28719Q16139
$$ plain form
39441 3307050 4184045 4316838 3142935 1274231 53455 -73893 50456 -147606 -26271
39432 -26271 1003687 2246677 2775831 2915216 3435181 3942680 3588431 2915873 3198165
39423 3198165 4066451 3854664 2606159 2469442 4162153 5295179 3905608 1786563 2006012
39414 2006012 4324013 5682695 4798482 3648917 4087547 5276660 5405030 4322542 3366948
39405 3366948 3511459 4500549 5263287 4825482 3366795 2364173 2921985 4203012 4643656
39396 4643656 4417454 5043128 6534754 6950203 5387805 3509902 3058799 3570064 3813012
39387 3813012 3918283 4510490 5028657 4654640 3971818 4022482 4502664 4517291 4339613 4680045
39377 4680045 4951498 4202339 3165960 3232563 3805483 3107116 1538701 1553265 3679327
$$ packed form
39441C307050Q76995J32793j173903j868704j220776j27348J24349j98062J21335
39432b6271J029958J242990N29154J39385N19965N07499l54249o72558K82292
39423C198165Q68286k11787j248505j36717J692711J133026j389571k119045K19449
39414B006012K318001J358682q84213j149565M38630J189113J28370j082488r55594
39405C366948J44511R89090P62738m37805j458687j002622N57812J281027M40644
39396D643656k26202O25674J491626M15449j562398j877903m51103N11265K42948
39387C813012J05271N92207N18167l74017o82822N0664M80182J4627j77678L40432
39377D680045K71453p49159j036379O6603N72920o98367j568415J4564K126062
$$ plain form
39368 3679327 5370166 4939672 4149301 5151052 6918645 6953095 5205558 3950204 4368314
39359 4368314 5394509 5832837 5783370 5717785 5541891 5012903 4250539 3630049 3678211 4795071
39349 4795071 6395010 6841886 5292334 3224627 2912241 4576621 6331853 6859104 6709662
39340 6709662 6789841 7024389 7055590 7039047 7079644 6852665 6366572 6179036 6346452 6182228
39330 6182228 5620144 5636263 6517811 6961683 6047652 4971302 5323329 6539649 6840109
39321 6840109 6165459 6201252 7535757 8766526 8831075 8431254 8441374 8522779 8282244 8377538
39311 8377538 9268622 10052091 9905935 9741087 10889267 12855945 14087794 14613810 16077083
39302 16077083 19002408 21789962 23049680 23508036 24684042 26700860 28429407 29173965
$$ packed form
39368C679327J690839m30494p90371J001751J767593L4450j747537j255354M18110
39359D368314J026195M38328m9467o5585j75894n28988p62364o20490M8162J116860
39349D795071J599939M46876j549552k067707l12386J664380J755232N27251j49442
39340F709662Q0179K34548L1201j6543M0597k26979m86093j87536J67416j64224
39330F182228n62084J6119Q81548M43872r14031j076350L52027J216320L00460
39321F840109o74650L5793J334505J230769O4549l99821J0120Q1405k40535R5294
39311H377538Q91084P83469j46156j64848J148180J966678J231849N26016J463273
39302A6077083K925325K787554J259718M58356J176006K016818J728547P44558
$$ plain form
39294 29173965 29281379 29418805 29986581 31027019 32144199 32689984 32438133 31860102 31482473
39285 31482473 31387722 31624035 32455892 33645787 34112895 33130302 31471325 30517678 30497766
39276 30497766 30483530 29946270 29336388 29082433 28942130 28559363 27890399 26857585 25330873
39267 25330873 23735694 22950607 23192787 23574878 23139844 21837324 20197434 18635866 17436234
39258 17436234 16789943 16367530 15397472 13689736 12075068 11286072 10927123 10210270 9227166
39249 9227166 8678226 8668490 8670347 8559083 8787400 9433774 9870094 9646453 9115022 8863991
39239 8863991 8950396 8977852 8657398 8092009 7692524 7875586 8637114 9440018 9785572 9849380
39229 9849380 10227584 11082541 11905979 12153754 11771855 11064227 10390322 10051784 10132448 10328974
$$ packed form
39294B9173965J07414J37426N67776J040438J117180N45785k51851n78031l77629
39285C1482473r4751K36313Q31857J189895M67108r82593j658977r53647j9912
39276C0497766j4236n37260o09882k53955j40303l82767o68964j032814j526712
39267B5330873j595179p85087K42180L82091m35034j302520j639890j561568j199632
39258A7436234o46291m22413r70058j707736j614668p88996l58949p16853r83104
39249I227166n48940r736J857j11264K28317O46374M36320k23641n31431k51031
39239H863991Q6405K7456l20454n65389l99485J83062P61528Q02904L45554O3808
39229I849380L78204Q54957Q23438K47775l81899p07628o73905l38538Q0664J96526
$$ plain form
39219 10328974 10195468 9668765 9207911 9409864 10585403 12563620 14754779 16632533 18312721
39210 18312721 20253120 22173728 23037763 22754272 23040647 25341483 28435515 29759129
39202 29759129 29020587 28622058 30041426 31785903 32109046 31991010 33522222 36416366 38367510
39193 38367510 38597659 38890231 40690962 43021201 44194984 44262393 44522201 45372778 45948997
39184 45948997 45766149 45682388 46881647 49406419 52093320 53846761 54695447 55481762 56705143
39175 56705143 58056166 59158082 60219512 61433614 62060878 60898935 57798917 54134069
39167 54134069 51484540 50216813 49572453 48808177 47933771 47452848 47555520 47585118 46503447
39158 46503447 44205398 42196997 42359224 44901423 48064893 50043498 50609619 50524666 50105182
$$ packed form
39219A0328974j33506n26703m60854K01953J175539J978217K191159J877754J680188
39210A8312721J940399J920608Q64035k83491K86375K300836L094032J323614
39202B9759129p38542l98529J419368J744477L23143j18036J531212K894144J951144
39193C8367510K30149K92572J800731K330239J173783O7409K59808Q50577N76219
39184D5948997j82848q3761J199259K524772K686901J753441Q48686P86315J223381
39175E6705143J351023J101916J061430J214102O27264j161943l100018l664848
39167E4134069k649529j267727o44360p64276q74406m80923J02672K9598j081671
39158D6503447k298049k008401J62227K542199L163470J978605N66121q4953m19484
$$ plain form
39149 50105182 49235431 48421603 48678551 50052945 51100987 50482128 48631066 47152783 46777830
39140 46777830 46731948 46228014 45684152 45845648 46315604 45943196 44600083 43629919 44193983
39131 44193983 45850278 47272047 47934272 48548211 50030038 52459584 54966735 56422065
39123 56422065 56413910 55688374 55354738 55578499 55494594 54467103 52727413 50578686 47981264
39114 47981264 45488122 44434493 45113406 45752301 44744974 43089437 42795461 43469972 42873818
39105 42873818 40939918 40518388 43058662 46014263 46424746 45183856 45296839 47049058
39097 47049058 47702848 45802598 43121402 41709952 41213897 40253350 38778043 37557188
39089 37557188 36363187 34229986 31141966 28201854 26191132 24937988 24118115 23790226
$$ packed form
39149E0105182q69751q13828K56948J374394J048042o18859j851062j478283l74953
39140D6777830m5882n03934n43862J61496M69956l72408j343113r70164N64064
39131D4193983J656295J421769O62225O13939J481827K429546K507151J455330
39123E6422065q155p25536l33636K23761q3905j027491j739690k148727k597422
39114D7981264k493142j053629O78913O38895j007327j655537k93976O74511n96154
39105D2873818j933900m21530K540274K955601M10483j240890J12983J752219
39097D7049058O53790j900250k681196j411450m96055r60547j475307j220855
39089C7557188j194001k133201l088020k940112k010722j253144q19873l27889
$$ plain form
39081 23790226 23953611 24305741 24729977 25442429 26312368 26562642 25685095 24387891 24047420
39072 24047420 25172512 26797184 27506033 26788498 25254286 23756117 22553127 21317530
39064 21317530 19800540 18338841 17568922 17648640 18018224 18094273 17894234 17641393 17119736
39055 17119736 16071888 15023816 14834477 15395176 15755951 15745902 16297552 17640790 18476947
39046 18476947 17953977 17297876 18111231 20006944 21564496 22813281 24708302 26597008
39038 26597008 26654494 25063330 24351554 25813763 27812150 28712823 29356637 31045850 32958409
39029 32958409 33597576 33489942 34271432 35877310 36719010 36288461 35763630 36158409 37356862
39020 37356862 38804247 39847532 39731445 38597343 38045911 39245299 40955386 41066909
$$ packed form
39081B3790226J63385L52130M24236P12452Q69939K50274q77547j297204l40471
39072B4047420J125092J624672P08849p17535j534212j498169j202990j235597
39064B1317530j516990j461699p69919P9718L69584P6049k00039k52841n21657
39055A7119736j047848j048072j89339N60699L60775j0049N51650J343238Q36157
39046A8476947n22970o56101Q13355J895713J557552J248785J895021J888706
39038B6597008N7486j591164p11776J462209J998387R00673O43814J689213J912559
39029C2958409O39167j07634P81490J605878Q41700m30549n24831L94779J198453
39020C7356862J447385J043285j16087j134102n51432J199388J710087J11523
$$ plain form
39012 41066909 39639767 38521827 38296820 37850247 37019649 37241380 38883014 40129840 39629495
39003 39629495 38479213 38357479 39086014 39258964 38194245 36232671 34096861 32793669
38995 32793669 33057144 34057218 33849644 32007024 30501379 30864123 31803863 31106899 28802911
38986 28802911 26758746 25895124 25578312 25374961 25661533 26463808 27172140 27714294 28920874
38977 28920874 31333000 34296395 36469825 36925211 35912856 34851831 35136407 36546137
38969 36546137 37422303 36874901 35953997 35891935 36185417 35615101 34344117 33459083 32847916
38960 32847916 31194427 28168149 25214156 23806836 23931592 24603130 25039005 24986797 24510613
38951 24510613 23800323 23033278 22525331 23004700 24965511 27394547 28263591 27159807 26260589
$$ packed form
39012D1066909j427142j117940k25007m46573q30598K21731J641634J246826n00345
39003C9629495j150282j21734P28535J72950j064719j961574k135810j303192
38995C2793669K63475J000074k07574j842620j505645L62744R39740o96964k303988
38986B8802911k044165q63622l16812k03351K86572Q02275P08332N42154J206580
38977B8920874K412126K963395K173430M55386j012355j061025K84576J409730
38969C6546137Q76166n47402r20904o2062K93482n70316j270984q85034o11167
38960C2847916j653489l026278k953993j407320J24756O71538M35875n2208m76184
38951B4510613p10290p67045n07947M79369J960811K429036Q69044j103784q99218
$$ plain form
38942 26260589 27414282 29434306 30072258 29622740 30153648 31655930 31755808 29597390 27398471
38933 27398471 27224889 28427523 29413414 29954672 30338169 29975485 28559909 27350220 27628371
38924 27628371 28754273 29229129 28948528 29009056 29902847 31235071 32751988 34457956 36148462
38915 36148462 37872644 40315833 43644590 46574432 47803923 47861470 48244550 49173551 49619430
38906 49619430 49308611 49196594 49832998 50487455 50088892 48061676 44259148 39196918 34430394
38897 34430394 31525444 30355571 29362260 27665020 25873040 24609500 23463833 21970849
38889 21970849 20567472 19786935 19253899 18271416 16883317 15658738 14856675 14456016 14601814
38880 14601814 15258829 15643453 14818354 12976157 11535752 11656840 12953095 13964169 13788936
$$ packed form
38942B6260589J153693K020024O37952m49518N30908J502282R9878k158418k198919
38933B7398471j73582J202634R85891N41258L83497l62684j415576j209689K78151
38924B7628371J125902M74856k80601O0528Q93791J332224J516917J705968J690506
38915C6148462J724182K443189L328757K929842J229491N7547L83080R29001M45879
38906D9619430l10819j12017O36404O54457l98563k027216l802528n062230m766524
38897C4430394k904950j169873r93311j697240j791980j263540j145667j492984
38889B1970849j403377p80537n33036r82483j388099j224579q02063m00659J45798
38880A4601814O57015L84624q25099j842197j440405J21088J296255J011074j75233
$$ plain form
38871 13788936 12985358 12796813 13712246 15050361 15903420 16117181 16172843 16426468 16781542
38862 16781542 16935223 16662807 16000580 15380695 15377192 16043128 16741287 16973545 17133894 18026723
38852 18026723 19849088 22103122 24325693 26384359 28175964 29623082 31042147 33078114
38844 33078114 36128858 39964734 43751723 46299652 46772780 45664018 44660093 44890403
38836 44890403 45639085 45465433 44123283 42352129 40137035 36624096 31956060 27788230
38828 27788230 25293988 23665864 21390760 18296237 15534734 13995405 13405361 12721613
38820 12721613 11011156 8373365 6361097 6874747 10012961 13467324 14718467 13549534
38812 13549534 11824814 11137884 11420351 11723804 11546260 11084237 10616521 10066374 9217891
$$ packed form
38871A3788936q03578j88545R15433J338115Q53059K13761N5662K53625L55074
38862A6781542J53681k72416o62227o19885l503O65936O98159K32258J60349Q92829
38852A8026723J822365K254034K222571K058666J791605J447118J419065K035967
38844C3078114L050744L835876L786989K547929M73128j108762j003925K30310
38836D4890403P48682j73652j342150j771154k215094l512939m668036m167830
38828B7788230k494242j628124k275104l094523k761503j539329n90044o83748
38820A2721613j710457k637791k012268N13650L138214L454363J251143j168933
38812A3549534j724720o86930K82467L03453j77544m62023m67716n50147q48483
$$ plain form
38803 9217891 8197972 7489538 7343780 7453632 7489011 7599365 7898587 7900252 7299837 6929397
38793 6929397 7720274 8865221 8521957 6545932 4840784 4442929 4132594 2995197 2385824
38784 2385824 3554246 4989714 4529824 2995174 2965430 4446542 4742730 2859331 1078974
38775 1078974 1235522 2102843 1960849 1434245 1827899 2454723 1900593 777788 911463
38766 911463 2405787 3654717 3974240 4209930 4748366 4843254 4237416 3814018 4161106
38757 4161106 4836492 5460758 6247369 7061387 7306719 7244139 8015918 9700933 10828755
38748 10828755 10785393 11193374 13452875 16168519 16939184 16000829 15962629 17992863 20360133
38739 20360133 21308861 21522880 22601022 24433019 25589934 25681582 25848403 26938086 28355929
$$ packed form
38803I217891j019919p08434j45758J09852L5379J10354K99222J665o00415l70440
38793F929397P90877J144947l43264j976025j705148l97855l10335j137397o09373
38784B385824J168422J435468m59890j534650k9744J481112K96188j883399j780357
38775A078974J56548Q67321j41994n26604L93654O26824n54130j122805J33675
38766I11463J494324J248930L19523K35690N38436R4888o05838m23398L47088
38757D161106O75386O24266P86611Q14018K45332o2580P71779J685015J127822
38748A0828755m3362M07981K259501K715644P70665r38355l8200K030234K367270
38739B0360133R48728K14019J078142J831997J156915R1648J66821J089683J417843
$$ plain form
38730 28355929 29023198 28640589 27559281 26016084 24133293 22402109 21454873 21208914 20751658
38721 20751658 19429870 17716752 16531984 15941851 15194464 14000449 12954681 12445256
38713 12445256 12043885 11555174 11793751 13367445 15366883 16501383 17176051 19108487 22987339
38704 22987339 27815802 32473233 36326073 38156784 36474869 31762376 26698970 23013263
38696 23013263 19701110 15721092 12690734 12730843 14826861 15918859 15163684 14586252 15494860
38687 15494860 16810103 17541552 18563459 20787440 23408798 25292151 26744454 28659235
38679 28659235 30934158 32792419 33774741 33642005 32418220 31304528 32116578 34640952
38671 34640952 35927230 33696262 29290359 25647491 23514176 21630711 19693805 18640977
$$ packed form
38730B8355929O67269l82609j081308j543197j882791j731184r47236k45959m57256
38721B0751658j321788j713118j184768n90133p47387j194015j045768n09425
38713A2445256m01371m88711K38577J573694J999438J134500O74668J932436L878852
38704B2987339M828463M657431L852840J830711j681915m712493n063406l685707
38696B3013263l312153l980018l030358M0109K096018J091998p55175n77432R08608
38687A5494860J315243P31449J021907K223981K621358J883353J452303J914781
38679B8659235K274923J858261R82322j32736j223785j113692Q12050K524374
38671C4640952J286278k230968m405903l642868k133315j883465j936906j052828
$$ plain form
38663 18640977 18217901 16713222 13562372 10272484 8189467 7009720 6077694 5543938
38655 5543938 5486180 5322903 4943669 5146558 6085025 6488442 5402804 3632437 2434381
38646 2434381 1807766 1231152 1121779 2089970 3342580 3390970 2184289 1145263 1030699
38637 1030699 1073179 580397 191313 816526 2092638 2760965 2326862 1618972 1616838 2224850
38627 2224850 2537425 2113085 1520392 1463228 1788064 1850028 1646284 1862487 2654614 3101428
38617 3101428 2349382 852218 -84459 227400 1326008 2405147 3164806 3767708 4235598
38608 4235598 4116343 2901465 877831 -694149 -758905 194228 620307 -21690 -413342
38599 -413342 841914 3128629 4384683 3659668 2294092 2253936 3795470 5257221 5059637
$$ packed form
38663A8640977m23076j504679l150850l289888k083017j179747r32026n33756
38655E543938n7758j63277l79234K02889R38467M03417j085638j770367j198056
38646B434381o26615n76614j09373R68191J252610M8390j206681j039026j14564
38637A030699M2480m92782l89084O25213J276112O68327m34103p07890k134O08012
38627B224850L12575m24340n92693n7164L24836O1964k03744K16203P92127M46814
38617C101428p52046j497164r36677L11859J098608J079139P59659O02902M67890
38608D235598j19255j214878k023634j571980o4756R53133M26079o41997l91652
38599d13342J255256K286715J256054p25015j365576m0156J541534J461751j97584
$$ plain form
38590 5059637 3478337 2178034 2197315 2916379 3176577 2799136 2384128 2065594 1434443
38581 1434443 602934 290119 632967 912174 845558 1161559 2311107 3564598 4167949
38572 4167949 4546246 5423322 6467971 6873508 6702597 6519166 6164722 5184854 4189533
38563 4189533 4395444 5796051 7112769 7779527 8707437 10672903 13153407 15415280 17704162
38554 17704162 20423862 22806741 23411706 21763027 18818734 15901065 13635604 11856185
38546 11856185 10130964 8314046 6746419 5935366 6059112 6896963 8121414 9395418
38538 9395418 10359149 11013668 12093242 14486992 18084818 21550225 23354798 22782116 20083438
38529 20083438 16270479 12800342 10742356 9886143 9083837 7705470 6356658 5981133
$$ packed form
38590E059637j581300j300303J9281P19064K60198l77441m15008l18534o31151
38581A434443q31509l12815L42848K79207o6616L16001J149548J253491O03351
38572D167949L78297Q77076J044649M05537j70911j83431l54444r79868r95321
38563D189533K05911J400607J316718O66758R27910J965466K480504K261873K288882
38554A7704162K719700K382879O04965j648679k944293k917669k265461j779419
38546A1856185j725221j816918j567627q11053J23746Q37851J224451J274004
38538I395418R63731O54519J079574K393750L597826L465407J804573n72682k698678
38529B0083438l812959l470137k057986q56213q02306j378367j348812l75525
$$ plain form
38521 5981133 6699710 7773627 8371461 8233768 7923373 8445539 10212318 12490263 14475519
38512 14475519 16712309 20389047 25052512 28217886 27944368 24968340 21583884 19165819
38504 19165819 17587943 16365555 15292731 14240288 13235445 12649570 12703089 13058355 13524813
38495 13524813 14785358 17654163 21996994 27379825 34549047 44937089 58230588 71325506
38487 71325506 80395752 83651579 81687947 75667788 66085227 53566488 40216846 29165512
38479 29165512 22293330 18832416 16774875 15271413 14755183 15013067 14653651 12988142
38471 12988142 11108496 10220305 10034218 9862626 10164250 11508148 12898660 13002442 12639198
38462 12639198 14081496 17808786 21832236 24641543 27028433 30198469 33606351 35764872
$$ packed form
38521E981133P18577J073917N97834j37693l10395N22166J766779K277945J985256
38512A4475519K236790L676738M663465L165374k73518k976028l384456k418065
38504A9165819j577876j222388j072824j052443j004843n85875N3519L55266M66458
38495A3524813J260545K868805M342831N382831P169222J0388042J3293499J3094918
38487G1325506R070246L255827j963632o020159r582561j2518739j3349642j1051334
38479B9165512o872182l460914k057541j503462n16230K57884l59416j665509
38471A2988142j879646q88191j86087j71592L01624J343898J390512J03782l63244
38462A2639198J442298L727290M023450K809307K386890L170036L407882K158521
$$ plain form
38454 35764872 36179841 35530327 34773911 34907108 36778319 40213495 43901694 46807628 49014688
38445 49014688 50651479 51088243 50185718 49328805 49854535 51092689 51384141 50619050 50217643
38436 50217643 50660914 50594969 48782559 45709794 42663830 40153203 37946179 36055187
38428 36055187 34940363 34922665 35822715 37103248 38215216 38973783 39675924 40653139 41696604
38419 41696604 42180821 41784464 40847664 39982762 39489625 39068629 37913652 35241456 31009248
38410 31009248 26026346 21215453 17037901 13809793 11991654 11545691 11413861 10465392
38402 10465392 8873252 7832748 7949689 8623193 9068702 9224588 9442051 9856776 10301163
38393 10301163 10446693 9983661 9089184 8648087 9455401 11307379 13595976 16692782 21683544
$$ packed form
38454C5764872M14969o49514p56416J33197J871211L435176L688199K905934K207060
38445D9014688J636791M36764r02525q56913N25730J238154K91452p65091m01407
38436E0217643M43271o5945j812410l072765l045964k510627k207024j890992
38428C6055187j114824j7698R00050J280533J111968P58567P02141R77215J043465
38419D1696604M84217l96357r36800q64902m93137m20996j154977k672196m232208
38410C1009248m982902m810893m177552l228108j818139m45963j31830r48469
38402A0465392j592140j040504J16941O73504M45509J55886K17463M14725M44387
38393A0301163J45530m63032q94477m41097Q07314J851978K288597L096806M990762
$$ plain form
38384 21683544 28373549 34443979 37208757 35793681 31376547 25997749 21511251 18898004
38376 18898004 17822873 17126278 16165907 15394673 15475576 16449639 18116314 20624830 24308094
38367 24308094 29519906 36892083 46837586 58195045 68164574 74276379 75757657 72595892
38359 72595892 64703682 53265731 41649061 32996842 27338653 22801364 19213766 18312417
38351 18312417 20285720 22592648 23341125 24016155 27403763 34076563 42387615 50850431
38343 50850431 58691958 64513809 66321337 63346352 56821841 48699608 40428623 33081281
38335 33081281 27581962 24134335 21926723 19961447 18008268 16531851 15988929 16474569
38327 16474569 17829592 19785228 22046532 24369403 26477475 27826788 27629359 25379130
$$ packed form
38384B1683544O690005O070430K764778j415076m417134n378798m486498k613247
38376A8898004j075131o96595r60371p71234Q0903R74063J666675K508516L683264
38367B4308094N211812P372177R945503J1357459R969529O111805J481278l161765
38359G2595892p892210j1437951j1616670q652219n658189m537289l587598r01349
38351A8312417J973303K306928P48477O75030L387608O672800Q311052Q462816
38343E0850431P841527N821851J807528k974985o524511q122233q270985p347342
38335C3081281n499319l447627k207612j965276j953179j476417n42922M85640
38327A6474569J355023J955636K261304K322871K108072J349313j97429k250229
$$ plain form
38319 25379130 21459710 17142961 13791428 11874926 10738505 9431892 7751184 6310578
38311 6310578 5636129 5545060 5603686 5847870 6593933 7614285 8007823 7162509 5628715
38302 5628715 4717066 5206195 6646827 7999548 8708237 8894616 8701014 7981513 6788479
38293 6788479 5660104 5049665 4822458 4695140 4748846 4993600 4960697 4590191 5056532 7408445
38283 7408445 10478341 11729402 10661071 9808549 11363760 14189361 15673048 15558962
38275 15558962 16138962 19113859 24113259 30202362 36816806 42644817 45395929 43903621
38267 43903621 39530467 34633718 30503892 27565156 26516718 27990236 31617647 36574010
38259 36574010 42657323 49755616 56620373 61500871 64075484 65596922 66828447 66890467
$$ packed form
38319B5379130l919420m316749l351533j916502j136421j306613j680708j440606
38311F310578o74449r1069N8626K44184P46063J020352L93538q45314j533794
38302E628715r11649M89129J440632J352721P08689J86379j93602p19501j193034
38293F788479j128375o10439k27207j27318N3706K44754l2903l70506M66341K351913
38283G408445L069896J251061j068331q52522J555211K825601J483687j14086
38275A5558962N80000K974897M999400O089103O614444N828011K751112j492308
38267D3903621m373154m896749m129826k938736j048438J473518L627411M956363
38259C6574010O083313P098293O864757M880498K574613J521438J231525O2020
$$ plain form
38251 66890467 64783972 61393424 59239457 60346066 64579999 69814150 73494606 74365913
38243 74365913 73100918 71408440 70601730 70990473 72167846 73315694 73414886 71872453 69079004
38234 69079004 65873266 62520898 58950697 56022218 55438045 57662952 60631981 61520919
38226 61520919 59740726 57613722 58108056 62110642 67470145 70194005 67070598 58118604
38218 58118604 46696197 36774417 30017066 25626971 22407541 20056953 18649844 17983277
38210 17983277 17823651 18138680 18864144 20124103 22820680 27973553 34814517 40338906
38202 40338906 41721478 38897711 34069627 29061080 24100344 19062944 14743422 12288842
38194 12288842 11890452 12649779 13678660 14979322 17159777 20506490 24616358 28938269
$$ packed form
38251F6890467k106495l390548k153967J106609M233933N234151L680456Q71307
38243G4365913j264995j692478q06710L88743J177373J147848R9192j542433k793449
38234F9079004l205738l352368l570201k928479n84173K224907K969029Q88938
38226F1520919j780193k127004M94334M002586N359503K723860l123407q951994
38218E8118604j1422407r921780o757351m390095l219430k350588j407109o66567
38210A7983277j59626L15029P25464J259959K696577N152873O840964N524389
38202D0338906J382572k823767m828084n008547m960736n037400m319522k454580
38194A2288842l98390P59327J028881J300662K180455L346713M109868M321911
$$ plain form
38186 28938269 33167574 36586790 37436006 34126974 27492334 20818952 16774096 14900220
38178 14900220 13001769 10332709 8118525 7243986 7008358 6511100 5917304 5635886 5283534
38169 5283534 4401060 3547168 3724944 5008638 6482254 7351824 7502590 7133673 6483230
38160 6483230 5914306 5771011 6046137 6442255 6737555 6920615 7115127 7551793 8374815
38151 8374815 9246869 9448782 8710474 7690487 7254966 7469695 7648405 7206115 6131999
38142 6131999 4832879 3866637 3625027 3922691 4101109 3846732 3596809 3784211 4140260
38133 4140260 4313640 4696972 5772625 6930009 7002693 6019411 5350824 5789323 6455883
38124 6455883 6187551 5213634 4677401 4995839 5497797 5435055 4631007 3277185 1821906
$$ packed form
38186B8938269M229305L419216Q49216l309032o634640o673382m044856j873876
38178A4900220j898451k669060k214184q74539k35628m97258n93796k81418l52352
38169E283534q82474q53892J77776J283694J473616Q69570J50766l68917o50443
38160F483230n68924j43295K75126L96118K95300J83060J94512M36666Q23022
38151H374815Q72054K01913p38308j019987m35521K14729J78710m42290j074116
38142F131999j299120r66242k41610K97664J78418k54377k49923J87402L56049
38133D140260J73380L83332J075653J157384P2684r83282o68587M38499O66560
38124F455883k68332r73917n36233L18438N01958o2742q04048j353822j455279
$$ plain form
38115 1821906 1071786 1663360 3172740 4328720 4480773 4378162 4999772 6026645 6247699
38106 6247699 5363839 4447922 4299011 4263444 3465021 2491975 2659330 3858160 4531934
38097 4531934 4017470 3511103 4028586 4695247 4203619 2997759 2569815 3152415 3656218
38088 3656218 3689016 4057704 5119034 6123242 6616437 7138255 7910832 8080781 7102431
38079 7102431 5847369 5405323 5615853 5722213 5698662 5882982 5972672 5564109 5174565 5472805
38069 5472805 5877977 5327768 4274071 4332461 5692353 6455666 5306895 3533261 3254663
38060 3254663 4510177 5417419 4860067 3730061 3391670 3955836 4510044 4382947 3660312
38051 3660312 2817638 2331271 2507778 3284786 4144834 4441053 3911449 2880130 2024664
$$ packed form
38115A821906p50120N91574J509380J155980J52053j02611O21610J026873K21054
38106F247699q83860r15917j48911l5567p98423r73046J67355J198830O73774
38097D531934n14464n06367N17483O66661m91628j205860m27944N82600N03803
38088C656218L2798L68688J061330J004208M93195N21818P72577J69949r78350
38079G102431j255062m42046K10530J06360k3551J84320Q9690m08563l89544K98240
38069E472805M05172n50209j053697N8390J359892P63313j148771j773634k78598
38060C254663J255514R07242n57352j130006l38391N64166N54208j27097p22635
38051C660312q42674m86367J76507P77008Q60048K96219n29604j031319q55466
$$ plain form
38042 2024664 1926194 2594544 3270008 2953354 1490177 6719 -168335 975291 2150327
38033 2150327 2402057 2126496 2127893 2291674 1933569 1137747 814644 1332546 1916791 1789130
38023 1789130 1300558 1409569 2371544 3457979 3877556 3611538 3299570 3430979 3678329
38014 3678329 3171386 1660896 207072 166381 1512490 2846849 3240112 3266403 3777147
38005 3777147 4461434 4423573 3649931 2967946 2796996 2818603 2787290 2836696 2958180 2919882
37995 2919882 2766513 2728748 2635903 2169652 1718260 2087879 3196853 3998590 4008394 3899883
37985 3899883 4098210 3904299 2912396 2305244 3418487 5557715 6657389 5952143 4635600
37976 4635600 3808972 3223850 2537622 2450743 3595456 5159507 5748951 5235460 4774857
$$ packed form
38042B024664r8470O68350O75464l16654j463177j483458j75054J143626J175036
38033B150327K51730k75561J397J63781l58105p95822l23103N17902N84245j27661
38023A789130m88572J09011R61975J086435M19577k66018l11968J31409K47350
38014C678329n06943j510490j453824m0691J346109J334359L93263K6291N10744
38005C777147O84287l7861p73642o81985j70950K1607l1313M9406J21484l8298
37995B919882j53369l7765r2845m66251m51392L69619J108974Q01737R804j08511
37985C899883J98327j93911r91903o07152J113243K139228J099674p05246j316543
37976D635600q26628n85122o86228q6879J144713J564051N89444n13491m60603
$$ plain form
37967 4774857 5165819 6061013 6792261 7176535 7307076 7161101 6754811 6376441 6403017 6968477
37957 6968477 7825934 8426449 8245423 7228691 5843381 4626321 3941900 4174343 5454371
37948 5454371 6835578 6656002 4649409 2967825 3765772 6174689 7288788 6125961
37940 6125961 4789816 5220386 6638892 7269479 6998047 6837131 6933559 6787945 6677493
37931 6677493 7168920 7711921 7380311 6702734 7075636 8467875 9395379 9260284 9033945
37922 9033945 9346212 9600392 9518519 9892445 10920875 11260954 9894011 7853829 6884203
37913 6884203 7128161 7313886 6758916 6119169 6304068 7405230 8697911 9378646 9417481
37904 9417481 9627126 10441240 10932411 10067524 8743462 8990775 10854335 11877551 10535351
$$ packed form
37967D774857L90962Q95194P31248L84274J30541j45975m06290l78370K6576N65460
37957F968477Q57457O00515j81026j016732j385310j217060o84421K32443J280028
37948E454371J381207j79576k006593j681584P97947K408917J114099j162827
37940F125961j336145M30570J418506O30587k71432j60916R6428j45614j10452
37931F677493M91427N43001l31610o77577L72902J392239R27504j35095k26339
37922I033945L12267K54180q1873L73926J028430L40079j366943k040182r69626
37913F884203K43958J85725n54970o39747J84899J101162J292681O80735L8835
37904I417481K09645Q14114M91171q64887j324062K47313J863560J023216j342200
$$ plain form
37895 10535351 8389398 7513999 7471208 6703243 5605953 5915697 7676913 9080322 9188056
37886 9188056 8818759 8652466 8337559 7776140 7582049 7788060 7577368 6785636 6288747
37877 6288747 6368045 6031432 4655701 3161043 2792692 3614205 4812425 5661615 5681121
37868 5681121 4744702 3616918 3533705 4636597 5586726 5311374 4370390 3967266 4319389
37859 4319389 4693852 4493208 3691243 2680259 2184996 2805234 4170299 5066083 4824060
37850 4824060 4043889 3594465 3593100 3811250 4300246 4938692 4992546 3903110 2176091 940112
37840 940112 920162 2137486 4076439 5779068 6372550 5921919 5241450 4681693 3920485
37831 3920485 3132237 3138827 3868339 4032976 3241796 3031409 4462949 5965684 5350627
$$ packed form
37895A0535351k145953q75399m2791p67965j097290L09744J761216J403409J07734
37886I188056l69297j66293l14907n61419j94091K06011k10692p91732m96889
37877F288747P9298l36613j375731j494658l68351Q21513J198220Q49190J9506
37868E681121r36419j127784q3213J102892R50129k75352r40984m03124L52123
37859D319389L74463k00644q01965j010984m95263O20238J365065Q95784k42023
37850D824060p80171m49424j365K18150M88996O38446N3854j089436j727019j235979
37840I40112j9950J217324J938953J702629N93482m50631o80469n59757p61208
37831C920485p88248O590P29512J64637p91180k10387J431540J502735o15057
$$ plain form
37822 5350627 3094265 1644675 1960405 2796450 3243675 3777077 4467243 4282758 3020419
37813 3020419 2185734 2871435 4136701 4618765 4556266 4939410 5616714 5699314 5279815 5307699
37803 5307699 5957132 6426638 6425809 6678248 7577843 8279828 7763933 6308974 5278325 5558109
37793 5558109 6677033 7578850 7939994 8367851 9326948 10354325 10727204 10584018 10725617
37784 10725617 11354227 11759202 11457558 10894488 10579796 10227000 9410101 8523885 8258569
37775 8258569 8452632 8359418 7901996 7731759 8006764 8069243 7607429 7249763 7522576 7957377
37765 7957377 7850942 7342606 7070613 7207648 7521439 7973439 8447987 8221006 6707000
37756 6707000 4680743 3724329 4251441 5013155 4887556 4205906 3759525 3424290 2670046
$$ packed form
37822E350627k256362j449590L15730Q36045M47225N33402O90166j84485j262339
37813C020419q34685O85701J265266M82064o2499L83144O77304Q2600m19499K7884
37803E307699O49433M69506q29K52439Q99595P01985n15895j454959j030649K79784
37793E558109J118924R01817L61144M27857R59097J027377L72879j43186J41599
37784A0725617O28610M04975l01644n63070l14692l52796q16899q86216k65316
37775H258569J94063r3214m57422j70237K75005O2479m61814l57666K72813M34801
37765G957377j06435n08336k71993J37035L13791M52000M74548k26981j514006
37756F707000k026257r56414N27112P61714j25599o81650m46381l35235p54244
$$ plain form
37747 2670046 1805143 1658178 2271804 2865948 3055484 3271317 3882083 4588830 4850316
37738 4850316 4407266 3344209 2125623 1526130 1925078 2649425 2617227 1675129 707144
37729 707144 432789 804291 1598772 2711826 3646571 3643782 2773071 2091402 2193248 2372399
37719 2372399 1871119 1238011 1564677 2798090 3688693 3293786 1919719 667335 446300
37710 446300 1230116 1985263 1701255 732988 474531 1309314 1813630 831193 -579622
37701 -579622 -585448 641157 1216895 506394 37072 973770 2210285 1972984 337013
37692 337013 -977078 -847486 163828 823468 621183 112117 232195 1266842 2388209
37683 2388209 2447974 1332467 144614 -148240 222012 438544 312784 368116 965282
$$ packed form
37747B670046q64903j46965O13626N94144J89536K15833O10766P06747K61486
37738D850316m43050j063057j218586n99493L98948P24347l2198r42098r67985
37729G07144k74355L71502P94481J113054R34745k789q70711o81669J01846J79151
37719B372399n01280o33108L26666J233413Q90603l94907j374067j252384k21035
37710D46300P83816P55147k84008r68267k58457Q34783N04316r82437j410815
37701e79622n826J226605N75738p10501m69322R36698J236515k37301j635971
37692C37013j314091J29592J011314O59640k02285n09066J20078J034647J121367
37683B388209N9765j115507j187853k92854L70252K16532j25760N5332N97166
$$ plain form
37674 965282 1838124 2418700 2315494 1612459 949060 1064427 1938683 2629646 2330008 1339572
37664 1339572 567501 351462 353191 420863 792763 1416407 1857550 2108846 2671174 3375150
37654 3375150 2984964 894868 -1351352 -1507783 435234 2061334 1728253 737081 1320525
37645 1320525 3365274 4604974 3844472 2448353 2189615 2895523 3134073 2413988 1572535
37636 1572535 1275022 1205955 908407 636526 951384 1815162 2428430 1951934 404276
37627 404276 -1081687 -1137962 351904 1815738 1579424 -75987 -1045022 111280 2333687
37618 2333687 3329844 2415872 1258788 1534942 2649931 2654288 1112298 -151428 405957
37609 405957 1835245 2078358 930491 184300 822314 1575450 956604 -435212 -722168
$$ packed form
37674I65282Q72842N80576j03206p03035o63399J15367Q74256O90963k99638r90436
37664A339572p72071k16039J729O7672L71900O23644M41143K51296N62328P03976
37654C375150l90186k090096k246220j56431J943017J626100l33081r91172N83444
37645A320525K044749J239700p60502j396119k58738P05908K38550p20085q41453
37636A572535k97513o9067k97548k71881L14858Q63778O13268m76496j547658
37627D04276j485963n6275J489866J463834k36314j655411r69035J156302K222407
37618B333687R96157r13972j157084K76154J114989M357j541990j263726N57385
37609D05957J429288K43113j147867p46191O38014P53136o18846j391816k86956
$$ plain form
37600 -722168 770232 2903771 4305584 4585913 4055459 3116428 2151953 1480193 1194330
37591 1194330 1234786 1503630 1686078 1300851 357514 -373085 -274164 259480 485456 475480
37581 475480 826455 1480333 1782725 1658048 1740222 2198187 2391174 2013271 1709613 2072112
37571 2072112 2730505 2992861 2822886 2578624 2201396 1344220 180273 -470431 42728
37562 42728 1438616 2617128 2580694 1386468 141758 -116678 586150 1508866 2216323
37553 2216323 2723636 2831543 2101901 634921 -768181 -1442249 -1372121 -795605 62393
37544 62393 696801 522080 -230511 -459500 451536 1750210 2344701 2257281 2356672 2895038
37534 2895038 3083637 2240000 803551 -116968 23820 772637 1484562 2165599 3088038
$$ packed form
37600g22168J492400K133539J401813K80329n30454r39031r64475o71760k85863
37591A194330M0456K68844J82448l85227r43337p30599R8921N33644K25976r976
37581D75480L50975O53878L02392j24677Q2174M57965J92987l77903l03658L62499
37571B072112O58393K62356j69975k44262l77228q57176j163947o50704N13159
37562D2728J395888J178512l6434j194226j244710k58436P02828R22716P07457
37553B216323N07313J07907p29642j466980j403102o74068P0128N76516Q57998
37544F2393O34408j74721p52591k28989R11036J298674N94491q7420R9391N38366
37534B895038J88599q43637j436449r20519J40788P48817P11925O81037R22439
$$ plain form
37525 3088038 3798006 3371600 1967988 1203945 2173437 3827057 4414482 3931088 3688758
37516 3688758 3832348 3136238 1450169 407181 955900 1931370 2144994 2284094 3303979
37507 3303979 4315102 3879006 2495288 1898819 2382357 2647674 2075185 1367407 982945
37498 982945 687665 815390 2187872 4297010 5222652 4134976 2506104 2007569 2484983
37489 2484983 2977073 3490979 4441885 5232015 4899702 3765506 3058499 3089146 3101332 2941521
37479 2941521 3493519 5000332 6120552 5516169 3722454 2535735 2799428 3596446 3640048
37470 3640048 2766755 1803498 1480428 1901972 2800513 3812167 4556266 4889623 5166169
37461 5166169 5879928 6938326 7664331 7692914 7461989 7538729 7872752 8123598 8336709 8723135
$$ packed form
37525C088038P09968m26406j403612p64043R69492J653620N87425m83394k42330
37516C688758J43590o96110j686069j042988N48719R75470K13624J39100J019885
37507C303979J011123m36096j383718n96469M83538K65317n72489p07778l84462
37498I82945k95280J27725J372482K109138R25642j087676j628872m98535M77414
37489B484983M92090N13906R50906P90130l32313j134196p07007L0647J2186j59811
37479B941521N51998J506813J120220o04383j793715j186719K63693P97018M3602
37470C640048q73293r63257l23070M21544Q98541J011654P44099L33357K76546
37461E166169P13759J058398P26005K8583k30925P6740L34023K50846K13111L86426
$$ plain form
37451 8723135 9048919 8931190 8618425 8753708 9366580 9866455 10173170 11054836 13020955
37442 13020955 15634189 18391070 21573623 25578758 30036709 34500261 39702048 47275129
37434 47275129 58416662 73650910 93582745 118391904 145880036 170879697 187560870
37427 187560870 192397373 185078295 167696313 143956078 118409129 94901923 75221331
37420 75221331 59566062 48007892 40590384 36162737 32521058 28432806 24716349 22614146
37412 22614146 21817828 20981099 19603258 18263519 17213009 15959093 14443391 13539206
37404 13539206 13827799 14632225 14897006 14536712 14309784 14689514 15453876 16232128 16929488
37395 16929488 17607773 18306141 19037884 19797738 20597364 21547399 22725927 23909482 24771163
$$ packed form
37451H723135L25784j17729l12765J35283O12872M99875L06715Q81666J966119
37442A3020955K613234K756881L182553M005135M457951M463552N201787P573081
37434D7275129J1141533J5234248J9931835K4809159K7488132K4999661J6681173
37427A87560870M836503p319078j7381982k3740235k5546949k3507206j9680592
37420G5221331j5655269j1558170p417508m427647l641679m088252l716457k102203
37412B2614146p96318q36729j377841j339739j050510j253916j515702r04185
37404A3539206K88593Q04426K64781l60294k26928L79730P64362P78252O97360
37395A6929488O78285O98368P31743P59854P99626R50035J178528J183555Q61681
$$ plain form
37386 24771163 25541258 27089661 29983519 33777983 37769621 42334446 48953667 58806035
37378 58806035 71864089 87891789 108369709 137050156 177869750 231237089 291312260
37371 291312260 346468654 383038710 390555303 366224598 316649279 255377191 196774653
37364 196774653 149810526 116093996 92752562 76343502 64378684 55042274 47271450
37357 47271450 41104485 36870398 33834901 30440729 26163297 22405485 20952893 21789087
37349 21789087 22926196 22409233 20160414 17679928 16171302 15450334 14845147 14507275 15001498
37340 15001498 15852288 15668373 14035896 12198560 11218196 10526816 9298781 8238045 8464420
37331 8464420 9233645 8659474 6713136 5578415 6445791 7727583 7535667 6442988 6257031
$$ packed form
37386B4771163P70095J548403K893858L794464L991638M564825O619221R852368
37378E8806035J3058054J6027700K0477920K8680447M0819594N3367339O0075171
37371B91312260N5156394L6570056P516593k4330705m9575319o1272088n8602538
37364A96774653m6964127l3716530k3341434j6409060j1964818r336410p770824
37357D7271450o166965m234087l035497l394172m277432l757812j452592Q36194
37349B1789087J137109n16963k248819k480486j508626p20968o05187l37872M94223
37340A5001498Q50790j83915j632477j837336r80364o91380j228035j060736K26375
37331H464420P69225n74171j946338j134721Q67376J281792j91916j092679j85957
$$ plain form
37322 6257031 7069459 7353904 6607860 6038259 6368532 6581344 5614977 4154802 3682492
37313 3682492 4351063 4866870 4342086 3371541 3073838 3687717 4521158 5001907 5318239
37304 5318239 5913208 6582248 6416093 4851206 2646466 1419453 2010641 3562538 4498869
37295 4498869 4195031 3280692 2490166 1912617 1536184 1770762 2797087 3826885 3818220
37286 3818220 2871060 2180133 2448689 3006935 2860137 2106145 1785030 2510754 3697568
37277 3697568 4188349 3468130 2228551 1732390 2532489 3888300 4607466 4269948 3287649
37268 3287649 2065205 830452 184604 796081 2225767 3042067 2708546 2442433 3340777
37259 3340777 4499649 4225010 2597137 1402312 1613898 2367305 2684166 2828132 3284295
$$ packed form
37322F257031Q12428K84445p46044n69601L30273K12812r66367j460175m72310
37313C682492O68571N15807n24784r70545k97703O13879Q33441M80749L16332
37304E318239N94969O69040j66155j564887k204740j227013N91188J551897R36331
37295D498869l03838r14339p90526n77549l76433K34578J026325J029798q665
37286C818220r47160o90927K68556N58246j46798p53992l21115P25724J186814
37277C697568M90781p20219j239579m96161Q00099J355811P19166l37518r82299
37268C287649j222444j234753o45848O11477J429686Q16300l33521k66113Q98344
37259C340777J158872k74639j627873j194825K11586P53407L16861J43966M56163
$$ plain form
37250 3284295 3539030 2894243 1827330 1486424 2095003 2765897 2871705 2824086 3308968
37241 3308968 4311510 5181734 5322874 4581172 3261242 2067786 1795746 2603962 3579573
37232 3579573 3482080 2127300 650039 120926 370151 669669 1029043 1867181 2705577
37223 2705577 2499388 1434980 1013716 1795270 2466781 2093384 1855423 3044047 4537313
37214 4537313 4327247 2866027 2498573 3631435 4015161 2501315 1066841 1687636 3206057
37205 3206057 3273948 2032554 1581722 2452365 2976294 2298222 1875522 3090503 4865965
37196 4865965 4947051 2895257 637698 98821 1109653 1941759 1470765 358253 84771
37187 84771 1181737 2770648 3759862 4038488 4278875 4888293 5518962 5549426 4810402 3782962
$$ packed form
37250C284295K54735o44787j066913l40906O08579O70894J05808m7619M84882
37241C308968J002542Q70224J41140p41702j319930j193456k72040Q08216R75611
37232C579573r7493j354780j477261n29113K49225K99518L59374Q38138Q38396
37223B705577k06189j064408m21264P81554O71511l73397k37961J188624J493266
37214D537313k10066j461220l67454J132862L83726j513846j434474O20795J518421
37205C206057O7891j241394m50832Q70643N23929o78072m22700J214981J775462
37196D865965Q1086k051794k257559n38877J010832Q32106m70994j112512k73482
37187H4771J096966J588911R89214K78626K40387O09418O30669L0464p39024j027440
$$ plain form
37177 3782962 3121260 3008323 3105410 3162965 3326007 3574650 3361904 2446139 1674024 1992961
37167 1992961 2901850 3051403 2383549 2253706 3056163 3322759 2117495 842864 1179344
37158 1179344 2333796 2206770 729041 -9783 976419 2110644 1696070 286836 -366647
37149 -366647 272343 1199003 1370479 666673 -317766 -754323 -87894 1361833 2466182
37140 2466182 2436599 1789030 1724310 2614599 3558937 3558186 2778377 2308672 2704631 3162685
37130 3162685 2513207 887645 -211044 276234 1674067 2586818 2663691 2571823 2564834 2138870
37120 2138870 1211358 658284 1220611 2514709 3584454 3987922 3970662 3959048 4205183
37111 4205183 4570719 4410527 3109118 1043178 -433381 -357530 831091 1961820 2397305
$$ packed form
37177C782962o61702j12937R7087N7555J63042K48643k12746r15765p72115L18937
37167A992961R08889J49553o67854j29843Q02457K66596j205264j274631L36480
37158A179344J154452j27026j477729p38824R86202J134225m14574j409234o53483
37149c66647O38990R26660J71476p03806r84439m36557O66429J449727J104349
37140B466182k9583o47569o4720Q90289R44338p51p79809m69705L95959M58054
37130C162685o49478j625562j098689M87278J397833R12751P6873r1868o989m25964
37120B138870r27512n53074N62327J294098J069745M03468j7260j1614K46135
37111D205183L65536j60192j301409k065940j476559P5851J188621J130729M35485
$$ plain form
37102 2397305 2242445 1757725 1153999 713820 563697 476183 339885 586703 1601169
37093 1601169 2886034 3467274 3122447 2592454 2483919 2584430 2532184 2594708 3231998 4103648
37083 4103648 4108100 2653649 651450 -145101 1024699 2958734 3724752 2829048 1647672
37074 1647672 1522387 2078322 2029423 1158761 535570 817848 1352130 1351895 1165980 1671512
37064 1671512 2815434 3510218 2967996 1622957 594148 526674 1132405 1763612 2241462
37055 2241462 2913329 3849007 4366580 3842052 2799875 2465920 3137266 3824831 3901017
37046 3901017 4207455 5689861 7597152 8229597 7308194 6418067 6886368 8265123 9438088
37037 9438088 10428138 12326594 15742533 19971355 23736852 26460626 28675679 31093072
$$ packed form
37102B397305j54860m84720o03726m40179j50123q7514j36298K46818J014466
37093A601169J284865N81240l44827n29993j08535J00511n2246O2524O37290Q71650
37083D103648M452j454451k002199p96551J169800J934035P66018q95704j181376
37074A647672j25285N55935m8899q70662o23191K82278N34282k35j85915N05532
37064A671512J143922O94784n42222j345039j028809o7474O05731O31207M77850
37055B241462O71867R35678N17573n24528j042177l33955O71346O87565P6186
37046C901017L06438J482406J907291O32445r21403q90127M68301J378755J172965
37037I438088R90050J898456L415939M228822L765497K723774K215053K417393
$$ plain form
37029 31093072 33226013 33380489 30552705 26008706 22119155 19722756 17682848 15153682
37021 15153682 12939345 11918871 11334698 9858763 7702382 6433147 6937711 8555905
37013 8555905 10071376 10690194 10217228 9179807 8745039 9709831 11569796 13266657 14728753
37004 14728753 16870010 20085309 23506565 25800934 26142206 24583809 22164989 20376162
36996 20376162 19675741 18815049 16568983 13734042 12150451 12065447 12072575 11618694 11707612
36987 11707612 12740381 13608509 13805829 14664214 17276869 20727198 23787003 26981546
36979 26981546 31248169 35608563 38101936 38426334 37792444 36501276 33573717 28893668
36971 28893668 24077883 20825527 19566905 19908242 21222930 22617902 23557986 24932626
$$ packed form
37029C1093072K132941J54476k827784m543999l889551k396399k039908k529166
37021A5153682k214337j020474n84173j475935k156381j269235N04564J618194
37013H555905J515471O18818m72966j037421m34768R64792J859965J696861J462096
37004A4728753K141257L215299L421256K294369L41272j558397k418820j788827
36996B0376162p00421q60692k246066k834941j583591q5004P128m53881Q8918
36987A1707612J032769Q68128J97320Q58385K612655L450329L059805L194543
36979B6981546M266623M360394K493373L24398o33890j291168k927559m680049
36971B8893668m815785l252356j258622L41337J314688J394972R40084J374640
$$ plain form
36963 24932626 28455590 34515551 41410048 47056850 50699684 52601013 52844721 51001781
36955 51001781 46654265 40062879 32581501 26194817 22039977 19524992 17469394 15715095
36947 15715095 14771249 14383775 13759629 12969364 12658369 12402567 11004169 8712558 7465354
36938 7465354 8297213 10038112 11289404 12084529 12631224 12097210 10157231 8461949 8840307
36929 8840307 10856044 12730404 13960087 15347144 17007944 18214791 19043833 20392212
36921 20392212 22186072 23122135 22543196 21327420 20650171 21027311 22766932 26076549 30326760
36912 30326760 34311550 37542969 40175140 41505530 40106197 36048209 31515005 28334254
36904 28334254 26255181 24650535 24408471 26579297 30317110 34076943 38194111 44264498
$$ packed form
36963B4932626L522964O059961O894497N646802L642834J901329K43708j842940
36955E1001781m347516o591386p481378o386684m154840k514985k055598j754299
36947A5715095r43846l87474o24146p90265l10995k55802j398398k291611j247204
36938G465354Q31859J740899J251292P95125N46695n34014j939979j695282L78358
36929H840307K015737J874360J229683J387057J660800J206847Q29042J348379
36921B0392212J793860R36063n78939j215776o77249L77140J739621L309617M250211
36912C0326760L984790L231419K632171J330390j399333m057988m533204l180751
36904B8334254k079073j604646k42064K170826L737813L759833M117168O070387
$$ plain form
36896 44264498 52115212 59245175 63416500 64152283 61558441 55664147 47700637 40301212
36888 40301212 35235308 32093662 30106954 29811080 31587563 34015134 35720647 38044711
36880 38044711 43527965 51831455 59409141 63681677 65421917 66072498 64744925 59691590
36872 59691590 51592387 43398565 37230185 32993555 29933969 27967428 27094427 26718934
36864 26718934 26212005 25494592 24688816 23865272 23538259 24741712 27994441 32560753 37315034
36855 37315034 42173817 48175944 56105531 65314937 73991993 80468707 84146055 85070930
36847 85070930 82829540 76528745 66373670 54814435 45175303 38931490 34924079 31397005
36839 31397005 28087388 25904932 25200817 25134952 24695708 23859574 23567204 24579896 26377874
$$ packed form
36896D4264498P850714P129963M171325P35783k593842n894294p963510p399425
36888D0301212n065904l141646j986708k95874J776483K427571J705513K324064
36880C8044711N483254Q303490P577686M272536J740240O50581j327573n053335
36872E9691590q099203q193822o168380m236630l059586j966541q73001l75493
36864B6718934n06929p17413q05776q23544l27013J203453L252729M566312M754281
36855C7315034M858783O002127P929587R209406Q677056O476714L677348R24875
36847H5070930k241390o300795j0155075j1559235r639132o243813m007411l527074
36839C1397005l309617k182456p04115o5865m39244q36134k92370J012692J797978
$$ plain form
36830 26377874 27495345 27373495 27591592 30375511 35807817 41597887 46187119 51146799
36822 51146799 59637794 73253176 91440200 113264143 137819553 162358706 181339370
36815 181339370 188682910 181464909 161852282 136057879 111138992 91513422 77559591
36808 77559591 67380171 59651819 54323736 51086712 48633448 45951456 43272566 40975517
36800 40975517 38414334 34819085 30759103 27591573 25709261 24365057 23115660 22339566
36792 22339566 22127371 21648239 20133139 17889241 15879345 14684775 14204953 14024315 13800158
36783 13800158 13590082 13943649 15251611 16850394 17352073 16246300 14677108 14127376 14713472
36774 14713472 15331621 15183832 14512749 13962392 13865388 14230772 14926233 15722881 16489935
$$ packed form
36830B6377874J117471j21850K18097K783919N432306N790070M589232M959680
36822E1146799Q490995J3615382J8187024K1823943K4555410K4539153J8980664
36815A81339370P343540p218001j9612627k5794403k4918887j9625570j3953831
36808G7559591j0179420p728352n328083l237024k453264k681992k678890k297049
36800D0975517k561183l595249m059982l167530j882312j344204j249397p76094
36792B2339566k12195m79132j515100k243898k009896j194570m79822j80638k24157
36783A3800158k10076L53567J307962J598783N01679j105773j569192n49732N86096
36774A4713472O18149j47789o71083n50357r7004L65384O95461P96648P67054
$$ plain form
36765 16489935 17413769 18742401 20321479 21697389 22671151 23463970 24432072 25976589 28555745
36756 28555745 32217067 36225909 39963170 44377237 51715175 63363377 78726155 96859324
36748 96859324 118166829 142739596 166830916 182662062 183364256 168424641 143998217
36741 143998217 118105657 95806660 78238318 64600134 53965542 45674637 39223243
36734 39223243 34310194 30675202 27743357 24844262 21982041 19928398 19179320 19153874
36726 19153874 18822147 17822549 16507020 15187753 13957456 13104328 13010037 13543882 14093108
36717 14093108 14316353 14459666 14921490 15959117 17762613 20250912 22905135 25635806
36709 25635806 29865839 37627107 48910023 60588071 68636269 71005880 68034872 61056300
$$ packed form
36765A6489935R23834J328632J579078J375910R73762P92819R68102J544517K579156
36756B8555745L661322M008842L737261M414067P337938J1648202J5362778J8133169
36748I6859324K1307505K4572767K4091320J5831146P02194j4939615k4426424
36741A43998217k5892560k2298997j7568342j3638184j0634592q290905o451394
36734C9223243m913049l634992k931845k899095k862221k053643p49078k5446
36726A9153874l31727r99598j315529j319267j230297q53128r4291N33845N49226
36717A4093108K23245J43313M61824J037627J803496K488299K654223K730671
36709B5635806M230033P761268J1282916J1678048Q048198K369611k971008o978572
$$ plain form
36701 61056300 51678202 41883264 33478613 27141691 22546438 19306942 17160152 15462540
36693 15462540 13472924 11291710 9776099 9342794 9507058 9725015 9916077 9893732 9131952
36684 9131952 7653631 6464858 6377570 6863388 6844703 6279040 6066911 6538405 7045925
36675 7045925 7197267 7410763 7725423 7116116 5041485 2965962 2892849 4494353 5217390
36666 5217390 3690854 1659046 1631982 3690367 5793865 6475547 5868753 4570189 3058055
36657 3058055 2181536 2687550 3913774 4232707 3268312 2541669 3351955 5037144 6010373
36648 6010373 5681884 4683887 3891752 3825971 4411334 4857551 4404749 3492433 3362689 4211566
36638 4211566 4803868 4374418 3699532 3624641 3804377 3761387 3891520 4362606 4329274 3487860
$$ packed form
36701F1056300r378098r794938q404651o336922m595253l239496k146790j697612
36693A5462540j989616k181214j515611m33305J64264K17957J91062k2345p61780
36684I131952j478321j188773q7288M85818j8685n65663k12129M71494N07520
36675G045925J51342K13496L14660o09307k074631k075523p3113J601504P23037
36666E217390j526536k031808k7064K058385K103498O81682o06794j298564j512134
36657C058055q76519N06014J226224L18933r64395p26643Q10286J685189R73229
36648F010373l28489r97997p92135o5781N85363M46217m52802r12316j29744Q48877
36638D211566N92302m29450o74886p4891J79736m2990J30133M71086l3332q41414
$$ plain form
36628 3487860 3052551 3669718 3765841 1950687 -141965 143430 2365444 3518208 2481746
36619 2481746 1258668 1460875 2164409 2124914 1862568 2273599 2895523 2900824 2554503 2477676
36609 2477676 2468355 2133183 1868979 2248886 3050308 3616065 3604057 2888848 1443181 -182653
36599 -182653 -975358 -525548 614048 1825660 2870180 3323763 2683586 1380331 584944
36590 584944 585020 459205 -182705 -364767 656574 2052239 2503359 1801841 691142 -148528
36580 -148528 -418722 -222010 -111975 -368192 -188959 1243953 2908367 2794952 940804
36571 940804 -256805 544551 1828114 1839591 1048093 590465 154938 -743434 -993065
36562 -993065 432101 2194868 2256906 996803 394205 659518 105079 -1642433 -2626791
$$ packed form
36628C487860m35309O17167R6123j815154k092652K85395K222014J152764j036462
36619B481746j223078K02207P03534l9495k62346M11031O21924N301l46321p6827
36609B477676r321l35172k64204L79907Q01422N65757j2008p15209j445667j625834
36599a82653p92705M49810J139596J211612J044520M53583o40177j303255p95387
36590E84944P6j25815o41910j82062J021341J395665M51120p01518j110699q39670
36580a48528k70194J96712J10035k56217J79233J432912J664414j13415j854148
36571I40804j197609Q01356J283563J1477p91498m57628m35527q98372k49631
36562i93065J425166J762767O2038j260103o02598K65313n54439j747512r84358
$$ plain form
36553 -2626791 -1371179 1029094 2428499 2104089 1011336 318673 269442 218849 -406115
36544 -406115 -1205266 -1239866 -436890 236649 298917 399120 909952 1142707 802101 835711
36534 835711 1655076 1921281 648254 -781068 -552176 714681 1086027 428377 178109
36525 178109 610519 675136 290306 533041 1538269 2254598 2311970 2215283 1820501 716328
36515 716328 -4519 1261411 3710430 4682879 3579192 2735052 3640076 4759338 4282322
36506 4282322 2819720 1931513 1826982 2002978 2556141 3360096 3331785 2014729 728330
36497 728330 761265 1503937 1703805 1502702 1779712 2353845 2344467 1758714 1397455 1539574
36487 1539574 1760401 1730369 1408606 871519 574304 1190804 2599206 3720298 3922311
$$ packed form
36553b626791J255612K400273J399405l24410j092753o92663m9231n0593o24964
36544d06115p99151l4600Q02976O73539O2268J00203N10832K32755l40606L3610
36534H35711Q19365K66205j273027j429322K28892J266857L71346o57650k50268
36525A78109M32410O4617l84830K42735J005228P16329N7372r6687l94782j104173
36515G16328p20847J265930K449019R72449j103687q44140R05024J119262m77016
36506D282322j462602q88207j04531J75996N53163Q03955k8311j317056j286399
36497G28330L2935P42672J99868k01103K77010N74133r378n85753l61259J42119
36487A539574K20827l0032l21763n37087k97215O16500J408402J121092K02013
$$ plain form
36478 3922311 3760402 3764357 3532933 2792244 2262271 2480864 2737423 2260585 1605891 1730005
36468 1730005 2436265 2872934 2905798 2892145 2740571 2307764 2090819 2365516 2249968 886809
36458 886809 -925403 -1563597 -707773 553019 1408244 1886893 1998534 1648568 1403617
36449 1403617 2108499 3530151 4355880 3773665 2300315 914947 78208 -255167 -266397
36440 -266397 -107096 224724 807170 1387083 1409160 794214 191231 5318 -189670 -665879
36430 -665879 -756223 14505 739028 308736 -706493 -782496 162481 631775 -14311 -486830
36420 -486830 451178 2122161 2932075 2467311 1690558 1463956 1730580 2059431 2275024
36411 2275024 2364106 2256143 2052292 2194815 2903167 3472991 2809678 1043536 -32636
$$ packed form
36478C922311j61909L955k31424p40689n29973K18593K56559m76838o54694J24114
36468A730005P06260M36669L2864j3653j51574m32807k16945K74697j15548j363159
36458H86809j812212o38194Q55824J260792Q55225M78649J11641l49966k44951
36449A403617P04882J421652Q25729n82215j473350j385368q36739l33375j1230
36440b66397J59301L31820N82446N79913K2077o14946o02983j85913j94988m76209
36430f65879r0344P70728P24523m30292j015229p6003R44977M69294o46086m72519
36420d86830R38008J670983Q09914m64764p76753k26602K66624L28851K15593
36411B275024Q9082j07963k03851J42523P08352N69824o63313j766142j076172
$$ plain form
36402 -32636 1041252 3319217 4388540 3284527 1363356 206219 -39827 172953 898972
36393 898972 2069807 2807256 2432194 1497001 941366 839981 744404 548200 218962 -539780
36383 -539780 -1480429 -1511370 -232382 1045393 956878 -9499 -482883 -297579 -198574 -175675
36373 -175675 291895 833379 705949 362660 809572 1690749 1810851 1347441 1550722 2288759
36363 2288759 2128500 1149606 1245218 2810844 3575867 2149785 519983 1026573 2621017
36354 2621017 2601740 920192 -47665 342070 31041 -1900861 -3086457 -1249054 2041785
36345 2041785 3205975 1521971 -82074 718336 2630847 2989970 1512112 215602
36337 215602 320555 979829 1061706 578970 -88211 -993139 -1914056 -2019157 -1162819 -540345
$$ packed form
36402c2636J073888K277965J069323j104013j921171j157137k46046K12780P26019
36393H98972J170835P37449l75062r35193n55635j01385r5577j96204l29238p58742
36383e39780r40649l0941J278988J277775q8515r66377m73384J85304R9005K2899
36373a75675M67570N41484j27430l43289M46912Q81177J20102m63410K03281P38037
36363B288759j60259r78894R5612J565626P65023j426082j629802N06590J594444
36354B621017j9277j681548r67857L89735l11029j931902j185596J837403L290839
36345B041785J164190j684004j604045Q00410J912511L59123j477858j296510
36337B15602J04953O59274Q1877m82736o67181r04928r20917j05101Q56338O22474
$$ plain form
36327 -540345 -992868 -1487797 -529698 1487391 2673271 2146115 926258 362011 701219
36318 701219 1296316 1399601 701396 -306459 -630539 42108 863232 1112738 1256618
36309 1256618 1793823 1883201 537312 -1392687 -2080623 -1287820 -350464 237155 1269579
36300 1269579 2645613 2822336 1272471 -260193 -85447 1175180 1806042 1424639 1000827
36291 1000827 1165985 1611308 1814595 1590975 1156628 1041745 1573119 2281615 2416428
36282 2416428 2112464 2204325 2790446 3053428 2731780 2542161 2716229 2410856 1221806
36273 1221806 64601 -203466 123853 644437 1692846 3154262 3712794 2573120 912990
36264 912990 293186 529252 541097 460989 1245076 2687654 3461768 2990847 1930556 908878
$$ packed form
36327e40345m52523m94929R58099K017089J185880n27156j219857n64247L39208
36318G01219N95097J03285o98205j007855l24080O72647Q21124K49506J43880
36309A256618N37205Q9378j345889j929999o87936P92803R37356N87619J032424
36300A269579J376034J76723j549865j532664J74746J260627O30862l81403m23812
36291A000827J65158M45323K03287k23620m34347j14883N31374P08496J34813
36282B416428l03964R1861N86121K62982l21648j89619J74068l05373j189050
36273A221806j157205k68067L27319N20584J048409J461416N58532j139674j660130
36264I12990o19804K36066J1845q0108P84087J442578P74114m70921j060291j021678
$$ plain form
36254 908878 -5945 -716640 -1098655 -1433924 -1842833 -1643991 -408606 819774 753451
36245 753451 -86232 -157954 521566 483693 -452730 -654230 533125 1499766 953845 10934
36235 10934 262954 1177242 1131882 81342 -604808 -420035 -92652 88142 615643 1343901
36225 1343901 1323836 469183 -3035 607040 1430936 1531545 1356089 1741101 2349748 2242210
36215 2242210 1470832 998220 1310817 2060906 2806421 3168254 2567757 885699 -840081
36206 -840081 -1509175 -1514744 -1893137 -2201459 -1072427 987054 1534920 -236022 -1942863
36197 -1942863 -1368895 491737 1449442 1447173 1685052 1836393 813053 -496273 -91273
36188 -91273 1750379 2680216 2006742 1510129 2064553 2184567 922271 -314227 -239909
$$ packed form
36254I08878r14823p10695l82015l35269m08909J98842J235385J228380o6323
36245G53451q39683p1722O79520l7873r36423k01500J187355R66641n45921r42911
36235A0934K52020R14288m5360j050540o86150J84773L27383J80794N27501P28258
36225A343901k0065q54653m72218O10075Q23896J00609j75456L85012O08647j07538
36215B242210p71378m72612L12597P50089P45515L61833o00497j682058j725780
36206h40081o69094n569l78393l08322J129032K059481N47866j770942j706841
36197a942863N73968J860632R57705k269K37879J51341j023340j309326M05000
36188i1273J841652R29837o73474m96613N54424J20014j262296j236498P4318
$$ plain form
36179 -239909 170697 -345662 -1042234 -621286 393531 511710 -464916 -1507927 -1833333
36170 -1833333 -1121584 714989 2791351 3353731 1876511 24754 -623943 -576530 -871666
36161 -871666 -999042 -104227 989190 949653 201881 69540 456097 340732 -137014 -99246
36151 -99246 225942 175005 548508 2531209 5072273 5731557 4099305 2147931 1196437
36142 1196437 802317 723896 1491576 2586501 2457611 1109641 558491 1929317 4054050
36133 4054050 5608978 6542451 6639464 5026672 2312509 994180 2169865 3745368 3542586
36124 3542586 2386150 2242174 2930413 2897289 2106154 1866311 2386992 2556773 1909398
36115 1909398 1120502 693938 525840 567022 748375 598508 18328 -119093 686716 1332427
$$ packed form
36179b39909M10606n16359o96572M20948J014817J18179r76626j043011l25406
36170a833333P11749J836573K076362N62380j477220j851757o48697M7413k95136
36161h71666j27376Q94815J093417l9537p47772j32341L86557j15365m77746L7768
36151i9246L25188n0937L73503J982701K541064O59284j632252j951374r51494
36142A196437l94120p8421P67680J094925j28890j347970n51150J370826K124733
36133D054050J554928R33473R7013j612792k714163j318329J175685J575503k02782
36124C542586j156436j43976O88239l3124p91135k39843N20681J69781o47375
36115A909398p88896m26564j68098M1182J81353j49867n80180j37421Q05809O45711
$$ plain form
36105 1332427 654873 -480231 -358794 787954 1131149 276543 -118402 855484 1863523
36096 1863523 1468541 224136 -461397 -454644 -720185 -1642663 -2577715 -2854259 -2477389 -1858431
36086 -1858431 -1276949 -654366 244223 1326157 2009353 1821506 1040120 382808 199521
36077 199521 349319 635520 854136 683109 162579 12112 702118 1489557 1350107 663592
36067 663592 744512 1672452 2023915 1176918 416087 888471 1746267 1528165 394552 -440735
36057 -440735 -806302 -1468510 -2250913 -2033484 -838077 -236358 -1004234 -1792573 -1135333
36048 -1135333 350243 1009614 565975 55533 -141594 -563912 -1014625 -382782 1334429
36039 1334429 2349567 1427127 -232759 -688860 -28489 326 -1248663 -2429970 -2217993
$$ packed form
36105A332427o77554j135104J21437J146748L43195q54606l94945R73886J008039
36096A863523l94982j244405o85533O753k65541r22478r35052k76544L76870O18958
36086a858431N81482O22583Q98589J081934O83196j87847p81386o57312j83287
36077A99521J49798K86201K18616j71027n20530j50467O90006P87439j39450o86515
36067F63592Q0920R27940L51463q46997p60831M72384Q57796k18102j133613q35287
36057d40735l65567o62208p82403K17429J195407O01719p67876p88339O57240
36048a135333J485576O59371m43639n10442j97127m22318m50713O31843J717211
36039A334429J015138r22440j659886m56101O60371K8815j248989j181307K11977
$$ plain form
36030 -2217993 -965366 52904 132691 -551152 -1405434 -1770849 -1354820 -596169 -144147
36021 -144147 36476 349318 435245 -522752 -2114597 -2636476 -1431187 -85113 -206638
36012 -206638 -1051748 -832487 301295 402521 -1191753 -2704528 -2460248 -1179456 -696290
36003 -696290 -1263344 -1392634 -156399 1492760 2035268 1291039 421827 348771 855636
35994 855636 1314140 1576355 1678171 1244062 35494 -1167573 -1256845 -439812 -136564
35985 -136564 -914485 -1642162 -1336649 -739014 -993498 -1628149 -1227712 308486 1576705
35976 1576705 1661847 1067645 552379 185670 -175378 -467262 -776213 -1217756 -1217683 78746
35966 78746 2271699 3613334 3125984 1955997 1778829 2519205 2655090 1462423 -33279
$$ packed form
36030b217993J252627J018270P9787o83843q54282l65415M16029P58651M52022
36021a44147J80623L12842Q5927r57997j591845n21879J205289J346074j21525
36012b06638q45110K19261J133782J01226j594274j512775K44280J280792M83166
36003f96290n67054j29290J236235J649159N42508p44229q69212p3056N06865
35994H55636M58504K62215J01816m34109j208568j203067q9272Q17033L03248
35985a36564p77921p27677L05513N97635k54484o34651M00437J536198J268219
35976A576705Q5142n94202n15266l66709l61048k91884l08951m41543P3J296429
35966G8746K192953J341635m87350j169987j77168P40376J35885j192667j495702
$$ plain form
35957 -33279 -386614 720414 2444058 3768878 4230369 3898444 2996196 1726323 471067
35948 471067 -149928 166674 859754 1001458 446407 -4315 231423 744884 904544 869729
35938 869729 1208097 1787908 1808474 1012284 217392 263036 819963 835516 136863 -80024
35928 -80024 1152600 2934408 3351661 1975022 434423 47508 53272 -730483 -1545996
35919 -1545996 -762417 1163567 1945005 950779 223757 1055772 1679093 151025 -2124664
35910 -2124664 -2218517 -213514 767226 -814909 -2784532 -2650879 -1065710 -379787 -1104505
35901 -1104505 -1583041 -656263 908029 1700907 1288724 283732 -498572 -639096 -210914
35892 -210914 500800 1356168 2275027 2834925 2497612 1490163 828975 955141 977812 53996
$$ packed form
35957c3279l53335J107028J723644J324820M61491l31925r02248j269873j255256
35948D71067o20995L16602O93080J41704n55051m50722K35738N13461J59660l4815
35938H69729L38368N79811K0566p96190p94892M5644N56927J5553o98653k16887
35928h0024J232624J781808M17253j376639j540599l86915N764p83755q15513
35919a545996P83579J925984P81438r94226p27022Q32015O23321j528068k275689
35910b124664r3853K005003R80740j582135j969623J33653J585169O85923p24718
35901a104505m78536R26778J564292P92878m12183j004992p82304j40524M28182
35892b10914P11714Q55368R18859N59898l37313j007449o61188J26166K2671r23816
$$ plain form
35882 53996 -1037316 -811499 684456 1836481 1786122 1460367 1762961 2019625 1256380
35873 1256380 109796 95169 1315986 2241460 1859729 889973 459489 534404 324922
35864 324922 -373052 -998866 -1134219 -953289 -788701 -691736 -512412 -189543 106444 75414
35854 75414 -378514 -896056 -976050 -639934 -490371 -886758 -1336896 -1058112 -15520 936857
35844 936857 952834 34093 -993725 -1205958 -371183 833446 1485313 1377014 1135091
35835 1135091 1304192 1663701 1738436 1656986 1990475 2798271 3312216 2776527 1435599 492566
35825 492566 920236 2211948 2614811 1127607 -908627 -1129248 744165 2246736 1364777
35816 1364777 -679404 -1101360 713551 2743009 3309741 2795835 2175834 1525698 666043
$$ packed form
35882E3996j091312K25817J495955J152025n0359l25755L02594K56664p63245
35873A256380j146584j4627J220817R25474l81731r69756m30484P4915k09482
35864C24922o97974o25814j35353J80930J64588R6965J79324L22869K95987l1030
35854G5414m53928n17542p9994L36116J49563l96387m50138K78784J042592R52377
35844I36857J5977r18741j027818k12233Q34775J204629O51867j08299k41923
35835A135091J69101L59509P4735q1450L33489Q07796N13945n35689j340928r43033
35825D92566M27670J291712M02863j487204k036234k20621J873413J502571q81959
35816A364777k044181m21956J814911K029458N66732n13906o20001o50136q59655
$$ plain form
35807 666043 -82259 -618991 -1403895 -2254193 -1977698 -264191 1153935 610053 -1026735
35798 -1026735 -1541633 -567079 75980 -808091 -2229550 -2663382 -1962452 -981864 -239330
35789 -239330 316456 790504 1268439 1960168 2909628 3668791 3575943 2414814 799924
35780 799924 -137394 229563 1157563 1192496 79154 -638128 337771 2051467 2486348
35771 2486348 1376333 402025 575424 950576 391006 -748391 -1458333 -1497600 -1148019
35762 -1148019 -469717 334085 625742 320399 438422 1705930 3243231 3662674 2901564
35753 2901564 1892142 976569 -53577 -728749 -240609 939741 1216370 24925 -1354536
35744 -1354536 -1644033 -1169258 -948512 -1075917 -907911 -350274 -48584 -379826 -900605
$$ packed form
35807F66043p48302n36732p84904q50298K76495J713507J418126n43882j636788
35798a026735n14898R74554O43059q84071j421459m33832P00930R80588P42534
35789b39330N55786M74048M77935O91729R49460P59163r2848j161129j614890
35780G99924r37318L66957R28000L4933j113342p17282R75899J713696M34881
35771B486348j110015r74308J73399L75152n59570j139397p09942l9267L49581
35762a148019O78302Q03802K91657l05343J18023J267508J537301M19443p61110
35753B901564j009422r15573j030146o75172M88140J180350K76629j191445j379461
35744a354536k89497M74775K20746j27405J68006N57637L01690l31242n20779
$$ plain form
35735 -900605 -945679 -482658 -193372 -655006 -1478054 -1582881 -602496 405323 265321 -609656
35725 -609656 -737804 265281 1142899 927255 301087 333721 779733 645502 -110760 -564371
35715 -564371 -336580 -85372 -336610 -651958 -328039 595730 1426612 1663694 1452686 1294232
35705 1294232 1490815 1879733 2032706 1692698 1042033 608537 876949 1747101 2262548
35696 2262548 1293142 -1058588 -3068375 -3103902 -1564866 -328269 -404213 -1187679 -2015422
35687 -2015422 -3001655 -3826352 -3276787 -1146914 676900 513756 -669774 -754828 362573
35678 362573 1038652 859915 1096500 2055326 2288712 1197088 365640 1107610 2351094
35669 2351094 2395297 1418228 675254 308453 -286302 -672266 133189 1640780 2175941
$$ packed form
35735i00605m5074M63021K89286m61634q23048j04827R80385J007819j40002q74977
35725f09656j28148J003085Q77618k15644o26168L2634M46012j34231p56262m53611
35715e64371K27791K51208k51238l15348L23919R23769Q30882K37082k11008j58454
35705A294232J96583L88918J52973l40008o50665m33496K68412Q70152N15447
35696B262548r69406k351730k009787l5527J539036J236597p5944p83466q27743
35687b015422r86233q24697N49565K129873J823814j63144j183530q5054J117401
35678C62573O76079j78737K36585R58826K33386j091624q31448P41970J243484
35669B351094M4203r77069p42974l66801n94755l85964Q05455J507591N35161
$$ plain form
35660 2175941 1329987 576014 1061463 2090238 2339287 1550035 420603 -381694 -529273
35651 -529273 14978 817974 1183231 916390 488788 199870 -299770 -1309691 -2389483
35642 -2389483 -2804300 -2362440 -1482646 -696433 -346284 -489012 -804786 -798035 -303325 361982
35632 361982 815834 910567 565411 -289556 -1395897 -2140229 -2128460 -1601360 -1117075 -1007217
35622 -1007217 -1222183 -1454542 -1335089 -788206 -258669 -268954 -694712 -857823 -439096 104587
35612 104587 190352 -201361 -674560 -931565 -954006 -887700 -796846 -362072 927039 2846287
35602 2846287 4085181 3641366 2304315 1645317 1655138 875095 -858753 -1591081 -123763
35593 -123763 1891163 2192873 984298 42054 -223036 -730109 -1337954 -834730 622130
$$ packed form
35660B175941q45954p53973M85449J028775K49049p89252j129432q02297j47579
35651e29273N44251Q02996L65257k66841m27602k88918m99640j009921j079792
35642b389483m14817M41860Q79794P86213L50149j42728l15774O751M94710O65307
35632C61982M53852R4733l45156q54967j106341p44332J1769N27100M84285J09858
35622a007217k14966k32359J19453N46883N29537j0285m25758j63111M18727N43683
35612A04587Q5765l91713m73199k57005k2441O6306R0854M34774J289111J919248
35602B846287J238894m43815j337051o58998R821p80043j733848p32328J467318
35593a23763K014926L01710j208575r42244k65090n07073o07845N03224J456860
$$ plain form
35584 622130 1289096 590844 91288 890067 1875835 1707055 945904 800201 977322 389926
35574 389926 -799670 -1409279 -1084779 -557329 -307946 -152232 43352 292042 922937
35565 922937 2052290 2818366 2193063 420472 -1338487 -2558085 -3416573 -3576355 -2368927
35556 -2368927 -331080 895757 626076 -185930 -760372 -1560658 -2769481 -3115827 -1546559
35547 -1546559 843078 1978593 1419924 475526 -8301 -553486 -1593464 -2370428 -1911489
35538 -1911489 -429379 836471 925474 18260 -831852 -711588 270945 1131324 1136208 575922
35528 575922 223907 398982 948892 1723252 2407821 2244174 828475 -882431 -1316138
35519 -1316138 -199581 1144596 1648794 1687180 1968530 2271540 2131067 1955445 2288444
$$ packed form
35584F22130O66966o98252m99556P98779R85768j68780p61151j45703J77121n87396
35574C89926j189596o09609L24500N27450K49383J55714J95584K48690O30895
35565I22937J129353P66076o25303j772591j758959j219598q58488j59782J207428
35556b368927K037847J226837k69681q12006n74442q00286j208823l46346J569268
35547a546559K389637J135515n58669r44398m83827n45185j039978p76964M58939
35538a911489J482110J265850Q9003r07214q50112J20264R82533Q60379M884n60286
35528E75922l52015J75075N49910P74360O84569j63647j415699j710906m33707
35519a316138J116557J344177N04198L8386K81350L03010j40473j75622L32999
$$ plain form
35510 2288444 2432955 1181757 -1074856 -2315876 -1418152 399964 1378984 1488305 1819335
35501 1819335 2396340 2091931 731814 -191425 452735 1790729 2263906 1807349 1579478
35492 1579478 2003805 2395958 2415856 2475359 2434243 1336577 -813706 -2291310 -1810613
35483 -1810613 -503021 -353431 -1305915 -1557600 -528497 243372 -420141 -1538692 -1537387
35474 -1537387 -466661 421826 571481 444270 320065 -100997 -849013 -1295845 -882408
35465 -882408 275874 1709049 3089887 4148696 4436562 3658547 2294892 1483548 1899833
35456 1899833 2909731 3357114 3173475 3419337 4422906 4897233 3803200 2180262 1688088
35447 1688088 1912055 1015362 -959551 -1599089 356897 2972715 3855027 3288741 3029904
$$ packed form
35510B288444J44511j251198k256613j241020Q97724J818116R79020J09321L31030
35501A819335N77005l04409j360117r23239O44160J337994M73177m56557k27871
35492A579478M24327L92153J9898N9503m1116j097666k150283j477604M80697
35483a810613J307592J49590r52484k51685J029103P71869o63513j118551J305
35474a537387J070726Q88487J49655j27211j24205m21062p48016m46832M13437
35465h82408J158282J433175J380838J058809K87866p78015j363655q11344M16285
35456A899833J009898M47383j83639K45862J003569M74327j094033j622938m92174
35447A688088K23967q96693j974913o39538J955986K615818Q82312n66286k58837
$$ plain form
35438 3029904 3291303 2917666 1838753 1318880 1870502 2547386 2386285 1298611 -384785
35429 -384785 -2045206 -2614333 -1535147 238758 1351655 1800060 2259051 2244708 866739
35420 866739 -869346 -842575 809667 1483689 71923 -1194748 -201967 1811823 2277889
35411 2277889 990788 -228943 -490649 -394497 -238694 356479 1145778 1211335 371503
35402 371503 -512404 -681327 -41125 1213714 2591097 3158930 2411406 1124928 478734
35393 478734 575588 705351 694761 949080 1458751 1861422 2228453 2664499 2437509 854710
35383 854710 -1132645 -1664439 -436558 959849 1388741 1418814 1788878 2078063 1695971
35374 1695971 1009834 559395 104972 -564871 -692774 432242 2003263 2411009 1343528
$$ packed form
35438C029904K61399l73637j078913n19873N51622O76884j61101j087674j683396
35429c84785j660421n69127J079186J773905J112897M48405M58991j4343j377969
35420H66739j736085K6771J652242O74022j411766j266671R92781K013790M66066
35411B277889j287101j219731k61706R6152J55803N95173P89299O5557q39832
35402C71503q83907j68923O40202J254839J377383N67833p47524j286478o46194
35393D78734R6854J29763j0590K54319N09671M02671L67031M36046k26990j582799
35383H54710j987355n31794J227881J396407M28892L0073L70064K89185l82092
35374A695971o86137m50439m54423o69843j27903J125016J571021M07746j067481
$$ plain form
35365 1343528 207650 312227 1374688 2144495 1992810 1396901 1004397 751613 218867
35356 218867 -427999 -460218 348436 1310049 1832111 2200496 2759807 2954879 2134725 892271
35346 892271 445134 789718 665135 -489616 -1687960 -1878065 -1258222 -607484 -190673
35337 -190673 66667 56564 -188041 -199756 285537 845416 1049358 1174384 1694244 2423631
35327 2423631 2729358 2362879 1635366 968509 666912 973740 1968488 3384841 4658282
35318 4658282 5183181 4701863 3667348 2986595 3002871 2993850 2239509 1289369 1338260 2472580
35308 2472580 3493390 3549590 2990590 2414454 1846849 1226419 853909 928871 1283071 1812006
35298 1812006 2497143 2921481 2624198 2022092 1992996 2455162 2494027 2000130 1822379 2072934
$$ packed form
35365A343528j135878J04577J062461P69807j51685n95909l92504k52784n32746
35356B18867o46866l2219Q08654R61613N22062L68385N59311J95072q20154j242454
35346H92271m47137L44584j24583j154751j198344j90105O19843O50738M16811
35337a90673K57340j0103k44605j1715M85293N59879K03942J25026N19860P29387
35327B423631L05727l66479p27513o66857l01597L06828R94748J416353J273441
35318D658282N24899m81318j034515o80753J6276r021p54341r50140M8891J134320
35308B472580J020810N6200n59000n76136n67605o20430l72510P4962L54200N28935
35298A812006O85137M24338k97283o02106k9096M62166L8865m93897j77751K50555
$$ plain form
35288 2072934 1850707 1084768 934060 1671284 1995291 1404076 1316242 2485557 3231638
35279 3231638 2052586 277046 -51349 511577 62354 -1201106 -1485326 -687028 -366588
35270 -366588 -649434 43472 1918413 3126323 2817391 2471850 3214093 3904580 3124756
35261 3124756 1364309 -41147 -807115 -1326798 -1500821 -1105141 -531578 -196477 175911
35252 175911 981934 2050259 3016029 3714252 3836433 2980562 1417810 60817 -572548
35243 -572548 -578634 122403 1610672 2905372 2553711 724325 -694160 -618730 57225
35234 57225 426896 1018724 2231521 2907366 1974402 418086 70242 1116686 2133035
35225 2133035 2071418 1098041 -23172 -406239 513070 2115556 2865867 2283397 1729897
$$ packed form
35288B072934k22227p65939j50708P37224L24007n91215q7834J169315P46081
35279C231638j179052j775540l28395N62926m49223j263460k84220P98298L20440
35270c66588k82846O92906J874941J207910l08932l45541P42243O90487p79824
35261C124756j760447j405456p65968n19683j74023L95680N73563L35101L72388
35252A75911Q06023J068325R65770O98223J22181q55871j562752j356993o33365
35243e72548o086P01037J488269J294700l51661j829386j418485P5430O75955
35234E7225L69671N91828J212797O75845r32964j556316l47844J046444J016349
35225B133035o1617r73377j121213l83067R19309J602486P50311n82470n53500
$$ plain form
35216 1729897 2231331 2670100 1654781 201489 564949 2804887 4542855 4254382 2979116
35207 2979116 2276622 2065790 1373416 167173 -580467 -269237 578093 924499 351934
35198 351934 -466379 -572767 4631 285457 -166205 -531617 -63090 675201 774879 554443
35188 554443 1061238 2357984 3387921 3370665 2373015 697663 -1261993 -2639423 -2591401
35179 -2591401 -1302548 204381 1164015 1325313 540168 -870282 -1640236 -706321 1181694
35170 1181694 2184209 1768028 1154295 1206828 1239150 476515 -493796 -609467 86707 618511
35160 618511 452783 49754 183958 1076106 2129086 2480020 1980570 1431284 1452914 1439083
35150 1439083 343246 -1640422 -3017983 -2710868 -1151250 424643 1185678 1187874 1185801
$$ packed form
35216A729897N01434M38769j015319j453292L63460K239938J737968k88473j275266
35207B979116p02494k10832o92374j206243p47640L11230Q47330L46406n72565
35198C51934q18313j06388N77398K80826m51662l65412M68527P38291R9678k20436
35188E54443N06795J296746J029937j7256r97650j675352j959656j377430M8022
35179b591401J288853J506929R59634J61298p85145j410450p69954R33915J888015
35170A181694J002515m16181o13733N2533L2322p62635r70311j15671O96174N31804
35160F18511j65728m03029J34204Q92148J052980L50934m99450n49286K1630j3831
35150A439083j095837j983668j377561L07115J559618J575893P61035K196k073
$$ plain form
35141 1185801 1865134 2787876 2539231 679065 -1086162 -917427 488724 902971 -1584
35132 -1584 -267963 973707 1960405 1161000 -243108 -313607 627405 746476 -410985 -1578856
35122 -1578856 -1889754 -1706621 -1477961 -1200458 -1073598 -1444686 -1935405 -1690359 -703873
35113 -703873 59755 118296 132485 741654 1539086 1733381 1258745 673896 334441 213141
35103 213141 345349 922211 1906797 2935053 3736962 4397929 4993219 5154050 4368682
35094 4368682 2763561 1241241 628009 894337 1379152 1496244 1002290 -37470 -1129942
35085 -1129942 -1517351 -948618 -46236 519098 824909 1126615 1051644 261738 -527771 -357071
35075 -357071 359190 298346 -693670 -1342504 -950965 -269999 22048 286180 750952 774431
$$ packed form
35141A185801O79333R22742k48645j860166j765227J68735J406151M14247r04555
35132a584k66379J241670R86698p99405j404108p0499R41012J19071j157461j167871
35122a578856l10898J83133K28660K77503J26860l71088m90719K45046R86486
35113g03873P63628N8541J4189O09169P97432J94295m74636n84849l39455j21300
35103B13141J32208N76862R84586J028256Q01909O60967N95290J60831p85368
35094D368682j605121j522320o13232K66328M84815J17092m93954j039760j092472
35085a129942l87409N68733R02382N65334L05811L01706p4971p89906p89509J70700
35075c57071P16261o0844r92016o48834L91539O80966K92047K64132M64772K3479
$$ plain form
35065 774431 146437 -155507 421831 778651 -202408 -1701387 -1993222 -812358 579786
35056 579786 1205957 1067198 463167 -192656 -205466 619569 1283983 727088 -633604 -1519792
35046 -1519792 -1592737 -1473575 -1266381 -405469 1028122 2081966 2199721 1711630 991051
35037 991051 137354 -433606 -162936 673975 1116662 847454 491972 501564 732165 1252196
35027 1252196 2383514 3555329 3303835 1146568 -1405683 -2499469 -2020867 -1328411 -1345223
35018 -1345223 -1617858 -1131689 409474 2163501 2946659 2528806 1910513 1978585 2284569
35009 2284569 1882837 1043070 999432 1948622 2525833 1743560 425702 31875 818371
35000 818371 1877203 2420626 2306036 1659766 646039 -473934 -1353291 -1543240 -603935
$$ packed form
35065G74431o27994l01944N77338L56820r81059j498979k91835J180864J392144
35056E79786O26171j38759o04031o55823j2810Q25035O64414n56895j360692q86188
35046a519792p2945J19162K07194Q60912J433591J053844J17755m88091p20579
35037I91051q53697n70960K70670Q36911M42687k69208l55482R592K30601N20031
35027A252196J131318J171815k51494k157267k552251j093786M78602O92456j6812
35018a345223k72635M86169J541163J754027P83158m17853o18293O8072L05984
35009B284569m01732q39767m3638R49190N77211p82273j317858l93827P86496
35000H18371J058832N43423j14590o46270j013727j119973q79357j89949R39305
$$ plain form
34991 -603935 1218441 2536195 1975805 7932 -1342621 -993329 25765 441933 566623
34982 566623 1223960 1899530 1458014 204649 -349796 213585 585785 -220462 -1343829
34973 -1343829 -1290035 50592 1351487 1496756 656501 -245404 -684215 -925457 -1366611
34964 -1366611 -1781653 -1542062 -584431 276039 272229 -404833 -994816 -1198727 -1342168 -1650061
34954 -1650061 -1889957 -1794922 -1427670 -996975 -602802 -273802 -22891 243368 689929 1324184
34944 1324184 1923961 2273037 2384133 2426302 2489550 2503339 2414555 2377095 2601841 2950896
34934 2950896 2890564 2089039 943416 220032 213815 530482 633619 313726 -270492 -635847
34924 -635847 -196604 1042379 2106912 2008252 1070677 551762 836605 934955 163399 -629528
$$ packed form
34991f03935J822376J317754n60390j967873j350553L49292J019094M16168J24690
34982E66623O57337O75570m41516j253365n54445N63381L72200q06247j123367
34973a343829N3794J340627J300895J45269q40255r01905m38811k41242m41154
34964a366611m15042K39591R57631Q60470l810o77062n89983k03911j43441l07893
34954a650061k39896R5035L67252M30695L94173L29000K50911K66259M46561O34255
34944A324184N99777L49076J11096M2169O3248J3789q8784l7460K24746L49055
34934B950896o0332q01525j145623p23384o217L16667J03137l19893n84218l65355
34924f35847M39243J238983J064533r8660r37575n18915K84843R8350p71556p92927
$$ plain form
34914 -629528 -289682 881113 1533717 1095402 298303 7254 288118 684475 839558
34905 839558 739786 688640 1020042 1595861 1788211 1256756 456351 10049 -66900 -48054
34895 -48054 207457 980512 1956091 2469835 2414682 2277543 2299594 2180224 1656592 909707
34885 909707 362702 401315 1156748 2208368 2755532 2532955 2241598 2525482 2897193 2410599
34875 2410599 1098797 -95437 -614304 -638750 -334351 288717 873116 1101560 1501703
34866 1501703 2679913 3742525 2924918 198123 -2155157 -2291327 -937373 52615 131963
34857 131963 -8987 -9620 -77466 -203701 -260497 -514875 -1110775 -1441499 -948311 -115088
34847 -115088 276297 421291 959198 1592819 1490924 837667 656875 1098875 1193664 455963
$$ packed form
34914f29528L39846J170795O52604m38315p97099k91049K80864L96357J55083
34905H39558r9772n1146L31402N75819J92350n31455q00405m46302p6949J8846
34895d8054K55511P73055R75579N13744n5153j37139K2051j19370n23632p46885
34885I09707n47005L8613P55433J051620N47164k22577k91357K83884L71711m86594
34875B410599j311802j194234n18867k4446L04399O23068N84399K28444M00143
34866A501703J178210J062612q17607k726795k353280j36170J353954R89988P9348
34857A31963j40950o33o7846j26235n6796k54378n95900l30724M93188Q33223
34847a15088L91385J44994N37907O33621j01895o53257j80792M42000R4789p37701
$$ plain form
34837 455963 -528474 -1391578 -2565331 -4049696 -4770809 -3934934 -2170048 -624141 316963
34828 316963 776237 683201 152837 -118428 250662 556016 58624 -644169 -353816 844432
34818 844432 1527125 835508 -540736 -1549352 -2081909 -2571462 -2890989 -2416457 -1128254
34809 -1128254 -39936 -130845 -1000064 -1126193 183269 1553615 1084337 -951924 -2087515
34800 -2087515 -820940 1325824 1937786 1010139 609901 1606435 2524419 2037925 1017598
34791 1017598 1100958 2260038 2989741 2436177 1243659 401874 167797 280117 553871
34782 553871 898234 1064269 743224 -28241 -672570 -480853 604938 1744497 2025445
34773 2025445 1457522 798860 536933 593841 951694 1759212 2641438 2782912 2128954 1672188
$$ packed form
34837D55963r84437q63104j173753j484365p21113Q35875J764886J545907R41104
34828C16963M59274r3036n30364k71265L69090L05354m97392p02793K90353J198248
34818H44432O82693o91617j376244j008616n32557m89553l19527M74532J288203
34809a128254J088318r0909q69219j26129J309462J370346m69278k036261j135591
34800b087515J266575K146764O11962r27647m00238R96534R17984m86494j020327
34791A017598Q3360J159080P29703n53564j192518q41785k34077J12320K73754
34782E53871L44363J66035l21045p71465o44329J91717J085791J139559K80948
34773B025445n67923o58662k61927N6908L57853Q07518Q82226J41474o53958m56766
$$ plain form
34763 1672188 1950453 2089878 1166335 -223521 -793541 -407544 63046 275630 504688
34754 504688 499241 -212995 -886958 -114132 1788053 2637153 1449155 49589 401837
34745 401837 1723311 1934405 973486 608027 1299216 1420091 4078 -1569187 -1569476 -317982
34735 -317982 491683 90687 -745600 -920799 -60051 1350188 2253640 1807213 414838
34726 414838 -445570 17817 874392 925754 576414 1131532 2574745 3408317 2835052 1850602
34716 1850602 1752438 2616726 3749681 4634726 4795312 3717110 1789351 505551 755352
34707 755352 1633685 1971429 2219536 3371982 4668242 4300128 2372790 1150065 1792651
34698 1792651 2702330 2137533 871534 769345 1848951 2462325 1823726 716648 -142265
$$ packed form
34763A672188K78265J39425r23543j389856n70020L85997M70590K12584K29058
34754E04688n447p12236o73963P72826J902185Q49100j187998j399566L52248
34745D01837J321474K11094r60919l65459O91189J20875j416013j573265k89J251494
34735c17982Q09665m00996q36287j75199Q60748J410239R03452m46427j392375
34726D14838q60408M63387Q56575N1362l49340N55118J443213Q33572n73265r84450
34716A850602r8164Q64288J132955Q85045J60586j078202j927759j283800K49801
34707G55352Q78333L37744K48107J152446J296260l68114j927338j222725O42586
34698A792651R09679n64797j265999j02189J079606O13374o38599j107078q58913
$$ plain form
34689 -142265 -952950 -1896527 -2569037 -2675507 -2411541 -1908225 -1023972 154392 1243883
34680 1243883 2026908 2359535 1817411 333031 -968207 -733175 709262 1600121 1180041
34671 1180041 600060 915957 1495759 1283558 522598 138428 256830 441383 698780
34662 698780 1115558 1135103 434650 -31281 727051 1824011 1420461 -488553 -1837230
34653 -1837230 -1336537 -6189 710213 866180 1097219 1046397 41244 -1356715 -1798648
34644 -1798648 -921261 314688 929535 785018 297193 14047 341605 1049536 1249561
$$ packed form
34689a42265q10685r43577o72510j06470K63966N03316Q84253J178364J089491
34680A243883P83025L32627n42124j484380j301238K35032J442437Q90859m20080
34671A180041n79981L15897N79802k12201p60960l84170J18402J84553K57397
34662F98780M16778J9545p00453m65931P58332J096960m03550j909014j348677
34653a837230N00693J330348P16402J55967K31039n0822j005153j397959m41933
34644a798648Q77387J235949O14847j44517m87825k83146L27558P07931K00025
$$ [...]
##END NTUPLES=NMR SPECTRUM
##END=
