##TITLE=31Pdec_SR124T5
 CDCl3, 24 sc
 2.6.2022
##JCAMPDX= 6.0         $$ Bruker NMR JCAMP-DX V2.0
##DATA TYPE= NMR SPECTRUM
##DATA CLASS= NTUPLES
##ORIGIN= UXNMR, Bruker Analytische Messtechnik GmbH
##OWNER= root
$$ XWIN-NMR		Version 3.5
$$ Thu Jun  2 14:52:05 2022 Russian Standard Time (UT+4h)  she@DPX200
##.OBSERVE FREQUENCY= 81.013821
##.OBSERVE NUCLEUS= ^31P
##.ACQUISITION MODE= SIMULTANEOUS
##.ACQUISITION SCHEME= undefined
##.AVERAGES= 24
##.DIGITISER RES= 16
##SPECTROMETER/DATA SYSTEM= spect
##.PULSE SEQUENCE= zgpg30
##.SOLVENT NAME= DMSO
##.SHIFT REFERENCE= (INTERNAL, DMSO, 0, 248.564)
##AUDIT TRAIL= $$ (NUMBER, WHEN, WHO, WHERE, WHAT)
$$ ##TITLE= Audit trail, XWIN-NMR		Version 3.5
$$ ##JCAMPDX= 5.01
$$ ##ORIGIN= Bruker BioSpin GmbH
$$ ##OWNER= she
$$ F:/spectra/data/she/nmr/P31/1/pdata/1/auditp.txt
$$ ##AUDIT TRAIL=  $$ (NUMBER, WHEN, WHO, WHERE, WHAT)
(   1,<2022-06-02 14:50:52.54 +0400>,<she>,<DPX200>,
      <created by zg, POWCHK disabled, PULCHK disabled
       configuration hash MD5:
       00 E9 B6 7A A2 85 ED C7 34 08 36 98 17 FE 4E 26
       data hash MD5: 32K
       02 EC 1A 1A 22 8D 81 CE 34 8F 7D B3 6B 98 8D 1A>)
(   2,<2022-06-02 14:50:55.07 +0400>,<she>,<DPX200>,
      <Start of raw data processing
       efp BC_mod = 2 LB = 1 FT_mod = 6 PKNL = 1 PHC0 = -10159.03 PHC1 = -172.7461 SI = 64K 
       data hash MD5: 64K
       83 3D 6B D7 CA 61 5E 4A BD EA 1C 74 8D 76 94 BE>)
$$ ##END=
$$ 
$$ hash MD5
$$ D3 DD 4F BA 8B 10 87 32 BC B2 ED FF ED D9 46 B5
##$RELAX= 
##$RELAX= 
##$RELAX= 
##$RELAX= 
##$RELAX= 
##$RELAX= 
##$RELAX= 
##$RELAX= 
$$ Bruker specific parameters
$$ --------------------------
##$DU= <F:/spectra>
##$EXPNO= 1
##$NAME= <P31>
##$PROCNO= 1
##$TYPE= <nmr>
##$USER= <she>
##$AMP= (0..31)
100 100 100 100 100 100 100 100 100 100 100 100 100 100 100 100 100 100 
100 100 100 100 100 100 100 100 100 100 100 100 100 100 
##$AQSEQ= 0
##$AQ_mod= 1
##$AUNM= <au_zg>
##$AUTOPOS= <>
##$BF1= 81.014009
##$BF2= 200.13
##$BF3= 200.13
##$BF4= 200.13
##$BF5= 200.13
##$BF6= 200.13
##$BF7= 200.13
##$BF8= 200.13
##$BYTORDA= 1
##$CFDGTYP= 0
##$CFRGTYP= 5
##$CHEMSTR= <none>
##$CNST= (0..31)
1 1 145 1 1 1 1 1 1 1 1 1 1 1 1 1 1 1 1 1 1 1 1 1 1 1 1 1 1 1 1 1 
##$CPDPRG= <waltz16>
##$CPDPRG1= <>
##$CPDPRG2= <waltz16>
##$CPDPRG3= <>
##$CPDPRG4= <mlev>
##$CPDPRG5= <mlev>
##$CPDPRG6= <mlev>
##$CPDPRG7= <mlev>
##$CPDPRG8= <mlev>
##$CPDPRGB= <>
##$CPDPRGT= <>
##$D= (0..31)
0 1 0 0 0 0 0 0 0 0 0 0.03 2e-05 3e-06 0 0 0 0 0 0 0 0 0 0 0 0 0 0 0 0 
0 0 
##$DATE= 1654167051
##$DBL= (0..7)
120 120 120 11 120 120 24 19 
##$DBP= (0..7)
150 150 150 150 150 150 150 150 
##$DBP07= 0
##$DBPNAM0= <>
##$DBPNAM1= <>
##$DBPNAM2= <>
##$DBPNAM3= <>
##$DBPNAM4= <>
##$DBPNAM5= <>
##$DBPNAM6= <>
##$DBPNAM7= <>
##$DBPOAL= (0..7)
0.5 0.5 0.5 0.5 0.5 0.5 0.5 0.5 
##$DBPOFFS= (0..7)
0 0 0 0 0 0 0 0 
##$DE= 6
##$DECBNUC= <off>
##$DECIM= 3
##$DECNUC= <off>
##$DECSTAT= 4
##$DIGMOD= 1
##$DIGTYP= 9
##$DL= (0..7)
0 0 52 120 120 21 21 25 
##$DP= (0..7)
$$ [...]
##$SUBNAM2= <"">
##$SUBNAM3= <"">
##$SUBNAM4= <"">
##$SUBNAM5= <"">
##$SUBNAM6= <"">
##$SUBNAM7= <"">
##$SUBNAM8= <"">
##$SUBNAM9= <"">
##$SW= 501.771253377433
##$SWIBOX= (0..15)
0 1 3 0 0 0 0 0 0 0 0 0 0 0 0 0 
##$SW_h= 40650.406504065
##$TD= 32768
##$TD0= 1
##$TE= 0
##$TE2= 300
##$TE3= 300
##$TEG= 300
##$TL= (0..7)
0 120 53 12 22 120 120 120 
##$TP= (0..7)
150 150 150 150 150 150 150 150 
##$TP07= 0
##$TPNAME0= <>
##$TPNAME1= <>
##$TPNAME2= <>
##$TPNAME3= <>
##$TPNAME4= <>
##$TPNAME5= <>
##$TPNAME6= <>
##$TPNAME7= <>
##$TPOAL= (0..7)
0.5 0.5 0.5 0.5 0.5 0.5 0.5 0.5 
##$TPOFFS= (0..7)
0 0 0 0 0 0 0 0 
##$TUNHIN= 0
##$TUNHOUT= 0
##$TUNXOUT= 0
##$USERA1= <user>
##$USERA2= <user>
##$USERA3= <user>
##$USERA4= <user>
##$USERA5= <user>
##$V9= 5
##$VALIST= <valist>
##$VCLIST= <CCCCCCCCCCCCCCC>
##$VD= 0
##$VDLIST= <DDDDDDDDDDDDDDD>
##$VPLIST= <PPPPPPPPPPPPPPP>
##$VTLIST= <TTTTTTTTTTTTTTT>
##$WBST= 1024
##$WBSW= 4
##$XGAIN= (0..3)
0 0 0 0 
##$XL= 0
##$YL= 0
##$YMAX_a= 3480
##$YMIN_a= -4566
##$ZGOPTNS= <>
##$ZL1= 120
##$ZL2= 120
##$ZL3= 120
##$ZL4= 120
##$ABSF1= 0
##$ABSF2= 0
##$ABSG= 0
##$ABSL= 0
##$ALPHA= 0
##$AQORDER= 0
##$ASSFAC= 0
##$ASSFACI= 0
##$ASSFACX= 0
##$ASSWID= 0
##$AUNMP= <proc_1d>
##$AZFE= 0.1
##$AZFW= 0.5
##$BCFW= 0
##$BC_mod= 2
##$BYTORDP= 0
##$COROFFS= 0
##$CY= -3
##$DATMOD= 1
##$DC= 0
##$DFILT= <>
##$DTYPP= 0
##$F1P= 0
##$F2P= 0
##$FCOR= 1
##$FTSIZE= 65536
##$FT_mod= 6
##$GAMMA= 0
##$GB= 0
##$INTBC= 1
##$INTSCL= 5.30512e-09
##$ISEN= 30
##$LB= 1
##$LEV0= 0
##$LPBIN= 0
##$MAXI= 10000
##$MC2= 0
##$MEAN= 0
##$ME_mod= 0
##$MI= 50
##$NCOEF= 0
##$NC_proc= -9
##$NLEV= 6
##$NOISF1= 182.463
##$NOISF2= 159.3651
##$NSP= 0
##$NTH_PI= 0
##$NZP= 0
##$OFFSET= 248.5645
##$PC= 4
##$PHC0= -10159.03
##$PHC1= -172.7461
##$PH_mod= 1
##$PKNL= yes
##$PPARMOD= 0
##$PSCAL= 0
##$PSIGN= 0
##$REVERSE= no
##$SF= 81.014009
##$SI= 65536
##$SIGF1= 159.3651
##$SIGF2= -187.1042
##$SINO= 113.3802
##$SIOLD= 16384
##$SREGLST= <1H.CDCl3>
##$SSB= 0
##$STSI= 65536
##$STSR= 0
##$SW_p= 40650.406504065
##$SYMM= 0
##$S_DEV= 0
##$TDeff= 32768
##$TDoff= 0
##$TI= <>
##$TILT= no
##$TM1= 0
##$TM2= 0
##$TOPLEV= 0
##$USERP1= <user>
##$USERP2= <user>
##$USERP3= <user>
##$USERP4= <user>
##$USERP5= <user>
##$WDW= 1
##$XDIM= 65536
##$YMAX_p= 378870015
##$YMIN_p= -363947754
$$ End of Bruker specific parameters
$$ ---------------------------------
##NTUPLES= NMR SPECTRUM
##VAR_NAME=  FREQUENCY,     SPECTRUM/REAL,   SPECTRUM/IMAG
##SYMBOL=    X,             R,               I
##VAR_TYPE=  INDEPENDENT,   DEPENDENT,       DEPENDENT
##VAR_FORM=  AFFN,          ASDF,            ASDF
##VAR_DIM=   65536,         65536,           65536
##UNITS=     HZ,            ARBITRARY UNITS, ARBITRARY UNITS
##FACTOR=    0.620285442955139, 1,           1
##FIRST=     20137.2065510759, 0,            0
##LAST=      -20513.1999529892, 0,           0
##MIN=       -20513.1999529892, -363947754,  0
##MAX=       20137.2065510759, 378870015,    0
$$ Real data points
##PAGE= N=1
##DATA TABLE= (X++(R..R)), XYDATA
$$ [...]
45279 -5497841 4206958 15305855 20010818 18374753 16766863 17486502 15684588 7409272
45271 7409272 -3264422 -7244041 108287 13299621 21462454 19357624 11770289 5527351
45263 5527351 856051 -5017173 -9298023 -6050960 3643878 11335674 11743318 7278897
45255 7278897 1651735 -4003093 -7557475 -5886480 -730465 1855646 -164494 -3389507
45247 -3389507 -7046160 -14432739 -23756585 -26090550 -17181513 -4467257 2359535 1954087
45239 1954087 -1198506 -3400481 -1897042 4699875 11505907 9597275 -1727281 -11204001
45231 -11204001 -9182613 1355489 12177800 20766205 27581132 29567313 24337623 15786593
45223 15786593 8815064 3524958 192404 2741801 10059179 11851966 2628728 -7528002
45215 -7528002 -7089428 -1075961 -1826285 -7341995 -4626034 7306100 14245924 8759055
45207 8759055 350673 -1334332 -639903 -5962031 -15316380 -19990105 -16865849 -10602332
45199 -10602332 -7033166 -8332362 -11591410 -10501173 -2593757 4982454 3219207 -4835416
45191 -4835416 -6402484 2480387 10191165 6280345 -3936679 -9102832 -9023494 -12500555
45183 -12500555 -21680042 -28296843 -25345968 -15086303 -4499864 1648106 2255676 -805400
45175 -805400 -3364321 -2543820 -837811 -3318648 -9727219 -13175710 -9150134 -2401795
45167 -2401795 -770255 -4151082 -5266013 -1792177 -1008334 -8299916 -16966447 -17165375
45159 -17165375 -11596961 -12000942 -19905935 -22502358 -12121722 1128874 4147911 -879920
45151 -879920 -3326995 -2044129 -3976193 -9358540 -11803858 -11500359 -14973457 -21410217
45143 -21410217 -22319975 -16616888 -13086981 -14685391 -13504125 -6384012 -2528596 -8072698
45135 -8072698 -14525798 -11561460 -1792889 6263348 11095492 14432837 12992349 4933335
45127 4933335 -2282244 -1574040 2227975 1622170 740525 7303662 15638432 13200947 1892562
45118 1892562 -2972960 4163524 11827868 10029278 2002324 -6514206 -15752051 -23434601
45110 -23434601 -21056148 -7757671 2669705 -937981 -10756650 -11422484 -1672533 6479211
45102 6479211 6130766 1769502 -1493654 -4596042 -9266817 -14066912 -17437736 -18657794
45094 -18657794 -14777809 -2930137 12247318 19328492 12149635 -2007583 -9727587 -5466358
45086 -5466358 4305488 10204471 10437223 10474062 13159724 13255992 5719480 -3235484 -1215925
45077 -1215925 12405794 22150345 15996185 2037646 -3477257 684994 1760590 -4859707
45069 -4859707 -8994564 -4429137 -358524 -5959635 -14666738 -15015457 -9219486 -7682786
45061 -7682786 -9532052 -3556027 11318744 21073417 16587062 6196223 1197768 -495497
45053 -495497 -6129074 -11573519 -6183612 8564406 18254932 15079687 7471917 6116140
45045 6116140 9319043 8802218 3700212 634411 2525086 5059093 4540849 3046359
45037 3046359 3586945 4292940 566478 -8522846 -18234624 -22326136 -18498365 -10279612
45029 -10279612 -4031981 -3444081 -6277533 -6728246 -1473168 6460640 10020586 4934596
45021 4934596 -5219784 -11385212 -7974840 446914 3269946 -4421353 -15787574 -19342086
45013 -19342086 -10890752 3258150 13803477 16702636 14126454 9914141 5763350 1225044
45005 1225044 -3931214 -8286377 -10074625 -9124409 -5978524 432707 11091732 21671729
44997 21671729 23113218 11875392 -2494691 -6029454 2754025 10338703 5352084 -6836064
44989 -6836064 -11685216 -4430810 5327536 7867310 5107106 4593607 6973802 5970744
44981 5970744 -425767 -5496956 -2976648 3943531 6869267 2930211 -3204358 -6791019
44973 -6791019 -7479744 -5985504 -1566235 4716909 8363745 6633396 2706417 1297005
44965 1297005 2610930 4425459 7531124 13702561 19462336 18199171 9683100 2065827
44957 2065827 1965523 6758263 9471216 7619599 3682961 -384698 -4837095 -9190032
44949 -9190032 -10997105 -7931242 409136 12237965 23783308 30566758 29989266 22593506
44941 22593506 10954661 -1002870 -7849727 -5585853 3086782 9354236 7220539 -16824
44933 -16824 -4990987 -5834960 -6723422 -10004379 -12189455 -8741546 -163781 7848623 9248421
44924 9248421 2792314 -6339234 -10481205 -6304222 2555096 9757908 11334459 6396888
44916 6396888 -3283650 -12156150 -13314198 -5989500 2149327 3885428 408839 -3664876
44908 -3664876 -8514664 -15598170 -20091313 -16296024 -8701210 -6965607 -9609631 -4459329
44900 -4459329 11408190 23899860 20656291 7705064 -1070342 -2975489 -4867691 -8339491
44892 -8339491 -8109470 -3046819 1697232 3780043 6269308 10024396 10699922 5406995
44884 5406995 -2586075 -7150960 -4046201 6800451 19956978 27241888 26235211 23428794
44876 23428794 23759398 21263797 8485468 -8139592 -13524404 -4490196 6328988 9326888
44868 9326888 9285786 13333615 18354660 17889591 13380822 10030547 7151148 1032917 -6372754
44859 -6372754 -9480622 -7565603 -4580499 -2085693 1635214 6158014 7781747 4336004
44851 4336004 -1502102 -3625691 2908054 15854002 24382771 19007966 4072455 -6131489
44843 -6131489 -5423028 -1575461 -1181042 155942 5482099 6036776 -4961865 -17216530
44835 -17216530 -16881606 -9210848 -11215373 -24522554 -33012336 -28200941 -19579016 -15674711
44827 -15674711 -11526797 -2450052 4376420 2132569 -3200895 -3062659 240643 606389
44819 606389 445008 4895364 10365697 10197714 6768010 6873752 9242582 7977755 5071700
44810 5071700 7267117 12122011 9932399 211595 -5976988 -2861405 1997201 770226
44802 770226 -3426898 -3969565 -881146 3091851 9519506 19498679 26519450 22560456
44794 22560456 9827061 -338064 -322407 6712921 12640270 13083432 9637139 6352554
44786 6352554 5225830 4277129 231598 -6647401 -11989444 -12238949 -7766838 -30604
44778 -30604 10733848 22160943 27732862 23081446 12670475 5195114 3091382 1851211
44770 1851211 -462330 386043 6559739 12319512 11112015 4650075 -208481 -1207449
44762 -1207449 -1963290 -4780443 -7720457 -8798156 -7854130 -3630520 5482919 15915305
44754 15915305 19519906 13065932 2900537 -3402529 -5923653 -8642478 -10953927 -9088159
44746 -9088159 -3677556 610510 2291411 3999737 6428530 7223089 6325636 6554646 7798858
44737 7798858 6339300 1475973 -2806205 -4667329 -7076157 -11112010 -12605705 -9124280
44729 -9124280 -4858961 -4256057 -5649712 -5775328 -5802729 -7537962 -7935852 -3500855 3114201
44720 3114201 6945896 8347707 10771455 13725338 14659809 15641184 20600473 26767764
44712 26767764 26368342 17428511 6415029 -550691 -2789345 -564653 7419671 18966941
44704 18966941 26202712 22592322 10015528 -3027996 -8693138 -5494908 476351 469366
44696 469366 -7923499 -17810819 -21945726 -21603456 -21616058 -20357324 -12814819 -1691024 4193340
44687 4193340 2850116 863555 886969 -2262010 -9857973 -14034696 -9682745 -2612776
44679 -2612776 185114 231341 1224167 1328149 -866310 -770771 3238349 3046524 -6724103
44670 -6724103 -16214263 -12471888 413821 6332552 242966 -6730635 -5467777 304629
44662 304629 3748170 4544368 4736190 3546376 614069 -1948628 -3561943 -5515830 -6086901
44653 -6086901 -2037651 4085985 5825486 3042016 1638287 1758212 -3206081 -12665616
44645 -12665616 -15724683 -8346418 -2302252 -7747412 -16647319 -15304159 -6071517 -3022493
44637 -3022493 -9909032 -16333095 -15202439 -10882588 -8001661 -4022902 2655167 6994786
44629 6994786 5679293 4053918 8481237 16602352 20911758 18809019 14267568 11701165
44621 11701165 11996577 12959707 10957772 4025165 -4521360 -8045667 -4421150 738170
44613 738170 923337 -4147902 -10514344 -15067020 -15055493 -6924465 8229113 20531463
44605 20531463 19769537 7888438 -3114042 -6215771 -5792751 -7623437 -10039618 -9536062
44597 -9536062 -8851573 -12387885 -17116432 -15879072 -8743173 -3316619 -2675713 -589155
44589 -589155 7598764 15770642 14795071 5746053 -1436822 -1279641 1736925 1650788 -1040299
44580 -1040299 -2459491 -1743937 -723948 -173790 -111488 -1978103 -6810483 -12078574 -13608402
44571 -13608402 -10441549 -5334559 -1203631 110326 -3271207 -11160356 -17777575 -15317734
44563 -15317734 -3528168 7910929 9564541 2048341 -7030306 -12421140 -13270940 -9086761
44555 -9086761 -294693 7885903 9106832 4886581 3590521 7968846 10520727 5937612
44547 5937612 1509406 7141981 19047687 23173840 14257972 1758196 -5020535 -8021097
44539 -8021097 -11983916 -13870137 -9041716 -2321874 -2997742 -10638862 -15007111 -10466589
44531 -10466589 -2310682 2977905 5909335 8812258 9417026 5355260 434431 -84882
44523 -84882 1952133 174357 -5918521 -9431893 -6158471 -706688 453913 -1850426
44515 -1850426 -1560023 3151708 7083563 5405663 325630 -2020671 369983 3195967
44507 3195967 1611595 -4183200 -9870246 -11771586 -9565241 -5611994 -2938726 -3052951
44499 -3052951 -4722650 -5789071 -6679952 -9991130 -15103575 -16115685 -8844240 1600035
44491 1600035 4852055 -2606600 -13222677 -17405942 -13468265 -6942766 -3010292 -2165052
44483 -2165052 -1882649 -224937 2386702 4593550 7139664 12754876 21262618 27093194
44475 27093194 25494275 19682354 16708312 16869910 13560948 4434678 -4359877 -7736697
44467 -7736697 -8562596 -10810843 -12233117 -9501965 -5376386 -4330162 -5151612 -4322569 -3056748
44458 -3056748 -4211283 -5565061 -3453424 -174291 -75022 -1048875 1369624 3751534 -1137811
44449 -1137811 -10651288 -13777000 -7976540 -3640650 -8062528 -14833982 -14339778 -6406319
44441 -6406319 3048139 10423855 13678530 10266922 2388218 -1789905 1269792 4244339
44433 4244339 1115 -6695372 -6273004 1220884 6782080 4599263 -3422839 -12304900
44425 -12304900 -16674333 -12433543 -2614553 2509286 -1350464 -4118963 4385039 16949484
44417 16949484 18306928 8876445 4117495 9740551 13767188 8173487 2949588 9185531
44409 9185531 20520581 23508865 17889045 13635319 13267351 10409014 3847492 284304
44401 284304 2021813 2726357 -1739281 -7223196 -9583773 -11172861 -14399971 -15666954
44393 -15666954 -11745326 -7119829 -8047359 -12327296 -12212750 -6505805 -2713882 -6180602
44385 -6180602 -13184181 -17039709 -15758667 -10703864 -2833432 5174928 7392535 1282164
44377 1282164 -6723953 -8553955 -5545130 -5245910 -8553611 -8724975 -3876667 -860476
44369 -860476 -3394328 -5614367 -2767191 302752 -1783962 -5496550 -6434047 -9092850
44361 -9092850 -17900801 -24833198 -18834561 -3906315 5506957 5254803 4067980 6373253
44353 6373253 7374426 6488942 10029865 16487099 14466272 1674230 -8443965 -6842307
44345 -6842307 -1558749 -860384 1848993 13430989 24078260 20799551 8592969 1935065
44337 1935065 2315226 796426 -2981983 -2198267 642575 -2756177 -8107167 -3027735
44329 -3027735 9283084 10760963 -3077672 -14794744 -12154858 -5200017 -6335883 -10368805
44321 -10368805 -7541906 -2385026 -4300930 -9780710 -9553858 -5740542 -6464231 -9197301
44313 -9197301 -5212739 2968859 4362840 -1508504 -3723169 1105444 3713636 -910448
44305 -910448 -5203775 -2855628 1100042 889423 390198 4674889 9466300 8349648 4546477
44296 4546477 5710888 10621106 10872323 4530185 -1239594 -2017045 -2090022 -5604294 -8955369
44287 -8955369 -7175795 -3108635 -3756692 -9347095 -12535709 -9373711 -5381605 -7426809
44279 -7426809 -13550915 -15871536 -11934359 -7509595 -7341497 -8482077 -5748387 338891
44271 338891 5328920 7829962 9723980 10700242 8131791 2976090 512182 2840471
44263 2840471 4863416 1351943 -4713869 -5282029 1913723 9661416 9683616 2136573 -5391396
44254 -5391396 -7226113 -5466781 -5867417 -9837328 -12909398 -11040218 -5820378 -1908788
44246 -1908788 -1211056 -2002158 -2638594 -3063988 -2836159 -1071266 713555 -972470 -6214029
44237 -6214029 -9501967 -6148467 637316 2754488 -2862767 -10762018 -14244259 -12850693
44229 -12850693 -10416229 -8141766 -3369103 4778328 12035033 13549262 10350396 8467599
44221 8467599 11155794 14380651 12039318 4479210 -1104055 666014 6886095 10282180
44213 10282180 7538079 1252929 -4783205 -8654853 -9094872 -5426056 42998 3282032
44205 3282032 4120898 6924502 13048922 16702705 12921132 6481765 6658463 14447694
44197 14447694 21702076 22967170 20876088 18091113 11895239 1664822 -4800584 219661
44189 219661 12582609 19871683 15834761 5777120 -1937831 -4690593 -5549745 -8478164
44181 -8478164 -14375638 -19565643 -18870943 -12311325 -6440443 -5653124 -5256643 1431225 11630358
44172 11630358 15936282 11897403 7095827 7689765 11290449 13387901 13648154 12467959
44164 12467959 8095180 1850958 260205 6167926 12374879 10682918 4169490 3319377
44156 3319377 10791840 16799869 11504450 -2446795 -12995909 -12993077 -8423215 -10297860
44148 -10297860 -19377745 -23798521 -14966715 -636786 5184887 1945631 1356242 6791883
44140 6791883 7468569 -1754892 -8306252 -275928 13329558 14543026 2685034 -6234547
44132 -6234547 -4222722 -362880 -3203343 -7645154 -5174427 2565989 7438879 6403399
44124 6403399 3830016 5315220 12145654 19251119 18130596 5949308 -8407673 -12731795
44116 -12731795 -5764389 3146155 7976751 11093169 13686223 11500487 3967928 -1973261
44108 -1973261 -2724536 -3933512 -8944913 -10000553 42933 14046755 19057437 14027968
44100 14027968 8550518 6733866 3523609 -3214485 -7818226 -6610948 -3894757 -4368911
44092 -4368911 -6040526 -4713112 -748790 2554867 4046292 4765145 4893161 3174395
44084 3174395 -1503317 -8726471 -15592648 -17539231 -12409807 -3601027 2994802 4806263
44076 4806263 3448150 1362704 593552 2990582 7356660 7970417 1331339 -6489458
44068 -6489458 -5607419 4105600 11836983 9892777 2414604 -2532855 -2906739 -749829
44060 -749829 3350321 8333254 10287552 8184458 7794584 13132328 17681814 12389681
44052 12389681 482625 -4825508 1928173 11588883 13761711 9192013 4449200 1159074
44044 1159074 -2752137 -5402759 -2581178 3621265 4922370 -2129182 -10092497 -9401087
44036 -9401087 -946713 4389812 -598399 -9666771 -10183362 985880 12855992 13566797
44028 13566797 4775975 -1460631 1416690 7199778 6456006 -1728789 -10415371 -13674933
44020 -13674933 -11372825 -7320300 -5795289 -8423500 -12080411 -11587715 -6645229 -3533240
44012 -3533240 -6902378 -12633688 -13148346 -7720453 -2348716 -471625 462831 2909297
44004 2909297 5278496 5555066 4256882 2225893 -241705 -694159 4028813 11274669
43996 11274669 12679089 4734859 -4823513 -5888227 1573835 8662205 9177860 5174277
43988 5174277 1499333 -569133 -2976429 -6585970 -8645776 -5039789 3556807 8519866
43980 8519866 753421 -16767360 -28791037 -24308320 -9525084 597948 346982 -3442245
43972 -3442245 -3601612 -451446 2521283 3525369 1490316 -3497150 -6751770 -2036107
43964 -2036107 8870105 15060165 9165934 -2871246 -9085463 -5471683 1945886 6805277
43956 6805277 8724938 9885677 10099881 7798802 3921264 2074585 4296907 8071951
43948 8071951 9159627 7035242 5083494 4729525 2980153 -1344466 -2710128 3998480
43940 3998480 13165877 12685136 -43535 -13029516 -13984589 -4288951 5646817 10240176
43932 10240176 11877176 12824629 11144343 5779306 604975 366401 4581096 8030485
43924 8030485 7077379 3719346 2412252 3995414 5241834 4869746 6460572 12395305
43916 12395305 17815148 15698477 6830614 -883377 -3020700 -2331503 -649261 5649550
43908 5649550 17884232 28479753 28315769 18139599 7480949 3360650 4162968 4233052
43900 4233052 1335568 -1067089 1724135 8531193 11140348 3657222 -8204902 -12913137
43892 -12913137 -8059349 -2030885 275543 3320626 8222305 5724275 -8714678 -22274745
43884 -22274745 -20103323 -7204064 -804417 -4474323 -5705905 932396 5136484 -212297
43876 -212297 -6916676 -6373396 -3940008 -8108544 -14995949 -14975104 -8103299 -1969874 830513
43867 830513 2403040 1121369 -4733144 -7560527 2397095 19986428 27569160 17634010
43859 17634010 2246092 -4353577 -2327723 643220 3075614 7357133 10648645 8791366
43851 8791366 5707238 8552376 15136019 16450144 11785681 10692239 17350414 23158694
43843 23158694 19904313 11494203 5739672 1884402 -5016887 -12498510 -13131758 -6137303
43835 -6137303 2084431 7301159 8977126 4447624 -8241715 -21651570 -23868219 -14455954
43827 -14455954 -5624353 -4450341 -4302503 1366841 7479150 7077155 3429230 3376120 5924113
43818 5924113 6784403 7667775 10971917 11236821 3304852 -5789317 -5537486 759985 675422
43809 675422 -7198868 -11920664 -9212419 -7065809 -9525827 -9326871 -2229392 4357293
43801 4357293 4423880 3575517 7662438 11260387 7311981 55407 -2258486 -1297682 -4334756
43792 -4334756 -10192124 -10517321 -3654695 2210007 236317 -7380262 -13226682 -11855294
43784 -11855294 -4415008 580119 -5421475 -18900366 -24562596 -13645413 3275648 9252538
43776 9252538 1931224 -7216473 -10198217 -8310216 -3527945 3429394 6323241 -2641019
43768 -2641019 -18632447 -24801712 -12489542 7255461 17590153 14515842 6554162 2043144
43760 2043144 2721558 5794480 6967135 3678344 -1524277 -3301067 -673693 2002557
43752 2002557 2127410 1312647 -652109 -6877764 -15030298 -15926002 -6415373 3211139 1973846
43743 1973846 -7420365 -14940429 -18311122 -21455990 -21948546 -13079004 1112559 5771832
43735 5771832 -4834677 -17220168 -15559163 -1853372 8404319 6232014 -3204289 -10829536
43727 -10829536 -13397272 -12171681 -8746891 -5479934 -5850695 -10392389 -14212238 -12199103
43719 -12199103 -6104157 -3048689 -6308504 -10614182 -8780559 -1095471 5100833 5005059
43711 5005059 2164583 2943758 7379260 8694207 2226243 -7604312 -11598861 -7075777
43703 -7075777 -2225648 -6219815 -15912631 -17757793 -5866591 7164074 4538547 -12073223
43695 -12073223 -23511771 -18050873 -5370767 -473457 -2989536 -1992855 4792442 8839734
43687 8839734 6341074 3869669 6223991 8632659 5459598 -961144 -4849583 -4129233
43679 -4129233 1063425 10525768 19713902 19822580 8714756 -3300042 -5525779 -411168
43671 -411168 2167658 -129050 -1708843 -847076 -1920167 -6127628 -9328264 -10196585 -11807897
43662 -11807897 -13436506 -9893660 -2278650 -347199 -8709248 -18224822 -17898252 -9534563
43654 -9534563 -3281477 -2954719 -3630260 -1415397 1987589 4042822 4592730 4030488 3004764
43645 3004764 4126671 9876365 18456848 24825962 25786830 21841712 15341096 9380418
43637 9380418 6565180 5847968 2998075 -2452011 -4153576 2390874 11698832 15320124
43629 15320124 13995952 14766593 17785098 15765672 7233060 201511 -681921 -1438372
43621 -1438372 -7815420 -14699966 -13410220 -4373662 4391542 8146158 8758875 9664918
43613 9664918 12743460 17997886 21679533 17361132 4097906 -8688679 -10153611 -747250
43605 -747250 9004138 11200843 6717901 -323333 -7656569 -13104441 -13319760 -7508007
43597 -7508007 422073 5830510 7882160 8795097 10039845 10581506 8458733 3762212
43589 3762212 -144428 353547 4393297 6987504 5307352 2054282 668001 390686
43581 390686 -550202 29856 4872049 10353178 8717837 -2088982 -15290033 -23131485
43573 -23131485 -24261534 -22100559 -19293561 -15921188 -11407290 -6380374 -2731748 -1662945
43565 -1662945 -1533037 589535 4185163 4720051 -122184 -6719958 -10929347 -13540749
43557 -13540749 -16152663 -15814346 -10121987 -4109555 -3851679 -5466216 -296489 9421193
43549 9421193 11317702 1686588 -7930069 -8274036 -5744598 -9894123 -16402958 -13714999
43541 -13714999 -1747644 7556774 7145456 2534226 2013276 7222993 14849384 20981969
43533 20981969 21930968 16148799 7305025 1464609 311544 902252 1799793 4326512
43525 4326512 7566652 8209201 6918479 8860016 15138721 19244423 15810897 8189729
43517 8189729 2845277 309443 -2869226 -6238555 -5996126 -2443739 -648442 -3041998
43509 -3041998 -6872364 -10378656 -15748007 -22737877 -24693929 -16738796 -5052695 -1013337
43501 -1013337 -6065501 -9209404 -2070402 9427106 13189774 6704389 -1434923 -3914807
43493 -3914807 -2128715 -871979 -1623758 -3349414 -5527489 -7626180 -8667637 -9377594
43485 -9377594 -11604149 -13681784 -10169483 857584 13561538 20699126 21403937 19399587
43477 19399587 16561727 12313106 6947602 1412208 -4097324 -7648908 -4953921 3708114
43469 3708114 9333108 4002668 -7034138 -10930957 -4447260 2693239 2620236 -1186903
43461 -1186903 -2254730 -850974 -373014 -410385 940502 2744967 4582680 9629984 18598517
43452 18598517 24801522 21899641 13410191 7667710 6010647 3677300 654250 2482927
43444 2482927 9369329 13329366 9653995 4169581 4413352 8904687 10401935 6083430
43436 6083430 -735638 -6461500 -9690554 -9424626 -5705427 -1302436 1495453 4839186
43428 4839186 11188144 15930448 10796609 -3544189 -15074594 -15154364 -10021650 -10686190
43420 -10686190 -15230835 -10898528 5789083 20978630 20482206 7522449 -3446288 -5549018
43412 -5549018 -3561424 -1779191 1981483 8255527 10385818 2620906 -10544606 -18123998
43404 -18123998 -14005029 -1699437 10218937 14763081 10547535 2175134 -3780203 -4485940
43396 -4485940 -2049976 458448 1687757 1037397 -1161386 -1985601 1335949 6289643
43388 6289643 7664082 6110588 7478867 11501855 9447818 -2031315 -13064648 -14139695
43380 -14139695 -10075800 -10635325 -13367376 -8200401 4065726 11226071 7749247 1163145
43372 1163145 -1280529 -956236 -461871 1007735 1653382 -2515175 -7381377 -2520568 11318169
43363 11318169 18643514 10785731 -557124 -1002563 6112071 8910802 7133044 8814037
43355 8814037 13429560 13628934 10053053 9448510 10122331 4555828 -3800450 -2213356 10375486
43346 10375486 19298524 16047198 10249302 12652873 18433568 16686294 7222081 -1692001
43338 -1692001 -5654204 -5606875 -2484763 1857395 3130993 801970 706462 5001725 5813593
43329 5813593 -2696149 -11753220 -8158767 6035088 15005443 9919815 -1511087 -7373321
43321 -7373321 -5091992 -443976 451085 -4105637 -9920296 -9281082 769875 12855171
43313 12855171 17172530 14114360 12341312 14799408 15279097 10667265 7371163 10535789
43305 10535789 14395417 10374152 26593 -7245497 -6708046 -2025237 1949962 3821803
43297 3821803 3309428 94613 -3623863 -3821998 117163 3822013 3287880 -611710 -4640262
43288 -4640262 -7906792 -11587961 -15282652 -16583711 -14542830 -11358875 -9639729 -9446483
43280 -9446483 -9155981 -7944909 -5937603 -3170800 -649387 -1413951 -7201199 -13995153
43272 -13995153 -15014154 -9816888 -6389027 -10808639 -18029505 -17685381 -7663399 2914579
43264 2914579 4366659 -3743024 -13814875 -17752342 -12813751 -3404191 1864043 -2349893
43256 -2349893 -12439675 -19531397 -18898556 -13409074 -8215399 -5636929 -5486722 -6475487
43248 -6475487 -6158006 -2812321 1702145 4006014 4033976 3691254 1351448 -5684298 -12354057
43239 -12354057 -8049155 8021877 21725227 21132022 12038197 7771811 9309899 6994863
43231 6994863 -848391 -4447009 465654 4600414 -501532 -9712905 -13139545 -10493373
43223 -10493373 -8641358 -9734579 -10081227 -8232315 -6603070 -6043696 -4995172 -3305312
43215 -3305312 -1597137 1662709 6587265 7213491 -1811869 -14062303 -15539145 -2462382
43207 -2462382 12913482 17946494 13844108 9346631 7201815 4356838 868957 -63367
43199 -63367 671290 -1428078 -6543784 -9139878 -5246887 3250078 11407796 14341120 9174314
43190 9174314 -893848 -6338472 -1651626 5796829 5300607 -320456 1566824 11836996
43182 11836996 15132695 2901878 -11613648 -11560139 63475 7615008 6676030 6476061
43174 6476061 11591266 15733797 14433597 11116263 8098691 2865896 -3411261 -4431884
43166 -4431884 -263926 -93557 -7693119 -13455024 -8134609 3338187 9840207 9412856
43158 9412856 8079057 8399319 8264886 7774870 8548540 8220334 3787409 -1032418 50947
43149 50947 5094008 5638031 -64283 -3690277 748170 7969900 8772278 1689307 -6614524
43140 -6614524 -9999818 -8850053 -8406524 -12345852 -17615458 -16853037 -7736328 2363378
43132 2363378 4767015 533542 -1954114 774806 3683359 2170772 -1848029 -4710801
43124 -4710801 -6092341 -6405041 -3843032 2485692 9569199 13228708 11531680 4712927
43116 4712927 -4625933 -10753437 -9423344 -4563545 -4407694 -8925641 -8284139 2268714
43108 2268714 13613774 15243121 9911505 7581285 9884695 10366872 7147527 4811470
43100 4811470 4371167 1631823 -3218554 -3978120 989339 5232707 4760077 4054281 7317158
43091 7317158 11371886 12475830 12986234 15039509 14422993 8383686 3515234 6482971
43083 6482971 11276826 6679761 -5264681 -9895621 -745355 10806785 11130553 1424506
43075 1424506 -6461694 -5337817 2196142 9776961 12330318 7402910 -2819228 -11044113
43067 -11044113 -10367332 -862278 10843112 17789589 17381805 11796671 5691334 2336801
43059 2336801 950119 -652184 -1005721 3424514 10530929 11800818 3096108 -8085648
43051 -8085648 -11303812 -6368436 -2395419 -5279671 -11564744 -14426181 -10971840 -3210718
43043 -3210718 4482398 8329832 8014242 6162506 3499831 -2547940 -11371769 -15624697
43035 -15624697 -10172837 -1349732 543729 -3734947 -3883522 3276627 8713099 5857866
43027 5857866 837447 1996927 6534620 5477438 -2048541 -7355510 -4176603 3627393
43019 3627393 7102603 1880547 -7811116 -13763830 -12409313 -7894528 -5062218 -2319366
43011 -2319366 3423660 7340062 1119150 -12544854 -19895893 -14320601 -5161030 -2731432
43003 -2731432 -3884377 -609891 5236356 6300765 3185967 2539943 5237786 6975699
42995 6975699 7815026 10278345 10118593 1110497 -11092137 -12422656 -143786 12386125
42987 12386125 14574308 11285738 10972899 11354352 5700109 -3545237 -7465763 -4304563
42979 -4304563 -1692418 -4954360 -9656101 -8239352 -700641 4689960 1656268 -5412125
42971 -5412125 -6402371 968285 7920804 7852837 6310444 10873276 16812994 13668378 3518862
42962 3518862 -251069 6207233 10613680 3743489 -6432435 -7489117 -153454 6074899
42954 6074899 8200511 10615279 14385608 15120502 10949947 5851671 4523840 7619023
42946 7619023 11517591 11018848 4535570 -2480069 -3522344 -1025998 -3619352 -11849404
42938 -11849404 -15893947 -11542920 -7803368 -11320972 -14165917 -8137715 -1492022 -6588746
42930 -6588746 -17381011 -16537864 -2989182 5398581 -949111 -9976688 -8149166 87708
42922 87708 2278804 -2775111 -6272884 -4128042 -833097 -932979 -3610286 -5076486 -2455978
42913 -2455978 3515148 7760369 5608529 -220168 -1478278 4667239 11337729 11712125
42905 11712125 8358290 8442595 13198412 16924901 14416715 5485419 -6271576 -15742578
42897 -15742578 -18565663 -14275580 -7024837 -1736674 -156998 -846054 -951653 2374974
42889 2374974 9469395 16197094 17415561 13351412 9618682 10162587 13476288 16516216
42881 16516216 18562625 20093718 21498600 23716182 26275040 24709231 15381623 3324993
42873 3324993 -1612541 1792109 4074752 -632413 -6579789 -7382080 -6340187 -8583295
42865 -8583295 -10660926 -7253144 -2250329 -2760816 -6520618 -6460045 -4648173 -9139951 -17839069
42856 -17839069 -18950956 -9773129 -2135691 -4106004 -7962791 -3894078 4184456 6193893
42848 6193893 2192430 324043 2647549 4083745 4020808 7821061 14947930 15604628 4376841
42839 4376841 -9601422 -12591814 -2969039 7657933 8395947 -671894 -11332211 -15690180
42831 -15690180 -11487615 -3111747 1585253 -1215914 -6047894 -4032779 4970567 11220319
42823 11220319 9036399 5918432 11247417 20323411 19307136 5430557 -8017623 -9787853
42815 -9787853 -4348089 -2038161 -3868077 -4295180 -3325699 -6089011 -12789947 -18003004
42807 -18003004 -19173260 -17904858 -13442354 -3501631 7603423 10537623 3626214 -3555327
42799 -3555327 -3108625 1219932 1522663 -2511237 -4768081 -1685113 5101543 12371056
42791 12371056 17366945 18626621 18109826 19717222 22902281 21835129 14536226 7818667
42783 7818667 7563948 8713851 2505827 -9292687 -15944832 -12575861 -4948688 907216
42775 907216 4977980 7006681 2950875 -7107360 -14310300 -10909386 -783379 5947521
42767 5947521 5943947 4442696 6084594 10180362 14742189 19331678 22424004 20425251 12000941
42758 12000941 1228346 -5769626 -6812451 -5352539 -6121424 -9129330 -9004148 -2293272
42750 -2293272 5473953 4726030 -4731139 -11305941 -7281263 -1002327 -5278902 -17541840
42742 -17541840 -22627129 -15087809 -6539303 -6925464 -10086901 -5666433 4103478 9893789
42734 9893789 10943434 13413594 16830751 14775170 8422154 6966653 12398780 15230771
42726 15230771 9572197 2216145 785600 1858981 -1313647 -6307360 -5857913 -470714
42718 -470714 2251237 -935090 -5728820 -7756531 -6746717 -3744434 -122939 815905
42710 815905 -3020399 -7423410 -5314317 3665926 11620486 11958961 6848552 3550985
42702 3550985 5997965 11427910 14037852 11565744 8444859 10452361 15471960 13951063
42694 13951063 1963942 -10820259 -12179976 -3139642 4275571 3144909 -1938819 -3630956
42686 -3630956 631820 9627770 19029302 20837238 10593415 -3625881 -8056752 -887391
42678 -887391 6118783 5971099 5484101 10837530 15200537 9496588 -2846034 -11450634
42670 -11450634 -12782347 -8982625 614782 15463801 25907365 22030931 9052334 2170963
42662 2170963 5974111 10100021 6502348 -429271 -4379314 -7142940 -12372306 -17412634
42654 -17412634 -17974466 -15234485 -12162172 -7407970 810201 7979773 7198644 -815740
42646 -815740 -6921853 -3919683 5184109 10699850 7084537 -961857 -4190504 -219504
42638 -219504 3703702 1164829 -4050873 -3803454 2096728 6398773 6270700 6336258 8137508
42629 8137508 5084920 -6988288 -20515873 -24249535 -17612212 -10922789 -12262463 -18862046
42621 -18862046 -21811281 -16228480 -5982026 475410 -1382541 -8167813 -13662450 -15840431
42613 -15840431 -15849134 -12316023 -2737282 9342600 15300304 12030640 5984936 3856505
42605 3856505 4720297 4735111 3928585 3612922 1866678 -2976462 -7752547 -8426299 -6066437
42596 -6066437 -4784774 -6346096 -10138316 -15058523 -18130798 -15478121 -8413056 -3915031
42588 -3915031 -5133517 -7016855 -5992989 -7076805 -14650393 -23060754 -24897528 -22331026
42580 -22331026 -20553170 -16488188 -6340957 1042878 -6351571 -22903882 -29943376 -21956991
42572 -21956991 -12460503 -10805456 -9363518 -167899 10607974 14030254 12215387 10950605
42564 10950605 8752762 3352181 -37590 2517085 4648587 224903 -4464369 -673734
42556 -673734 6961824 7035563 -789762 -6960292 -7532318 -6137589 -3379441 2693996 7276858
42547 7276858 3669100 -2690669 816167 13128301 17789353 6546061 -8351759 -11848147
42539 -11848147 -4644232 3707319 10274788 17651344 24274103 25653565 21775465 15988411
42531 15988411 9674361 3930373 2605314 7087766 11137907 7380556 -3012695 -12373686
42523 -12373686 -15956648 -14357537 -9299206 -2669085 2208945 3731456 4855248 8054744
42515 8054744 9814751 5704756 -1301884 -4158360 -2133596 -769070 -1478703 1270196
42507 1270196 10221233 19287543 21223614 17149699 14196761 15789793 17973146 15042288
42499 15042288 6393051 -3044009 -8439833 -9819416 -10036817 -9213698 -4707732 2842900
42491 2842900 8162320 8763804 9060443 12642458 14982153 10327325 2482061 570599
42483 570599 5460283 8999912 6797584 2624122 -1422420 -9030331 -19410174 -22322247
42475 -22322247 -11160425 5325904 13064235 10762710 9507199 15900446 23797016 23750067
42467 23750067 14452813 2736559 -3998451 -3928877 -1857227 -4429310 -12407286 -18817527
42459 -18817527 -17297677 -10362255 -5614473 -5506617 -5732990 -2875344 1834165 6477573
42451 6477573 10463597 11384025 5585521 -5449291 -14055025 -15072959 -11828122 -10081400
42443 -10081400 -9727765 -6932513 -1834803 1138056 -93706 -2825258 -3932561 -2942328
42435 -2942328 -409905 2954323 4461538 701106 -6660901 -9294868 -668477 14488274
42427 14488274 23247873 18249750 5238201 -5123000 -9586132 -12277404 -14666802 -12714456
42419 -12714456 -5834711 -1675964 -6096961 -12683160 -9987387 2093778 11392822 10351061
42411 10351061 5959333 8622969 17333994 22136122 17763499 8345246 -48851 -5655505
42403 -5655505 -9618464 -12948149 -15859822 -17374987 -15686451 -11455494 -9504597 -13456934
42395 -13456934 -19542563 -20214479 -13870300 -6438445 -3005755 -2761628 -3049762 -3011554 -1490133
42386 -1490133 2895629 6691799 2675081 -9277052 -17700624 -12386199 1866705 11216113
42378 11216113 9961571 4266103 292636 -2503271 -5226265 -5399308 -2515360 -761169
42370 -761169 -1923031 -1718191 1825710 2289518 -6022074 -17272639 -20381460 -13863101
42362 -13863101 -6431735 -3746561 -2849450 -444265 1840068 3206909 6706334 11772525
42354 11772525 10691737 -712335 -13528602 -14448328 -1932825 12722007 18821751 14358090
42346 14358090 2308210 -12837563 -23661729 -22872966 -11729614 -250734 4375238
42339 4375238 4908995 6521156 7961567 5621968 1639985 776555 1698170 -1153351 -7589885
42330 -7589885 -10794213 -7372870 -1673875 2103864 6042373 13143342 20557560 22606555
42322 22606555 17833947 9554426 1734827 -2836925 -3241246 -2632313 -6581446 -15042338
42314 -15042338 -19257576 -12533628 -1825442 -1031925 -12515121 -23037044 -20809617 -9652042
42306 -9652042 -1433363 -228161 -1058243 -1139457 -3785845 -10367508 -15872258 -16119572 -14138402
42297 -14138402 -14346829 -13866747 -6252732 6732617 14212069 9937051 1176756 -1380413
42289 -1380413 1504826 361042 -6918816 -11022934 -5799845 1849100 2657168 -1310772
42281 -1310772 -1855645 1437040 2568836 1703681 4591843 9106880 5217163 -7292969
42273 -7292969 -13484688 -4049050 8735841 7383426 -5298450 -10589022 -994268 10825701
42265 10825701 11647347 3815699 -2646582 -3917635 -1835594 3164303 10951678 17521271
42257 17521271 18674891 16259158 15841111 19056570 21802400 19472059 11766674 3073513
42249 3073513 -863358 1800508 6563709 7611311 5025287 3231575 2672873 -892436
42241 -892436 -7446056 -10351078 -6722346 -3095854 -5025239 -7542523 -3694702 2812294
42233 2812294 3180379 -1563816 -2091229 3517750 6860934 4025681 2336040 7271610
42225 7271610 12126716 8473173 333534 -1162547 6078547 13129465 13222136 8651994
42217 8651994 3581853 -1976297 -7252515 -6600458 2784233 12350293 9764994 -4043839
42209 -4043839 -13037668 -5709214 9230471 14128011 6254532 606005 7340575 16411555
42201 16411555 11677129 -5963010 -19121438 -16328025 -5195922 -867696 -7454728 -15397128
42193 -15397128 -14866770 -7560317 -3765241 -8886594 -15948010 -14606278 -5978127 -2153162
42185 -2153162 -9160800 -17672512 -16098640 -6856800 -1630754 -4454678 -8810147 -9756864
42177 -9756864 -9267053 -9154740 -7784508 -5550229 -5602236 -7102948 -5349730 -612284 1085409
42168 1085409 -1490050 -1812751 3289885 7983308 7692263 6958464 10841271 15451260 14284257
42159 14284257 8776045 5417321 6103380 7631577 7825164 6903118 5324244 3961050
42151 3961050 3213710 -120873 -9561428 -20407464 -22500981 -15210059 -10037373 -12582555
42143 -12582555 -12986223 -3288203 6989707 5394744 -2806112 -4009035 886265 750526
42135 750526 -3052146 1854548 14495994 17791055 5269903 -7159061 -4419514 7314418
42127 7314418 13241931 11261826 9619591 11255991 11246560 5905697 -2998665 -10426946 -10764420
42118 -10764420 -2825604 5561386 4484523 -4322471 -8820624 -4341341 166877 -2113507
42110 -2113507 -5259589 -2894974 -13442 -2642294 -5062822 918533 10775543 13384352
42102 13384352 7538296 804185 -4192946 -10354905 -15282513 -12031917 -1094415 8442439
42094 8442439 10838769 8724309 5897175 3093814 1581047 3475887 7213383 8624834
42086 8624834 6967416 4709939 2279792 -1235395 -3698937 -2715583 -1235924 -3495123
42078 -3495123 -7089649 -6566270 -2993128 -1494913 -1080000 3097117 8159514 5642534
42070 5642534 -3379367 -6907166 423721 8805197 7549268 -886866 -6974303 -6831504
42062 -6831504 -3115115 557653 890882 -3639174 -8235585 -4981613 5050275 10131039
42054 10131039 3897465 -4305235 -2260211 8413676 16644867 17631959 14934137 10671936
42046 10671936 3806639 -2919624 -3781171 966158 4215700 1967316 -1536350 -796414
42038 -796414 3043516 3793826 -2179037 -11325344 -15795034 -11748725 -4250634 -726192
42030 -726192 -113913 5075890 14417462 16381424 5380102 -6752346 -6095405 3092158
42022 3092158 5608124 -1265119 -5725422 -2250063 530540 -3685577 -8264400 -6351485
42014 -6351485 -2831157 -4824908 -9110091 -8759308 -5711658 -6448578 -9619951 -8428199
42006 -8428199 -2971648 -26897 -911160 875630 8226435 14672882 13078503 4330966
41998 4330966 -5276160 -10568377 -9239095 -1896245 6720417 10314371 7683915 3993531
41990 3993531 3388322 3593141 338414 -5872044 -10441460 -10041804 -4724554 3332925 10533215
41981 10533215 12971834 9653962 3908259 -56019 -840646 894718 4308740 7391791
41973 7391791 6820392 1989332 -2844960 -3812172 -2804836 -3686659 -5281072 -3629781 -184012
41964 -184012 -897072 -6021017 -7989235 -3146621 921683 -3851111 -12374381 -12024399 -1013831
41955 -1013831 7715869 3885083 -6201279 -9049760 -2531871 3057341 1422322 -1064194
41947 -1064194 3566972 12295944 16137145 13374175 9471328 5542240 -2893335 -13297373
41939 -13297373 -12892432 4208814 24013322 27326047 13969165 1260404 -676909 362531
41931 362531 -4597954 -10941968 -10231626 -5065452 -3473648 -4435174 -791329 5966577 5956834
41922 5956834 -3033468 -10682826 -9030928 -3228034 -2143830 -5539893 -7166341 -5383241
41914 -5383241 -3473431 -2503993 -939734 90417 -2344840 -7171572 -10179336 -10844380
41906 -10844380 -12579070 -15529722 -15362282 -11316447 -9263358 -12890049 -17251601 -16370102
41898 -16370102 -12813839 -13021673 -16195112 -16024695 -12549168 -13195083 -20023393 -24648296
41890 -24648296 -20469153 -12610893 -9284422 -9168059 -5349008 2295379 7800902 10260164
41882 10260164 14594293 20755872 21675666 14883753 7955186 7898556 11680248 12330050 9020546
41873 9020546 5519205 2909669 -181739 -2825580 -2693426 -149102 2717662 5465911
41865 5465911 8273665 9743233 9048699 7701551 6153059 2395380 -2315875 -1418557
41857 -1418557 7200254 14079002 9191099 -2715172 -7325157 -668203 6197856 4223307
41849 4223307 -1635719 -2089383 2661029 5412468 3549559 1359156 2502269 5430462
41841 5430462 6298159 3357287 -1752824 -5653612 -6391920 -5302608 -4867512 -5299158 -5226935
41832 -5226935 -4938079 -5751075 -6519341 -4633196 -747829 1780208 2954570 6695839 13266486
41823 13266486 16094216 10074582 -316168 -5751292 -3429966 323024 -1166417 -6617814
41815 -6617814 -8677195 -3190474 4927942 6626803 -414609 -8562342 -9824970 -5568038
41807 -5568038 -2604781 -2328535 -272624 3952295 3865157 -3963485 -13096367 -14538177 -7336747
41798 -7336747 1515468 5023339 1450621 -5436360 -8783598 -3969632 6095747 13416647
41790 13416647 14352907 13384212 15398975 18146086 15999040 8598925 1836398 1174464
41782 1174464 6412078 12156784 12131991 4571103 -5528871 -11167146 -10782976 -8704823
41774 -8704823 -8316578 -8283417 -6004383 -960619 6094449 13399388 17264715 15320191 10807002
41765 10807002 8541333 7187044 2557663 -1839258 2561600 14250198 20375656 15398048
41757 15398048 9496154 10899832 11449112 962781 -13686058 -17927957 -11518558 -6231493
41749 -6231493 -5429336 -1798941 5429170 7133433 805689 -4158553 -2446094 -1064689
41741 -1064689 -5292452 -8407606 -4052723 1002665 -3040862 -12642701 -15415937 -7758231
41733 -7758231 1685866 5202282 4301693 4012572 5565811 7139970 7740431 7749187 7372740
41724 7372740 6072497 3145807 -1166578 -4974597 -6233556 -5627161 -6440227 -10199306
41716 -10199306 -13725024 -12377695 -5751733 1571747 5185214 5449235 5894051 7622503
41708 7622503 7462665 3157492 -1625076 -1164154 3812745 6256080 2878136 -921047
41700 -921047 538698 4466970 3966036 -2289428 -9767749 -14574071 -15092224 -10317594 -2780504
41691 -2780504 -292683 -7262275 -15996433 -14914625 -4910718 1204935 -3587719 -12277365
41683 -12277365 -15527549 -12787345 -7750949 -905140 7515771 13331198 13721584 12763369
41675 12763369 15842534 21307275 22682388 17205168 8216274 997478 -618255 3996827
41667 3996827 10480202 11722265 5307477 -2987564 -5755547 -1938909 4164333 9210369
41659 9210369 12929041 15947263 18723394 21461200 22696538 19340514 10470244 218161
41651 218161 -4845298 -1073373 9118195 17953984 17596853 8439325 1218392 5881929
41643 5881929 18557012 25655363 21443236 13991458 11420425 10832690 6219559 -100192
41635 -100192 -1402996 3063658 8952616 14236295 18600494 18816378 12563494 4907456
41627 4907456 3365722 7365265 9362161 5642148 -668705 -6527156 -11459411 -12903924
41619 -12903924 -6864495 4648882 13361501 14730010 12850158 12667866 12520068 8176360
41611 8176360 260750 -6645000 -10008753 -10830810 -10451132 -8863377 -5776213 -1422197
41603 -1422197 3542914 7958410 10244969 9106881 4289363 -2563618 -7347373 -5669465
41595 -5669465 2390015 11111682 15224578 15796551 17055669 19041933 18086542 14066422
41587 14066422 11383407 11082810 7634233 -2451870 -12787895 -13433025 -3968172 4784099
41579 4784099 3175178 -6640314 -14364375 -13380834 -6277297 92338 1505901 -2191988
41571 -2191988 -8852921 -14490942 -14589464 -9075282 -4784764 -8083927 -15025972 -14538895 -3070673
41562 -3070673 9937171 14607761 12699180 11674431 12100992 9103336 3567887 2550494
41554 2550494 7935185 12853997 11809318 7772022 6227235 7772097 10003376 11942993
41546 11942993 12944104 11259893 7375532 5295143 7018658 8981884 7397194 3824208
41538 3824208 1762755 1037118 -248950 -1249273 -456452 574091 460101 2026359 7309370
41529 7309370 11240638 7544407 -495950 -3110874 2259563 8593712 11233698 12777799
41521 12777799 13784303 9477107 1338203 1050660 13235224 23364352 16121801 34017
41513 34017 -2038259 14278991 28403718 24864014 13586004 11259045 16178783 15301116
41505 15301116 7622821 4479205 9172738 11572887 5378839 -1772437 -908410 4791235
41497 4791235 6217411 2262609 -56373 2909894 6561722 5373260 567764 -2019225
41489 -2019225 19065 2679041 1502393 -1732466 -1386680 3590984 7912190 7839681 6144665
41480 6144665 6466572 7484023 6900854 6799169 9576580 12388455 11859675 10743553 12639981
41471 12639981 13454447 7064636 -2587452 -5163222 598576 5341972 4072530 2315636
41463 2315636 4961891 9128118 11540755 13225717 13010110 6636982 -2775343 -4264547
41455 -4264547 4270841 9577920 1889627 -9683338 -11054890 -3715252 805418 117370
41447 117370 1073410 4972537 6304947 4436035 4000482 4492141 1431169 -2482427 221816
41438 221816 7379459 7950274 23772 -4347651 2565990 12189210 13071988 7280007 4819759
41429 4819759 7873200 9501579 5173147 -1859397 -5935832 -4630134 686052 6423159
41421 6423159 9052330 7812761 4752617 1585173 -1657527 -4272857 -3810866 1228469
41413 1228469 9345621 17331954 21852143 19994939 11197044 -704983 -9632380 -11988945
41405 -11988945 -7989999 108425 8276741 11260784 7488794 2571866 3191336 8079349
41397 8079349 10072480 6552222 1948300 -290617 -1686661 -3356158 -3100384 -323688
41389 -323688 1908248 2598692 5240801 11201547 15631281 13855047 7890956 3014579
41381 3014579 1387080 2306583 4963420 7277631 5533111 -729473 -6147932 -5584716
41373 -5584716 -392454 4478946 6723827 6502674 3201089 -2888041 -7640444 -6832866
41365 -6832866 -2174210 542095 -914267 -3110599 -2676278 -820709 -1228092 -5519729
41357 -5519729 -11480750 -14687521 -12155699 -5441037 761995 4266564 7793584 13398989
41349 13398989 16710769 11501244 101275 -6225320 -511365 10149624 12921205 5334067
41341 5334067 -2806563 -3490677 619007 4120765 8043128 14233626 16601526 8549811
41333 8549811 -3188970 -4530219 4506030 7176693 -5409204 -19242644 -16937539 -2835202
41325 -2835202 4494422 -628299 -5778445 -1478007 5908297 5600667 -2798171 -10115467
41317 -10115467 -7585383 5862206 21632170 27083308 18448546 6689244 4370273 9695228
41309 9695228 12033369 9852745 10994738 16026275 15561691 7192014 1448183 5055099
41301 5055099 10354167 8917837 4970245 6245240 10427670 10733468 8253983 8701746
41293 8701746 11877549 14025917 16673547 23176728 28775086 24211698 9986961 -1037450
41285 -1037450 2074146 15999902 27193989 25866122 14826575 5377170 4969105 10103802
41277 10103802 12698498 10608480 7491123 5021539 2471622 2707188 9578318 18722035
41269 18722035 20585207 14617448 10637349 13530849 17568509 19611524 25278077 35462965
41261 35462965 39707690 32704102 25800547 30296795 39388739 40301020 36009785 39388042
41253 39388042 51028053 58875615 57840533 54723306 53413372 49065115 39542002 31017825
41245 31017825 28060612 26446272 19731590 7909623 -2306125 -2903550 7899068 20133217
41237 20133217 18924621 2680981 -11252137 -6910248 10153818 22329103 23213793 19567092
41229 19567092 15453119 9008604 2740722 2475591 6159568 6982447 7315403 15508670
41221 15508670 28523348 33117748 26689020 21348067 22943824 21821119 11668861 2967550
41213 2967550 7434852 20202394 28152509 27644169 23866934 19253388 12602209 5670656
41205 5670656 2152977 2176535 3312490 4657041 6299638 7944619 10341746 13842093
41197 13842093 14548853 8400972 425605 1463614 12497065 20945910 17251584 7129250
41189 7129250 2106231 5372615 12385883 18234664 18957738 12835049 5805066 7785180
41181 7785180 17645154 20433099 7270285 -10103385 -14034201 -3751836 6483554 7225711
41173 7225711 1803505 -2565408 -2263943 2942404 10284281 14810719 14622021 13180952
41165 13180952 13039319 11944553 9249085 9659464 14684709 17286059 12531149 6768160
41157 6768160 7428622 10428413 8249510 4657469 9006771 19743106 26477135 26447354
41149 26447354 26123079 27338352 25057696 19752948 18751091 22366960 21114386 11326958
41141 11326958 2363426 2297081 6121484 5201355 574085 -723590 3224691 8915718
41133 8915718 13879978 16911515 15292531 8100543 261475 -2021917 1250721 4940738
41125 4940738 5998921 5991114 7282796 9754940 11053712 8535546 1987851 -4599274 -6068951
41116 -6068951 -2450166 -493 -3768785 -11022854 -14563065 -11357753 -5428572 -2527607
41108 -2527607 -3868883 -5479888 -2934003 3712541 10073033 12774173 13551200 16520578
41100 16520578 22119667 26003278 24274538 18148317 12898829 13018464 18210555 23412418
41092 23412418 23622395 19562343 16961994 19015515 22270253 22672840 22512561 26298854
41084 26298854 31494299 30055418 20370280 11582141 12555912 20529030 24821238 19695042
41076 19695042 9597850 2233465 -21624 -486188 -1863089 -2202969 1538537 7384066
41068 7384066 9327847 5746155 3171340 7971631 16693794 19857673 14715774 8593592
41060 8593592 8405146 12221661 13948138 11838671 8501588 5705013 3568027 2923053
41052 2923053 4130037 4757164 2844116 1721588 6420149 14757970 17809009 11986633
41044 11986633 5298730 6660225 13251869 15688012 13495369 15941688 25683556 31375982
41036 31375982 22983563 7304047 -662588 2370342 6787067 7289181 10044662 19825035
41028 19825035 29693750 29741030 20444162 11361536 9667824 14498008 20350853 22577940
41020 22577940 21078382 20232042 22869541 24284897 17191824 3554168 -5173967 -2536173
41012 -2536173 4862483 7871891 6581081 6048248 6792296 6844771 8165675 12928034 16958717
41003 16958717 14829416 8994795 6476328 8603427 11088332 12084122 12979077 13235917
40995 13235917 11756041 11463837 15102187 18382239 15104402 7361070 2666716 2833332
40987 2833332 4260286 7086181 13879061 20405965 18940374 11218662 7027971 8853186
40979 8853186 9493216 6661213 7147196 12746406 15206721 11122202 9050936 13779382
40971 13779382 15791430 7143018 -2696323 23414 11787865 17428812 12969283 8763269
40963 8763269 10990828 13463647 10214265 5347426 5804266 11528213 17127834 18626918
40955 18626918 15382390 8886990 2399723 -529234 816035 3630274 4531361 2538313
40947 2538313 -251741 -293605 3658150 7846403 6928949 853205 -4821974 -6261703 -4785046
40938 -4785046 -1997648 2471568 5923321 2628326 -6092766 -8985893 763569 14446226
40930 14446226 19730619 18125690 19831134 25082745 23725611 13173253 3610125 2071730
40922 2071730 3111131 800725 -381664 5435408 13460262 14493081 8581084 3371996
40914 3371996 1377556 -2075779 -8260849 -10935083 -5779461 2061363 4312383 310370
40906 310370 -2916982 -277667 5465029 8146077 5974138 3002167 3791340 8396103
40898 8396103 12843420 13533172 10689963 7807461 7901493 10693705 14385636 19578044 28244887
40889 28244887 37489567 38827612 28571556 15825313 12952901 19034724 21316028 14427729
40881 14427729 8500959 13404743 23946954 28621288 26140424 23711361 23719243 22823031
40873 22823031 21677065 24213148 27354491 22622086 10454320 3100679 9027539 22165517
40865 22165517 31003616 31705006 27845414 23459570 21590077 24773401 31652226 36558351
40857 36558351 36533247 35329361 37215500 41140249 44555627 47985825 51238706 50213448
40849 50213448 43407249 37331803 38782751 45032945 48739012 49843340 54613599 64238924
40841 64238924 73003911 78440202 84983108 95005152 103702266 107442845 111641649 124397513
40833 124397513 144872071 163664839 175092349 185334930 206162235 241260996 280847298
40826 280847298 311600118 330844873 346934815 364902971 378077978 378870015 371826691
40819 371826691 366396115 359400221 337176861 297921073 259965148 240130465 232291504
40812 232291504 217231104 188678465 159017734 141118935 134862208 132755498 129982015
40805 129982015 125458891 119223538 112786958 108585129 106822748 105872401 106363551 110285342
40797 110285342 115083480 114543613 108337632 105037195 111202432 122009104 128190104 129216748
40789 129216748 133501711 146515735 164057814 177762439 183498454 183845392 185126362 192038681
40781 192038681 202395100 206937811 197047451 173710446 147754787 130983348 127350090
40774 127350090 131438772 134124221 130498670 123128310 116873411 111746591 104700870 98060865
40766 98060865 99391293 109908734 119731124 120184188 115010300 112488245 112326024 109918873
40758 109918873 108940554 117263055 131811605 140942770 143634723 152827243 174919999 198801282
40750 198801282 213054556 222927741 240017417 263874008 285599011 303427106 321725393
40743 321725393 337406516 340164945 326868521 305529785 283800009 262553459 242051802
40736 242051802 224719562 208398091 185696797 155673632 129580474 118205353 117320131
40729 117320131 112521955 97381377 80842501 75327720 81595081 88491586 86410790 77335598
40721 77335598 69729041 66270138 61599153 52630623 45353562 47255680 56398422 63111211
40713 63111211 61312424 53844384 47114755 44251021 43590822 41024342 33811983 24048717
40705 24048717 17585979 17905829 22595499 27126395 29118871 27176331 20245303 11843589
40697 11843589 10005562 17558913 26530689 28141729 24215462 21953840 22133115 21376607
40689 21376607 22077540 28786595 36414020 34139795 21946940 11863544 10699427 12571139
40681 12571139 11315247 8827650 6832555 2004567 -4497807 -3619594 7414284 17111595
40673 17111595 15264754 8516100 10080244 19981080 26392944 23144334 15839631 12084564
40665 12084564 13827992 18715081 22936403 23779443 23437459 27270332 34744176 37632755
40657 37632755 32185141 26152472 26696651 28710546 24583356 18729201 20508777 27513649
40649 27513649 28893210 22593303 16229608 12343488 6360908 -793652 -2023589 2076162
40641 2076162 2189195 -3508528 -5159967 1968687 9041610 8404216 5340006 7452053
40633 7452053 12353174 14392552 15097196 18141225 21055450 20484852 19495016 21599622 23592276
40624 23592276 22450399 23203703 30761276 39039377 37881820 27217353 15613919 8358151
40616 8358151 5560172 8071585 15479685 21117418 18976388 13538517 13437402 18109670
40608 18109670 21088087 23458537 31119635 39907060 38319892 27274740 22353925 31098649
40600 31098649 41776053 42387278 38215663 40057107 45502701 45005594 40059595 41767078
40592 41767078 53776773 68402191 79153052 86947845 93568325 98411453 103255585 111791250
40584 111791250 122011386 126483102 123047647 118380070 117312187 115182580 106096303 93671815
40576 93671815 86635665 85870388 82768514 71432318 57294012 50565526 53733136 59204276
40568 59204276 59155775 54243391 50483785 50052686 49405774 46158438 42666738 40676515 37266192
40559 37266192 30159204 23125981 20700375 20493444 17294104 12786859 13132863 17043764
40551 17043764 15514556 6305319 -125980 5154977 16426343 21851137 20276986 20921954
40543 20921954 28523020 37502906 41531096 41541145 41698194 42513585 41095339 35556029 27228680
40534 27228680 20128125 18519817 22856871 28276562 29606995 27299928 25413624 24731950
40526 24731950 22230165 17254362 13395088 13219070 15490358 18735889 23113826 27447488
40518 27447488 29274723 29666791 32774039 38105720 39004937 32502268 24839087 22125240
40510 22125240 21306255 17363402 14336513 19706954 30351397 34572984 28623185 21396508
40502 21396508 20338584 22078637 21400912 20751451 23990324 27538852 26347004 24422971
40494 24422971 29979453 41461031 47701798 43506752 37036557 37875863 43800196 44865792
40486 44865792 37406193 28158024 24769457 26791089 27904800 24746716 20972825 22407590
40478 22407590 29755811 37769718 41647604 42344765 44235436 49152421 55050518 59536136
40470 59536136 61803572 61614548 60063980 61738630 71686879 88091367 101773572 106082757
40462 106082757 104185086 103311417 105397124 108077653 111240550 115329149 115000986 103646960
40454 103646960 85702506 75402227 78820831 84732372 79435598 64324139 51296472
40447 51296472 46115270 45627980 47796156 53153479 56751548 50469560 36483684 28087398
40439 28087398 31897771 38277407 36288821 30079785 31074975 39537331 44998735 43002983
40431 43002983 40437582 43025135 47239588 48377396 48955483 53637012 60853794 65352252
40423 65352252 66601036 69667659 78647150 92848404 108718505 122183297 129531770 129613610
40415 129613610 125995229 124042717 124366473 121470286 111102805 97254115 88600838 88177251
40407 88177251 90062595 87607946 81619029 77628864 77756221 79330889 80112502 80195744 79027765
40398 79027765 75316372 70512242 67863480 67247251 65694056 63644496 64547287 66658149
40390 66658149 62724072 51596941 42603590 42617941 45861242 43946604 39474114 40194933
40382 40194933 44863089 45976616 43411841 43528365 46107481 44440170 38759697 37076863
40374 37076863 40507196 40317914 33702690 30390234 37372406 47750473 51929736 50334094
40366 50334094 47472003 42886214 36954416 36792651 45622264 53353899 49329081 39054543
40358 39054543 36337961 42721884 47078793 43483806 37275251 33843575 32926833 34633630
40350 34633630 40217369 45470709 43769419 37719809 37670388 45973818 52774639 51048361
40342 51048361 45883120 43969728 43557746 41425235 41079160 45548017 48626383 42755217
40334 42755217 31653397 25986529 28532933 32298527 32880201 34052121 38686326 41129720
40326 41129720 33895038 19230997 9064058 12589264 26480922 39182182 43431338
40319 43431338 41563820 38829540 36600885 35141614 37930981 46679145 54733886 53452036
40311 53452036 45084889 41486155 48425974 58677498 63430983 63283313 63720236 66129851
40303 66129851 68545807 70359596 71229282 69473333 65939393 64910670 66721467 64858083
40295 64858083 56111257 48169024 49636895 56738020 58491731 52559692 47075631 47615172
40287 47615172 50931913 52220234 50873652 47586560 42520737 38113540 37642681 39316023
40279 39316023 37727716 32970896 32004105 38274629 46177633 49598514 50197859 52141663
40271 52141663 53484217 49617536 42957671 41983879 49785937 58938741 60119327 52375143
40263 52375143 42018479 33728711 26984301 21391691 20658368 27215555 35291974 35397115
40255 35397115 26679344 19093757 20290655 25805079 27271443 25429386 27286896 33010824
40247 33010824 34822538 29511188 23417350 22164996 22957200 21387086 19473758 21045637
40239 21045637 23665862 21939477 16892958 15760445 22119199 30775756 33840918 29448418
40231 29448418 23277737 22322051 27571540 33085763 32976136 28301322 24706145 24150890
40223 24150890 23156639 19663135 16588411 16592734 18353116 21130353 27793038 38457741
40215 38457741 45592424 41846635 30259595 20645214 17865978 19910620 25419431 34902526
40207 34902526 44382695 46399602 40122402 33580877 32447162 32805082 29100149 23207257
40199 23207257 19942728 18403264 14694768 10405077 11079775 17069613 22483361 23666004
40191 23666004 22881233 22534697 21463693 19240161 19125722 23256734 28350947 29685002
40183 29685002 26901683 22902367 19458220 17210189 17675543 21188636 24334543 23707023
40175 23707023 21383690 22161781 25650554 26342635 22687440 20750246 25830927 34684273
40167 34684273 40087355 39963595 37166613 32360939 23308277 11852482 5848097 10527431
40159 10527431 20768671 25954286 22116483 15955497 15500116 19238167 18062081 8419348
40151 8419348 -598213 2467119 15755705 24875344 21097336 12639441 12964561 22603700
40143 22603700 30091289 29010439 25424981 26833717 31560448 33250870 30089006 24374113
40135 24374113 17151458 9102364 4215620 6429124 13096742 16862861 14530732 10294099
40127 10294099 9808558 14359532 21108986 25879697 25359068 19574549 12584303 8271691
40119 8271691 6149770 4466880 5549558 12032692 18263480 13893207 -666921 -10418406
40111 -10418406 -3914305 10885671 17380986 12841681 9712293 15326255 21786379 19799178
40103 19799178 13125308 12353069 19984440 28797379 31918621 28363871 20646635 12699091
40095 12699091 9211260 11997748 17294235 20315262 21134983 22112466 21839415 17479770
40087 17479770 11754465 10722762 14482414 17049212 16467849 17404978 21184642 21460997
40079 21460997 14981979 9448044 13161302 21928581 25060076 21636724 21076450 27179583
40071 27179583 31159257 24522077 11718981 3848761 3901689 5245127 3624572 3304495
40063 3304495 8508369 14482993 13291971 6397744 3885928 9452499 13747450 8187476
40055 8187476 -784241 -198221 9783308 15486822 9471821 -283538 -4270246 -3867208
40047 -3867208 -3718162 -1334167 6683432 15048576 16452453 13241311 12815609 15090950
40039 15090950 14540347 11909079 13106677 17569282 18490052 14891892 13001572 14304855
40031 14304855 12613469 5695264 5198 -78722 1094396 -781673 -2391156 664848
40023 664848 6087541 8820756 7800730 4819065 1644118 1448760 7321219 15866492
40015 15866492 18376694 12430554 6507510 8881015 17636693 25812399 30230666 30510015
40007 30510015 25790007 18417707 15339425 19445248 23992707 21539428 14315143 10212976
39999 10212976 12413375 17954752 22480498 22084105 15429498 8074109 8244665 13838901
39991 13838901 12046642 -1510862 -12749446 -7993867 5683589 11351251 6776905 3899573
39983 3899573 7867085 11813967 11709356 12006370 14961687 16858443 17006570 19193405 22245963
39974 22245963 20441146 15461440 16122579 22987276 25372889 18576685 12346900 15420233
39966 15420233 22014840 21830484 14962352 8309113 4085487 621359 -803672 1575160
39958 1575160 4630637 4969727 5470439 10042097 15133307 14191235 8624856 6546540 10673327
39949 10673327 14265152 10720215 2450922 -2203016 1239735 8426859 10997175 6451825
39941 6451825 2063256 6466699 18013930 25669022 22200331 11869918 3434160 649170
39933 649170 2667997 8652898 16806242 21760332 18499984 8894219 1275026 3038504
39925 3038504 14116799 26588768 30905463 24910169 16485215 14284797 16925157 16229693
39917 16229693 10350153 6526766 9561795 15259824 18509752 20454466 22964218 22917427
39909 22917427 18175371 13660348 14625041 18068210 17612833 13493749 10900947 11149184
39901 11149184 11389648 11133547 12193417 13263569 11234326 7616644 7339035 10582462
39893 10582462 11628739 7415787 2426969 2561600 7161525 9717509 5579082 -2354448
39885 -2354448 -5838150 497943 13361841 24377764 28712553 27651222 23617279 17434506
39877 17434506 11231759 8602504 9529370 9977022 8919193 10353636 15231352 17490053
39869 17490053 12936819 6682450 5987181 10104957 13104878 12858348 11217256 8900705
39861 8900705 6478384 7167082 12109182 15576855 11421152 2265638 -3532009 -1810706
39853 -1810706 5709210 16008742 24631677 24895743 15258299 4729362 2705174 5770944
39845 5770944 3557611 -4081951 -6131414 2703808 14020064 17571445 13514251 9332889
39837 9332889 9909868 13604789 15004557 10657383 4301076 4256493 12057762 17813418 12939607
39828 12939607 2980005 -604621 2778918 4955708 4908801 9640490 19017413 22984099
39820 22984099 17046116 9170727 7281775 9883606 12903112 15945256 17468422 13365441
39812 13365441 5271323 1555854 5430267 10535295 12325058 14396239 19006373 21415356
39804 21415356 19173869 16934402 16121458 10758385 756722 -2332490 7558706 19014914
39796 19014914 19558669 14241529 15057382 20589888 21011345 16870530 16887300 20548389 18745938
39787 18745938 10841333 6341109 8705420 10850594 8615536 6439300 7072155 6943787
39779 6943787 4955707 5629668 10023363 12727829 11177957 9328431 9290435 8198953 6212660
39770 6212660 8103192 13182089 13419594 6564742 1609663 4835090 9260734 5782046
39762 5782046 -2739364 -7390677 -7344211 -8567740 -12315105 -14528216 -14851093 -17067863 -20528197
39753 -20528197 -19421524 -12475221 -6719382 -8345411 -14148544 -15556273 -9023337 441061
39745 441061 5521596 4311873 905110 -947343 -2439283 -6075714 -9363571 -6545515
39737 -6545515 2748696 10864014 10318458 1672830 -8396352 -13438527 -9987901 1251380
39729 1251380 13309221 16220822 7533299 -3051065 -4558065 1993097 6833052 6046962
39721 6046962 5495818 9391691 12576665 8497401 -56202 -4061657 -794719 1815637
39713 1815637 -5039600 -19315395 -28609290 -22983506 -6264356 7348115 8620104 3051079
39705 3051079 2925953 11349952 18707294 15822152 5927880 -232049 1388854 4063227
39697 4063227 919021 -5029423 -4912104 3839901 13436733 14644395 6892155 -2467665
39689 -2467665 -7009353 -6358718 -3240892 676090 4411828 6172173 5269441 4261552
39681 4261552 6189996 10103495 12210670 11520261 11073306 12503400 12680942 8279275 1286529
39672 1286529 -3409225 -4738859 -6077199 -9213022 -11399771 -9605845 -4646352 642779
39664 642779 4683260 6529122 4679676 -361545 -4316049 -3549633 81552 2725060
39656 2725060 5517312 12539566 21555994 23384709 13713047 311223 -6116194 -4497827
39648 -4497827 -1824192 -2108311 -2911236 -1344273 2472865 7467721 11500196 9749080
39640 9749080 -100700 -10627733 -10473115 -14989 6549561 -486885 -13207990 -18035506
39632 -18035506 -14513759 -12876569 -16850532 -19984296 -18682726 -17751830 -19979837 -19847465
39624 -19847465 -12962802 -4385589 -1370774 -3488582 -6363274 -10296229 -17598233 -24580378
39616 -24580378 -24378617 -16894446 -9001115 -5172886 -4219841 -4861999 -7510573 -9994031
39608 -9994031 -8714594 -5496305 -6039772 -9464653 -7417801 2504127 10638471 8904099
39600 8904099 3413763 4759767 10696848 9065877 -3369070 -15311977 -16214369 -9161753
39592 -9161753 -4913389 -8620032 -16220243 -20471496 -17440946 -9228895 -2216161 -950509
39584 -950509 -3128141 -2654532 2519786 8420785 10496329 7679451 1570792 -4368059
39576 -4368059 -5322482 236685 6456603 6102912 914053 -289241 5415606 11261079
39568 11261079 11673648 8557421 3551514 -6275555 -18943821 -23538656 -15138659 -5782339
39560 -5782339 -8777459 -18199159 -18141837 -8830755 -6776722 -17705727 -26588610 -21303762
39552 -21303762 -11115068 -10634524 -16854672 -15879516 -5645041 2572887 2890283 1647720
39544 1647720 4659767 9003933 10303485 8969040 5832300 -512722 -8457465 -12760622
39536 -12760622 -12824789 -14078716 -16771545 -11983008 3957230 18852037 18732209 7564739
39528 7564739 1130795 3620895 3602001 -5152515 -12279048 -6758147 6094960 12631023
39520 12631023 9303400 3762391 1577588 1403726 1950065 4798794 9175760 10912043
39512 10912043 8698121 6260737 6435811 7271595 5742143 1765477 -2955731 -6828830
39504 -6828830 -7752869 -3881345 3041986 7419040 4773181 -3922632 -13091350 -16324118
39496 -16324118 -10130589 3024824 14906178 17326309 9219869 -2593026 -9328773 -6657503
39488 -6657503 2454756 9666668 8665412 2603946 493552 3877448 3287303 -6613674
39480 -6613674 -15403142 -10179007 4388952 11705791 7049543 1999840 4095924 6669419
39472 6669419 3653431 687982 3483712 6735958 4379980 1490182 5250332 11310267
39464 11310267 10163994 2034617 -4822488 -6606060 -5350185 -1784128 3747479 6782804
39456 6782804 4571397 2977314 7853879 13084650 8429315 -2943770 -7008389 940054
39448 940054 10443232 12184069 9362309 9284782 12765761 16325928 17845879 15899133 9169389
39439 9169389 130841 -5295360 -4560772 -1277243 197389 -972314 -3980062 -8205342
39431 -8205342 -12184215 -14255136 -14547450 -13778498 -11634858 -9088479 -8756503 -9132040 -3963773
39422 -3963773 6615693 11149082 2167484 -10211623 -12058957 -7097896 -8991253 -15979263
39414 -15979263 -12113449 5041139 17125572 11199482 -3430138 -12092518 -13398903 -12331423
39406 -12331423 -8677669 -2703327 -776142 -5180162 -8287310 -5471054 -3036047 -4978455
39398 -4978455 -4455423 1558283 2784507 -6470198 -13387953 -6126180 5041493 4098956
39390 4098956 -3943071 -3497822 2522227 -2252404 -17073824 -23004083 -13862582 -5235636
39382 -5235636 -7467699 -10687149 -4891563 3469018 5302359 4094474 6338781 9161721
39374 9161721 8231906 7286709 9168607 7102824 -3733040 -14003850 -11598253 309805
39366 309805 8030552 6647088 3869746 6247326 11059690 12524087 9228473 4130470
39358 4130470 1015448 1189107 1983773 316373 -1614341 1394968 8207977 10707383
39350 10707383 5807955 1168240 3829941 9872379 11873879 10425065 10329100 10687565
39342 10687565 7933165 4930187 7253662 12433968 12515878 6623173 1838890 1474629
39334 1474629 1415030 -862405 -2386795 -1850104 -2503966 -5195004 -6170374 -4912459 -6256391
39325 -6256391 -10380242 -8596767 4287304 19497558 23840016 15904175 5452322 -427203
39317 -427203 -2709430 -3393351 -1469777 2593937 4914505 3364129 94235 -3190592
39309 -3190592 -8068982 -14946646 -19761673 -18546494 -12570202 -5886116 -277846 4092833
39301 4092833 5583309 3191402 656964 3501449 11246293 16584092 13840029 5185113
39293 5185113 -3192645 -8086531 -9959601 -9089615 -4777608 1758597 6555675 6131188
39285 6131188 693503 -6043240 -9538298 -7310701 -691565 5577405 6356760 137336
39277 137336 -9130444 -14617566 -12345179 -5066490 431440 631831 -1377062 -1001078 1553912
39268 1553912 2919121 2770436 3869118 6109654 5833851 2686676 1885492 6296123 10704623
39259 10704623 8660769 1980898 -1668689 1064836 6231900 8646108 6523539 946848
39251 946848 -4980671 -7111760 -4473199 -1549441 -2103469 -2468527 3060120 11227912 11830914
39242 11830914 1958449 -9042233 -11474174 -5651824 2606469 9934994 14516324 13893661
39234 13893661 9653170 8829530 14111948 17598742 11748925 2017561 -512599 4080712
39226 4080712 5715383 1245802 -1271850 2767406 6760599 4582219 352852 -97642
39218 -97642 618857 -2031293 -4312428 -69529 7452863 9750344 6896071 6755068 10147243
39209 10147243 7361687 -6970314 -23890448 -30191032 -23006996 -10000117 113464
39202 113464 2772100 -2009924 -8818707 -9389398 -1343013 7468940 8086774 2222127 -165493
39193 -165493 5712308 13734932 15439445 10233646 5183291 6764600 14246154 20471179
39185 20471179 18897369 10112385 681122 -4218521 -4677121 -2521938 1733017 6117247
39177 6117247 5916242 -406006 -7034845 -7379384 -2796854 -244287 -3026960 -8242526
39169 -8242526 -11613657 -10673291 -5396287 112779 -295474 -6187711 -8176966 -477310
39161 -477310 8962353 9110445 1705334 -4013533 -7550828 -14285740 -19549717 -12966195
39153 -12966195 469040 2612629 -9283222 -15198374 -2746244 13269413 14873839
39146 14873839 7770899 6886250 8961131 822505 -13731995 -18006671 -10024123 -4625523
39138 -4625523 -7918962 -9905433 -5525979 -3889324 -10257163 -15370890 -11168351 -4086882
39130 -4086882 -4080706 -10633323 -17143102 -20082052 -17390435 -7177721 5138781 7518323
39122 7518323 -3260945 -14726541 -14573106 -5818094 1116053 3328632 3573375 706958
39114 706958 -7249572 -14776434 -13930282 -5996196 231236 521795 -1503877 -1949288 -1114266
39105 -1114266 -1203669 -4761390 -14113720 -27671004 -38389559 -40232665 -34227339 -24518746
39097 -24518746 -12133854 2134090 12384498 12231313 3409770 -6012222 -10842076 -11316996
39089 -11316996 -8720825 -4380937 -1383883 -1133013 614760 7979890 16183805 15738154
39081 15738154 6130976 -1589329 1415531 10399755 12699593 2121815 -14649901 -24834090
39073 -24834090 -21832415 -11094933 -3021124 -530920 2271275 8016801 9810275 2838300
39065 2838300 -4151862 1138234 15862300 24262820 18926622 9185728 5664287 6640769
39057 6640769 5049879 490759 -2896279 -4456241 -5445832 -3712489 2531050 8355655
39049 8355655 7027473 211265 -3555180 -667935 3475605 3395558 1028259 1765010 6668409
39040 6668409 11417746 11293700 5653813 -1513195 -5274667 -5236270 -6248776 -11092223 -14181620
39031 -14181620 -7597960 6661943 16653662 14957785 7303821 2942773 2177598 -579528
39023 -579528 -5995347 -9848660 -11171744 -11894196 -9667773 -508412 10882098 13789499
39015 13789499 7567875 4735455 12365087 20104457 15187892 1506368 -6702328 -4849619
39007 -4849619 -683911 -270325 -2342717 -5125567 -8247242 -8512153 -3957767 -1448586
38999 -1448586 -9084217 -21007968 -22280612 -10671012 -329233 -107460 -2326319 573242
38991 573242 2738942 -1664587 -4885086 1079184 7892175 3379056 -6409047 -4881963
38983 -4881963 8358659 15842099 8328024 -3247871 -5884339 -722232 4891886 9629771
38975 9629771 14319774 14826698 8001336 -595712 -3011605 289372 2364488 -261008
38967 -261008 -5438929 -10667087 -14414889 -13740566 -6932262 1255562 2531028 -5192778
38959 -5192778 -14992795 -19509489 -18665108 -16465625 -13507165 -6939668 3102744 11265669
38951 11265669 12216174 5546142 -5138736 -15080573 -19602134 -16636645 -10432807 -8689395
38943 -8689395 -12679331 -14809217 -10733341 -8129172 -15015169 -24002046 -20298444 -4190181
38935 -4190181 8215389 8785552 7119180 10759191 11200206 932367 -8825750 -3427791
38927 -3427791 10465773 12962569 173800 -11516938 -10126438 -1232359 5654360 9243893
38919 9243893 10620777 7957730 2695982 426374 389513 -5512967 -17521371 -22726253
38911 -22726253 -13123596 374554 1918900 -8050623 -15876523 -14361958 -8932929 -6370991
38903 -6370991 -7200038 -9413633 -11752906 -11919279 -7528572 -303608 5110270 7231257
38895 7231257 8614831 10353299 10154361 7069195 4110338 4064602 5565777 5680483 4486708
38886 4486708 4421713 5690950 5007665 126486 -5777168 -6460079 211673 9020524 12356649
38877 12356649 7375804 -2468780 -11264545 -14592938 -11552778 -5119692 488179 4112416
38869 4112416 7410337 9380404 5547139 -3879126 -9873203 -5162461 4148887 5491615
38861 5491615 -2794916 -9567142 -6878679 1117147 7715359 12885906 17607304 16750989
38853 16750989 5665988 -10108952 -19373234 -18223664 -12582410 -8411853 -5014638 756271
38845 756271 7872638 11691288 10112353 6830124 7068412 10736941 12408242 9172423
38837 9172423 5341813 6405520 11216678 14435495 14164963 11756938 6296284 -3658424
38829 -3658424 -13547083 -15544685 -8720339 -43028 5076236 6433601 3690446 -3611623
38821 -3611623 -9793837 -7034068 1576800 3456842 -4743588 -10777173 -5377785 3703969
38813 3703969 4854271 -52489 -2088807 -1005395 -2447357 -5045426 -2625301 3912268
38805 3912268 8094365 8793447 9246334 7834888 1030264 -6075671 -3850753 6891948
38797 6891948 14346518 11065944 736336 -10520112 -19894317 -24237000 -20472780 -11526788
38789 -11526788 -3741494 1990000 8153310 11217090 5645655 -3291126 -4181762 1942388
38781 1942388 2751290 -2792410 -752942 11553327 14553885 -4344828 -26169308 -23878268
38773 -23878268 -491746 16484815 13598582 3918868 1495019 3172859 688954 -5093808
38765 -5093808 -9288276 -10720100 -8203817 908379 12584903 16097911 8501904 294264
38757 294264 116008 2903527 1193303 -908265 4106882 11854716 11710470 4500997 1735732
38748 1735732 7177573 10940393 4751083 -6394001 -12023437 -8835487 -1709554 2780103
38740 2780103 1049277 -4743028 -7061317 -1302996 5644240 2635989 -8202304 -11030102
38732 -11030102 1203805 13715035 9123224 -7390356 -14807019 -5269981 7052194
38725 7052194 7695584 205806 -2996521 1050942 4891112 3486191 -33838 -1101563
38717 -1101563 -786092 -4296467 -13957984 -24812001 -28462009 -22614548 -14848617 -13294114
38709 -13294114 -15187390 -10607384 2354711 13610069 14991174 10738627 8841848 8435355
38701 8435355 3505256 -5164774 -10722169 -11251108 -11269911 -12162874 -9838006 -3832961 -359485
38692 -359485 -2403042 -4275542 -1520698 328323 -5586795 -14681548 -15981150 -8237220
38684 -8237220 -1571563 -1921146 -2714910 4130230 16061057 24147845 24438682 19418121
38676 19418121 12228865 5825455 4946895 11649033 19724207 20227964 12683670 4804723
38668 4804723 1014176 -2111129 -7918968 -14068211 -17177439 -17106366 -14319476 -9087698
38660 -9087698 -5529798 -9135966 -16807867 -17472280 -8028689 -471565 -5267938 -14809363
38652 -14809363 -13614654 -379043 11143007 11294956 4246661 -1281911 -2017357 61318
38644 61318 876661 -3092682 -9635450 -10122024 -576342 9860143 10371121 5052087 6596922
38635 6596922 15182717 17323399 7293076 -4017660 -6025106 -1968700 290308 -29329
38627 -29329 -982136 -4262004 -9570626 -10533072 -3695666 4762371 7441924 4590394 -410277
38618 -410277 -6856592 -12360709 -10593508 -244537 10357330 13550014 10732006 6048138
38610 6048138 577106 -2060363 4600895 16921794 19570471 7015920 -4783259 -572830
38602 -572830 11241672 12973719 5442533 3138743 7845971 7163877 -2227431 -9111465
38594 -9111465 -7587426 -5364699 -8083387 -9856271 -4634665 4681703 12865512 17957676
38586 17957676 17508309 9842398 1549313 2555394 10957720 14333693 9209570 6368169
38578 6368169 11796615 15694801 8723235 -2054379 -3786585 3395800 8401040 5170495
38570 5170495 -2068252 -6784446 -6774065 -4346486 -3560208 -5261792 -4050558 5112496 17021603
38561 17021603 20342787 13057391 4981022 2162577 -907957 -8296840 -12563919 -6522277
38553 -6522277 3053609 3690452 -5817689 -16031235 -20764107 -21469968 -20202409 -16787563
38545 -16787563 -12526899 -9982399 -8796654 -6169376 -924291 6061837 13565239 19123952
38537 19123952 19191524 13432662 6091295 616197 -3169659 -4477677 -366167 6924562
38529 6924562 8467222 674378 -7521055 -7081432 -2723663 -5233112 -14391336 -20112653
38521 -20112653 -18328609 -14811150 -13269564 -10390653 -4981064 -2361662 -5210787 -7469943
38513 -7469943 -2873336 5338286 8653502 4635498 -562952 -463590 3747251 4135938 -5109362
38504 -5109362 -19452967 -26343556 -18217898 -2000810 7855674 5566462 -575716 184511
38496 184511 7749034 12020393 5427158 -7967672 -16515224 -13491568 -4340337 -182481
38488 -182481 -4989382 -12109885 -13787872 -10092194 -6300942 -5387926 -6800166 -9692727
38480 -9692727 -12963510 -14015076 -11771215 -9279952 -8993433 -7386284 182629 10268061
38472 10268061 13497510 6846152 -2194576 -5697390 -4024100 -1460147 1617529 7122348
38464 7122348 12847611 13461317 7813615 1108791 -1232981 541199 1654553 -1571053
38456 -1571053 -7588992 -10313593 -4606778 7468438 16892739 16659808 9914107 5857391
38448 5857391 7597900 8757251 3996708 -2515702 -4003136 -2181750 -4085838 -9464968
38440 -9464968 -9877767 -1744321 7608022 10199369 6745517 1746386 -3690930 -8472516
38432 -8472516 -7667154 319720 7799373 7338696 3149664 4023323 8527349 7804696 1143600
38423 1143600 -2993285 -1909081 -2696431 -8318721 -10772276 -3649016 7130603 11286271
38415 11286271 6564857 -1983315 -9476902 -13235041 -12326735 -9240634 -7747856 -6696656
38407 -6696656 -1421312 6938280 11107747 9501050 9449514 13835282 13970220 3389028
38399 3389028 -9411188 -11579244 -3567250 3638316 5035742 5315855 7648574 8115112
38391 8115112 2544431 -7215369 -15309124 -17241380 -13808026 -11181772 -14137629 -17972207
38383 -17972207 -12846219 1164567 10909173 7281166 -2213973 -5442148 -2944719 -3517664
38375 -3517664 -8022120 -9009947 -4063762 1199794 3055078 3692516 5354683 7951706
38367 7951706 11981142 16951062 18271916 12887241 6275409 6186479 11183160 13575954
38359 13575954 11874238 11012969 11378627 8189832 2736519 3792047 14430339 25629115
38351 25629115 27027622 18384223 7610074 2123210 3751117 8132368 8796218 5080612
38343 5080612 3566019 7199234 8224031 249334 -7922982 -2824082 12027508 19217735
38335 19217735 12392026 3361585 1795092 3177492 2327882 3546790 8557595 8236975
38327 8236975 -1996038 -9948211 -3351725 9752700 12021625 2591060 -3611832 -121940
38319 -121940 3210956 -1191505 -6246771 -2886711 4822126 5819692 -1810867 -9142018
38311 -9142018 -9588470 -6840665 -7703759 -11818184 -12962360 -8997862 -5074181 -5282842 -6271828
38302 -6271828 -3512266 301663 -182625 -2642288 20949 6627976 7359730 -601791
38294 -601791 -6492655 -902314 10348439 14878136 10717526 6003655 5156916 4712107
38286 4712107 2431168 1745260 4521333 5895212 738072 -8005272 -11901971 -7412691
38278 -7412691 -106285 3101569 3440945 7957754 17536989 22686642 15166082 -537936
38270 -537936 -13372943 -19872422 -23919635 -24701984 -16452166 -2085149 5106973 -262036
38262 -262036 -5961562 284672 11705029 12283860 522847 -9201547 -7606525 -612642
38254 -612642 3215221 4192299 5665506 5368329 -275054 -8171892 -11952754 -11227821 -11367939
38245 -11367939 -14474992 -16106194 -12500576 -6610912 -3640283 -3271199 -842468 4273514
38237 4273514 6456631 1927365 -5049389 -7458148 -4127375 774577 4271054 6097000
38229 6097000 5923102 4380034 5084409 9650809 12324456 6882212 -2207904 -4558955
38221 -4558955 -160892 -162641 -8271380 -12913467 -4874399 7444971 10448276 5600569
38213 5600569 5374632 12733152 16775476 9089031 -5232257 -14877845 -13809320 -3960635
38205 -3960635 7889758 14429946 13191134 8499422 5410666 3200090 -1518093 -7881168
38197 -7881168 -12321602 -14679513 -16489118 -15159241 -7448615 1908494 3271883 -4843329
38189 -4843329 -12908708 -12553227 -5279873 2842739 8654116 11297086 10121194 6626116
38181 6626116 3773540 848575 -5690441 -13685568 -14219586 -3862139 7716586 8650649
38173 8650649 -425973 -8856594 -10154666 -6879697 -3082536 395785 2140527 -1356164
38165 -1356164 -9819995 -16049216 -12978591 -2381483 6826394 8648174 5589179 3542862
38157 3542862 3795454 2934952 -117467 -1105954 3309217 9418300 10669489 6451786 1765265
38148 1765265 -1381471 -6009545 -11951442 -12414099 -3586572 7453757 10996558 7818759
38140 7818759 6924211 11624213 15674263 14092268 10351796 9858050 12209932 13637351
38132 13637351 12367209 7911293 -325817 -9458639 -12661355 -7585545 -1405569 -1612026
38124 -1612026 -5446691 -5516360 -2423368 -2459083 -4427399 -201820 9762847 13118371 3306981
38115 3306981 -9374234 -12182650 -7464647 -6484132 -11655434 -15382698 -13146247 -7299006
38107 -7299006 351756 9311621 14355445 9647839 235657 -1391305 6626697 11487353
38099 11487353 4977972 -3469124 -1270433 7722289 8804285 -2473130 -15523418 -20422690
38091 -20422690 -18892791 -17640786 -18261232 -17670874 -14075515 -8560844 -2880316 1440786
38083 1440786 2791390 458144 -3816164 -5972873 -2083665 7961374 18354704 20558673
38075 20558673 11051645 -4092286 -14237823 -14243740 -8295520 -3810671 -3514893 -4497831
38067 -4497831 -3314571 208524 3899430 5719653 4662899 1239436 -1548891 151918
38059 151918 5917248 9378734 5313386 -2946435 -7865897 -8324530 -9104042 -9626253 -2735213
38050 -2735213 11182905 18857684 11422971 -837021 -2153300 6002763 9115235 3329697
38042 3329697 -562477 2215464 1881403 -7991317 -17975380 -17137284 -8974558 -2990962
38034 -2990962 590893 6130247 9286872 1664960 -13572084 -22587143 -18169263 -7405028
38026 -7405028 -1115810 -2883789 -9442626 -15339035 -15845870 -10675743 -5757619 -6500281
38018 -6500281 -9350486 -6068747 3015143 7292382 520534 -9440139 -11174785 -5492069
38010 -5492069 -3079913 -7551947 -9358210 -309649 12534937 15497346 8390194 5836607
38002 5836607 15424980 24264422 15903717 -5433039 -18989369 -14199301 -1386541 6087846
37994 6087846 8510352 12581246 17000098 14672526 4913706 -4990365 -9295746 -9137936
37986 -9137936 -8820592 -10738295 -13818715 -14837652 -11830169 -6693052 -2722390 -255366
37978 -255366 2005120 2728194 238238 -2151172 50019 4112101 3831217 1247079 4110760
37969 4110760 10786862 10455148 1832206 -2423280 3342927 6831561 -2086259 -13679531
37961 -13679531 -14060829 -7409137 -7146995 -13406440 -15629343 -11721113 -8247633 -5697389
37953 -5697389 3271 3901484 -3272985 -17241562 -23019899 -16725936 -9697851 -9277676
37945 -9277676 -10242557 -8087808 -6423493 -6975697 -5435324 -2058331 -4201942 -13159538
37937 -13159538 -19706860 -17847640 -12401052 -8274674 -3208177 3589479 6695157 4597723
37929 4597723 4176257 8450777 9927479 3534626 -3241411 -1414095 6269431 11225337
37921 11225337 11158478 8666626 4384778 -776669 -2414276 1030387 3940008 1906686
37913 1906686 -1150174 -403408 1407321 -520586 -4987890 -8760056 -12386603 -15203080
37905 -15203080 -11290792 1253889 12958660 13990470 7785514 4614508 5839111 4399380
37897 4399380 -1820369 -6939520 -6524917 -2072334 3246525 6740722 5781450 1621291
37889 1621291 1100701 7490543 12539214 6105360 -8226753 -16434961 -12655523 -5405341
37881 -5405341 -4034640 -7376874 -8691413 -5394678 -672138 409396 -5113602 -14162740
37873 -14162740 -17730114 -10036151 2405692 7011995 1406200 -3206479 2291307 11982525
37865 11982525 12497014 125088 -14494866 -18023497 -7905480 5656987 9954364 2164877
37857 2164877 -8548663 -11928029 -8062305 -5428084 -8880211 -14146926 -15144087 -12217536
37849 -12217536 -10060398 -10349115 -10429554 -8351735 -5307441 -2451203 1092469 4718864
37841 4718864 3753229 -5035921 -15766615 -16782117 -4455277 10334042 13561793 3168603
37833 3168603 -11370430 -21506653 -25576298 -24311555 -18401357 -11627848 -9289621 -10729112
37825 -10729112 -8995924 -725280 8605003 11957149 8646861 2659823 -2009705 -1989377
37817 -1989377 4036616 11487303 12704542 6681388 717560 -278718 319194 -1083994
37809 -1083994 -2047360 -821971 -1334541 -4800296 -4218844 4240243 11435285 7037453 -4536279
37800 -4536279 -11088854 -10862186 -11318403 -12962635 -8626937 1266386 7050805 5976826
37792 5976826 6445874 11488397 11260027 -256784 -12391329 -11884307 -1757588 4929528
37784 4929528 4640004 4904511 8823645 9989628 4358548 -2640783 -4761413 -3604596
37776 -3604596 -3894419 -5218145 -4039642 -1019653 -432513 -2799083 -3339715 923866 6645668
37767 6645668 9012513 7773858 5272433 1328155 -5267467 -11589646 -12485972 -8110240
37759 -8110240 -4146409 -2944383 -120665 6806121 12006917 9051834 1131573 -2957621
37751 -2957621 -993120 1253707 139876 -1370171 -775074 -1246142 -6483021 -14771030
37743 -14771030 -21659416 -25224183 -25157965 -19803309 -9107846 775836 1566850 -6845091
37735 -6845091 -14394479 -12134905 -2724728 4140705 4699624 3929773 5182918 3839941
37727 3839941 -4486461 -14474150 -16490855 -9533151 -2263941 -1428382 -5276343 -8891910
37719 -8891910 -9819019 -7059610 -907486 3590593 -883316 -14009789 -25271886 -25477631
37711 -25477631 -16792563 -7514096 -1514022 2035925 2537310 -1618084 -7784299 -9982449
37703 -9982449 -5539721 2629907 10183220 14924381 16412864 14311172 7823770 -2797328
37695 -2797328 -13091835 -14866866 -4574508 9373062 14010602 7607268 1162067 2250319
37687 2250319 5677183 4278929 415813 213893 3733748 8201153 14130433 20071845
37679 20071845 18234861 5397920 -7656266 -8811001 -1899117 915759 -361221 4208361
37671 4208361 13239910 12279132 -2696996 -15706936 -12842974 -1710249 1426371 -4817139
37663 -4817139 -7780274 -773674 8546751 9635507 1254443 -9258275 -14360686 -12362134
37655 -12362134 -7376499 -4507043 -5140845 -7435410 -10393273 -14876032 -20576833 -24788978
37647 -24788978 -24850593 -19905908 -10688764 -113585 6840389 7482115 5348783 6049381
37639 6049381 9309535 9241557 3011382 -4662532 -6848477 -1714822 5809212 7893813
37631 7893813 740464 -9918524 -13011186 -5641237 1174678 -3800115 -15998462 -20963902
37623 -20963902 -14464989 -6892387 -6921375 -10897093 -11760562 -9404583 -6823328 -3245470
37615 -3245470 2315358 5384253 432648 -10874273 -20106777 -19928532 -10053476 2503848
37607 2503848 8575501 5427621 292995 1340085 5998941 4605652 -4342151 -10801185
37599 -10801185 -7364466 1364664 7456165 9778862 10123890 6715804 -1103480 -7189646
37591 -7189646 -5361164 1591845 6337827 7225300 7554516 7778722 5673485 2331235 902851
37582 902851 432036 -2433026 -6404929 -7045493 -5034858 -5695170 -9254268 -9041533 -2358433
37573 -2358433 3554992 1388048 -5213343 -6654885 -950168 4302226 3409606 -344327
37565 -344327 -1583825 -1383786 -3906096 -7664777 -6825560 -1126137 2219929 -968749 -5287392
37556 -5287392 -4066953 520938 1672721 -912339 -1272631 2392871 4814074 2471631
37548 2471631 -851640 -225923 2996906 3271069 -1647053 -7556702 -7592566 956868 12629794
37539 12629794 17746397 12148477 1339135 -6952519 -11208403 -14000887 -15660064 -15545023
37531 -15545023 -16086616 -18741382 -18732314 -11535551 -2228739 469402 -2280152 -2004585 1816948
37522 1816948 756868 -7072367 -12862925 -11784384 -9563743 -9507219 -5709191 3218499
37514 3218499 6050488 -4398274 -16306731 -13417175 2071195 14311770 16944862 17460116
37506 17460116 20054747 18589324 9823762 1976477 3503499 10111919 9723677 -2103234
37498 -2103234 -16708254 -22553692 -18182369 -12634331 -12749557 -13737375 -6858553 5974641
37490 5974641 13270710 10358704 5456474 5598793 6118542 1197175 -3744137 -388265
37482 -388265 7439833 8374606 547279 -6604365 -6860210 -3881241 -2754468 -3435667 -4146650
37473 -4146650 -4233782 -2156094 3279818 8593184 8197890 2104076 -4166077 -7368719 -8524717
37464 -8524717 -7526911 -2906250 2101985 696117 -7675161 -14939791 -14935422 -10772388 -8359005
37455 -8359005 -7929449 -6504752 -4638044 -5208820 -7249910 -5998012 357123 7123246
37447 7123246 7966969 2429988 -3027652 -2435378 2342015 4286759 1207769 -1134277
37439 -1134277 2091323 7396630 8845363 7537639 8965419 12735916 11952019 3488281
37431 3488281 -7008004 -12246794 -11146388 -7840734 -6390055 -8219050 -12063174 -14796204
37423 -14796204 -13934096 -10072621 -5876893 -3317609 -3100503 -4927985 -6292737 -3723515
37415 -3723515 1610482 2661495 -4603276 -13950585 -16169633 -11182986 -6248575 -4101006
37407 -4101006 -1124480 3095115 3645872 -319625 -2764262 -930276 -490108 -5815581
37399 -5815581 -12179510 -13621000 -12619616 -14819714 -18386268 -16355299 -7516177 2114871
37391 2114871 7863695 10057748 9222916 4102606 -3598599 -7476584 -2826162 7160218
37383 7160218 13703446 10404760 -1203753 -12814245 -16324974 -11303147 -5238589 -4985532
37375 -4985532 -9041185 -10507284 -6336186 -169503 3350052 2870768 -1259915 -7968489
37367 -7968489 -13241836 -12031776 -5609740 -2504391 -7716263 -15033368 -15679299 -10917825
37359 -10917825 -8427406 -8435619 -3295242 8201373 16240849 13793770 6109070 660528
37351 660528 -4103362 -12019803 -18225389 -15184376 -5754516 52943 -587210 -1749640
37343 -1749640 -14822 2643644 6490993 13838868 20391264 17678355 6700307 -1142322
37335 -1142322 -285421 1810914 -1775072 -6560512 -5568170 -446475 3515522 6422827
37327 6422827 10562758 13933495 13678539 10983394 7066503 128110 -8215139 -10329738
37319 -10329738 -3242577 4559876 4545956 361478 748539 6033049 10217080 11332566
37311 11332566 10799306 7134496 -576261 -7024480 -7300482 -4950374 -4875380 -3726805 2460216
37302 2460216 7028790 1898302 -6485155 -4999482 4547725 7131841 -1864800 -10352676
37294 -10352676 -9776059 -6644686 -8296758 -10637982 -8005468 -4529666 -6693544 -12127416
37286 -12127416 -14107016 -11822520 -9141432 -7409745 -5645696 -4828174 -6957763 -11598714
37278 -11598714 -16047274 -17091037 -12362088 -3720527 1279747 -2823723 -10217716 -9743379
37270 -9743379 -968904 4089939 -1952503 -11554321 -13609338 -7622844 -774050 3097360
37262 3097360 5068397 5779282 4664158 2554212 856633 -397985 -1520174 -2488332
37254 -2488332 -4353064 -7760605 -9430398 -5112958 2716871 6067280 2560878 -938336
37246 -938336 890362 3937333 2574883 -274198 1985768 7619505 6862150 -4881248
37238 -4881248 -18913867 -21286078 -8260246 8436945 13910029 6900419 33684 2271207
37230 2271207 7883730 7684616 3899885 4722705 9266013 9535015 5007758 3141440 5919924
37221 5919924 8034402 8591922 11485348 12884288 3250983 -14057669 -21248039 -10285115
37213 -10285115 4805234 8275570 2803596 -420025 27752 -784633 -1839070 474857
37205 474857 3711654 4994330 8441818 16361186 20239085 12250380 -525070 -5496405
37197 -5496405 -2669580 -1064493 -2169779 -293074 4160248 5105216 2349371 533019
37189 533019 -1127876 -5806135 -8649674 -3009253 5124645 3856822 -4322735 -5179775
37181 -5179775 3241173 6589826 -1461891 -8027410 -2140734 7888788 8580756 668177
37173 668177 -6517424 -9853516 -10311632 -4957109 6639418 15085700 13046260 8800747
37165 8800747 14383201 24484852 22750490 8166188 -1504560 3464003 9935669 2396814
37157 2396814 -13877801 -21903165 -17627841 -12470213 -14169298 -17564593 -15431745 -7988298
37149 -7988298 1568056 12180841 20901264 21208060 11840581 2174844 1808532 7927676
37141 7927676 9607303 2383039 -8079957 -15187896 -17175115 -14155607 -6664504 1803036
37133 1803036 6953868 9611428 13944392 19298604 20277528 15878779 11210018 8305806
37125 8305806 3343225 -3894352 -6634189 -2561717 -210194 -6238051 -13283644 -9946623
37117 -9946623 1881914 9956044 9474402 7383476 8865296 9828282 6050943 1613544
37109 1613544 2884242 8943327 13359736 13265307 11966710 12571833 12501377 6374133 -6481168
37100 -6481168 -19506216 -25016839 -21661723 -14297424 -7826726 -3832511 -2291662 -2758999
37092 -2758999 -3512371 -2925755 -2065994 -2745127 -3433904 -1293341 2308095 3652360 3709198
37083 3709198 6661138 10941926 9751551 2721921 -1329383 2655946 8152754 7509861
37075 7509861 3202718 2371676 5925563 9605744 11425182 12251454 12781160 14321569 18182310
37066 18182310 21103011 17622767 10318941 9113429 15478601 17568593 8660100 -328461
37058 -328461 2474596 10419414 9086184 -935182 -7080087 -5605656 -3593577 -2922634
37050 -2922634 1618999 8384295 8581847 1915222 -1707651 883330 1052894 -5360903
37042 -5360903 -9551859 -4037162 5005949 6947876 642860 -6876417 -9270098 -3751193
37034 -3751193 8377361 19184877 18074668 3506261 -13373545 -20493824 -16456104 -8250688
37026 -8250688 -2481214 -1780447 -5371972 -9776263 -11593934 -11078893 -10494633 -9505339 -6210714
37017 -6210714 -1901990 115177 -244752 -652777 -1015687 -1976557 -930600 4038205 8527457
37008 8527457 7186030 1955613 -2851242 -9630076 -21191634 -29215040 -22558431 -5920190
37000 -5920190 4168136 2645324 456288 4006915 6232629 2638331 4126 1971713
36992 1971713 1231318 -5120954 -7180226 -6981 4013891 -6168596 -20819716 -23236044
36984 -23236044 -13918694 -5923738 -3345154 -288530 3354071 1155935 -6058331 -9598379
36976 -9598379 -6504298 -2395332 -688254 556236 1162789 -1483862 -4999041 -3999075
36968 -3999075 65536 639135 -2039813 -940316 4726623 7250814 3919075 1832735
36960 1832735 4317144 2962083 -8777096 -21940946 -22146073 -9474638 1455762 541175
36952 541175 -7244468 -11564648 -9238717 -3511783 2744031 7179399 5434136 -4019301
36944 -4019301 -13689580 -13556444 -4920231 -74391 -5254086 -11986364 -10676929 -4699658
36936 -4699658 -2717066 -3908233 -1792287 1912872 -104693 -6317181 -7582472 -2837293
36928 -2837293 -499396 -2704154 -1540013 5751762 11115708 9887321 7617738 7072652
36920 7072652 1976018 -8687519 -13503174 -5445544 6168605 10696771 10844947 10841917
36912 10841917 3426042 -15429308 -30020322 -22725867 -2129290 6136649 -6015372
36905 -6015372 -21953728 -26807867 -22846596 -16643515 -8600504 -692234 -44237 -7618311
36897 -7618311 -13949087 -12167642 -6620130 -4080118 -4794981 -6310866 -8181852 -9024678
36889 -9024678 -6270178 -2034675 -1903742 -5179491 -4180642 3678090 10901758 10460483 4124190
36880 4124190 -2828648 -7972946 -9914571 -7772549 -5576694 -9127371 -15059054 -11931272
36872 -11931272 3025131 17305867 19703588 15106309 14788076 19227001 20381931 16221030
36864 16221030 12369706 10985563 7810254 1354753 -2877588 -375124 5184565 6233249
36856 6233249 566505 -6572155 -9516045 -9358323 -12092918 -19328920 -24036393 -18875835
36848 -18875835 -6696485 2211773 2759700 -435277 -1444320 157050 2603118 6060650
36840 6060650 10150578 12062215 10623009 8433932 6957570 3520793 -3321332 -9155152
36832 -9155152 -8453264 -1442554 6833267 11625329 10091083 1623972 -9379861 -14178947
36824 -14178947 -8125312 2775700 7898775 4033808 -2070490 -2883749 1611607 5727588
36816 5727588 5760117 3629830 2747311 2383112 -752276 -5354523 -5010918 1802776 6336840
36807 6336840 891889 -8088039 -7512290 2907334 9473477 4548275 -3450026 -4853865
36799 -4853865 -2716145 -4223800 -7543563 -7640090 -8342491 -16488276 -27656715 -30012590
36791 -30012590 -21611979 -12629686 -9670782 -8839826 -6759987 -7492242 -13269742 -17615753
36783 -17615753 -15001519 -10662319 -12630494 -18329517 -17660948 -7637762 4092255 10469951
36775 10469951 12465483 13404975 12305762 6974947 -304594 -4996234 -6525064 -8017349
36767 -8017349 -10182710 -9428606 -3496254 3567474 4489885 -3280664 -13800903 -17576572
36759 -17576572 -10997699 -774811 2759112 -2177784 -5734065 1516812 15414776 22272866
36751 22272866 16262055 6678690 4936216 9755848 10801141 3794201 -4697404 -7108727
36743 -7108727 -3393422 1930315 6574199 11301347 16279786 19479466 18652784 14062932
36735 14062932 9118549 7666759 9911543 11753211 9058553 1816232 -6326651 -11070609
36727 -11070609 -9851045 -4184557 -374591 -3688321 -9976523 -8341899 4229140 16604374
36719 16604374 17548220 10565980 6928054 8624400 8684676 5988148 7409561 13945437
36711 13945437 16642125 10742293 3825400 3844041 7215972 5642634 -1559044 -8800209
36703 -8800209 -12945448 -14219227 -12455230 -8493860 -5848375 -5586421 -3354986 2959630
36695 2959630 6958723 2058411 -7497047 -12111073 -11331763 -13915723 -22899569 -29226055
36687 -29226055 -23823298 -10093042 326817 1247275 -2779371 -3827426 222285 4993956
36679 4993956 6360842 5234727 4591148 4150130 1449882 -2686090 -4265925 -2421670
36671 -2421670 -1013660 -2223148 -3038038 -644677 2992855 5065518 6353489 8159120
36663 8159120 8680822 6478447 4079119 3996110 4528613 3727363 3818437 6718536 8731709
36654 8731709 5528736 -441042 -3586431 -3884432 -5638443 -9256392 -10745673 -8685879
36646 -8685879 -6032122 -5514350 -7771666 -12201477 -14990384 -9842654 2799692 11231071
36638 11231071 5884555 -6063919 -10001118 -5137148 -3353371 -7481568 -6750895 2296234
36630 2296234 7159110 642532 -4371593 5143316 19480463 19876956 7559925 880283
36622 880283 6420894 11668548 8200499 4317035 8227575 13781901 12425117 7610259
36614 7610259 6301753 5119371 -2733708 -12689147 -13896834 -6335030 -456974 -224131
36606 -224131 1478329 8564841 14177268 11879806 5201001 395936 -2713869 -6499768
36598 -6499768 -8722839 -7048840 -5271665 -7722537 -11405284 -10883808 -7453688 -5851553
36590 -5851553 -5081316 -1100077 3818123 4076242 1936123 5106202 12536236 13764179
36582 13764179 5288369 -3213313 -3660027 -323662 300013 436245 3660439 5468652
36574 5468652 1411644 -2391805 1593103 7725477 4290625 -7615158 -15314585 -14095226
36566 -14095226 -12245911 -14585413 -14234984 -6402049 816128 -2375263 -12989758 -20134131
36558 -20134131 -19129800 -13169259 -5066360 4415458 11827248 12243931 5788873 -2053352
36550 -2053352 -6866353 -8023019 -5508221 1099291 9534081 14828216 14407284 10935857
36542 10935857 8703758 8872247 9231873 7059529 1326987 -6396548 -12210001 -12498429
36534 -12498429 -7782010 -3018078 -2364011 -4168571 -3305642 1382611 4813934 2643357
36526 2643357 -2102054 -3182532 -884605 -2486400 -11535401 -21519637 -23859506 -18670946
36518 -18670946 -12772807 -9260292 -5071305 1093950 4563643 1205765 -5760543 -9116359
36510 -9116359 -6216640 -1277549 461003 -1519083 -3827417 -4288088 -4275573 -5256000 -5027772
36501 -5027772 -552854 5829840 7424808 2195052 -3702788 -4918285 -5180012 -10968408
36493 -10968408 -19849871 -22304671 -14753367 -3976729 2336094 3199659 1047419 -2618181
36485 -2618181 -5193506 -2316879 6236357 13709249 13577369 7053649 220058 -3480953
36477 -3480953 -4520094 -3852700 -2321878 -1850127 -3396028 -4433894 -1491724 5152714
36469 5152714 11412003 13365207 9642583 1069728 -9787081 -19006574 -22971399 -20454682
36461 -20454682 -13732887 -8142374 -8614591 -14069950 -16990078 -12464108 -5865559 -5676816
36453 -5676816 -9817386 -7477428 3987914 13393390 11443736 3290193 -1382731 -2720301
36445 -2720301 -5945210 -8756162 -5039830 2162932 3451501 -1626341 -3390172 2393858
36437 2393858 8329153 7872181 4302993 2632965 1221697 -2238278 -3183961 3753793
36429 3753793 14876796 20521129 16655678 8459963 3189850 3241454 5877574 7119521
36421 7119521 5688058 3759599 3379094 3413487 2695838 4398523 12045202 21597379 24039127
36412 24039127 17189632 8482423 3979014 1621422 -1562977 -3143514 -908445 2260923
36404 2260923 4597716 9308581 15684092 14229723 33202 -15434805 -17148537 -6984825
36396 -6984825 413444 -572104 -1780475 2200309 6171736 5648748 4171089 4887551 4663618
36387 4663618 1230853 -2249899 -3815501 -5589957 -6479039 -1267885 8476516 12354528
36379 12354528 5898731 -2011000 -3210949 -2211905 -6138901 -12260138 -15239520 -17804614
36371 -17804614 -22761161 -22672503 -11106232 2366669 3661827 -3635453 -3844010 5153440
$$ [...]
##END NTUPLES=NMR SPECTRUM
##END=
