##TITLE=31Pdec_SR125
 , 24 sc
 11.5.2022
##JCAMPDX= 6.0         $$ Bruker NMR JCAMP-DX V2.0
##DATA TYPE= NMR SPECTRUM
##DATA CLASS= NTUPLES
##ORIGIN= UXNMR, Bruker Analytische Messtechnik GmbH
##OWNER= root
$$ XWIN-NMR		Version 3.5
$$ Wed May 11 11:38:30 2022 Russian Standard Time (UT+4h)  she@DPX200
##.OBSERVE FREQUENCY= 81.013821
##.OBSERVE NUCLEUS= ^31P
##.ACQUISITION MODE= SIMULTANEOUS
##.ACQUISITION SCHEME= undefined
##.AVERAGES= 24
##.DIGITISER RES= 16
##SPECTROMETER/DATA SYSTEM= spect
##.PULSE SEQUENCE= zgpg30
##.SOLVENT NAME= CDCl3
##.SHIFT REFERENCE= (INTERNAL, CDCl3, 0, 248.564)
##AUDIT TRAIL= $$ (NUMBER, WHEN, WHO, WHERE, WHAT)
$$ ##TITLE= Audit trail, XWIN-NMR		Version 3.5
$$ ##JCAMPDX= 5.01
$$ ##ORIGIN= Bruker BioSpin GmbH
$$ ##OWNER= she
$$ F:/spectra/data/she/nmr/P31/1/pdata/1/auditp.txt
$$ ##AUDIT TRAIL=  $$ (NUMBER, WHEN, WHO, WHERE, WHAT)
(   1,<2022-05-11 11:37:39.92 +0400>,<she>,<DPX200>,
      <created by zg, POWCHK disabled, PULCHK disabled
       configuration hash MD5:
       00 E9 B6 7A A2 85 ED C7 34 08 36 98 17 FE 4E 26
       data hash MD5: 32K
       2A 6A 7D 32 2A 84 71 6F 71 6B 32 72 10 D7 63 DA>)
(   2,<2022-05-11 11:37:46.51 +0400>,<she>,<DPX200>,
      <Start of raw data processing
       efp BC_mod = 2 LB = 1 FT_mod = 6 PKNL = 1 PHC0 = -9787.885 PHC1 = -145.9463 SI = 64K 
       data hash MD5: 64K
       F0 54 8C F6 C5 C0 B2 F2 4F EF 13 7C F4 A3 83 FA>)
(   3,<2022-05-11 11:38:03.23 +0400>,<she>,<DPX200>,
      <pk PHC0 = -17.46109 PHC1 = 9.200001 
       data hash MD5: 64K
       81 48 6F 00 A3 B7 D0 B7 44 38 B6 28 1D A2 CF 10>)
(   4,<2022-05-11 11:38:06.84 +0400>,<she>,<DPX200>,
      <abs ABSG = 5 
       data hash MD5: 64K
       94 2F 53 43 8D CA CD A6 C6 CA 52 97 14 CD EB F1>)
$$ ##END=
$$ 
$$ hash MD5
$$ 8B 93 9E C1 CC BB CC 68 D6 28 50 0C FC CB 76 1A
##$RELAX= 
##$RELAX= 
##$RELAX= 
##$RELAX= 
##$RELAX= 
##$RELAX= 
##$RELAX= 
##$RELAX= 
$$ Bruker specific parameters
$$ --------------------------
##$DU= <F:/spectra>
##$EXPNO= 1
##$NAME= <P31>
##$PROCNO= 1
##$TYPE= <nmr>
##$USER= <she>
##$AMP= (0..31)
100 100 100 100 100 100 100 100 100 100 100 100 100 100 100 100 100 100 
100 100 100 100 100 100 100 100 100 100 100 100 100 100 
##$AQSEQ= 0
##$AQ_mod= 1
##$AUNM= <au_zg>
##$AUTOPOS= <>
##$BF1= 81.014009
##$BF2= 200.13
##$BF3= 200.13
##$BF4= 200.13
##$BF5= 200.13
##$BF6= 200.13
##$BF7= 200.13
##$BF8= 200.13
##$BYTORDA= 1
##$CFDGTYP= 0
##$CFRGTYP= 5
##$CHEMSTR= <none>
##$CNST= (0..31)
1 1 145 1 1 1 1 1 1 1 1 1 1 1 1 1 1 1 1 1 1 1 1 1 1 1 1 1 1 1 1 1 
##$CPDPRG= <waltz16>
##$CPDPRG1= <>
##$CPDPRG2= <waltz16>
##$CPDPRG3= <>
##$CPDPRG4= <mlev>
##$CPDPRG5= <mlev>
##$CPDPRG6= <mlev>
##$CPDPRG7= <mlev>
##$CPDPRG8= <mlev>
##$CPDPRGB= <>
##$CPDPRGT= <>
##$D= (0..31)
0 1 0 0 0 0 0 0 0 0 0 0.03 2e-05 3e-06 0 0 0 0 0 0 0 0 0 0 0 0 0 0 0 0 
0 0 
##$DATE= 1652254659
##$DBL= (0..7)
120 120 120 11 120 120 24 19 
##$DBP= (0..7)
150 150 150 150 150 150 150 150 
##$DBP07= 0
##$DBPNAM0= <>
##$DBPNAM1= <>
##$DBPNAM2= <>
$$ [...]
##$SUBNAM3= <"">
##$SUBNAM4= <"">
##$SUBNAM5= <"">
##$SUBNAM6= <"">
##$SUBNAM7= <"">
##$SUBNAM8= <"">
##$SUBNAM9= <"">
##$SW= 501.771253377433
##$SWIBOX= (0..15)
0 1 3 0 0 0 0 0 0 0 0 0 0 0 0 0 
##$SW_h= 40650.406504065
##$TD= 32768
##$TD0= 1
##$TE= 0
##$TE2= 300
##$TE3= 300
##$TEG= 300
##$TL= (0..7)
0 120 53 12 22 120 120 120 
##$TP= (0..7)
150 150 150 150 150 150 150 150 
##$TP07= 0
##$TPNAME0= <>
##$TPNAME1= <>
##$TPNAME2= <>
##$TPNAME3= <>
##$TPNAME4= <>
##$TPNAME5= <>
##$TPNAME6= <>
##$TPNAME7= <>
##$TPOAL= (0..7)
0.5 0.5 0.5 0.5 0.5 0.5 0.5 0.5 
##$TPOFFS= (0..7)
0 0 0 0 0 0 0 0 
##$TUNHIN= 0
##$TUNHOUT= 0
##$TUNXOUT= 0
##$USERA1= <user>
##$USERA2= <user>
##$USERA3= <user>
##$USERA4= <user>
##$USERA5= <user>
##$V9= 5
##$VALIST= <valist>
##$VCLIST= <CCCCCCCCCCCCCCC>
##$VD= 0
##$VDLIST= <DDDDDDDDDDDDDDD>
##$VPLIST= <PPPPPPPPPPPPPPP>
##$VTLIST= <TTTTTTTTTTTTTTT>
##$WBST= 1024
##$WBSW= 4
##$XGAIN= (0..3)
0 0 0 0 
##$XL= 0
##$YL= 0
##$YMAX_a= 12281
##$YMIN_a= -17263
##$ZGOPTNS= <>
##$ZL1= 120
##$ZL2= 120
##$ZL3= 120
##$ZL4= 120
##$ABSF1= 248.5645
##$ABSF2= -253.2056
##$ABSG= 5
##$ABSL= 3
##$ALPHA= 0
##$AQORDER= 0
##$ASSFAC= 0
##$ASSFACI= 0
##$ASSFACX= 0
##$ASSWID= 0
##$AUNMP= <proc_1d>
##$AZFE= 0.1
##$AZFW= 0.5
##$BCFW= 0
##$BC_mod= 2
##$BYTORDP= 0
##$COROFFS= 0
##$CY= -3
##$DATMOD= 1
##$DC= 0
##$DFILT= <>
##$DTYPP= 0
##$F1P= 0
##$F2P= 0
##$FCOR= 1
##$FTSIZE= 65536
##$FT_mod= 6
##$GAMMA= 0
##$GB= 0
##$INTBC= 1
##$INTSCL= 5.30512e-09
##$ISEN= 30
##$LB= 1
##$LEV0= 0
##$LPBIN= 0
##$MAXI= 10000
##$MC2= 0
##$MEAN= 0
##$ME_mod= 0
##$MI= 50
##$NCOEF= 0
##$NC_proc= -7
##$NLEV= 6
##$NOISF1= 182.463
##$NOISF2= 159.3651
##$NSP= 0
##$NTH_PI= 0
##$NZP= 0
##$OFFSET= 248.5645
##$PC= 4
##$PHC0= -9805.346
##$PHC1= -136.7463
##$PH_mod= 1
##$PKNL= yes
##$PPARMOD= 0
##$PSCAL= 0
##$PSIGN= 0
##$REVERSE= no
##$SF= 81.014009
##$SI= 65536
##$SIGF1= 159.3651
##$SIGF2= -187.1042
##$SINO= 113.3802
##$SIOLD= 16384
##$SREGLST= <1H.CDCl3>
##$SSB= 0
##$STSI= 65536
##$STSR= 0
##$SW_p= 40650.406504065
##$SYMM= 0
##$S_DEV= 0
##$TDeff= 32768
##$TDoff= 0
##$TI= <>
##$TILT= no
##$TM1= 0
##$TM2= 0
##$TOPLEV= 0
##$USERP1= <user>
##$USERP2= <user>
##$USERP3= <user>
##$USERP4= <user>
##$USERP5= <user>
##$WDW= 1
##$XDIM= 65536
##$YMAX_p= 481548588
##$YMIN_p= -134612068
$$ End of Bruker specific parameters
$$ ---------------------------------
##NTUPLES= NMR SPECTRUM
##VAR_NAME=  FREQUENCY,     SPECTRUM/REAL,   SPECTRUM/IMAG
##SYMBOL=    X,             R,               I
##VAR_TYPE=  INDEPENDENT,   DEPENDENT,       DEPENDENT
##VAR_FORM=  AFFN,          ASDF,            ASDF
##VAR_DIM=   65536,         65536,           65536
##UNITS=     HZ,            ARBITRARY UNITS, ARBITRARY UNITS
##FACTOR=    0.620285442955139, 1,           1
##FIRST=     20137.2065510759, 0,            0
##LAST=      -20513.1999529892, 0,           0
##MIN=       -20513.1999529892, -134612068,  0
##MAX=       20137.2065510759, 481548588,    0
$$ Real data points
##PAGE= N=1
##DATA TABLE= (X++(R..R)), XYDATA
$$ [...]
$$ plain form
39828 8112995 8763041 9843649 9520505 7864157 6574811 6143179 5238330 3398994 2374129
39819 2374129 3693284 6326623 7940753 7528036 5897982 4478428 4427024 6002023 7984514
39810 7984514 8539041 7379698 6278981 6784046 8327419 9299446 9065042 8119081 7105814
39801 7105814 6557205 6909167 7975354 8927381 9291910 9331950 9215187 8812650 8531696
39792 8531696 8951463 9282461 8008068 5762777 5353494 7515599 8953841 6869403 3515548
39783 3515548 3294833 6512485 9252843 8996616 7072558 5336826 3651747 1643914
39775 1643914 259489 175845 666617 1231273 2512252 4505761 5793293 5830181 6073567
39766 6073567 7295381 7662769 5466867 2195635 623602 967836 1275322 799768 522551
$$ packed form
39828H112995O50046J080608l23144j656348j289346m31632r04849j839336j024865
39819B374129J319155K633339J614130m12717j630054j419554n1404J574999J982491
39810G984514N54527j159343j100717N05065J543373R72027k34404r45961j013267
39801G105814n48609L51962J066187R52027L64529M0040j16763m02537k80954
39792H531696M19767L30998j274393k245291m09283K162105J438242k084438l353855
39783C515548k20715L217652K740358k56227j924058j735732j685079k007833
39775A643914j384425q3644M90772N64656J280979J993509J287532L6888K43386
39766F073567J221814L67388k195902l271232j572033L44234L07486m75554k77217
$$ plain form
39757 522551 772714 870285 1099268 2538791 4593176 5080254 3439792 1631830 1035960
39748 1035960 757562 141434 464161 2227726 3085452 1276129 -458347 2118659 8194538
39739 8194538 11929689 9859951 5240943 3338012 4770837 5920839 4555478 2314877
39731 2314877 1683279 2711163 3586480 3287345 2730600 3549164 6137737 8962691 9950820
39722 9950820 8614173 6371574 4602848 3159538 1397877 -133316 -179294 1359981
39714 1359981 3155461 3999316 3723775 2639359 1066718 -378306 -871425 -127735 1284286
39705 1284286 2346157 2048882 19731 -2629776 -3791946 -2761293 -1418065 -1620485
39697 -1620485 -2253246 -946298 1825326 3117279 2153046 1491513 2510803 2808614 105692
$$ packed form
39757E22551K50163R7571K28983J439523K054385M87078j640462j807962n95870
39748A035960k78398o16128L22727J763565Q57726j809323j734476K577006O075879
39739H194538L735151k069738m619008j902931J432825J150002j365361k240601
39731B314877o31598J027884Q75317k99135n56745Q18564K588573K824954R88129
39722I950820j336647k242599j768726j443310j761661j531193m5978J539275
39714A359981J795480Q43855k75541j084416j572641j445024m93119P43690J412021
39705A284286J061871k97275k029151k649507j162170J030653J343228k02420
39697a620485o32761J306948K771624J291953r64233o61533J019290K97811k702922
$$ plain form
39688 105692 -3840903 -5806485 -5631107 -5385475 -5502523 -4784788 -3372195 -2675354 -2720946
39679 -2720946 -2251181 -1132704 -76905 1506212 4363158 6498689 5011111 1076454
39671 1076454 -741048 869085 1942458 -333139 -3007929 -2081443 1282041 2879911
39663 2879911 1775436 668140 1047558 1683760 1729439 1981643 2597450 2340898 973296
39654 973296 203439 1163445 2494808 2086341 -135378 -1995330 -1366730 1542730 4101748
39645 4101748 3872289 1530107 183528 1232963 2441024 1410954 -698804 -1105405
39637 -1105405 267487 1180856 1064529 1409373 2218530 1509428 -797269 -1809201 -149093
39628 -149093 1408618 157081 -2019579 -1367011 1856900 3552596 1719874 -761204
$$ packed form
39688A05692l946595j965582J75378K45632j17048P17735J412593O96841m5592
39679b720946M69765J118477J055799J583117K856946K135531j487578l934657
39671A076454j817502J610133J073373k275597k674790R26486L363484J597870
39663B879911j104475j107296L79418O36202M5679K52204O15807k56552j367602
39654I73296p69857R60006J331363m08467k221719j859952O28600K909460K559018
39645D101748k29459k342182j346579J049435J208061j030070k109758m06601
39637a105405J372892R13369j16327L44844Q09157p09102k306697j011932J660108
39628a49093J557711j251537k176660O52568L223911J695696j832722k481078
$$ plain form
39620 -761204 -254752 2833117 4903118 3746158 731919 -1383205 -1496110 -431508 930444
39611 930444 2504260 3916146 3974139 2221342 129687 -578228 -268577 -604720 -1820893
39602 -1820893 -2581273 -2475591 -2543161 -2871635 -1938002 543373 2219909 1295557 -501014
39593 -501014 -275317 1754920 2646528 979494 -1507987 -2660974 -2277287 -1145118 569062
39584 569062 2817430 4537970 4332534 2206552 -139710 -1020763 -498446 -117814 -916972
39575 -916972 -2118070 -2198727 -881431 730600 1758976 2121895 1486739 -693865 -3331853
39566 -3331853 -3550779 -19043 4523005 5924283 3492900 515500 -51565 1304747
39558 1304747 2270407 1862569 962812 635594 1086186 2030980 3142042 3902939 3618516
$$ packed form
39620g61204N06452L087869K070001j156960l014239k115124j12905J064602J361952
39611I30444J573816J411886N7993j752797k091655p07915L09651l36143j216173
39602a820893p60380J05682o7570l28474R33633K481375J676536r24352j796571
39593e01014K25697K030237Q91608j667034k487481j152987L83687J132169J714180
39584E69062K248368J720540k05436k125982k346262q81053N22317L80632p99158
39575i16972j201098q0657J317296J612031J028376L62919o35156k180604k637988
39566c331853k18926L531736M542048J401278k431383k977400n67065J356312
39558A304747R65660m07838q99757l27218M50592R44794J111062P60897k84423
$$ plain form
39549 3618516 2107209 301024 -396912 325072 1180057 872562 -170956 -468639 384110
39540 384110 1368360 1808359 2118244 2446431 2072915 956591 497130 1596969 3090672
39531 3090672 3421663 2955912 3176076 4268132 5021625 4701351 3621600 2213660 883877
39522 883877 484706 1501435 2900117 3106305 2070893 1162106 1131087 1437428 1519486
39513 1519486 1459316 1353011 1201547 1457868 2563214 3964458 4703710 4864001 5207061
39504 5207061 5540340 4921652 3560342 2982082 3923192 5358271 6021764 5742954 4965904
39495 4965904 4171229 4181051 5814560 8603279 10746610 10893734 9348576 7342716 5892662
39486 5892662 5418449 5524202 5029312 3179543 952691 219397 1517913 3557351 4872081
$$ packed form
39549C618516j511307j806185o97936P21984Q54985l07495j043518k97683Q52749
39540C84110R84250M39999L09885L28187l73516j116324m59461J099839J493703
39531C090672L30991m65751K20164J092056P53493l20274j079751j407940j329783
39522H83877l99171J016729J398682K06188j035412r08787l1019L06341Q2058
39513A519486o0170j06305j51464K56321J105346J401244P39252J60291L43060
39504E207061L33279o18688j361310n78260R41110J435079O63493k78810p77050
39495D965904p94675R822J633509K788719K143331J47124j545158k005860j450054
39486E892662m74213J05753m94890j849769k226852p33294J298516K039438J314730
$$ plain form
39477 4872081 4994184 4141596 2854464 1828164 1109150 -140436 -1979846 -2659264 -962566
39468 -962566 1330980 1692639 904000 1940185 4953079 6760091 5986278 5276302 6917164
39459 6917164 9322271 9847827 8557290 7024789 5530052 3655363 1920989 787722
39451 787722 -352991 -1376986 -475966 2936070 6178101 6433903 4339386 2283910 945390
39442 945390 9139 458153 2998616 5485077 5147564 2593591 640180 30047 -553408
39433 -553408 -1016568 19306 1891920 2329641 1464079 1953780 4525413 6724329 6986515
39424 6986515 6725004 7126570 6935313 5107483 3062433 2412093 2564875 2383292 2355536
39415 2355536 3314827 4572809 5029567 4794622 4230246 2812664 516780 -1004628 -328084
$$ packed form
39477D872081J22103q52588j287132j026300p19014j249586j839410o79418J696698
39468i62566K293546L61659p88639J036185L012894J807012p73813p09976J640862
39459F917164K405107N25556j290537j532501j494737j874689j734374j133267
39451G87722j140713j023995R01020L412036L242031K55802k094517k055476j338520
39442I45390r36251M49014K540463K486461l37513k553973j953411o10133n83455
39433e53408m63160J035874J872614M37721q65562M89701K571633K198916K62186
39424F986515k61511M01566j91257j827830k045050o50340J52782j81583k7756
39415B355536R59291J257982M56758k34945n64376j417582k295884j521408O76544
$$ plain form
39406 -328084 1684566 3263874 4164840 5184607 6162878 6112391 4816512 2955245 1100351
39397 1100351 -369876 -1008296 -974674 -1226652 -2016883 -2067180 -377785 2032337 3460561
39388 3460561 3766696 3972712 4456379 4982767 5738075 6737077 6897035 5434019 3616253
39379 3616253 3283130 4082371 4207516 3547608 3724270 4911675 5246766 4141077 3583641
39370 3583641 4731134 5554632 3996121 1641749 1538481 3342054 3657673 1261905 -870762
39361 -870762 245803 3621679 5965281 5740708 3900129 1802177 388061 752011 3280983
39352 3280983 6040234 5974514 2504985 -1412400 -2594027 -895166 1523465 2965003
39344 2965003 3149469 2388386 1219482 492920 709137 1469735 2323307 3586165 5344493
$$ packed form
39406c28084K012650J579308R00966J019767R78271n0487j295879j861267j854894
39397A100351j470227o38420L3622k51978p90231n0297J689395K410122J428224
39388C460561L06135K06016M83667N26388P55308R99002J59958j463016j817766
39379C616253l33123P99241J25145o59908J76662J187405L35091j105689n57436
39370C583641J147493Q23498j558511k354372j03268J803573L15619k395768k132667
39361h70762J116565L375876K343602k24573j840579k097952j414116L63950K528972
39352C280983K759251o5720l469529l917385j181627J698861K418631J441538
39344B965003J84466p61083j168904p26562K16217P60598Q53572J262858J758328
$$ plain form
39335 5344493 6327166 5255605 3066489 2198036 3466359 5103314 5374640 4808824 4974914
39326 4974914 6085901 7014568 7250261 7564596 8393446 8459840 6082456 1933029 -707204
39317 -707204 388442 3127459 3388414 721103 -572175 2731715 8128078 10823411
39309 10823411 10082284 9088027 9431125 9411453 8079460 7290977 8273687 9138323 7924687
39300 7924687 5925853 5617872 6783742 7097811 5715900 4105401 3705371 4580100 6147188
39291 6147188 7650221 8088886 7140241 6025687 6105052 6773874 6249788 4446600 3383336
39282 3383336 4237855 5547007 5351727 3985977 3331857 3866974 4106944 3225316 2635496
39273 2635496 3812745 5600681 5539492 3690704 2976301 4904564 7028006 6410961 4046269
$$ packed form
39335E344493R82673j071561k189116q68453J268323J636955K71326n65816J66090
39326D974914J110987R28667K35693L14335Q28850O6394k377384m149427k640233
39317g07204J095646K739017K60955k667311j293278L303890N396363K695333
39309A0823411p41127r94257L43098j9672j331993p88483R82710Q64636j213636
39300G924687j998834l07981J165870L14069j381911j610499m00030Q74729J567088
39291F147188J503033M38665r48645j114554P9365O68822n24086j803188j063264
39282C383336Q54519J309152j95280j365750o54120N35117K39970q81628n89820
39273B635496J177249J787936o1189j848788p14403J928263K123442o17045k364692
$$ plain form
39264 4046269 3334706 4954537 6087121 4891185 3013396 2700554 3639878 4059002 3433700
39255 3433700 2747499 3003277 4338080 5775615 5553854 2988526 210533 279104 3154591
39246 3154591 5608464 5751873 5198847 5652177 6120383 5446694 5020012 6308368 7655530
39237 7655530 6486395 3369098 1025096 373329 439165 1247823 3564494 6097513 6205821
39228 6205821 3750632 1543675 1479186 2575489 3289150 3472318 3438383 3171956 3123427
39219 3123427 3959647 5004779 4691066 2976011 1527638 1156679 961032 419675 319078
39210 319078 1006909 1678110 2055423 2863597 3991903 4234727 3627757 3846214 5238808
39201 5238808 5744349 4225907 2719839 3423653 5200133 5315271 3469631 1867397 1962261
$$ packed form
39264D046269p11563J619831J132584j195936j877789l12842R39324M19124o25302
39255C433700o86201K55778J334803J437535k21761k565328k777993O8571K875487
39246C154591K453873J43409n53026M53330M68206o73689m26682J288356J347162
39237G655530j169135l117297k344002o51767O5836Q08658K316671K533019J08308
39228F205821k455189k206957o4489J096303P13661J83168l3935k66427m8529
39219C123427Q36220J045132l13713j715055j448373l70959j95647n41357j00597
39210C19078O87831O71201L77313Q08174J128306K42824o06970K18457J392594
39201E238808N05541j518442j506068P03814J776480J15138j845640j602234R4864
$$ plain form
39192 1962261 3186955 4583110 5827542 6586135 6336640 5168681 3913459 3355110 3781672
39183 3781672 5023862 6383578 6878486 6113267 4651733 3298732 2531443 2691871 3772088
39174 3772088 4770936 4466348 3278912 3039265 4279499 5270014 4702105 3750987 4097070
39165 4097070 5308346 5897656 5884775 6448237 7795502 9187953 10442227 11564890 11493470
39156 11493470 9328459 6590728 6028011 7923182 9634011 9342793 8347487 8727374 10377849
39147 10377849 11614199 11602971 10908149 10278358 10045363 10425382 11471147 12723710 13491657
39138 13491657 13548309 13305603 13342628 13863439 14493258 14604398 14022764 13290759 12923033 12592045
39128 12592045 11542845 9694614 7754036 6296785 5380447 5061685 5542668 6633574
$$ packed form
39192A962261J224694J396155J244432P58593k49495j167959j255222n58349M26562
39183C781672J242190J359716M94908p65219j461534j353001p67289J60428J080217
39174C772088R98848l04588j187436k39647J240234R90515n67909r51118L46083
39165D097070J211276N89310j2881N63462J347265J392451J254274J122663p1420
39156A1493470k165011k737731n62717J895171J710829k91218r95306L79887J650475
39147A0377849J236350j1228o94822o29791k32995L80019J045765J252563P67947
39138A3491657N6652k42706L7025N20811O29819J11140n81634p32005l67726l30988
39128A2592045j049200j848231j940578j457251r16338l18762M80983J090906
$$ plain form
39120 6633574 7774469 8809107 10013129 11118043 11239942 10328521 9730244 10366003 11144461
39111 11144461 10520923 9143145 9178523 10848335 11577555 9623431 6898720 6452188 8238850
39102 8238850 9584363 9348113 9014761 9318034 8606428 6055317 4131348 5485935 8861022
39093 8861022 10668618 9815391 8313990 7500888 6534182 5001453 4280589 5256821 6803416
39084 6803416 7614943 7705353 7129333 5288634 2860193 2374047 4968370 8089699 8410133
39075 8410133 5899474 3176848 1995641 2382965 4126675 6666993 8186412 7384580
39067 7384580 5946537 6755027 9637218 11511203 11163755 11072389 13286010 16035786 16386951
39058 16386951 14420762 12494411 11522750 10528708 9471242 9825730 11663082 12408317 10159555
$$ packed form
39120F633574J140895J034638J204022J104914J21899r11421n98277O35759P78458
39111A1144461o23538j377778L5378J669812P29220j954124k724711m46532J786662
39102H238850J345513k36250l33352L03273p11606k551111j923969J354587L375087
39093H861022J807596q53227j501401q13102r66706j532729p20864R76232J546595
39084F803416Q11527R0410n76020j840699k428441m86146K594323L121329L20434
39075H410133k510659k722626j181207L87324J743710K540318J519419q01832
39067G384580j438043Q08490K882191J873985l47448r1366K213621K749776L51165
39058A6386951j966189j926351r71661r94042j057466L54488J837352P45235k248762
$$ plain form
39049 10159555 6971696 6793690 10337860 13886739 13791042 10639823 7864512 7382855 8263887
39040 8263887 9120647 9845013 10676636 11209990 11095362 10647161 10182832 9762826 9960965
39031 9960965 11540435 13702082 14128848 11865066 8906096 7687344 8105331 8392889 7917899
39022 7917899 7502272 7660224 8098238 8523145 8627160 7834512 6387321 5993483 7861744
39013 7861744 10676704 12136627 11992313 11874025 12547918 13157972 12958578 12092257 10878945
39004 10878945 9958561 10651932 13225938 15296991 14367617 11766007 11319565 13784587 15514921
38995 15514921 13733585 10438573 9302666 10691916 11837969 10851921 8735730 7753769
38987 7753769 8854475 10550888 10229624 7243441 4356775 4644148 7229399 8291851
$$ packed form
39049A0159555l187859j78006L544170L548879r5697l151219k775311m81657Q81032
39040H263887Q56760P24366Q31623N33354j14628m48201m64329m20006J98139
39031I960965J579470K161647M26766k263782k958970j218752M17987K87558m74990
39022G917899m15627J57952M38014M24907J04015p92648j447191l93838J868261
39013G861744K814960J459923j44314j18288O73893O10054j99394q66321j213312
39004A0878945r20384O93371K574006K071053r29374k601610m46442K465022J730334
38995A5514921j781336l295012j135907J389250J146053r86048k116191r81961
38987G753769J100706J696413l21264k986183k886666K87373K585251J062452
$$ plain form
38979 8291851 6467450 4540755 4836338 5768060 4833945 2692382 1855936 2951941 4682289
38970 4682289 6296280 7728534 8170205 6906194 5120523 4695168 5444322 5492435 4218179
38961 4218179 2903164 2492192 2629857 3150529 4658867 6973712 8499377 8081196 6540853
38952 6540853 5502128 5303177 4960276 4030413 3632037 5044569 7607418 9032278 8315984
38943 8315984 7331691 8316370 10589189 11588331 10695313 9632565 8998153 7302515 4372909
38934 4372909 2719689 3714723 5108273 4717887 4127830 5694301 7882042 7272655 4117154
38925 4117154 2087686 2801291 4187751 4512704 4582783 5222509 5682940 5655342 6128061
38916 6128061 7004836 6426711 3959677 2146776 3086368 5367000 6385159 6229044 7075258
$$ packed form
38979H291851j824401j926695K95583R31722r34115k141563q36446J096005J730348
38970D682289J613991J432254M41671j264011j785671m25355P49154M8113j274256
38961D218179j315015m10972J37665N20672J508338K314845J525665m18181j540343
38952F540853j038725j98951l42901r29863l98376J412532K562849J424860p16294
38943H315984r84293R84679K272819R99142q93018j062748o34412j695638k929606
38934D372909j653220R95034J393550l90386n90057J566471K187741o09387l155501
38925D117154k029468P13605J386460L24953P0079O39726M60431k7598M72719
38916F128061Q76775n78125k467034j812901R39592K280632J018159j56115Q46214
$$ plain form
38907 7075258 9519100 11563008 11217813 8743707 6154944 5245272 6097218 7128375 6761025
38898 6761025 5187812 4097932 4633013 6217950 7438746 7381073 6137047 4811876 4957525
38889 4957525 7026796 9406253 9965052 8460454 6380312 4791056 3829400 3977933 5795724
38880 5795724 8166500 8870423 7487576 5879138 5202271 4478260 2990537 1992392 2655284
38871 2655284 4011282 4354229 3320557 1466267 -644982 -1794321 -434322 2786961
38863 2786961 4666518 3482911 1662616 2221866 4150953 4060321 1382662 -992780 -926576
38854 -926576 845594 2889584 4930964 6982763 8415842 8471637 6662933 2918569 -1418204
38845 -1418204 -3487943 -1737784 1667828 3347490 3050795 3006001 3489572 2487501 162653
$$ packed form
38907G075258K443842K043908l45195k474106k588763r09672Q51946J031157l67350
38898F761025j573213j089880N35081J584937J220796n7673j244026j325171J45649
38889D957525K069271K379457N58799j504598k080142j589256r61656J48533J817791
38880E795724K370776P03923j382847j608438o76867p24011j487723r98145O62892
38871B655284J355998L42947j033672j854290k111249j149339J359999L221283
38863B786961J879557j183607j820295N59250J929087r0632k677659k375442O6204
38854i26576J772170K043990K041380K051799J433079N5795j808704l744364m336773
38845a418204k069739J750159L405612J679662k96695m4794M83571j002071k324848
$$ plain form
38836 162653 -119926 3133976 6748941 7556689 7133220 8796221 11844495 12411184 9279181
38827 9279181 5350618 3178985 2178997 1138046 740617 1899975 3417690 3309335 1622496
38818 1622496 213166 57418 331490 240965 306598 1135782 1949491 1511906 214329
38809 214329 2782 1904181 4604172 6155399 6318046 6240290 6406237 6232508 5542820
38800 5542820 4987454 4746796 4231221 3567235 3904350 5390302 6316738 5565240 4562452
38791 4562452 5081237 6207803 5723244 3892425 3279767 4679240 5888174 5366641 4606072
38782 4606072 5315259 6353485 5575599 3267146 1405500 444534 -620871 -1353469 202982
38773 202982 4099341 7321754 7370737 5475935 4814090 6454836 8497436 8868332 7705999
$$ packed form
38836A62653k82579L253902L614965Q07748m23469J663001L048274N66689l132003
38827I279181l928563k171633r99988j040951l97429J159358J517715j08355j686839
38818A622496j409330j55748K74072r0525O5633Q29184Q13709m37585j297577
38809B14329k11547J901399K699991J551227J62647p7756J65947j73729o89688
38800E542820n55366k40658n15575o63986L37115J485952R26436p51498j002788
38791D562452N18785J126566m84559j830819o12658J399473J208934n21533p60569
38782D606072P09187J038226p77886k308453j861646r60966j065405p32598J556451
38773B02982L896359L222413M8983j894802o61845J640746K042600L70896j162333
$$ plain form
38764 7705999 6700984 6777915 7075381 6403934 5259923 5370936 6914810 7539424 5435179
38755 5435179 2299785 1306553 2799267 4426206 5268607 6755131 8870791 8891788 5798958
38746 5798958 3027233 4066953 7416265 8896371 7423596 5297784 3907457 2674569
38738 2674569 1819184 2601573 4511398 5373024 4795481 4612293 5342329 5313862 4219738
38729 4219738 4303026 6440766 8048237 6979143 4941282 4604408 5470337 5358548 4360373
38720 4360373 4332316 5346249 5531973 4341713 3638871 5167524 8351719 10770627 10138320
38711 10138320 6462729 2936372 3348464 7448555 10532085 9299367 6208170 5521981
38703 5521981 6903267 6565301 3857506 2450798 4521318 7705150 9240186 9763582
$$ packed form
38764G705999j005015P6931K97466o71447j144011J11013J543874O24614k104245
38755E435179l135394r93232J492714J626939Q42401J486524K115660K0997l092830
38746E798958k771725J039720L349312J480106j472775k125812j390327j232888
38738B674569q55385P82389J909825Q61626n77543j83188P30036k8467j094124
38729D219738Q3288K137740J607471j069094k037861l36874Q65929j11789r98175
38720D360373k8057J013933J85724j190260p02842J528653L184195K418908o32307
38711A0138320l675591l526357M12092M100091L083530j232718l091197o86189
38703E521981J381286l37966k707795j406708K070520L183832J535036N23396
$$ plain form
38695 9763582 10992318 12380721 12500279 11769521 11440180 11394501 11222735 12063335 14759657
38686 14759657 17184465 16324006 12768286 10265812 10475986 10966001 9469387 7542594
38678 7542594 8027197 10650677 12542783 12263978 10953636 9732208 8353685 6842743
38670 6842743 6199263 6420999 5779299 3594500 2095443 3518668 6575035 8193929 8052235
38661 8052235 8616672 10760709 12307251 11693957 10318992 9845861 9618000 8626773 7976800
38652 7976800 9092170 10984391 11720199 11503957 11830622 12369594 11337477 8743654 6791954
38643 6791954 6852566 8097047 9352162 10366499 10943933 10661443 9875204 9445303 9227574
38634 9227574 8410785 7396405 7460922 8359654 8376384 7260498 6929500 8378840 10009485
$$ packed form
38695I763582J228736J388403J19558p30758l29341m5679j71766Q40600K696322
38686A4759657K424808q60459l555720k502474K10174M90015j496614j926793
38678G542594M84603K623480J892106k78805j310342j221428j378523j510942
38670F842743o43480K21736o41700k184799j499057J423225L056367J618894j41694
38661H052235N64437K144037J546542o13294j374965m73131k27861r91227o49973
38652G976800J115370J892221P35808k16242L26665N38972j032117k593823j951700
38643F791954O0612J244481J255115J014337N77434k82490p86239m29901k17729
38634I227574q16789j014380O4517Q98732J6730j115886l30998J449340J630645
$$ plain form
38625 10009485 10229784 9705821 9419803 8309323 5091269 1465176 1087769 5143950 10493488
38616 10493488 12822869 10997607 7892159 7032708 8660242 9661023 7750434 4755429
38608 4755429 4370927 7263692 10399685 11233550 10336960 9297692 8296103 6980181 5811040
38599 5811040 5042513 3924254 2363310 1839591 3101693 4495122 4418081 3996575 5140877
38590 5140877 7103822 7444332 5762307 4048719 3651103 4228324 5519017 7598438 9101146
38581 9101146 7780226 3857741 785851 1339474 4342418 6498769 6368065 5256225
38573 5256225 4901359 5575775 6375177 6560213 6398832 6802062 8096725 9420634 9749771
38564 9749771 9182426 8506852 7873619 6937430 6076271 6126326 6817881 6917951 6327720 6554700
$$ packed form
38625A0009485K20299n23963k86018j110480l218054l626093l77407M056181N349538
38616A0493488K329381j825262l105448q59451J627534J000781j910589k995005
38608D755429l84502K892765L135993Q33865q96590j039268j001589j315922j169141
38599E811040p68527j118259j560944n23719J262102J393429p7041m21506J144302
38590E140877J962945L40510j682025j713588l97616N77221J290693K079421J502708
38581I101146j320920l922485l071890N53623L002944K156351j30704j111840
38573E256225l54866O74416P99402J85036j61381M03230J294663J323909L29137
38564I749771n67345o75574o33233r36189q61159N0055O91555J00070n90231K26980
$$ plain form
38554 6554700 8305569 9963851 9660605 7900668 6786616 7207618 8141681 8490641 8292814
38545 8292814 7988421 7572729 6907653 6221068 5890494 6030024 6436143 6720512 6581714
38536 6581714 6255282 6471329 7480163 8382111 8160094 7252223 7171787 8439001 9890716
38527 9890716 10425600 10390501 10532686 10600123 10117921 9782164 10592257 11949401 12264467 11504674
38517 11504674 11376630 12441429 12788153 10706782 7346668 5349461 5795548 7825364
38509 7825364 10307018 12259007 12455417 10622334 8635922 8456054 9057558 7783738 4940393
38500 4940393 4237867 7514987 11654950 12767723 11385742 10925347 12370583 13487887
38492 13487887 12828988 11461952 10383509 9067871 7641673 7956327 10735435 13591491
$$ packed form
38554F554700J750869J658282l03246j759937j114052M21002R34063L48960j97827
38545H292814l04393m15692o65076o86585l30574J39530M06119K84369j38798
38536F581714l26432K16047J008834R01948k22017r07871q0436J267214J451715
38527I890716N34884l5099J42185O7437m82202l35757Q10093J357144L15066p59793
38517A1504674j28044J064799L46724k081371l360114j997207M46087K029816
38509G825364K481654J951989J96410j833083j986412j79868O01504j273820k843345
38500D940393p02526L277120M139963J112773j381981m60395J445236J117304
38492A3487887o58899j367036j078443j315638j426198L14654K779108K856056
$$ plain form
38484 13591491 14033799 13067177 13344785 14647144 14167488 11327950 9180599 9852678 11348478
38475 11348478 10912455 9402492 9622257 11753726 13575264 14493893 15894155 17403738
38467 17403738 16541461 13223350 11105576 12416159 14499679 14104242 12405440 12519667
38459 12519667 14207248 14880676 14393399 14604962 14951976 13033883 9806222 9565477 13496224
38450 13496224 17377791 17623890 15944380 15665559 16742883 17326696 17504381 18121093 17890516
38441 17890516 15220690 11719289 10519058 11748970 12795188 12763602 13509415 15817433
38433 15817433 17470627 16424409 13968445 13138250 14832901 16844034 16763994 15080721
38425 15080721 14650485 16932054 19759609 20159967 18686842 18679822 21088336 22823784 21437126
$$ packed form
38484A3591491M42308r66622K77608J302359m79656k839538k147351O72079J495800
38475A1348478m36023j509963K19765K131469J821538R18629J400262J509583
38467A7403738q62277l318111k117774J310583K083520l95437j698802J14227
38459A2519667J687581O73428m87277K11563L47014j918093l227661k40745L930747
38450A3496224L881567K46099j679510k78821J077324N83813J77685O16712k30577
38441A7890516k669826l501401j200231J229912J046218l1586P45813K308018
38433A5817433J653194j046218k455964q30195J694651K011133q0040j683273
38425A5080721m30236K281569K827555M00358j473125p020K408514J735448j386658
$$ plain form
38416 21437126 18727650 17683201 18146954 18103961 17459199 17584794 18287238 18198689 17537797
38407 17537797 17760234 18919294 19901715 20800889 22461561 24079307 23975844 22559205 21808213
38398 21808213 21951967 21494333 20517826 20839997 22447687 22921897 21342917 19878679 20304748
38389 20304748 21631843 22558096 23674720 25497839 26610285 25815426 24374129 24065903
38381 24065903 24406243 23735627 21989058 20528619 19988247 19904133 19892389 19818585 19369638
38372 19369638 18718285 19072563 21321865 24485309 26562155 26689505 25682725 24790881 24642170
38363 24642170 25074016 25344075 24785966 23727529 23374112 24316600 25537429 25407152 23528576
38354 23528576 21331729 20844032 22698278 25197272 25828684 24099370 22185865 22206822 23863609
$$ packed form
38416B1437126k709476j044449M63753m2993o44762J25595P02444q8549o60892
38407A7537797K22437J159060R82421Q99174J660672J617746j03463j416639p50992
38398B1808213J43754m57634r76507L22171J607690M74210j578980j464238M26069
38389B0304748J327095R26253J116624J823119J112446p94859j441297l08226
38381B4065903L40340o70616j746569j460439n40372q4114j1744p3804m48947
38372A9369638o51353L54278K249302L163444K076846J27350j006780q91844j48711
38363B4642170M31846K70059n58109j058437l53417R42488J220829j30277j878576
38354B3528576k196847m87697J854246K498994O31412j729314j913505K0957J656787
$$ plain form
38345 23863609 25708238 27368373 28843483 28928823 26784233 24255213 23895739 25146936
38337 25146936 25454358 24892280 26084797 29101968 30351920 28016110 25041707 24670990
38329 24670990 26094089 26887105 26923875 27172490 27135230 26486607 27083609 30071712 32739194
38320 32739194 31731664 28161380 26029363 26436303 26935642 26196281 25626665 26152559 26836429
38311 26836429 27417925 29097244 31666639 32592579 30435948 27106746 25345924 25710702
38303 25710702 27215515 29088990 30428070 29856482 27475441 25968567 27630807 30851327
38295 30851327 31668800 28887744 25683740 25443272 27671584 29312002 28932585 27740270
38287 27740270 26888006 26029528 25113328 25420536 27305700 28654013 27726854 26275424 27208538
$$ packed form
38345B3863609J844629J660135J475110Q5340k144590k529020l59474J251197
38337B5146936L07422n62078J192517L017171J249952k335810k974403l70717
38329B4670990J423099P93016L6770K48615l7260o48623N97002K988103K667482
38320C2739194j007530l570284k132017M06940M99339p39361n69616N25894O83870
38311B6836429N81496J679319K569395R25940k156631l329202j760822L64778
38303B5710702J504813J873475J339080n71588k381041j506874J662240L220520
38295C0851327Q17473k781056l204004k40468K228312J640418l79417j192315
38287B7740270q52264q58478r16200L07208J885164J348313r27159j451430R33114
$$ plain form
38278 27208538 29952340 31208725 30172115 29579836 30934808 32119236 31151295 29175466
38270 29175466 27934891 27226709 26915702 28465896 31890135 34020361 32846346 30959370
38262 30959370 31320118 32219314 30517410 27614910 27375712 29618418 30832362 30529556 31420502
38253 31420502 33363982 32889834 29720354 28245086 30649677 33581677 33951874 33313297
38245 33313297 33656568 33372057 30974839 28961859 29862876 31516214 30494829 27790840
38237 27790840 26828908 27771034 28137511 27669364 28209655 29625017 30106056 30092747 31728990
38228 31728990 34385322 34755471 31928273 28694326 27104062 26262325 25477139 26040869 28345169
38219 28345169 30355933 30784449 31065732 32287241 32755750 30936596 28616066 28476916 30098074
$$ packed form
38278B7208538K743802J256385j036610n92279J354972J184428r67941j975829
38270B9175466j240575p08182l11007J550194L424239K130226j174015j886976
38262C0959370L60748Q99196j701904k902500k39198K242706J213944l02806Q90946
38253C1420502J943480m74148l169480j475268K404591K932000L70197o38577
38245C3313297L43271k84511k397218k012980R01017J653338j021385k703989
38237B7790840r61932R42126L66477m68147N40291J415362M81039j3309J636243
38228C1728990K656332L70149k827198l233947j590264q41737p85186N63730K304300
38219B8345169K010764M28516K81283J221509M68509j819154k320530j39150J621158
$$ plain form
38210 30098074 31078957 31056131 31754225 33410440 33901832 31979864 29359012 28593761 29953630
38201 29953630 31270527 30517411 28089146 26474258 27568879 30503251 32765899 33342184
38193 33342184 33493367 34155870 34292776 32950770 31402942 31465255 32671948 33081950 32323901
38184 32323901 31826027 32248997 32747021 32943279 33669565 35191296 36359747 36208677 35010744
38175 35010744 33204868 30774186 28392899 27616039 28826149 30247473 30175477 29133015
38167 29133015 28647919 28934250 29195360 29436886 30397036 31978778 33092850 33030369 32119823
38158 32119823 31253326 31412429 32995759 34745697 34307394 31265336 28764189 30174265
38150 30174265 34530686 37427831 36546947 34105010 33229387 34061962 34677605 34124235 32947129
$$ packed form
38210C0098074R80883k2826O98094J656215M91392j921968k620852p65251J359869
38201B9953630J316897p53116k428265j614888J094621K934372K262648N76285
38193C3342184J51183O62503J36906j342006j547828O2313J206693M10002p58049
38184C2323901m97874M22970M98024J96258P26286J521731J168451j51070j197933
38175C5010744j805876k430682k381287p76860J210110J421324p1996j042462
38167B9133015m85096K86331K61110K41526R60150J581742J114072o2481r10546
38158C2119823q66497J59103J583330J749938m38303l042058k501147J410076
38150C0174265M356421K897145q80884k441937q75623Q32575O15643n53370j177106
$$ plain form
38141 32947129 31848492 31420040 32409441 34687204 36453214 35968755 33809262 32033595
38133 32033595 31385013 30877481 30146233 30407600 32428915 35033182 36620143 37033839 36823295
38124 36823295 35757579 33647914 31914840 32360174 34424988 35611056 35001929 34391558
38116 34391558 35157958 36195956 36428688 37199741 39769622 42155691 41642809 39457674 39266511
38107 39266511 41235818 41716904 39608925 38629688 41198511 44204943 44090102 42609536
38099 42609536 43342338 45129701 44004136 40270720 38401614 39957335 41590959 41004338
38091 41004338 40371399 42072961 44748118 45797083 45033312 43827122 42911102 42769982 44035179
38082 44035179 45857770 46012139 44217750 43204743 44780862 47043511 47502347 46912616
$$ packed form
38141C2947129j098637m28452R89401K277763J766010m84459k159493j775667
38133C2033595o48582n07532p31248K61367K021315K604267J586961M13696k10544
38124C6823295j065716k109665j733074M45334K064814J186068o09127o10371
38116C4391558P66400J037998K32732P71053K569881K386069n12882k185135j91163
38107C9266511J969307M81086k107979r79237K568823L006432j14841j480566
38099D2609536P32802J787363j125565l733416j869106J555721J633624n86621
38091D1004338o32939J701562K675157J048965p63771j206190r16020j41120J265197
38082D4035179J822591J54369j794389j013007J576119K262649M58836n89731
$$ plain form
38074 46912616 47618526 49638760 50876648 50322076 48967567 48122396 48347497 49443811 50410249
38065 50410249 50268485 49654529 50250440 52001338 52808832 51854188 50860543 50768429 49873179
38056 49873179 47250448 45373701 46693020 49808321 51816474 52453212 52989466 53016991 51706933
38047 51706933 50640704 51787146 53840352 54096865 52922700 52729837 53503621 53337753 52756896
38038 52756896 54143661 56856815 57342861 54876692 53125635 54727555 57853502 59582880
38030 59582880 59509010 58488705 56758951 54991002 54713381 56050679 57106838 56805860 56242623
38021 56242623 56266805 56126962 55573821 55769261 56841302 57082837 56005723 55620758 57020462
38012 57020462 58221189 57364109 55718175 55313969 55699925 55416272 54857186 55145478 55626866
$$ packed form
38074D6912616P05910K020234J237888n54572j354509q45171K25101J096314R66438
38065E0410249j41764o13956N95911J750898Q07494r54644r93645r2114q95250
38056D9873179k622731j876747J319319L115301K008153O36738N36254K7525j310058
38047E1706933j066229J146442K053206K56513j174165j92863P73784j65868n80857
38038E2756896J386765K713154M86046k466169j751057J601920L125947J729378
38030E9582880p3870j020305j729754j767949k77621J337298J056159l00978n63237
38021E6242623K4182j39843n53141J95440J072041K41535j077114l84965J399704
38012E7020462J200727q57080j645934m04206L85956k83653n59086K88292M81388
$$ plain form
38003 55626866 55029649 54045293 54377350 56055907 57835879 59383853 60848879 61074101 58794199
37994 58794199 55426313 54270015 56505687 59755257 61121287 60317404 59288595 59729146
37986 59729146 61502122 62997362 62753223 60876349 58792525 57657647 57540900 58093670
37978 58093670 58965119 59280421 58017784 55686309 54484749 55735411 58024146 59014521
37970 59014521 58479955 58366630 60106494 62839733 64399556 63620994 61582600 60480244
37962 60480244 61114436 62009855 61621067 60563098 60361640 60832332 60731588 60531119 61910514
37953 61910514 64264616 64556821 61661815 58319126 57379665 58339593 59115923 59126333 58833100
37944 58833100 58132410 57133532 56991961 58202776 59518257 60044803 60603063 61425563 60799496
$$ packed form
38003E5626866n97217r84356L32057J678557J779972J547974J465026K25222k279902
37994E8794199l367886j156298K235672L249570J366030q03883j028809M40551
37986E9729146J772976J495240k44139j876874k083824j134878j16747N52770
37978E8093670Q71449L15302j262637k331475j201560J250662K288735R90375
37970E9014521n34566j13325J739864K733239J559823p78562k038394j102356
37962F0480244O34192Q95419l88788j057969k01458M70692j00744k00469J379395
37953F1910514K354102K92205k895006l342689r39461R59928P76330J0410k93233
37944E8833100p00690r98878j41571J210815J315481N26546N58260Q22500o26067
$$ plain form
37935 60799496 58242581 56721432 58722026 61933917 62191267 59368045 56829381 56050919
37927 56050919 55696294 55612030 57466993 60756651 62100533 60047082 57459477 57374402 59093735
37918 59093735 60290498 60732611 61623210 62789066 62930794 62032673 61583452 62494999 64043548
37909 64043548 64786500 63740886 60992736 57889562 56239101 56548180 57373640 57116828 56078017
37900 56078017 55855708 56940462 58020398 57959832 57455266 57900276 59190170 59810351 59078045
37891 59078045 58062039 57819440 57963216 57926668 58454377 60292247 62265710 62630611 61861760
37882 61861760 61827782 62305814 61007421 57681714 55436093 56563434 59368769 60887599
37874 60887599 60807866 60783641 61515959 62511416 63370007 63474956 61828806 59032292 57759818
$$ packed form
37935F0799496k556915j521149K000594L211891K57350k823222k538664p78462
37927E6050919l54625q4264J854963L289658J343882k053451k587605q5075J719333
37918E9093735J196763M42113Q90599J165856J41728q98121m49221R11547J548549
37909F4043548P42952j045614k748150l103174j650461L09079Q25460k56812j038811
37900E6078017k22309J084754J079936o0566n04566M45010J289894O20181p32306
37891E9078045j016006k42599J43776l6548N27709J837870J973463L64901p68851
37882F1861760l3978M78032j298393l325707k245621J127341K805335J518830
37874F0887599p9733k4225P32318R95457Q58591J04949j646150k796514j272474
$$ plain form
37865 57759818 59082186 60054934 57685311 53777299 52570085 54537993 56109004 55259460
37857 55259460 53784154 53562103 53891035 53620561 53264847 53689972 54656208 55691279 56794875
37848 56794875 57620174 57578368 57217390 57788334 59069985 59452033 58545340 57745670 57752676 57598276
37838 57598276 56756008 56132662 56187325 56077266 55507669 55439017 56111747 56469777 56494925 57807464
37828 57807464 60632950 62487016 61622314 59717805 59185804 59740061 59891846 60059996 61404549
37819 61404549 62805418 62126282 60087389 59891157 62700245 66088542 67677377 67973410
37811 67973410 68399378 68415663 66391685 62452937 58809199 57323458 57778082 58618150 58686976
37802 58686976 58055740 57633587 58182010 59416297 59949096 58514598 55558545 53226162 53185535
$$ packed form
37865E7759818J322368R72748k369623l908012j207214J967908J571011q49544
37857E5259460j475306k22051L28932k70474l55714M25125R66236J035071J103596
37848E6794875Q25299m1806l60978N70944J281651L82048r06693p99670P006j54400
37838E7598276q42268o23346N4663j10059n69597o8652O72730L58030K5148J312539
37828E7807464K825486J854066q64702j904509n32001N54257J51785J68150J344553
37819F1404549J400869o79136k038893j96232K809088L388297J588835K96033
37811F7973410M25968J6285k023978l938748l643738j485741M54624Q40068O8826
37802E8686976o31236m22153N48423J234287N32799j434498k956053k332383m0627
$$ plain form
37793 53185535 54677431 55489281 54773476 53817555 53767357 53951526 53387680 52754790 53395961
37784 53395961 55060371 56253494 56537246 56909240 57947360 59095972 59945437 60834314 61966050
37775 61966050 63185553 64688514 66495900 67172997 64949588 60668833 57752044 58220401
37767 58220401 60335650 61331224 60929995 60623863 60772521 60433451 59538261 59314305 60392565
37758 60392565 61875005 62629955 62590059 62416745 62450256 62267292 61084828 58696576 56160223
37749 56160223 55125028 56076137 57682193 58378738 58088016 57656685 57113598 55694671 53646835
37740 53646835 52725387 54098761 56503919 57583848 56842383 55995319 56006757 55212042 51841716
37731 51841716 47612499 46576930 49920600 53895164 54244342 51283896 48956737 49828229
$$ packed form
37793E3185535J491896Q11850p15805r55921n0198J84169n63846o32890O41171
37784E3395961J664410J193123K83752L71994J038120J148612Q49465Q88877J131736
37775F1966050J219503J502961J807386O77097k223409m280755k916789M68357
37767E8220401K115249R95574m01229l06132J48658l39070q95190k23956J078260
37758F0392565J482440P54950l9896j73314L3511j82964j182464k388252k536353
37749E6160223j035195R51109J606056O96545k90722m31331n43087j418927k047836
37740E3646835r21448J373374K405158J079929p41465q47064J1438p94715l370326
37731E1841716m229217j035569L343670L974564L49178k960446k327159Q71492
$$ plain form
37723 49828229 52901991 55898730 57666439 58121690 57447047 55977289 54050173 51817451
37715 51817451 49847360 49445882 51206041 53639286 54700015 54450707 54648714 55778496
37707 55778496 56221928 54625706 51569698 48597557 46921302 47106610 48515486 49138984
37699 49138984 47822271 46617006 48636083 53221038 55805239 53573744 48891100 45772049
37691 45772049 45179810 45545627 45958612 46634746 47470812 48173699 49043434 50039129 49913547
37682 49913547 47784593 44797727 42885395 42649485 43552431 45046854 46241499 45799886
37674 45799886 43802616 42470611 43272002 44568043 44132825 42701755 42500520 43262151 42713006
37665 42713006 40688522 39664204 40809158 42327546 42527507 42009779 41707939 41064215 39621965
$$ packed form
37723D9828229L073762K996739J767709M55251o74643j469758j927116k232722
37715E1817451j970091m01478J760159K433245J060729k49308J98007J129782
37707E5778496M43432j596222l056008k972141j676255J85308J408876O23498
37699D9138984j316713j205265K019077M584955K584201k231495m682644l119051
37691D5772049n92239L65817M12985O76134Q36066P02887Q69735R95695j25582
37682D9913547k128954k986866j912332k35910R02946J494423J194645m41613
37674D5799886j997270j332005Q01391J296041m35218j431070k01235P61631n49145
37665D2713006k024484j024318J144954J518388J99961n17728l01840o43724j442250
$$ plain form
37656 39621965 38505373 38606592 38792296 37719388 36315126 36539143 38335841 39707525
37648 39707525 39645740 39298850 40001077 41503512 42635912 42770083 42139797 41347444 40887233
37639 40887233 40647863 39794754 37872790 36134155 36667887 39571476 42005640 41179209 37660079
37630 37660079 34502341 33555599 34152894 35253443 36914493 39021341 40344670 40067203
37622 40067203 38991936 38061108 36916043 35301920 34589063 35915769 37647381 36947005
37614 36947005 33710058 30895618 30809217 32846979 35101051 36408628 36415159 35236531 33649224
37605 33649224 32480217 31631774 30760751 30465144 31144069 31292806 29350061 26991921 27621234
37596 27621234 31179408 33619193 32576048 30417885 30033824 30632463 30029320 28537226
$$ packed form
37656C9621965j116592J01219J85704j072908j404262K24017J796698J371684
37648C9707525o1785l46890P02227J502435J132400J34171o30286p92353m60211
37639D0887233k39370q53109j921964j738635N33732K903589K434164q26431l519130
37630C7660079l157738r46742N97295J100549J661050K106848J323329k77467
37622D0067203j075267r30828j145065j614123p12857J326706J731612p00376
37614C6947005l236947k814440q6401K037762K254072J307577O531j178628j587307
37605C3649224j169007q48443q71023k95607O78925J48737j942745k358140O29313
37596B7621234L558174K439785j043145k158163l84061N98639o03143j492094
$$ plain form
37588 28537226 27842294 27910196 27720355 27592147 28207237 28615932 27741023 26713573 27214943
37579 27214943 28539998 28809388 28134538 28011983 28412405 28090739 27124089 26598105 26424129
37570 26424129 25990389 26161198 27793779 29070439 27623883 24886702 24667506 27264811
37562 27264811 28797967 27187030 25075936 25323978 26964133 27727962 27830609 28808276 30550762
37553 30550762 31849125 32618591 33674268 35333919 37723182 41298342 45580581 48428389
37545 48428389 48010766 44739973 40338606 36154656 33253980 32493530 33055668 32436383 29606406
37536 29606406 26839064 26528044 27514798 26909170 24603569 23222357 23773949 24112805 22355585
37527 22355585 19525468 17672784 17107633 16885449 16843489 17600246 19036596 20107452 20099518
$$ packed form
37588B8537226o94932O7902j89841j28208O15090M08695q74909j027450N01370
37579B7214943J325055K69390o74850j22555M00422l21666r66650n25984j73976
37570B6424129m33740J70809J632581J276660j446556k737181k19196K597305
37562B7264811J533156j610937k111094K48042J640155P63829J02647R77667J742486
37553C0550762J298363P69466J055677J659651K389263L575160M282239K847808
37545D8428389m17623l270793m401367m183950k900676p60450N62138o19285k829977
37536B9606406k767342l11020R86754o05628k305601j381212N51592L38856j757220
37527B2355585k830117j852684n65151k22184m1960P56757J436350J070856p934
$$ plain form
37518 20099518 19131804 17485331 15463191 14083458 14714768 17175641 19059419 18315139
37510 18315139 16197508 15982918 18416200 20299905 18831558 15686478 14701594 16534084
37502 16534084 18327074 18529223 18976425 21099041 22815594 21426760 17907057 15744380
37494 15744380 16194014 17105782 16484252 15039168 14508859 15053111 15378171 14629653 13284943
37485 13284943 12538787 13297617 15430864 17652208 18468017 17531582 15774518 14104303 12555053
37476 12555053 11053614 10314356 11118820 12958886 14322202 14468216 14127074 14116483 14099813
37467 14099813 13436527 12608516 12659390 13368693 13219302 11532658 9578852 8909074 9441761
37458 9441761 10085908 10619889 11801066 13761817 15346498 15310486 13617473 11435278 10272105
$$ packed form
37518B0099518r67714j646473k022140j379733O31310K460873J883778p44280
37510A8315139k117631k14590K433282J883705j468347l145080r84884J832490
37502A6534084J792990K02149M47202K122616J716553j388834l519703k162677
37494A5744380M49634R11768o21530j445084n30309N44252L25060p48518j344710
37485A3284943p46156P58830K133247K221344Q15809r36435j757064j670215j549250
37476A2555053j501439p39258Q04464J840066J363316J46014l41142j0591j6670
37467A4099813o63286q28011N0874P09303j49391j686644j953806o69778N32687
37458I441761O44147N33981J181177J960751J584681l6012j693013k182195j163173
$$ plain form
37449 10272105 11029803 13290214 15409022 15797813 14348461 12439225 11582185 12205588 13484547
37440 13484547 14049716 13162464 11582930 10952301 11882711 13061664 12802858 11070005 9320464
37431 9320464 8813984 9891649 12397866 15563687 17611377 16900673 13974185 11509925
37423 11509925 11617143 13706576 15445931 15339390 13934769 12795684 12726457 13082777 12752852
37414 12752852 11614737 10644718 10618297 11356751 12408295 13563202 14271246 13680146 12103176
37405 12103176 11315945 12184639 13074093 12178199 10482739 10475032 12597520 15185867 17476519
37396 17476519 20109511 22643167 23393195 22413131 21944425 22814657 22998388 21251694 19542443
37387 19542443 19651228 19669635 16867290 12520923 10459673 11318262 11731409 9799214 8145750
$$ packed form
37449A0272105P57698K260411K118808L88791j449352j909236q57040O23403J278959
37440A3484547N65169q87252j579534o30629R30410J178953k58806j732853j749541
37431I320464n06480J077665K506217L165821K047690p10704k926488k464260
37423A1509925J07218K089433J739355j06541j404621j139085o9227L56320l29925
37414A2752852j138115r70019k6421P38454J051544J154907P08044n91100j576970
37405A2103176p87231Q68694Q89454q95894j695460p707K122488K588347K290652
37396A7476519K632992K533656P50028r80064m68706Q70232J83731j746694j709251
37387A9542443J08785J8407k802345m346367k061250Q58589M13147j932195j653464
$$ plain form
37378 8145750 9839674 13543828 15145766 13292440 10900459 10872105 12234454 11868817 9136241
37369 9136241 6867000 7377150 9261293 9639020 8463404 8300093 9962381 11006541 9606022
37360 9606022 7576681 7576918 8958091 8939734 7130056 6156494 7637556 9942941 10782547
37351 10782547 10117153 9332995 8975751 8726465 8705031 9276020 9914137 9648379 8705984
37342 8705984 8525502 9708901 10930268 10692349 9573962 9585219 11278057 12715365 12003135
37333 12003135 9903140 8735239 9199082 9819269 9550066 9173739 9403731 9253107 7707832
37324 7707832 5891086 5797379 7413989 8899073 9497712 10435993 12511015 14451179 14569866
37315 14569866 12921400 10908768 9594441 9239585 9756544 10673020 11158303 10909574 10550425
$$ packed form
37378H145750J693924L704154J601938j853326k391981k8354J362349l65637k732576
37369I136241k269241N10150J884143L77727j175616j63311J662288J044160j400519
37360I606022k029341K37J381173j8357j809678r73562J481062K305385Q39606
37351A0782547o65394p84158l57244k49286k1434N70989O38117k65758r42395
37342H705984j80482J183399J221367k37919j118387J1257J692838J437308p12230
37333A2003135k099995j167901M63843O20187k69203l76327K29992j50624j545275
37324G707832j816746r3707J616610J485084N98639R38281K075022J940164J18687
37315A4569866j648466k012632j314327l54856N16959R16476M85283k48729l59149
$$ plain form
37306 10550425 10450963 9874174 8335500 7115377 7891995 10084208 11212972 10177810 8615434
37297 8615434 8410552 9364466 10310671 11158365 12352467 13243131 12738515 11243292 10353290
37288 10353290 10650676 11207897 11318884 11288536 11309968 11038991 10711599 11225435 12446308
37279 12446308 12827462 11637153 10353736 10756016 12612952 14382892 15324959 15737621 15878433
37270 15878433 15915135 16365508 17387136 18150996 18029476 17787434 18447023 19762388 21203970
37261 21203970 23504727 27262332 30672623 31141051 29209840 28396588 30492454 33370452
37253 33370452 34637448 35358012 38333592 44063376 50437272 55840753 60737624 66219161
37245 66219161 72554949 79750302 88643400 100643790 116424155 135280940 156147018
$$ packed form
37306A0550425r9462n76789j538674j220123P76618K192213J128764j035162j562376
37297H615434k04882R53914R46205Q47694J194102Q90664n04616j495223q90002
37288A0353290K97386N57221J10987l0348K1432k70977l27392N13836J220873
37279A2446308L81154j190309j283417M02280J856936J769940R42067M12662J40812
37270A5878433L6702M50373J021628P63860j21520k42042O59589J315365J441582
37261B1203970K300757L757605L410291M68428j931211q13252K095866K877998
37253C3370452J266996P20564K975580N729784O373896N403481M896871N481537
37245F6219161O335788P195353Q893098J2000390J5780365J8856785K0866078
$$ plain form
37238 156147018 179342565 207086016 242123635 286015517 338182980 394600701 445938526
37231 445938526 478646808 481548588 453417384 403743059 345832908 289596652 239763664
37224 239763664 197806457 163602166 136241964 114768683 98224598 85095468 73833322
37217 73833322 64194924 56796758 51052668 45176276 38831570 33926394 31640335 30365163
37209 30365163 28032499 24919200 22400946 20291834 17495727 14357211 12251494 11447744
37201 11447744 11317385 11952080 13378125 13825340 11504567 7986749 6833861 8346471
37193 8346471 8746703 5832848 2398919 1848515 3059732 2749670 1138801 1371974 3809016
37184 3809016 4969623 3054043 881704 1397590 3211959 3308918 1992444 1830314 2935698
$$ packed form
37238A56147018K3195547K7743451L5037619M3891882N2167463N6417721N1337825
37231D45938526L2708282K901780k8131204m9674325n7910151n6236256m9832988
37224B39763664m1957207l4204291k7360202k1473281j6544085j3129130j1262146
37217G3833322r638398p398166n744090n876392o344706m905176k286059j275172
37209C0365163k332664l113299k518254k109112k796107l138516k105717q03750
37201A1447744j30359O34695J426045M47215k320773l517818j152888J512610
37193H346471M00232k913855l433929n50404J211217l10062j610869K33173K437042
37184C809016J160607j915580k172339N15886J814369R6959j316474j62130J105384
$$ plain form
37175 2935698 2921748 1302458 363235 1055877 1392893 242175 -322193 1599100 4510956
37166 4510956 5941928 6020487 6221912 6342025 5425133 4332871 4546477 5335802 4841019
37157 4841019 3232802 2185764 1999667 1964257 2684183 4896123 6705077 5567467 2694710
37148 2694710 1703443 2902168 2992014 871129 -606312 294672 1695482 2203900 3149720
37139 3149720 4700625 4171321 973319 -932576 1091413 3868710 3654431 2318247
37131 2318247 3704851 6692606 6999071 4081561 1238734 -22383 -953471 -1616987 -581528
37122 -581528 1633773 2917167 3187098 3855628 4192892 2396521 -119072 -92615 1871842
37113 1871842 1729799 -1309585 -3363060 -2276892 -646144 -667754 -543653 1569276 4025532
$$ packed form
37175B935698j3950j619290r39223O92642L37016j150718n64368J921293K911856
37166D510956J430972P8559K01425J20113r16892j092262K13606P89325m94783
37157D841019j608217j047038j86097l5410P19926K211940J808954j137610k872757
37148B694710r91267J198725Q9846k120885j477441R00984J400810N08418R45820
37139C149720J550905n29304l198002j905895K023989K777297k14279j336184
37131B318247J386604K987755L06465k917510k842827j261117r31088o63516J035459
37122e81528K215301J283394K69931O68530L37264j796371k515593K6457J964457
37113A871842j42043l039384k053475J086168J630748k1610J24101K112929K456256
$$ plain form
37104 4025532 4818264 4815066 5213111 4970423 3516349 2955160 4593945 6077908 5096608
37095 5096608 3306980 3229192 3764999 2678452 1483539 3437039 7700718 9886489 8369179
37086 8369179 6224881 6377099 8084586 9160718 9045504 8498645 8015246 7515135 6604272
37077 6604272 4921887 3064245 2626692 4087933 5501528 4983479 3566669 3421658 4121715
37068 4121715 3456277 1557071 1023490 2554477 3596642 2449820 960121 1530756 3671074
37059 3671074 5306053 5786382 5810684 5759184 5880079 6989510 9196530 10791144 10156099
37050 10156099 8211690 7336032 8255279 9531369 9863293 9386661 8726242 8146346 7857776
37041 7857776 8118426 8824582 9740273 11008414 12592355 13511083 12794786 11086140 10042048
$$ packed form
37104D025532P92732l198L98045k42688j454074n61189J638785J483963r81300
37095E096608j789628p7788N35807j086547j194913J953500M263679K185771j517310
37086H369179k144298J52218J707487J076132j15214n46859m83399n00111r10863
37077F604272j682385j857642m37553J461241J413595n18049j416810j45011P00057
37068D121715o65438j899206n33581J530987J042165j146822j489699N70635K140318
37059C671074J634979M80329K4302n1500J20895J109431K207020J594614o35045
37050A0156099j944409q75658R19247J276090L31924m76632o60419n79896k88570
37041G857776K60650P06156R15691J268141J583941R18728p16297j708646j044092
$$ plain form
37032 10042048 10145913 10478094 10761232 11960343 14225117 15816240 15166631 12867235 10558390
37023 10558390 8944423 8061020 8353382 9887517 11261409 11013609 9703511 9042191 9418400
37014 9418400 9996430 10796748 12517343 14342226 14304898 12312067 10519498 9933985 8992420
37005 8992420 6707926 4864930 5292396 6948695 7771531 7648554 7250036 5652964 2072998
36996 2072998 -1276657 -1451837 616243 1301216 146385 812813 5153099 9893161 11209399
36987 11209399 9744853 8554842 8285385 7407943 5943777 5736983 7156728 8217582
36979 8217582 7520101 6061990 5376598 5439277 5375700 5112795 5188098 5503412 5396882 4914417
36969 4914417 5073807 6439248 8025403 8373996 7557087 7165351 7998289 8799520 8182519
$$ packed form
37032A0042048J03865L32181K83138J199111K264774J591123o49609k299396k308845
37023A0558390j613967q83403K92362J534135J373892k47800j310098o61320L76209
37014I418400N78030Q00318J720595J824883l7328j992831j792569n85513r41565
37005H992420k284494j842996M27466J656299Q22836j22977l98518j597072l579966
36996B072998l349655j75180K068080O84973j154831O66428M340286M740062J316238
36987A1209399j464546j190011k69457q77442j464166k06794J419745J060854
36979H217582o97481j458111o85392O2679o3577k62905P5303L15314j06530m82465
36969D914417J59390J365441J586155L48593q16909l91736Q32938Q01231o17001
$$ plain form
36960 8182519 6953228 7049649 8514166 9258502 8123734 6503224 6116054 6561168 6273474
36951 6273474 4974353 3864901 3832742 4581789 5345111 5587979 5147644 4430653 4393371
36942 4393371 5667773 7654412 8895811 8383914 6359581 4043923 2724130 2750125 3239554
36933 3239554 3111727 2432965 2139926 2409169 2285279 1344396 691068 1450129 3017360
36924 3017360 3833663 3478741 2984291 3186276 3628745 3269707 1833935 341117 316971
36915 316971 2208499 4616357 5707921 5416357 5290481 5960610 6120273 4798449 3204584
36906 3204584 2864916 3001831 1659127 -1061558 -2857163 -2313103 -333710 1708529 3397263
36897 3397263 4338049 3745120 2060972 1339059 2531898 3725330 2842409 1008871 936233
$$ packed form
36960H182519j229291R6421J464517P44336j134768j620510l87170M45114k87694
36951F273474j299121j109452l2159P49047P63322K42868m40335p16991l7282
36942D393371J274402J986639J241399n11897k024333k315658j319793K5995M89429
36933C239554j27827o78762k93039K69243j23890r40883o53328P59061J567231
36924C017360Q16303l54922m94450K01985M42469l59038j435772j492818k4146
36915C16971J891528K407858J091564k91564j25876O70129J59663j321824j593865
36906C204584l39668J36915j342704k720685j795605N44060J979393K042239J688734
36897C397263R40786n92929j684148p21913J192839J193432q82921j833538p2638
$$ plain form
36888 936233 2495587 2687224 474043 -1206802 152018 2621087 2807302 1228992 1329877
36879 1329877 3497038 3856430 296333 -3595585 -3183449 746362 3249940 1949571
36871 1949571 -682070 -1692512 -1208547 -673204 -84037 1227020 2583304 2681033 1772708
36862 1772708 1541617 2714160 3900889 3346560 1395902 466537 2131322 4741483 5192157
36853 5192157 3180253 1907871 3469759 5518703 4750545 2103986 1226561 2509149
36845 2509149 2613229 398160 -832965 1223845 3887157 3714866 1809282 1537869 2992790
36836 2992790 3422756 2146486 1412469 2479681 3920634 4181511 3368842 2090623 643814
36827 643814 -229145 363808 2005832 3356607 4105315 4932781 5608787 5116204 3904479
$$ packed form
36888I36233J559354J91637k213181j680845J358820K469069J86215j578310J00885
36879A329877K167161L59392l560097l891918M12136L929811K503578j300369
36871A949571k631641j010442M83965N35343N89167J311057J356284R7729r08325
36862A772708k31091J172543J186729n54329j950658r29365J664785K610161M50674
36853E192157k011904j272382J561888K048944p68158k646559q77425J282588
36845B509149J04080k215069j231125K056810K663312j72291j905584k71413J454921
36836B992790M29966j276270p34017J067212J440953K60877q12669j278219j446809
36827F43814q72959N92953J642024J350775P48708Q27466O76006m92583j211725
$$ plain form
36818 3904479 3917659 5642796 6921886 5727668 2845097 834110 1196970 3258045 5147217
36809 5147217 5407619 4157617 2882178 2736033 3339140 3684387 3444918 2606947 1000922
36800 1000922 -502759 190497 3320994 5423772 3420486 -422570 -1097762 1980503
36792 1980503 4354891 3421713 1694690 1831716 2581491 2064750 1482332 2500045 3790844
36783 3790844 3478942 2785743 3867412 5803465 6174668 5288433 5390952 6595729 6936391
36774 6936391 5887299 4691438 3652587 2185054 1165402 2046723 3792605 3884613 2394481
36765 2394481 1832596 2817089 3317125 2624941 2467314 3297318 3175407 1738371 1620433
36756 1620433 3920640 5694956 4546560 2661772 3170859 4993011 4834598 2596790
$$ packed form
36818C904479J3180J725137J279090j194218k882571k010987L62860K061075J889172
36809E147217K60402j250002j275439j46145O03107L45247k39469q37971j606025
36800A000922j503681O93256L130497K102778k003286l843056o75192L078265
36792A980503K374388r33178j727023J37026P49775n16741n82418J017713J290799
36783C790844l11902o93199J081669J936053L71203q86235J02519J204777L40662
36774F936391j049092j195861j038851j467533j019652Q81321J745882R2008j490132
36765B394481n61885R84493N00036o92184j57627Q30004j21911j437036j17938
36756A620433K300207J774316j148396j884788N09087J822152j58413k237808
$$ plain form
36748 2596790 1158449 1693309 2579420 2613406 2328553 2145543 1764541 1457505 1780366
36739 1780366 2079315 1335141 236320 289916 1244797 1734733 2055220 3517795 5206958
36730 5206958 4618669 2023849 877177 2715009 4791883 4489927 3104284 2901708 3013396
36721 3013396 1325112 -1266325 -1843422 -766 1717519 1888481 1946706 3292015 4955393
36712 4955393 5193337 3896947 2401229 1824646 2314698 3270084 3846849 3781262 3880375
36703 3880375 5057411 6863798 7875032 7697143 7552303 8384234 9334499 8949575 7326960
36694 7326960 6067651 6186800 6935810 6976759 6099856 5230990 5079331 5529468 6352551
36685 6352551 7560379 8578286 8065629 5672292 3344359 3422044 5633984 7521638 7852718
$$ packed form
36748B596790j438341N34860Q86111L3986k84853j83010l81002l07036L22861
36739A780366K98949p44174j098821N3596R54881M89936L20487J462575J689163
36730E206958n88289k594820j146672J837832K076874l01956j385643k02576J11688
36721C013396j688284k591437n77097J842656J718285J70962N8225J345309J663378
36712D955393K37944j296390j495718n76583M90052R55386N76765o5587R9113
36703C880375J177036J806387J011234j77889j44840Q31931R50265l84924j622615
36694G326960j259309J19149P49010M0949q76903q68866j51659M50137Q23083
36685F352551J207828J017907n12657k393337k327933P7685K211940J887654L31080
$$ plain form
36676 7852718 7816762 8485042 9140411 9061635 8953148 9194376 8567129 6559863 5165689
36667 5165689 6052008 7447723 6674822 4650203 4503815 6202819 6359802 3894793 2047545
36658 2047545 3170641 4899200 3955874 1200137 -47335 938352 1954825 1819824 1761475
36649 1761475 2794025 4037263 4274885 3699836 3510832 4577837 6662287 8381697 8231680
36640 8231680 6306430 4461504 3978916 3903029 2850667 1507481 1558858 2751119 3137173
36631 3137173 2163252 1351747 1584817 1860211 1499171 1528794 2664642 3723195 3587034
36622 3587034 3257825 4157947 5568130 5765456 4855188 4265837 3980932 2800201 1322194
36613 1322194 1852961 4525867 6181679 4681886 2050082 1233987 1758940 1402422 690211
$$ packed form
36676G852718l5956O68280O55369p8776j08487K41228o27247k007266j394174
36667E165689Q86319J395715p72901k024619j46388J699004J56983k465009j847248
36658B047545J123096J728559r43326k755737j247472R85687J016473j35001n8349
36649A761475J032550J243238K37622n75049j89004J067005K084450J719410j50017
36640H231680j925250j844926m82588p5887j052362j343186N1377J192261L86054
36631C137173r73921q11505K33070K75394l61040K9623J135848J058553j36161
36622C587034l29209R00122J410183J97326r10268n89351k84905j180731j478007
36613A322194N30767K672906J655812j499793k631804q16095N24953l56518p12211
$$ plain form
36604 690211 2079513 5004351 5658088 2688061 -427947 -523905 887816 1032882 937314
36595 937314 3344405 7124160 8052350 5132095 2183249 2186224 3545551 3660022 3127498
36586 3127498 3875144 5322226 5399035 4254482 4099388 5742220 7752531 8960151 9379133
36577 9379133 8462701 5065124 177919 -2585193 -1026132 2602825 4541345 4448463 5097706
36568 5097706 7553533 9320793 8122696 5323702 3940807 4631728 5570116 5519937 4943539
36559 4943539 4249878 3098414 1903900 2107193 4046608 6117879 7013934 7258841 7373503
36550 7373503 6258044 3250643 419840 411096 2635229 3960136 3012867 1501253 1128007
36541 1128007 1519947 1836904 2302077 3101507 3491334 3170448 3149432 4067619 4814364 4069853
$$ packed form
36604F90211J389302K924838O53737k970027l116008r5958J411721J45066r5568
36595I37314K407091L779755R28190k920255k948846K975J359327J14471n32524
36586C127498P47646J447082P6809j144553j55094J642832K010311J207620M18982
36577I379133r16432l397577m887205k763112J559061L628957J938520r2882O49243
36568E097706K455827J767260j198097k798994j382895O90921R38388n0179n76398
36559D943539o93661j151464j194514K03293J939415K071271Q96055K44907J14662
36550G373503j115459l007401k830803q744K224133J324907r47269j511614l73246
36541A128007L91940L16957M65173P99430L89827l20886k1016R18187P46745p44511
$$ plain form
36531 4069853 2345917 1297958 1574084 2333370 2513493 1866038 1061092 1141336 2407035
36522 2407035 3754102 3938930 3498858 4113080 5818407 6564078 5348012 4079988 4923501
36513 4923501 7151118 8386218 8042554 7587979 7773756 7560606 6102525 4269005 3463600
36504 3463600 3804410 4223924 3998150 3520003 3487715 3830911 4018265 4294019 5545596
36495 5545596 7372297 7545709 4906824 1921889 2132848 5202499 6979180 5094239
36487 5094239 2037170 1348510 2896162 3852242 2898306 1368756 937031 1915536 3514651
36478 3514651 4538829 4173048 2960712 2450635 3216295 4146743 4416695 4862292 6229043
36469 6229043 7266040 6132897 3056775 283396 -249524 1538001 3965329 4767999
$$ packed form
36531D069853j723936j047959K76126P59286J80123o47455q04946Q0244J265699
36522B407035J347067J84828m40072O14222J705327P45671j216066j268024Q43513
36513D923501K227617J235100l43664m54575J85777k13150j458081j833520q05405
36504C463600L40810M19514k25774m78147l2288L43196J87354K75754J251577
36495E545596J826701J73412k638885k984935K10959L069651J776681j884941
36487E094239l057069o88660J547652R56080r53936j529550m31725R78505J599115
36478C514651J024178l65781j212336n10077P65660R30448K69952M45597J366751
36469F229043J036997j133143l076122k773379n32920J787525K427328Q02670
$$ plain form
36461 4767999 3251703 1655794 2873520 6452611 8950259 8829196 8188977 8435180 7670973
36452 7670973 4784001 2708173 4016562 6041911 4763522 1551174 1115181 3846166
36444 3846166 5437822 4062778 2711611 3453925 4214952 3063811 1577715 1665637 2380480
36435 2380480 2196532 1652104 1514750 854680 -802719 -1643110 -140489 2446121 4238885
36426 4238885 5485760 6893983 7032901 4123459 -565980 -3580011 -3158027 -519464
36418 -519464 2205888 3785076 4138047 4191806 5109242 6697882 7234751 5722751 3414384
36409 3414384 2182308 2397207 3336647 4448045 5072474 4252408 2253219 1101461 2075282
36400 2075282 3738642 4053825 3314166 3111897 3420797 2976992 2002224 2128493 3586015
$$ packed form
36461D767999j516296j595909J217726L579091K497648j21063o40219K46203p64207
36452G670973k886972k075828J308389K025349j278389l212348m35993K730985
36444C846166J591656j375044j351167P42314P61027j151141j486096Q7922P14843
36435B380480j83948n44428j37354o60070j657399q40391J502621K586610J792764
36426D238885J246875J408223J38918k909442m689439l014031M21984K638563
36418e19464K725352J579188L52971N3759R17436J588640N36869j512000k308367
36409C414384j232076K14899R39440J111398O24429q20066j999189j151758R73821
36400B075282J663360L15183p39659k02269L08900m43805r74768J26269J457522
$$ plain form
36391 3586015 4714243 4719122 4874653 6072670 6823992 5062517 1140852 -2167601 -2495238
36382 -2495238 -77377 2755718 3866808 3112228 2077928 2155396 3102318 3651545 3180375
36373 3180375 2254273 1630319 1365784 1167471 1135164 1594204 2290962 2410619 1733780 1237211
36363 1237211 1858620 3015437 3321984 2628618 2086082 2098185 1842771 1329562 1956030
36354 1956030 3837696 4636376 2924591 800746 652775 1082126 -627988 -3248997 -2948658
36345 -2948658 329831 2226945 554883 -1669164 -1427230 -29016 168167 -42503 1153804
36336 1153804 2857128 3056228 2107763 1617806 1394457 396861 -642282 -399081 455932
36327 455932 657871 1028667 2661780 3705851 1706654 -1520304 -1515225 2103201 4667113
$$ packed form
36391C586015J128228M879J55531J198017P51322j761475l921665l308453l27637
36382b495238K417861K833095J111090p54580j034300P7468R46922N49227m71170
36373C180375r26102o23954k64535j98313l2307M59040O96758J19657o76839m96569
36363A237211O21409J156817L06547o93366n42536J2103k55414n13209O26468
36354A956030J881666P98680j711785k123845j47971M29351j710114k621009L00339
36345b948658L278489J897114j672062k224047K41934J398214J97183k10670J196307
36336A153804J703324J99100r48465m89957k23349r97596j039143K43201Q55013
36327D55932K01939L70796J633113J044071j999197l226958N079L618426K563912
$$ plain form
36318 4667113 3267851 615714 199271 1138842 786069 -159247 1174332 4631431 6627373
36309 6627373 5250725 2879805 2557442 3864322 4183306 2898749 2150212 3345038 4851709
36300 4851709 4228520 1588132 -632623 -664357 1219773 3910784 6403973 7585338 6857789
36291 6857789 5317296 4623754 4364674 2570977 -517975 -1719908 557353 3428380
36283 3428380 3432582 1403734 707689 2049524 3207489 3229922 3539989 4699802 5159071
36274 5159071 4058509 2786515 2694399 3253976 3472569 3358935 3020327 2014624 681274
36265 681274 502643 1848812 2752661 1424731 -1023394 -1898236 -350464 1915870 3029683
36256 3029683 2812831 2336778 2609974 3763564 4864314 4604281 2800177 1014983 849507
$$ packed form
36318D667113j399262k652137m16443R39571l52773r45316J333579L457099J995942
36309F627373j376648k370920l22363J306880L18984j284557p48537J194826J506671
36300D851709o23189k640388k220755l1734J884130K691011K493189J181365p27549
36291F857789j540493o93542k59080j793697l088952j201933K277261K871027
36283C428380M202k028848o96045J341835J157965K2433L10067J159813M59269
36274E159071j100562j271994r2116N59577K18593j13634l38608j005703j333350
36265F81274j78631J346169R03849j327930k448125q74842J547772K266334J113813
36256C029683k16852m76053K73196J153590J100750k60033j804104j785194j65476
$$ plain form
36247 849507 1664861 1118258 -1569343 -4015906 -3549403 -991718 261592 -915060 -1674285
36238 -1674285 326001 2813609 1971157 -1447782 -2557186 788862 5052843 6352341
36230 6352341 5475808 5142806 5070126 3279939 629507 50275 1691823 2601970 1725433
36221 1725433 1788133 4885706 8913908 10200459 7945019 4441470 2145552 1904765 3117192
36212 3117192 4347370 4313875 3102915 1965026 1578260 1339701 705917 128835 45603
36203 45603 -17012 -497952 -736957 289226 2579328 5018065 6389614 6287013 5396915
36194 5396915 4802862 4477251 2937251 -508638 -3670106 -3408761 257233 3838092 4548655
36185 4548655 2880261 492191 -2029927 -3982608 -3585940 -600286 1814388 691046
$$ packed form
36247H49507Q15354n46603k687601k446563M66503K557685J253310j176652p59225
36238a674285K000286K487608q42452l418939j109404L346048M263981J299498
36230F352341q76533l33002p2680j790187k650432n79232J641548R10147q76537
36221A725433O2700L097573M028202J286551k255440l503549k295918k40787J212427
36212C117192J230178l3495j210960j137889l86766k38559o33784n77082q3232
36203D5603o2615m80940k39005J026183K290102K438737J371549j02601q90098
36194E396915n94053l25611j540000l445889l161468K61345L665994L580859P10563
36185D548655j668394k388070k522118j952681L96668K985654K414674j123342
$$ plain form
36177 691046 -2248050 -2684199 41777 2007672 644197 -1578363 -1125466 1397500 2512853
36168 2512853 939487 -1302718 -2388037 -2661460 -2774860 -2224260 -874404 -130329 -974383
36159 -974383 -1962247 -927772 1866498 3952969 3831090 2327563 768276 -558005 -1693081
36150 -1693081 -2257657 -2118771 -1674867 -887276 824034 3156290 4704865 4875391 4590410
36141 4590410 4240931 2687111 -270738 -2198868 -1006708 1584064 2055831 -49425
36133 -49425 -1859189 -1551211 -351350 195447 406128 982671 1441581 1203647 694401
36124 694401 340696 -110868 -380628 662504 2938297 4261740 3005066 515603 -688677
36115 -688677 -223293 351760 357748 685811 1698351 2270970 1537547 321620 23490 888036
$$ packed form
36177F91046k939096m36149K725976J965895j363475k222560M52897K522966J115353
36168B512853j573366k242205j085319k73423j13400N50600J349856P44075q44054
36159i74383r87864J034475K794270K086471j21879j503527j559287j326281j135076
36150a693081n64576J38886M43904P87591J711310K332256J548575J70526k84981
36141D590410l49479j553820k957849j928130J192160K590772M71767k105256
36133d9425j809764L07978J199861N46797K10681N76543M58910k37934n09246
36124F94401l53705m51564k69760J043132K275793J323443j256674k489463j204280
36115f88677M65384N75053N988L28063J012540N72619p33423j215927k98130Q64546
$$ plain form
36105 888036 2197200 3621780 5318034 6678491 6093900 2804123 -1433941 -3568502
36097 -3568502 -2320583 782697 3593207 5321268 5670339 3640407 -806932 -4685771
36089 -4685771 -4250748 152945 3779557 3191219 337459 -763017 296219 602192 -790898
36080 -790898 -1106490 1586449 4670685 4199656 586364 -1677495 -110270 2519175 2308130
36071 2308130 -417817 -2063949 -1100792 193147 -479112 -2285947 -2985060 -2062812 -766337
36062 -766337 -124038 -253402 -828255 -1069517 -21001 2056192 3349559 2727363 1497069
36053 1497069 1611630 2883677 3498024 2685387 1252193 -94912 -1195250 -1447487 -231007
36044 -231007 1567455 2166506 1412885 1227857 3022231 5836250 7550458 7032853 4720481
$$ packed form
36105H88036J309164J424580J696254J360457n84591l289777m238064k134561
36097c568502J247919L103280K810510J728061L49071k029932m447339l878839
36089d685771M35023M403693L626612n88338k853760j100476J059236L05973j393090
36080g90898l15592K692939L084236m71029l613292k263859J567225K629445k11045
36071B308130k725947j646132R63157J293939o72259j806835o99113R22248J296475
36062g66337O42299j29364n74853k41262J048516K077193J293367o22196j230294
36053A497069J14561J272047O14347q12637j433194j347105j100338k52237J216480
36044b31007J798462N99051p53621j85028J794374K814019J714208n17605k312372
$$ plain form
36035 4720481 1881676 -303117 -1368236 -1447958 -601066 1052339 2419829 2176394 1201726
36026 1201726 2345681 6119600 8646603 6513244 1989328 13379 1058340 1081220
36018 1081220 -1564540 -3623342 -2465084 -63005 604266 -137187 -351867 88573 299959
36009 299959 572115 1299441 1321102 -334313 -2299216 -2576902 -1331633 -105365 624875
36000 624875 1237107 1425354 856834 456012 1063212 1573214 397910 -1763120 -2584509
35991 -2584509 -1319552 399634 938888 368741 -319692 -568548 -594143 -937068 -1633574
35982 -1633574 -1777120 -635840 739112 421947 -1383275 -1976091 140905 2885028 3427177
35973 3427177 1946632 744842 722461 718945 -217468 -1626106 -2450967 -1914041 -28357
$$ packed form
36035D720481k838805k184793j065119p9722Q46892J653405J367490k43435r74668
36026A201726J143955L773919K527003k133359m523916j975949J044961K2880
36018A081220k645760k058802J158258K402079O67271p41453k14680M40440K11386
36009B99959K72156P27326K1661j655415j964903k77686J245269J226268P30240
36000F24875O12232J88247n68520m00822O07200N10002j175304k161030q21389
35991b584509J264957J719186N39254n70147o88433k48856k5595l42925o96506
35982a633574j43546J141280J374952l17165j805222n92816K116996K744123N42149
35973C427177j480545j201790k2381l516r36413j408638q24861N36926J885684
$$ plain form
35964 -28357 1948867 2426527 1543336 992176 1024577 -320811 -3517640 -5390062 -3150385
35955 -3150385 1135077 3002253 1335987 -1232666 -2666568 -3043665 -2325768 -125373
35947 -125373 2076880 1744750 -892681 -2567979 -1435366 640290 1268871 741743 752287
35938 752287 1705756 2657487 2720758 1579761 -374434 -1855929 -1744212 -678465 -332669
35929 -332669 -880170 -714488 914847 2589270 2667521 1203693 -565952 -1366513 -252458
35920 -252458 2632887 5311144 5588032 3830987 2516702 2730297 3071348 2475094 1791104
35911 1791104 1630737 1051318 -166232 -207836 1837530 3624390 2450588 -828598 -3108141
35902 -3108141 -3245873 -2598079 -2041164 -967559 838226 2544971 3731805 4654800 4849011
$$ packed form
35964b8357J977224M77660q83191n51160L2401j345388l196829j872422K239677
35955c150385M285462J867176j666266k568653j433902l77097P17897K200395
35947a25373K202253l32130k637431j675298J132613K075656O28581n27128J0544
35938G52287R53469R51731O3271j140997j954195j481495J11717J065747L45796
35929c32669n47501J65682J629335J674423P8251j463828j769645q00561J114055
35920b52458K885345K678257K76888j757045j314285K13595L41051n96254o83990
35911A791104j60367n79419j217550m1604K045366J786860j173802l279186k279543
35902c108141j37732O47794N56915J073605J805785J706745J186834R22995J94211
$$ plain form
35893 4849011 3318075 570390 -1289884 -1260612 -757037 -1361741 -2578796 -2926621 -2210833
35884 -2210833 -1400424 -914461 -420281 -43100 -352120 -980236 -566454 1308906 3112444
35875 3112444 3135923 1609942 75267 -795241 -1428324 -1643463 -464606 1802285 2977492
35866 2977492 1793519 55684 302079 2061360 2522457 823330 -580589 431070
35858 431070 2568717 3139097 1862439 969454 1970737 3883141 4758960 3826616 1788050
35849 1788050 -181205 -1233092 -1114154 -205528 676263 846948 450810 622762 2515450
35840 2515450 5726586 8041840 7537161 4879152 2588409 1842785 1191232 -894563 -3399595
35831 -3399595 -4062641 -2650429 -1296099 -1546561 -2591829 -2913004 -2373669 -1812080 -1543515
$$ packed form
35893D849011j530936k747685j860274K9272N03575o04704j217055l47825P15788
35884b210833Q10409M85963M94180L77181l09020o28116M13782J875360J803538
35875C112444K3479j525981j534675q70508o33083k15139J178857K266891J175207
35866B977492j183973j737835K46395J759281M61097j699127j403919J011659
35858D31070K137647N70380j276658q92985J001283J912404Q75819r32344k038566
35849A788050j969255j051887J18938R08626Q81791J70685l96138J71952J892688
35840B515450L211136K315254n04679k658009k290743p45624o51553k085795k505032
35831c399595o63046J412212J354330k50462j045268l21175N39335N61589K68565
$$ plain form
35822 -1543515 -1352583 -1343997 -1639586 -1551610 -222484 1957163 3614819 4115875 3979523
35813 3979523 3529460 2416199 861036 21087 347743 786538 554903 490887 1354305
35804 1354305 1965407 813310 -1278691 -2137870 -1506169 -1151943 -1732566 -1855336 -811237
35795 -811237 -74831 -1047775 -3029121 -4507232 -4987664 -4556531 -3184317 -1593294 -1265492
35786 -1265492 -2270732 -2561014 -850842 1323082 2079846 2131293 3054725 3989708 2841302
35777 2841302 162377 -1076991 254615 2058821 2474317 2325900 2986282 3789863 3236252
35768 3236252 1626538 825381 1728179 3220982 3773344 3236768 2642083 2592637 2543290
35759 2543290 1925070 1296798 1494603 2089236 2073150 1925459 3080106 4993450 5166500
$$ packed form
35822a543515J90932Q586k95589Q7976J329126K179647J657656N01056j36352
35813C979523m50063j113261j555163q39949L26656M38795k31635o4016Q63418
35804A354305O11102j152097k092001q59179O31701L54226n80623j22770J044099
35795h11237P36406r72944j981346j478111m80432M31133J372214J591023L27802
35786a265492j005240k90282J710172K173924P56764N1447R23432R34983j148406
35777B841302k678925j239368J331606J804206M15496j48417O60382Q03581n53611
35768C236252j609714q01157R02798J492803N52362n36576n94685m9446m9347
35759B543290o18220o28272J97805N94633j6086j47691J154647J913344J73050
$$ plain form
35750 5166500 3339481 3135107 7191349 12648698 14514150 12312783 10113235 10454928
35742 10454928 11607642 11059231 8600940 5265044 1964222 95302 992043 3680958
35734 3680958 5319899 4825097 3964095 4013353 3773400 2170171 416463 -124263 -142347
35725 -142347 -629376 -886896 -323856 -362374 -2048083 -3234764 -1070606 3406370 6043912
35716 6043912 4976074 2751711 2604236 4680151 6748685 7042433 5477440 3199146
35708 3199146 1809252 2307662 4084393 5431347 5511011 5349234 6466600 8974841 11538218
35699 11538218 12971359 13337299 13415329 13507776 13169451 12121847 11024086 10890567 11740743
35690 11740743 12219530 10845106 7636959 4437178 3455432 5149626 7431686 7408336 4302412
$$ packed form
35750E166500j827019k04374M056242N457349J865452k201367k199548L41693
35742A0454928J152714n48411k458291l335896l300822j868920Q96741K688915
35734C680958J638941m94802q61002M9258k39953j603229j753708n40726j8084
35725a42347m87029k57520N63040l8518j685709j186681K164158M476976K637542
35716F043912j067838k224363j47475K075915K068534K93748j564993k278294
35708C199146j389894M98410J776731J346954P9664j61777J117366K508241K563377
35699A1538218J433141L65940P8030R2447l38325j047604j097761j33519Q50176
35690A1740743M78787j374424l208147l199781r81746J694194K282060k3350l105924
$$ plain form
35681 4302412 386643 -1354238 -262310 1588061 1701939 -465371 -3155577 -4058386
35673 -4058386 -2695814 -998203 -871362 -1545245 -851208 886020 620792 -2710276 -5813436
35664 -5813436 -5499776 -3346358 -2979606 -4318747 -4076459 -1225425 1775712 3200847 3865700
35655 3865700 4226377 3216489 995787 -418622 -564613 -1499020 -3917766 -5467996 -4786139
35646 -4786139 -4092812 -5301818 -6349128 -4446221 -847881 951721 401762 -1051 920189
35637 920189 1610086 710726 -1065199 -2334977 -2618597 -2277530 -2042991 -2567003 -3649676
35628 -3649676 -4298081 -4083708 -3580990 -3007202 -1860688 -591759 -744990 -2300377 -2944194
35619 -2944194 -1563245 -333848 -1324624 -3116050 -3244083 -2058138 -1303922 -609522 1315011
$$ packed form
35681D302412l915769j740881J091928J850371J13878k167310k690206r02809
35673d058386J362572J697611J26841o73883O94037J737228k65228l331068l103160
35664e813436L13660K153418L66752j339141K42288K851034L001137J425135O64853
35655C865700L60677j009888k220702j414409j45991r34407k418746j550230O81857
35646d786139O93327j209006j047310J902907L598340J799602n49959m02813R21240
35637I20189O89897q99360j775925j269778k83620L41067K34539n24012j082673
35628c649676o48405K14373N02718N73788J146514J268929j53231j555387o43817
35619b944194J380949J229397r90776j791426j28033J185945P54216O94400J924533
$$ plain form
35610 1315011 3252172 2800995 452343 -1032247 -872379 -613370 -633436 148847 1155602
35601 1155602 457871 -1378289 -1419242 817035 2206714 914479 -918843 -959523 7072
35592 7072 460171 897637 1896407 2013507 328304 -971035 530542 3446115 4388311
35583 4388311 2887794 1545451 1592930 1274984 -757791 -2926685 -2950763 -1098468 314111
35574 314111 69391 -695651 -518513 164472 -356627 -2568977 -4872936 -5480502 -4343979
35565 -4343979 -2723442 -1696171 -1778003 -3039784 -4523837 -4452038 -2385954 -389704 -475083
35556 -475083 -1692881 -1708817 -558145 -342450 -1436659 -1832585 -711943 85788 -852459
35547 -852459 -2448996 -3404928 -4202155 -5279911 -5335589 -3353535 -674739 844517 1340592
$$ packed form
35610A315011J937161m51177k348652j484590J59868K59009k0066P82283J006755
35601A155602o97731j836160m0953K236277J389679j292235j833322m0680R66595
35592G072M53099M37466R98770J17100j685203j299339J501577K915573R42196
35583D388311j500517j342343M7479l17946k032775k168894k4078J852295J412579
35574C14111k44720p65042J77138O82985n21099k212350k303959o07566J136523
35565d343979J620537J027271q1832j261781j484053P1799K066084J996250q5379
35556d75083j217798j5936J150672K15695j094209l95926J120642P97731r38247
35547h52459j596537r55932p97227j077756n5678J982054K678796J519256M96075
$$ plain form
35538 1340592 1834677 2071865 1480309 993163 1636625 2257227 1071925 -1105178 -1696350
35529 -1696350 -307577 604231 -588787 -2529029 -3245587 -2897733 -2912712 -3518817 -3499171
35520 -3499171 -2082846 -115070 835848 189827 -1068800 -1630697 -1479272 -1721978 -2745541
35511 -2745541 -3400117 -2566848 -779949 516396 768000 527114 362347 456172 881972
35502 881972 1356560 1091867 -135726 -1161577 -831878 52311 -433007 -2490593 -3996321
35493 -3996321 -3241745 -1154735 -41734 -857160 -2439733 -2976917 -1624919 928684 2916293
35484 2916293 2766167 503471 -2186215 -3608148 -3528020 -2647420 -1170117 1081609 3195654
35475 3195654 3205428 429316 -3183289 -5213847 -5583223 -5737319 -5687595 -4188161 -1977956
$$ packed form
35538A340592M94085K37188n91556m87146O43462O20602j185302k177103n91172
35529a696350J388773R11808j193018j940242p16558L47854j4979o06105J9646
35520c499171J416325J967776R50918o46021j258627n61897J51425k42706j023563
35511b745541o54576Q33269J786899J296345K51604k40886j64767R3825M25800
35502H81972M74588k64693j227593j025851L29699Q84189m85318k057586j505728
35493c996321P54576K087010J113001q15426j582573n37184J351998K553603J987609
35484B916293j50126k262696k689686j421933Q0128Q80600J477303K251726K114045
35475C195654R774k776112l612605k030558l69376j54096M9724J499434K210205
$$ plain form
35466 -1977956 -1919649 -4486102 -5900190 -3371607 54825 -519010 -4355166 -5927007 -3197061
35457 -3197061 -425369 -1316549 -3612841 -3179243 -179417 2154533 2678795 2786770 3036436
35448 3036436 2640095 1724638 1301246 1354133 1348519 2076565 4456449 6927367 6763460 3974760
35438 3974760 1383857 709807 1018157 1239574 1649232 2278736 2245660 1469185 1018775
35429 1018775 1076302 534306 -791263 -1665414 -1794889 -2390557 -3487255 -3104562 -381342
35420 -381342 2651082 3889193 3681765 3021577 1443946 -1267430 -3292471 -3120257 -2180790
35411 -2180790 -2699746 -4169409 -4433165 -3202940 -1850436 -545549 1507164 3398326
35403 3398326 3098487 879690 -654613 -458786 -280979 -1194834 -1589988 -129785 1544075
$$ packed form
35466a977956N8307k566453j414088K528583L426432n73835l836156j571841K729946
35457c197061K771692q91180k296292M33598K999826K333950N24262J07975K49666
35448C036436l96341r15457m23392N2887n614P28046K379884K470918j63907k788700
35438C974760k590903o74050L08350K21417M09658O29504l3076p76475m50410
35429A018775N7527n41996j325569q74151j29475n95668j096698L82693K723220
35420c81342L032424J238111k07428o60188j577631k711376k025041J72214R39467
35411b180790n18956j469663k63756J230225J352504J304887K052713J891162
35403C398326k99839k218797j534303J95827J77807r13855l95154J460203J673860
$$ plain form
35394 1544075 1166374 -477689 -443095 2273448 5335724 5925346 3822549 1272881 400764
35385 400764 1166087 1848403 1333636 397211 326344 893539 766409 -240757 -615370 759263
35375 759263 2935406 3903958 2698669 170789 -1805711 -1727036 322541 2603334 3289545
35366 3289545 2114238 143657 -1516188 -1974847 -312178 3313175 6573102 6792867
35358 6792867 4094161 1171730 -177650 -537178 -734048 -439717 386131 818870 780207
35349 780207 1490310 2978926 3347752 1961515 998517 1818521 2156812 -311898 -3559867
35340 -3559867 -3699915 -722336 1689297 1481340 -10390 -1382990 -2715715 -3413021 -1952393
35331 -1952393 1094929 2678161 1291994 -942286 -1505539 -645144 7759 18542 -48911
$$ packed form
35394A544075l77701j644063L4594K716543L062276N89622k102797k549668q72117
35385D00764P65323O82316n14767r36425p0867N67195j27130j007166l74613J374633
35375G59263K176143R68552j205289k527880j976500P8675K049577K280793O86211
35366C289545j175307j970581j659845m58659J662669L625353L259927K19765
35358F792867k698706k922431j349380l59528j96870K94331Q25848M32739l8663
35349G80207P10103J488616L68826j386237r62998Q20004L38291k468710l247969
35340c559867j40048K977579K411633k07957j491730j372600j332725o97306J460628
35331a952393L047322J583232j386167k234280n63253Q60395O52903J0783o7453
$$ plain form
35322 -48911 216552 1244618 3172458 4481626 2947808 -957852 -3787471 -3587854 -2363376
35313 -2363376 -2405030 -2670836 -1252575 797739 1271721 921216 2266936 4941486 5721854
35304 5721854 3446167 816208 428764 1452976 1442766 -298638 -2378229 -3231033 -2420126
35295 -2420126 -645093 991253 2014110 2836849 3732174 4239528 4246494 4572960 5289999
35286 5289999 4726207 2014658 -506041 45525 2729771 4066439 3515072 4216765 7464705
35277 7464705 9959704 8564548 4952370 2838608 2571861 1510333 -1291913 -3858286
35269 -3858286 -4609657 -4192207 -3463138 -1959252 440192 1943709 636026 -2635191 -4580750
35260 -4580750 -3012266 719360 3377711 3435933 2078550 686540 -1166585 -4090909
$$ packed form
35322d8911K65463J028066J927840J309168j533818l905660k829619J99617J224478
35313b363376m1654k65806J418261K050314M73982l50505J345720K674550P80368
35304E721854k275687k629959l87444J024212j0210j741404k079591q52804Q10907
35295b420126J775033J636346J022857Q22739Q95325N07354O966L26466P17039
35286E289999n63792k711549k520699N51566K684246J336668n51367P01693L247940
35277G464705K494999j395156l612178k113762k66747j061528k802246k566373
35269c858286p51371M17450P29069J503886K399444J503517j307683l271217j945559
35260d580750J568484L731626K658351N8222j357383j392010j853125k924324
$$ plain form
35252 -4090909 -6417400 -5485305 -1425947 2333312 3057600 1593078 409563 376733 800835
35243 800835 1253912 1558494 817781 -1554180 -4090328 -4398656 -2253640 -82675 45067
35234 45067 -1267423 -1929192 -904411 1009179 2326188 2298631 1473085 964802 995089
35225 995089 549210 -883343 -1811165 -330745 2852739 4607848 3192843 495370 -560343
35216 -560343 281345 871207 -85199 -1655641 -2479611 -2434287 -2105304 -1766769 -1532206 -1701787
35206 -1701787 -2280943 -2732627 -2808057 -3064674 -3881429 -4485313 -3826813 -2105055 -503176
35197 -503176 411748 1035610 1552739 1605585 1388826 1809062 2858852 2936473 873975 -2069309
35187 -2069309 -3441876 -2470964 -592071 620653 838850 376393 -434241 -939525 -489651
$$ packed form
35252d090909k326491R32095M059358L759259P24288j464522j183515l2830M24102
35243H00835M53077L04582p40713k371961k536148l08328K145016K170965J27742
35234D5067j312490o61769J024781J913590J317009k7557q25546n08283L0287
35225I95089m45879j432553r27822J480420L183484J755109j415005k697473j055713
35216e60343Q41688N89862r56406j570442q23970M5324L28983L38535K34563j69581
35206a701787n79156m51684p5430k56617q16755o03884O58500J721758J601879
35197e03176R14924O23862N17129N2846k16759M20236J049790P7621k062498k943284
35187b069309j372567R70912J878893J212724K18197m62457q10634n05284M49874
$$ plain form
35178 -489651 329346 -117791 -2264264 -4192839 -3785009 -1348419 1053135 2334625 2980097
35169 2980097 3131461 1979247 -295995 -1666195 -718334 1109746 1398024 189260 -360861
35160 -360861 397659 599154 -882373 -2376196 -2083191 -987046 -1019002 -1630288 -819830
35151 -819830 1007462 1170653 -944077 -2508987 -1402378 679771 1012021 -127425 -380379
35142 -380379 862684 1807758 1103431 -493796 -1419245 -1046379 -29449 354900 -615792
35133 -615792 -2092744 -2406541 -1376581 -895699 -2336493 -4449316 -5037412 -3748138 -1870476
35124 -1870476 -309647 761559 1151550 1151420 1897355 3551842 4119161 2030627 -1079058
35115 -1079058 -2451569 -2167586 -2432675 -3629445 -4063495 -3297237 -2546835 -1765132 276791
$$ packed form
35178d89651Q18997m47137k146473j928575M07830K436590K401554J281490O45472
35169B980097J51364j152214k275242j370200R47861J828080K88278j208764n50121
35160c60861P58520K01495j481527j493823K93005J096145l1956o11286Q10458
35151h19830J827292J63191k114730j564910J106609K082149L32250j139446k52954
35142c80379J243063R45074p04327j597227r25449L72866J016930L84349r70692
35133f15792j476952l13797J029960M80882j440794k112823n88096J289274J877662
35124a870476J560829J071206L89991j30P45935J654487N67319k088534l109685
35115a079058j372511K83983k65089j196770m34050P66258P50402P81703K041923
$$ plain form
35106 276791 2617386 2414173 -418064 -2393374 -1620785 -290430 -285209 40735 2197497
35097 2197497 4044375 3176491 1151377 828371 1624608 1108304 -368601 -558601 266034
35088 266034 -204406 -1929953 -2590515 -2067623 -2892049 -5489087 -6729249 -4738339 -2024827
35079 -2024827 -1797292 -3513818 -4294731 -3171463 -1755884 -1511688 -2201279 -2813197 -2783234
35070 -2783234 -2297856 -2046434 -2551509 -3413927 -3559614 -2536853 -1216968 -902056 -1900892
35061 -1900892 -3111825 -3060700 -1648776 -807586 -2561545 -6151921 -8307118 -7168931 -4587274
35052 -4587274 -3194539 -2643275 -876120 1834734 2818369 945568 -1825936 -3329538
35044 -3329538 -3548916 -3494477 -3571291 -3780503 -3972309 -3325307 -1131168 1441799 2120899
$$ packed form
35106B76791K340595k03213k832237j975310P72589J330355N221L25944K156762
35097B197497J846878q67884k025114l23006P96237n16304j476905j90000Q24635
35088B66034m70440j725547o60562N22892q24426k597038j240162J990910K713512
35079b024827K27535j716526p80913J123268J415579K44196o89591o11918K9963
35070b783234M85378K51422n05075q62418j45687J022761J319885L14912r98836
35061a900892j210933N1125J411924Q41190j753959l590376k155197J138187K581657
35052d587274J392735N51264J767155K710854R83635j872801k771504j503602
35044c329538k19378N4439p6814k09212j91806O47002K194139K572967O79100
$$ plain form
35035 2120899 671538 -544729 98699 1490795 2053602 2028541 2155116 1923115 877707
35026 877707 203872 1126097 2742758 3168525 2016991 269106 -1382074 -2510334 -2313226
35017 -2313226 -789644 319696 -298907 -1214282 -272908 1701176 1841933 -182335 -1336834
35008 -1336834 245518 2377067 1924593 -974542 -3479418 -3694893 -2142564 -240787
35000 -240787 1186782 2029214 2602229 3336864 4210847 4619157 4139735 3003601 1445900
34991 1445900 -686831 -2991601 -3970926 -2670902 -498549 25134 -1514503 -2820148
34983 -2820148 -2081252 -502407 -462115 -1981476 -2694680 -1350240 315823 49321 -1762436
34974 -1762436 -2767083 -1977914 -898704 -1150066 -2358529 -3117095 -3002430 -2606504 -2205344
$$ packed form
35035B120899j449361j216267O43428J392096N62807k5061J26575k32001j045408
35026H77707o73835R22225J616661M25767j151534j747885j651180j128260J97108
35017b313226J523582J109340o18603r15375R41374J974084J40757k024268j154499
35008a336834J582352K131549m52474k899135k504876k15475J552329J901777
35000b40787J427569Q42432N73015P34635Q73983M08310m79422j136134j557701
34991A445900k132731k304770r79325J300024K172353N23683j539637j305645
34983b820148P38896J578845M0292j519361p13204J344440J666063k66502j811757
34974a762436j004647P89169J079210k51362j208463p58566J14665L95926M01160
$$ plain form
34965 -2205344 -1577544 -943898 -998633 -1898734 -3030611 -3830741 -4075584 -3465009 -1998587
34956 -1998587 -828831 -1360120 -3009705 -3355057 -1523915 -16673 -1519688 -4928468
34948 -4928468 -6644962 -5410097 -3529257 -3110213 -3520538 -3495079 -3432271 -3878451 -3608193
34939 -3608193 -1595433 212082 -1185294 -5296576 -8084782 -7041395 -4155056 -2778026
34931 -2778026 -3344132 -3730411 -2677557 -1088906 -368574 -996154 -2737172 -4949960 -6311745
34922 -6311745 -5300938 -1814347 2038691 3572428 2190674 -31358 -798780 -200722
34914 -200722 -71596 -999096 -1462699 -624102 -346469 -2601199 -5795917 -6200537 -3161413
34905 -3161413 -362135 -863821 -3119054 -3682523 -2177409 -1151834 -1754128 -2126435 -453752
$$ packed form
34965b205344O27800O33646n4735r00101j131877q00130k44843O10575J466422
34956a998587J169756n31289j649585l45352J831142J507242j503015l408780
34948d928468j716494J234865J880840M19044m10325K5459O2808m46180K70258
34939c608193K012760J807515j397376m111282k788206J043387K886339J377030
34931b778026n66106l86279J052854J588651P20332o27580j741018k212788j361785
34922f311745J010807L486591L853038J533737j381754k222032p67422N98058
34914b00722J29126r27500m63603Q38597K77633k254730l194718m04620L039124
34905c161413K799278n01686k255233n63469J505114J025575o02294l72307J672683
$$ plain form
34896 -453752 2374919 4059022 3599978 1798408 -120187 -1370731 -1513827 -543617 752867
34887 752867 1218545 538326 -355160 -567421 -556532 -1309124 -2383126 -2165653 -561510
34878 -561510 216552 -1122811 -2444922 -1128994 1465767 1406353 -1967852 -4720752 -3734800
34869 -3734800 -560369 1652578 2388777 2782972 2666047 1357956 11032 412406 2194449
34860 2194449 3585679 4238426 4974628 5336213 3937894 1125523 -1031327 -1482781 -955173
34851 -955173 -73004 1158870 1996691 1317846 -343292 -1171456 -867175 -1067568 -2491392
34842 -2491392 -3678891 -3339736 -2177069 -1506309 -1578490 -2075225 -2834184 -3267342 -2423053
34833 -2423053 -579305 316519 -1224599 -4294539 -6364222 -5578064 -2259493 1205987
$$ packed form
34896d53752K828671J684103m59044j801570j918595j250544j43096R70210J296484
34887G52867M65678o80219q93486k12261J0889p52592j074002K17473J604143
34878e61510P78062j339363j322111J315928K594761n9414l374205k752900R85952
34869c734800L174431K212947P36199L94195j16925j308091j346924M01374J782043
34860B194449J391230O52747P36202L61585j398319k812371k156850m51454N27608
34851i55173Q82169J231874Q37821o78845j661138q28164L04281k00393j423824
34842b491392j187499L39155J162667O70760p2181m96735p58959m33158Q44289
34833b423053J843748Q95824j541118l069940k069683P86158L318571L465480
$$ plain form
34825 1205987 2225457 608888 -1087419 -806485 275175 -204212 -1992666 -2714665 -1533655
34816 -1533655 211240 1619421 2647255 2169390 -1001188 -4821017 -5346116 -2337066
34808 -2337066 -26662 -944249 -2591626 -2183272 -1041991 -1521625 -2727941 -2622252 -1922694
34799 -1922694 -2446668 -3450694 -3030230 -1686235 -1219488 -1342377 -622430 322946 -161705
34790 -161705 -1526831 -2064727 -2293311 -3790412 -5356744 -4205088 -842262 1130586 482804
34781 482804 -151924 954766 2072555 1625080 971750 1612212 2328379 1293146 -974846
34772 -974846 -2744185 -3548318 -3799189 -3381132 -2287328 -1436145 -1387757 -1379803 -893564 -852702
34762 -852702 -1829830 -2374209 -875465 1851060 3611854 3820816 3703426 3903385 3658364
$$ packed form
34825A205987J019470j616569j696307K80934J081660m79387j788454p21999J181010
34816a533655J744895J408181J027834m77865l170578l819829n25099L009050
34808b337066K310404r17587j647377M08354J141281m79634j206316J05689O99558
34799a922694n23974j004026M20464J343995M66747j22889P19947R45376m84651
34790a61705j365126n37896k28584j497101j566332J151656L362826J972848o47782
34781D82804o34728J106690J117789m47475o53330O40462P16167j035233k267992
34772i74846j769339q04133k50871M18057J093804Q51183M8388P954M86239M0862
34762h52702r77128n44379J498744K726525J760794K08962j17390J99959k45021
$$ plain form
34753 3658364 2483085 1189336 712255 883746 976384 928915 1372138 2429650 2970698
34744 2970698 1608997 -1469647 -4332525 -5445978 -5312784 -5111992 -4501652 -2395024 346222
34735 346222 1070319 -1137298 -3793751 -4022483 -1987963 -72366 463132 547752 1382541
34726 1382541 2734499 3335402 2323026 121063 -1895200 -2691451 -2556713 -2484849 -2717633
34717 -2717633 -2625776 -2053058 -1756464 -2087037 -2192104 -1263047 105722 632391 62717
34708 62717 -558246 -261830 632690 782675 -655399 -2720952 -3368631 -2010403 -630913
34699 -630913 -1210153 -2626141 -1976291 1014664 3129297 2054599 -399965 -1010287 522645
34690 522645 1891098 1823501 1220043 927391 442914 -747221 -2066642 -2786842 -3098259
$$ packed form
34753C658364j175279j293749m77081J71491R2638m7469M43223J057512N41048
34744B970698j361701l078644k862878j113453J33194K00792O10340K106628K741246
34735C46222P24097k207617k656453k28732K034520J915597N35498Q4620Q34789
34726A382541J351958O00903j012376k201963k016263p96251J34738P1864k32784
34717b717633R1857N72718K96594l30573j05067R29057J368769N26669n69674
34708F2717o20963K96416Q94520J49985j438074k065553o47679J358228J379490
34699f30913n79240j415988O49850K990955K114633j074698k454564o10322J532932
34690E22645J368453o7597o03458k92652m84477j190135j319421p20200l11417
$$ plain form
34681 -3098259 -3558137 -4036874 -3819164 -2561029 -782334 613749 1216633 1401924 1644034
34672 1644034 1758457 1283533 475483 152680 394422 227405 -995283 -2654024 -3779041
34663 -3779041 -4189516 -4197232 -3929955 -3591037 -3636948 -3888143 -3119029 -495379 2953399 5117797
34653 5117797 4817971 2536697 -274939 -2006008 -1778334 -489804 -347181 -2314885 -4589607
34644 -4589607 -4759718 -2933331 -1330240 -1145760 -1466883 -1302710 -944649 -804235 -467743
34635 -467743 167030 15312 -1754044 -4137192 -5358846 -5154288 -4799688 -4879365 -4253012
34626 -4253012 -1864914 1248297 2799264 1926154 15246 -1369121 -2303127 -3484240
34618 -3484240 -4319996 -3451175 -966188 1293931 1833539 776777 -1027938 -2790653 -3411389
$$ packed form
34681c098259m59878m78737K17710J258135J778695J396083O02884J85291K42110
34672A644034J14423m74924q08050l22803K41742j67017j222688j658741j125017
34663c779041m10475p716K67277L38918m5911k51195P69114K623650L448778K164398
34653E117797k99826k281274k811636j731069K27674J288530J42623j967704k274722
34644d589607j70111J826387J603091J84480l21123J64173L58061J40414L36492
34635d67743O34773j51718j769356k383148j221654K04558L54600p9677O26353
34626d253012K388098L113211J550967q73110j910908j384367r34006j181113
34618c484240q35756Q68821K484987K260119N39608j056762j804715j762715o20736
$$ plain form
34609 -3411389 -2004353 426546 1340987 -311308 -2775973 -4168523 -4829829 -5695196 -6147934
34600 -6147934 -5497271 -4987135 -5784259 -6196205 -3941993 -540210 27975 -2695809 -4374302
34591 -4374302 -1723477 3185302 6018418 5291133 2692988 223212 -1090608 -945034
34583 -945034 -211 468254 316716 841423 2332458 2849862 915199 -1985433 -3347819
$$ packed form
34609c411389J407036K430899R14441j652295k464665j392550o61306q65367m52738
34600f147934O50663N10136p97124m11946K254212L401783N68185k723784j678493
34591d374302K650825M908779K833116p27285k598145k469776j313820J45574
34583i45034R44823M68465j51538N24707J491035N17404j934663k900632j362386
$$ [...]
##END NTUPLES=NMR SPECTRUM
##END=
