##TITLE=31Pdec_SR124_rek5T_1
 DMSO, 24 sc
 9.6.2022
##JCAMPDX= 6.0         $$ Bruker NMR JCAMP-DX V2.0
##DATA TYPE= NMR SPECTRUM
##DATA CLASS= NTUPLES
##ORIGIN= UXNMR, Bruker Analytische Messtechnik GmbH
##OWNER= root
$$ XWIN-NMR		Version 3.5
$$ Thu Jun  9 14:23:10 2022 Russian Standard Time (UT+4h)  she@DPX200
##.OBSERVE FREQUENCY= 81.013821
##.OBSERVE NUCLEUS= ^31P
##.ACQUISITION MODE= SIMULTANEOUS
##.ACQUISITION SCHEME= undefined
##.AVERAGES= 24
##.DIGITISER RES= 16
##SPECTROMETER/DATA SYSTEM= spect
##.PULSE SEQUENCE= zgpg30
##.SOLVENT NAME= Acetone
##.SHIFT REFERENCE= (INTERNAL, Acetone, 0, 248.564)
##AUDIT TRAIL= $$ (NUMBER, WHEN, WHO, WHERE, WHAT)
$$ ##TITLE= Audit trail, XWIN-NMR		Version 3.5
$$ ##JCAMPDX= 5.01
$$ ##ORIGIN= Bruker BioSpin GmbH
$$ ##OWNER= she
$$ F:/spectra/data/she/nmr/P31/1/pdata/1/auditp.txt
$$ ##AUDIT TRAIL=  $$ (NUMBER, WHEN, WHO, WHERE, WHAT)
(   1,<2022-06-09 14:22:01.18 +0400>,<she>,<DPX200>,
      <created by zg, POWCHK disabled, PULCHK disabled
       configuration hash MD5:
       00 E9 B6 7A A2 85 ED C7 34 08 36 98 17 FE 4E 26
       data hash MD5: 32K
       EF CD 15 9F 15 B7 59 CC 76 0A 3A 2D 9F F5 56 29>)
(   2,<2022-06-09 14:22:03.62 +0400>,<she>,<DPX200>,
      <Start of raw data processing
       efp BC_mod = 2 LB = 1 FT_mod = 6 PKNL = 1 PHC0 = -9888.655 PHC1 = -821.1464 SI = 64K 
       data hash MD5: 64K
       E6 A0 47 61 60 A6 1F 0A 2F 5C 54 B7 77 77 B2 5B>)
(   3,<2022-06-09 14:22:22.78 +0400>,<she>,<DPX200>,
      <pk PHC0 = -25.05058 PHC1 = 0 
       data hash MD5: 64K
       CE CD 36 BE 69 38 30 37 94 C6 88 81 C2 6C B8 B7>)
$$ ##END=
$$ 
$$ hash MD5
$$ 0D DA 52 33 A2 CA E1 CA F0 67 5D 7D 0D 07 82 BF
##$RELAX= 
##$RELAX= 
##$RELAX= 
##$RELAX= 
##$RELAX= 
##$RELAX= 
##$RELAX= 
##$RELAX= 
$$ Bruker specific parameters
$$ --------------------------
##$DU= <F:/spectra>
##$EXPNO= 1
##$NAME= <P31>
##$PROCNO= 1
##$TYPE= <nmr>
##$USER= <she>
##$AMP= (0..31)
100 100 100 100 100 100 100 100 100 100 100 100 100 100 100 100 100 100 
100 100 100 100 100 100 100 100 100 100 100 100 100 100 
##$AQSEQ= 0
##$AQ_mod= 1
##$AUNM= <au_zg>
##$AUTOPOS= <>
##$BF1= 81.014009
##$BF2= 200.13
##$BF3= 200.13
##$BF4= 200.13
##$BF5= 200.13
##$BF6= 200.13
##$BF7= 200.13
##$BF8= 200.13
##$BYTORDA= 1
##$CFDGTYP= 0
##$CFRGTYP= 5
##$CHEMSTR= <none>
##$CNST= (0..31)
1 1 145 1 1 1 1 1 1 1 1 1 1 1 1 1 1 1 1 1 1 1 1 1 1 1 1 1 1 1 1 1 
##$CPDPRG= <waltz16>
##$CPDPRG1= <>
##$CPDPRG2= <waltz16>
##$CPDPRG3= <>
##$CPDPRG4= <mlev>
##$CPDPRG5= <mlev>
##$CPDPRG6= <mlev>
##$CPDPRG7= <mlev>
##$CPDPRG8= <mlev>
##$CPDPRGB= <>
##$CPDPRGT= <>
##$D= (0..31)
0 1 0 0 0 0 0 0 0 0 0 0.03 2e-05 3e-06 0 0 0 0 0 0 0 0 0 0 0 0 0 0 0 0 
0 0 
##$DATE= 1654770120
##$DBL= (0..7)
120 120 120 11 120 120 24 19 
##$DBP= (0..7)
150 150 150 150 150 150 150 150 
##$DBP07= 0
##$DBPNAM0= <>
##$DBPNAM1= <>
##$DBPNAM2= <>
##$DBPNAM3= <>
##$DBPNAM4= <>
##$DBPNAM5= <>
##$DBPNAM6= <>
##$DBPNAM7= <>
##$DBPOAL= (0..7)
0.5 0.5 0.5 0.5 0.5 0.5 0.5 0.5 
##$DBPOFFS= (0..7)
$$ [...]
##$SUBNAM2= <"">
##$SUBNAM3= <"">
##$SUBNAM4= <"">
##$SUBNAM5= <"">
##$SUBNAM6= <"">
##$SUBNAM7= <"">
##$SUBNAM8= <"">
##$SUBNAM9= <"">
##$SW= 501.771253377433
##$SWIBOX= (0..15)
0 1 3 0 0 0 0 0 0 0 0 0 0 0 0 0 
##$SW_h= 40650.406504065
##$TD= 32768
##$TD0= 1
##$TE= 0
##$TE2= 300
##$TE3= 300
##$TEG= 300
##$TL= (0..7)
0 120 53 12 22 120 120 120 
##$TP= (0..7)
150 150 150 150 150 150 150 150 
##$TP07= 0
##$TPNAME0= <>
##$TPNAME1= <>
##$TPNAME2= <>
##$TPNAME3= <>
##$TPNAME4= <>
##$TPNAME5= <>
##$TPNAME6= <>
##$TPNAME7= <>
##$TPOAL= (0..7)
0.5 0.5 0.5 0.5 0.5 0.5 0.5 0.5 
##$TPOFFS= (0..7)
0 0 0 0 0 0 0 0 
##$TUNHIN= 0
##$TUNHOUT= 0
##$TUNXOUT= 0
##$USERA1= <user>
##$USERA2= <user>
##$USERA3= <user>
##$USERA4= <user>
##$USERA5= <user>
##$V9= 5
##$VALIST= <valist>
##$VCLIST= <CCCCCCCCCCCCCCC>
##$VD= 0
##$VDLIST= <DDDDDDDDDDDDDDD>
##$VPLIST= <PPPPPPPPPPPPPPP>
##$VTLIST= <TTTTTTTTTTTTTTT>
##$WBST= 1024
##$WBSW= 4
##$XGAIN= (0..3)
0 0 0 0 
##$XL= 0
##$YL= 0
##$YMAX_a= 3100
##$YMIN_a= -3121
##$ZGOPTNS= <>
##$ZL1= 120
##$ZL2= 120
##$ZL3= 120
##$ZL4= 120
##$ABSF1= 0
##$ABSF2= 0
##$ABSG= 0
##$ABSL= 0
##$ALPHA= 0
##$AQORDER= 0
##$ASSFAC= 0
##$ASSFACI= 0
##$ASSFACX= 0
##$ASSWID= 0
##$AUNMP= <proc_1d>
##$AZFE= 0.1
##$AZFW= 0.5
##$BCFW= 0
##$BC_mod= 2
##$BYTORDP= 0
##$COROFFS= 0
##$CY= -3
##$DATMOD= 1
##$DC= 0
##$DFILT= <>
##$DTYPP= 0
##$F1P= 0
##$F2P= 0
##$FCOR= 1
##$FTSIZE= 65536
##$FT_mod= 6
##$GAMMA= 0
##$GB= 0
##$INTBC= 1
##$INTSCL= 5.30512e-09
##$ISEN= 30
##$LB= 1
##$LEV0= 0
##$LPBIN= 0
##$MAXI= 10000
##$MC2= 0
##$MEAN= 0
##$ME_mod= 0
##$MI= 50
##$NCOEF= 0
##$NC_proc= -8
##$NLEV= 6
##$NOISF1= 182.463
##$NOISF2= 159.3651
##$NSP= 0
##$NTH_PI= 0
##$NZP= 0
##$OFFSET= 248.5645
##$PC= 4
##$PHC0= -9913.706
##$PHC1= -821.1464
##$PH_mod= 1
##$PKNL= yes
##$PPARMOD= 0
##$PSCAL= 0
##$PSIGN= 0
##$REVERSE= no
##$SF= 81.014009
##$SI= 65536
##$SIGF1= 159.3651
##$SIGF2= -187.1042
##$SINO= 113.3802
##$SIOLD= 16384
##$SREGLST= <1H.CDCl3>
##$SSB= 0
##$STSI= 65536
##$STSR= 0
##$SW_p= 40650.406504065
##$SYMM= 0
##$S_DEV= 0
##$TDeff= 32768
##$TDoff= 0
##$TI= <>
##$TILT= no
##$TM1= 0
##$TM2= 0
##$TOPLEV= 0
##$USERP1= <user>
##$USERP2= <user>
##$USERP3= <user>
##$USERP4= <user>
##$USERP5= <user>
##$WDW= 1
##$XDIM= 65536
##$YMAX_p= 530978448
##$YMIN_p= -384032958
$$ End of Bruker specific parameters
$$ ---------------------------------
##NTUPLES= NMR SPECTRUM
##VAR_NAME=  FREQUENCY,     SPECTRUM/REAL,   SPECTRUM/IMAG
##SYMBOL=    X,             R,               I
##VAR_TYPE=  INDEPENDENT,   DEPENDENT,       DEPENDENT
##VAR_FORM=  AFFN,          ASDF,            ASDF
##VAR_DIM=   65536,         65536,           65536
##UNITS=     HZ,            ARBITRARY UNITS, ARBITRARY UNITS
##FACTOR=    0.620285442955139, 1,           1
##FIRST=     20137.2065510759, 0,            0
##LAST=      -20513.1999529892, 0,           0
##MIN=       -20513.1999529892, -384032958,  0
##MAX=       20137.2065510759, 530978448,    0
$$ Real data points
##PAGE= N=1
##DATA TABLE= (X++(R..R)), XYDATA
$$ [...]
41435b930344k367324l431873k950333K91585M699684O207960L627718R90743
41427D137816J580783K707903M06417l634489m888412l478813l085435l682406
41419i936636j669327K680771M191039Q60378k395777q61903L155386M004409
41411B8340P09972k185096j125435J939624K546033o0169j736947N87582L718211
41402D422115K097217l708500o848749l714906J038983J734750m41653p99530
41394f220273J246721K784446K975956K932037J913022j187221l836608k468126
41386a860046J545118L270159J214234j475293k478316k583012k571660j998031
41378f936847j286667j456012j732283n86695J359167K454251K846557L056660
$$ y = [-2930344, -5297668, -8729541, -11679874, -11388289, -6688605, -480645, 3147073, 4137816, 5718599, 8426502, 8832919, 5198430, 310018, -3168795, -6254230, -9936636, -11605963, -8925192, -4734153, -3873775, -6269552, -7131455, -3976069, 28340, 738312, -1446784, -2572219, -632595, 1913438, 1853269, 116322, 703904, 4422115, 6519332, 2810832, -4037917, -7752823, -6713840, -4979090, -5420743, -6220273, -4973552, -2189106, 786850, 3718887, 5631909, 4444688, 608080, -1860046, -314928, 2955231, 4169465, 2694172, 215856, -2367156, -4938816, -6936847, -8223514, -9679526, -11411809, -11998504, -10639337, -8185086, -5338529, -2281869]
41370b281869J738607j314672k498410M44627L334659J525354j777177m41254
41362a270135L595519L083648j708523k870910J450431L557744n08811m107607
41354A221356j447272K900359K386100r24415j437379l480j092471l904009l718902
41345f020113O5222L398977L627046J449008j294341k073415J224232N926295
41337F302911N188151k476827q649734n822539J437022L338649n64975k302258
41329c549600P85441K709225j4626k671966o13948L749079N582353L837232r8180
41320I715010m901068p567587m285135L316642P392866L564917k584282l281196
41312A370167P42292K779274O89639j519097j654251k102071l606489k624161
$$ y = [-2281869, -543262, -1857934, -4356344, -3911717, -577058, 948296, -828881, -1270135, 2325384, 5409032, 3700509, 829599, 2280030, 5837774, 5328963, 1221356, -225916, 2674443, 5060543, 4136128, 2698749, 2695269, 1602798, -2301211, -6020113, -5954891, -2555914, 1071132, 2520140, 1225799, -847616, 376616, 6302911, 11491062, 9014235, 364501, -5458038, -4021016, -682367, -1247342, -3549600, -2764159, -54934, -69560, -2741526, -3355474, 393605, 5975958, 9813190, 9715010, 4813942, -2753645, -7038780, -3722138, 3670728, 7235645, 4651363, 1370167, 2112459, 4891733, 5581372, 4062275, 2408024, 305953, -3300536, -5924697]
41304e924697K096696N350531K313933l718832n428368j631979J828044J160240
41296c954432o73199P6590J893812J167736j651574k979364j696063j05945K36967
41287g685472L01660R19507J276957R07812Q86382J871612K527114J070037k289191
41278b13582n025011m280819K75925N144540N893894K464806k82311Q54320K682920
41269G514682O61324l545905m317614r04220J500954K9540j979266j103496J092770
41260a051231J666101P67929l04130j825315l519086l145223j72604K384992K643684
41251b554883K769923M071878L319672j620714o226653m895191N63574L744156
41243h28238L004165K000787K174288J157023j420671k766725k321732k600151
$$ y = [-5924697, -3828001, 1522530, 3836463, 117631, -5310737, -6942716, -5114672, -3954432, -4627631, -4551041, -2657229, -1489493, -3141067, -6120431, -7816494, -7922439, -7685472, -7383812, -6464305, -5187348, -4279536, -3393154, -1521542, 1005572, 2075609, -213582, -5238593, -9519412, -9243487, -4098947, 1794947, 4259753, 3977442, 4831762, 7514682, 8176006, 4630101, 312487, -591733, 909221, 938761, -1040505, -2144001, -1051231, 614870, 1382799, 1078669, -746646, -4265732, -7410955, -7583559, -5198567, -2554883, 215040, 4286918, 7606590, 5985876, -240777, -5135968, -4572394, -828238, 2175927, 4176714, 6351002, 7508025, 6087354, 3320629, 998897, -1601254]
41235a601254l639906k373670R81483J933394m71408r11278L445312P127213M480354
41226H970240j003020j867712J711779K576591k013631o436461n294646l26197
41218c683057L433718L982369K270598o09780l174535l146181l36105J997087
41210G34114J389684j52443L16176J509498K33784k470316k411238N13064J406705
41201A069028j703485m044156j330495L303986L926376N33969j720708n95574
41193e61059Q87676M3834j897597k577944j447514Q84650L356775L954161J331772
41184C974754k515523l918350k260560k79077M59834J044152J829660J374077
41176b91033k70391r45535l28299o87481k200665j596459K311207N586977M435036
$$ y = [-1601254, -5241160, -7614830, -6633347, -4699953, -5171361, -6082639, -2637327, 4489886, 8970240, 7967220, 6099508, 7811287, 10387878, 8374247, 1937786, -3356860, -3683057, -249339, 3733030, 6003628, 5393848, 2219313, -926868, -1262973, 734114, 2123798, 1971355, 2287531, 3797029, 4030813, 1560497, -850741, -337677, 1069028, -634457, -4678613, -6009108, -2705122, 1221254, 1755223, 34515, -561059, 326617, 370451, -1527146, -4105090, -5552604, -4667954, -1311179, 2642982, 3974754, 1459231, -2459119, -4719679, -4998756, -4538922, -3494770, -1665110, -291033, -561424, -1506959, -1835258, -2522739, -4723404, -6319863, -4008656, 1578321, 6013357]
41167F013357K78288l017406l930724k949752q05536N64376j005737l445872j341812
41158i640818N531539R519142N324896j930070m345934k290522j199898j562623
41150e94288j84554J482106o78787m385519l115387K458175M323432j4748l395694
41141d105264o54156L754762L894463J049654m85450m51299n51683k14209R77776
41132C214594R31457q28003j177797O20480K40414l838832n639283r78551M143433
41123c312088K292166k791992j720698N049084P593126K256083l176152k258968
41115C930561J292906J525401p24288j825095k236697l666578l965784p58707
41107f428281L120810L455313J386011Q58542J490387n0546k862722k498156J062772
$$ y = [6013357, 6291645, 3274239, -656485, -3606237, -4411773, -3847397, -4853134, -8299006, -9640818, -4109279, 5409863, 10734759, 8804689, 4458755, 2168233, 968335, -594288, -778842, 703264, 24477, -4361042, -7476429, -5018254, -694822, -709570, -4105264, -4759420, -1004658, 2889805, 3939459, 3454009, 3002710, 2451027, 2236818, 3214594, 4146051, 3318048, 2140251, 2760731, 3001145, -837687, -6476970, -7455521, -3312088, -1019922, -3811914, -5532612, -483528, 7109598, 9365681, 6189529, 3930561, 5223467, 6748868, 6024580, 4199485, 1962788, -1703790, -5669574, -6428281, -3307471, 147842, 1533853, 2392395, 3882782, 3832236, 969514, -1528642, -465870]
41098d65870K530756j45213k339146m87527K164047J335337j370884k060054j369967
41089b208521k067258k421669J388138P096794P579534J416461m181737l513154
41081C088588L33432J884141J572929K565726L575710J163311l261780n167556
41073E754501m311645m010189l768985N4126N577896N417491j653898o656524
41065c597227l074733L003339K313048l217177m323614K24340K227071j601943
41057h046896l993556M45302N788969M173056j561257k522736K328923N296931
41049A908736K220785k227457k936228j278159p29965r75938j34077J132951J500165
41040a519187J744480K145384N48856l016563l593807J435974N784553K158213
$$ y = [-465870, 2064886, 1919673, -419473, -907000, 1257047, 2592384, 1221500, -838554, -2208521, -4275779, -6697448, -5309310, 1787484, 9367018, 10783479, 6601742, 3088588, 3422020, 5306161, 6879090, 9444816, 13020526, 14183837, 10922057, 5754501, 1442856, -2567333, -6336318, -6282192, -704296, 4713195, 3059297, -3597227, -6671960, -3668621, -1355573, -4572750, -8896364, -8672024, -6444953, -8046896, -12040452, -11595150, -5806181, -1633125, -3194382, -5717118, -3388195, 1908736, 4129521, 1902064, -1034164, -2312323, -3042288, -4018226, -4152303, -3019352, -1519187, 225293, 2370677, 2919533, -97030, -3690837, -2254863, 3529690, 5687903]
41032E687903n351149n548824K938689Q521615L582430m400650m568551J675032
41024B536495M557636Q15721l754676m429844k346878L35015L123530M550706
41016E387705K697250q14936k217903j286648q00275n38251K257408N851745M177629
41007A4713724l549486r432401o872424O51269M787302K776570j253757k847578
40999a026781j262189J529669K953759J869842k709j83593M95266j156623m757751
40990a541110n401368q25886M393216M952243J783063n70038n87842R4366Q41407
40981C138051K132512K904678J540571j189645l006794l105431k079698l20325
40973A3919J333810J172278q12062j924616p15793M89635k65419o94856J860916
$$ y = [5687903, 336754, -5212070, -2273381, 6248234, 9830664, 5430014, 861463, 2536495, 7094131, 7909852, 4155176, -274668, -2621546, -2286531, 836999, 5387705, 8084955, 7270019, 5052116, 3765468, 2965193, 2426942, 4684350, 10536095, 14713724, 11164238, 1731837, -5140587, -4489318, 297984, 3074554, 1820797, -1026781, -2288970, -759301, 2194458, 4064300, 4061591, 3877998, 4373264, 3216641, -1541110, -6942478, -7768364, -3375148, 1577095, 3360158, 2790120, 2202278, 2296644, 3138051, 5270563, 8175241, 9715812, 8526167, 5519373, 2413942, 334244, 13919, 1347729, 2520007, 1707945, -216671, -932464, -442829, -708248, -1403104, 457812]
40964D57812N098064M451247l67932n281711p045231n361467j491527K078588
40956g462157K562376N61094K75362K889373L523446q51814m945062k887229J638023
40947d696588J076546l151125k995739K241857M554410P26007k901485j706954
40939f853071O39799N85797P20440K630443K154607k302949m351443N04087O114701
40930a57589M649534j036709k534878N02328R92923l082995n565052j964900M424567
40921c772771P571133N087405j009717o081152n660076q2617M504303L258863
40913C815371r49084k366602j186239j790590l859458k367990L186132O526719
40905A008259L743195r75016j739848J149069K889235Q64090l144382n721653
$$ y = [457812, 5555876, 10007123, 9639191, 4357480, -2687751, -8049218, -9540745, -7462157, -4899781, -4338687, -4063325, -1173952, 2349494, 1497680, -3447382, -6334611, -4696588, -3620042, -6771167, -9766906, -7525049, -2970639, -2244632, -5146117, -6853071, -6213272, -5627475, -4907035, -2276592, -121985, -2424934, -6776377, -6272290, -157589, 4491945, 3455236, 920358, 1422686, 2415609, -667386, -6232438, -8197338, -3772771, 3798362, 8885767, 7876050, 1794898, -3865178, -3947795, 556508, 3815371, 2866287, 499685, -686554, -2477144, -6336602, -8704592, -5518460, 1008259, 4751454, 3776438, 2036590, 3185659, 6074894, 6938984, 3794602, -1927051]
40897a927051m940298j767525R45237J726770K006611K904178K507292n10978
40889I44236k651257K52903N709730O894059K292111k531275l413439k142071
40881E354997j342050p19254l61445j938881m038156k122507L653041O438768
40873D924513K493871k714346k995033m35986j30887j190312j18213J252260n72094
40864E13773k372452J311999P098215O115996j360291m950881l07172L836193
40856I885380k52700o974782o507548J86047M071085K054972n16507j61104K79194
40847B064037j372344k176789M36174L643859L258950j27424k273513j022119
40839B430831J680799K834287J566189o92365k220565k865029l581999l990354
$$ y = [-1927051, -6867349, -8634874, -7689637, -5962867, -3956256, -1052078, 1455214, 944236, -1707021, -1454118, 4255612, 11149671, 13441782, 10910507, 7497068, 5354997, 4012947, 3293693, 2932248, 993367, -3044789, -5167296, -1514255, 4924513, 7418384, 4704038, 1709005, 1273019, 1142132, -48180, -166393, 1085867, 513773, -1858679, -546680, 6551535, 12667531, 11307240, 6356359, 6049187, 9885380, 9632680, 2657898, -3849650, -3663603, 407482, 2462454, 1945947, 1784843, 2064037, 691693, -1485096, -1048922, 2594937, 5853887, 5726463, 3452950, 2430831, 4111630, 6945917, 8512106, 7819741, 5599176, 2734147, -847852, -4838206]
40831d838206j900121K989427O425822L969739k329354n628994l426309n53017
40823e291013j029460j805820J214166N020273L561592k070091m473288j055274
40815e928915K479263J552196p87820k73372J186609m43699l688997l673616L2819
40806i545532K968710K538296P47147K41204J281477K734716L141326J182618
40798E289962k208623l285371j84568L305000K614346n31120q71697J726335K394419
40789H248683j68927j957588j432205j956398m260750l716563J154473M289611
40781B00336J211241l496596l628762p96719J96908M17518L344470O186392L493307
40772G128095k660678m952663k321913m80938j198470k96293K688524K422575
$$ y = [-4838206, -6738327, -3748900, 2676922, 6646661, 4317307, -1311687, -4737996, -5291013, -6320473, -8126293, -6912127, -1891854, 1669738, -400353, -4873641, -5928915, -3449652, -1897456, -2685276, -2958648, -1772039, -2215738, -5904735, -9578351, -9545532, -6576822, -4038526, -3291379, -3050175, -1768698, 966018, 4107344, 5289962, 3081339, -204032, -388600, 2916400, 5530746, 4999626, 4127929, 5854264, 8248683, 8079756, 6122168, 4689963, 2733565, -1527185, -5243748, -4089275, 200336, 1411577, -2085019, -5713781, -6510500, -6313592, -5896074, -2551604, 3634788, 7128095, 4467417, -485246, -2807159, -3288097, -4486567, -4782860, -2094336, 328239]
40764C28239j933210l543835P39197M271994J382859l290685k859251Q41490J844477
40755b218725M37371P54731J801874m59733m325024m261583o68306O17705j384919
40746i706609j257088K840227N620997L633491N01123k31783q64675l773418n715478
40737h953213l212933R95321K515165K502284M267899N839973K905039k478262
40729D381273l501618R30027M354555K793047L9667K31785J230854m34403l013240
40720G011947l068897j796484k062416k002783J691154N649919K913034n005438
40712C330036p357465P24479R471997P189062l253266q628979l762518L008322
40704G21668L417946j02870j009890Q54373J021053j392031l216949l027754k056250
$$ y = [328239, -1604971, -5148806, -4409609, -137615, 1245244, -2045441, -4904692, -4063202, -2218725, -1781354, -1026623, 775251, 315518, -4009506, -8271089, -8939395, -8321690, -9706609, -10963697, -8123470, -2502473, 1131018, 1632141, 1400358, 535683, -3237735, -8953213, -12166146, -11170825, -8655660, -6153376, -1885477, 3954496, 6859535, 4381273, 879655, 1809682, 6164237, 8957284, 8996951, 9228736, 10459590, 10025187, 7011947, 3943050, 2146566, 84150, -1918633, -227479, 5422440, 8335474, 3330036, -4027429, -3302950, 6169047, 13358109, 10104843, 1475864, -2286654, 721668, 4139614, 4036744, 3026854, 3881227, 4902280, 3510249, 293300, -2734454, -4790704]
40695d790704l71350K773809N160888L341649j237305k812456M49307L378959
40687E892797J387606k974604m308235j954291N27327J186770R90279O55591Q49
40678A404089k52369N50580Q14025j153898l426867k707761o474L10907k318064
40669f785832l217504j1336K986627J160748l149366l856249M25059N061230N619589
40660a767034K142578k246749m212691k121106K352506M827943K643916j767059
40652a47696l908173k662208l24508J561618L094025L415574J110267k432950
40644b94051l687259k018460p96020k134998l566368j876406K105942M742686
40636g524934M175867J907841N80332J170173J864715j29064m509025o600849
$$ y = [-4790704, -5162054, -2388245, 2772643, 6114292, 4876987, 2064531, 2513838, 5892797, 7280403, 4305799, -2436, -1956727, -1429400, -242630, 747649, 1403240, 1404089, 1151720, 1702300, 2516325, 1362427, -2064440, -4772201, -4778675, -4467768, -6785832, -10003336, -10014672, -7028045, -5867297, -9016663, -12872912, -12447853, -7386623, -1767034, 375544, -1871205, -6083896, -8205002, -5852496, -1024553, 1619363, -147696, -4055869, -6718077, -7042585, -5480967, -2386942, 1028632, 2138899, -294051, -3981310, -5999770, -6795790, -8930788, -12497156, -14373562, -12267620, -7524934, -3349067, -1441226, -860894, 309279, 2173994, 2044930, -2464095, -9064944]
40628i064944k737588L775859N780742J598025k893353k644900M57717K053768
40620c674674J684493J436809J499918P76319l16177q91253j427088j780907M2228
40611b650332L886296N067381L19174o051766o853446j640023L280504L922943
40603g19269K562107K082071J440995j121946m021174m295649j877553L78062
40595e572356L95701p77848n99997J436714K897550J985473P12661J767115L123159
40586E368172L64344n181115o518183j526327K942253J627014j028203O23277
40578c328768L247051J227693j885143P54908N531271K790373n959440q454834
40570f076889j186048M588111J015978m414669k433003L115459L412067l93799
$$ y = [-9064944, -11802532, -8026673, -2245931, -647906, -3541259, -6186159, -5728442, -3674674, -1990181, -553372, 946546, 1722865, 1406688, 515435, -911653, -2692560, -2650332, 1235964, 6303345, 6622519, 570753, -6282693, -7922716, -4642212, -719269, 1842838, 3924909, 5365904, 4243958, 222784, -4072865, -5950418, -5572356, -5176655, -5954503, -6554500, -5117786, -2220236, -234763, 477898, 2245013, 5368172, 5732516, 551401, -5966782, -7493109, -4550856, -2923842, -3952045, -3328768, -81717, 1145976, -739167, 15741, 5547012, 8337385, 2377945, -6076889, -7262937, -2674826, -1658848, -6073517, -8506520, -5391061, -1978994, -2372793]
40562b372793j081762J153856J42831l856148l612343K963164Q596840O453757
40554H387402j561649q123842q343708l240142K091210L385220J440337K61136
40546e704036O17659p55761l987279l643125K558238Q073839O430552J219709
40538D809796K21750L221547L695936K65156k176755j883932k148337l359697
40530B645464j667093K721145L919473n3507l275043j273175J969166R67701k570254
40521C383877l326524r32682M81639p73820k296165k076280q68305j53774l00529
40512f862563q15274r44782k67084O04041P09878L94465O95088Q79478r45665
40503f552418l880949l825155Q65778N716243N152275m4411l541503j728303J867696
$$ y = [-2372793, -3454555, -2300699, -2157868, -6014016, -9626359, -6663195, 1933645, 8387402, 6825753, -1298089, -9641797, -12881939, -10790729, -7405509, -5965172, -5704036, -5086377, -5842138, -9829417, -13472542, -10914304, -2840465, 3590087, 4809796, 5031546, 8253093, 11949029, 12214185, 10037430, 8153498, 6005161, 2645464, 978371, 3699516, 7618989, 7565482, 4290439, 3017264, 4986430, 5954131, 3383877, 57353, -875329, -393690, -1167510, -3463675, -5539955, -6408260, -6562034, -6862563, -7677837, -8622619, -8889703, -8285662, -7575784, -7181319, -6486231, -5606753, -6552418, -10433367, -14258522, -13392744, -7676501, -2524226, -2568637, -6110140, -7838443, -5970747]
40494e970747J925642j031114j339895L308666P292103L889830m728435q743478
40486e397428l088079N487408O875557K16101o163471n900667j051136K699978
40478f321737L047671J756659J107744J522209J688821K88255k020666k981925
40470a912969j911963r41946j516133j712386L33026K420232J421268j084907
40462d905778p82071K352511L712055J176906j884256j883317N44880K726566
40454A057496L243308J767358j261287l516976k304547J522988L842977K467238
40446F818555o22776k939016m209812m430882k553585J193433M293056M694038
40438B243011K515742j338869n406672o454755k100079M434634O448975K269422
$$ y = [-5970747, -4045105, -5076219, -6416114, -3107448, 4184655, 8074485, 3346050, -5397428, -8485507, -2998099, 3877458, 4093559, -2069912, -7970579, -9021715, -6321737, -3274066, -1517407, -409663, 1112546, 2801367, 3089622, 1068956, -1912969, -3824932, -4766878, -6283011, -7995397, -7662371, -5242139, -3820871, -4905778, -5687849, -3335338, 376717, 1553623, -330633, -2213950, -1669070, 1057496, 4300804, 6068162, 4806875, 1289899, -1014648, 508340, 4351317, 6818555, 6195779, 3256763, -953049, -5383931, -7937516, -6744083, -2451027, 2243011, 4758753, 3419884, -1986788, -8441543, -10541622, -6106988, 341987, 2611409]
40430B611409k466218k863433p52169j20258r42116j005380k19603P08610K857511
40421b191647O378498P692601L571091l475536p477866n733112p12282L316993
40413A368740L362069n90503m569616l589266J922177N386147K613257k135702
40405C767303k452784R81246K407713o2664l076815m368353m764256m143181r83734
40396a2695525L305162M596062J952822q33513r37943J48648L50789K82683R87804
40387b843011J751361K065333K785891L534838J988292k122373n122712l946441
40379a908822k68404K178768K164858N90728j927420m260971l852471p253L619358
40370c671629L371205R19748L22576J168761l08095l632650l517082J510287N490884
$$ y = [2611409, 145191, -2718242, -3470411, -3590669, -4532785, -5538165, -5757768, -5049158, -2191647, 4186851, 11879452, 15450543, 11975007, 4497141, -1235971, -1948253, 1368740, 4730809, 4140306, -429310, -4018576, -2096399, 3289748, 5903005, 3767303, 1314519, 2295765, 4703478, 4640814, 1563999, -2804354, -7568610, -11711791, -12695525, -9390363, -4794301, -2841479, -3674992, -4612935, -4464287, -4113498, -3830815, -2843011, -1091650, 973683, 3759574, 7294412, 9282704, 7160331, 2037619, -1908822, -2177226, 1542, 2166400, 2757128, 829708, -3431263, -7283734, -7290987, -3671629, -300424, 619324, 941900, 2110661, 1802566, -1830084, -5347166, -3836879, 1654005]
40361A654005L319377j932865m197977l155812k541489k392745N70159N402021
40353c275326O308353J197211m452576m998561j833275O0678l55718L4076K667886
40344d647252M922414L802182j46619l368607l151275n33417J173105Q79631R40421
40335a29417K534350K623464r95850m237766j892792L261146L558938j425751
40327C296322m003204j147724R28861j409387k415742J882818M924943O83285
40319B740172m477862j760313M516102L744134k726989l889615J820114L919857
40311C885600j992989o973320l920274J608794J832649j415258k051094K26861
40303h799031J802412J758387J194741J71402o84352K71496J771236K55980l301579
$$ y = [1654005, 4973382, 3040517, -1157460, -4313272, -6854761, -9247506, -8677347, -3275326, 3033027, 4230238, -222338, -5220899, -7054174, -6993496, -7349214, -7315138, -4647252, 275162, 4077344, 3930725, 562118, -2589157, -3122574, -1949469, -1069838, -129417, 2404933, 5028397, 4032547, -205219, -2098011, 1163135, 4722073, 3296322, -706882, -1854606, -925745, -2335132, -4750874, -2868056, 2056887, 2740172, -1737690, -3498003, 1018099, 4762233, 2035244, -1854371, -34257, 3885600, 1892611, -5080709, -9000983, -7392189, -5559540, -6974798, -9025892, -8799031, -6996619, -5238232, -4043491, -3872089, -4556441, -4284945, -2513709, -2257729, -5559308]
40294e559308l259013J427104M616495K927507R98903K686197M414659K497087
40286A0749631K4996M50816P32544k572280o064904n089474j570717K18496R04425
40277b216467K560471K880553k73067k950897q87457K756260K470620n22575j353490
40268B463951j22180k36127j334873r63094l22513j548642k406114l84103J553175
40259c300520K45458q98677J807214L907631j33709n676998m259716J929196L344264
40250c035857j008271k937870K3871J258136j997773l855049o88516L337753M670493
40241d233083M972625M621278R72605l987980l821060J175545K651001k002570
40233C48361m646983k74544M365055K783129l16519J319763L418123r39148p627361
$$ y = [-5559308, -8818321, -7391217, -2774722, 152785, 1151688, 3837885, 8252544, 10749631, 10774627, 11225443, 11957987, 9385707, 3320803, -1768671, -3339388, -3120892, -2216467, 344004, 3224557, 2951490, 593, -886864, 1869396, 4340016, 3817441, 2463951, 2341771, 2105644, 770771, -192323, -514836, -2063478, -4469592, -4853695, -3300520, -3055062, -3953739, -2146525, 1761106, 1627397, -4049601, -8309317, -6380121, -3035857, -4044128, -6981998, -6958127, -5699991, -7697764, -11552813, -12241329, -8903576, -4233083, 739542, 5360820, 6333425, 2345445, -1475615, -300070, 2350931, 348361, -4298622, -4573166, -208111, 2575018, 2258499, 3578262, 6996385, 6057237, -1570124]
40224a570124p006470K49237L869969k42033m797993k974457K551683N164210
40216d755978L184185j9416j360248o92808L15813K74087o54874j241708q01408
40207e752355N31102K767056N260724N185694K33837o384097p748929k179918
40199h086886L570114L172529q46851j694579J515336L412631J129806j887864
40191B84236j730807M99141J236527j18752j082625n35050m99602k480904m059922
40182h487758j750137L251914N525402K731252r66805j157547N36205J84738j420639
40173a553375o82927J643628J273378j899612l012392j65227K543861J853963
40165A297J42186P62594K758757L101651J032699k238244n397787o674099m443834
$$ y = [-1570124, -8576594, -8327357, -4457388, -4699421, -9497414, -12471871, -9920188, -4755978, -1571793, -1591209, -2951457, -3644265, -3328452, -3054365, -3709239, -4950947, -5752355, -5221253, -2454197, 2806527, 7992221, 8226058, 1841961, -5906968, -8086886, -4516772, -1344243, -2191094, -3885673, -2370337, 1042294, 2172100, 284236, -1446571, -947430, 289097, 170345, -912280, -1447330, -1946932, -4427836, -8487758, -10237895, -6985981, -1460579, 1270673, 303868, -853679, -317474, -132736, -1553375, -2236302, -592674, 680704, -1218908, -4231300, -4396527, -1852666, 1297, 143483, 906077, 3664834, 6766485, 7799184, 5560940, 163153, -6510946, -10954780]
40156a0954780j8542K820806K583217J688674K187391K957360K458798J053811
40148D776735p90131l265270m813070k692808K144278M520232J887723j676009
40140I1680j311573J622464J842650k235654o443162o152852j585415K579149
40132a1592713K428993o72008j895470M30446K612444J715894L16176J458576
40124e197662K535342j42681l512031j653731L943778N831336K120720j361453
40116B563618j098133n560j14925O71733K220825O40791l876859n467751k204943
40107f671204M18037p50475j302985J805403M209040K290461l07976q6825q6470
40098d82994k671624l494073K85784L094221J79157l157151k92089N039400N221017
$$ y = [-10954780, -10973322, -8152516, -5569299, -3880625, -1693234, 1264126, 3722924, 4776735, 3986604, 721334, -4091736, -6784544, -4640266, -120034, 1767689, 91680, -1219893, 402571, 2245221, 9567, -6433595, -12586447, -14171862, -11592713, -9163720, -9835728, -11731198, -11300752, -8688308, -6972414, -6656238, -5197662, -2662320, -2805001, -6317032, -7970763, -4026985, 1804351, 3925071, 2563618, 1465485, 1459925, 1345000, 2016733, 4237558, 4878349, 1001490, -4466261, -6671204, -6253167, -7003642, -8306627, -6501224, -2292184, -1723, -309699, -396524, -482994, -3154618, -6648691, -6362907, -3268686, -3089529, -6246680, -6538769, -1499369, 3721648]
40089C721648J322045p54549j603106m955330p198038k171431N947665O645090
40081I53994o18531n474065k494440K793460M909611M891859L641988r51690o793062
40072H59124o816798J5871M927028J557303m705717m958105J011111O125518N890464
40063C905799K100980r96928q68285J400280J833860j678164n293537l604507
40055c200502J877832L857067n3176l629908j536279L065167M098464J152939
40047E631604j786083k637288j990032l15437J522198J171645j914266l959746
40039d277405j499626K959763L908318N66202k401721j767839O15158J785448
40031a11702J646002J278797K50091j866908l156558j439513K060283L796742
$$ y = [3721648, 5043693, 4289144, 2686038, -2269292, -9467330, -11638761, -5691096, 953994, 335463, -5138602, -7633042, -4839582, 70029, 4961888, 8603876, 7652186, 859124, -5957674, -5941803, -1014775, 542528, -4163189, -9121294, -8110183, -1984665, 3905799, 6006779, 5009851, 4141566, 5541846, 7375706, 5697542, 404005, -3200502, -1322670, 2534397, 2481221, -1148687, -2684966, 380201, 4478665, 5631604, 3845521, 1208233, -781799, -1097236, 424962, 1596607, -317659, -4277405, -5777031, -2817268, 1091050, 1657252, -744469, -2512308, -1897150, -111702, 1534300, 2813097, 3063188, 1196280, -1960278, -3399791, -1339508, 2457234]
40023B457234K488696J32565j523734k531215k294300P11139N019124N744859
40015A0204368J117558l823311l840839q22020L3431j479065j662218j34755L89118
40006a7733O7200R59098J345911j513519m057848o67460N150562M110480l298996
39997B077695o085857m44433M119146J388175j581700J252918L113645k558105
39989A281484q214901m239294L786080L951164k217508l558595J387252L691428
39981d132890O39329j260644M16313Q68989j038242p72383J871084J901254p02612
39972b209802o39741K102901J974518j183568j901815k75448j575824m009158
39964g717937r2130P794721P552366k799990r745248m953380K346822J793621
$$ y = [2457234, 4945930, 5078495, 3554761, 1023546, -1270754, -559615, 4459509, 10204368, 11321926, 7498615, 3657776, 2835756, 2869187, 1390122, -272096, -406851, -17733, 49467, 1008565, 2354476, 840957, -3216891, -3884351, 1266211, 5376691, 2077695, -4008162, -4452595, -333449, 1054726, -526974, 725944, 3839589, 1281484, -6933417, -11172711, -7386631, -3435467, -5652975, -9211570, -7824318, -4132890, -3493561, -4754205, -4337892, -3468903, -4507145, -5279528, -3408444, -1507190, -2209802, -2849543, -746642, 1227876, 44308, -1857507, -2132955, -3708779, -7717937, -7810067, -15346, 7537020, 4737030, -5008218, -9961598, -7614776, -5821155]
39956e821155k081495m91243L700248K456888k736202m131457n79121K703135
39948f980402L270854K261080K1853k180695p19129L820563M391895j464901n158513
39939b737395J60350P312039N663905k040570m975840j823695m40065k533625
39931a414896j923379K123419K822959q83842j212296M491073P756805K592867
39923A4352710m480082m980895j243954n95032k702772j790192K023599K915549
39915C498931n6945j350601R64145J675366j804793l563511J205925O378810K717435
39906I664762p160143j0739083l189996N796653O163030O36556j989215l69483
39898a186919K55563j591351k480472j488778r37435l76429K769376O562356N888268
$$ y = [-5821155, -7902650, -8393893, -4693645, -2236757, -4972959, -9104416, -9683537, -6980402, -3709548, -1448468, -1426615, -3607310, -4326439, -505876, 3886019, 2421118, -2737395, -2577045, 4734994, 10398899, 8358329, 3382489, 1558794, 1118729, -1414896, -3338275, -1214856, 1608103, 724261, -488035, 4003038, 11759843, 14352710, 9872628, 4891733, 3647779, 3052747, 349975, -1440217, 583382, 3498931, 3441986, 2091385, 3055530, 4730896, 2926103, -637408, 568517, 6947327, 9664762, 2504619, -8234464, -11424460, -5627807, 535223, 1171779, -817436, -1186919, -931356, -2522707, -5003179, -6491957, -7429392, -7805821, -5036445, 1525911, 7414179]
39889G414179J210232j028867J852188N193507M810756K120487l66894k624784
39881A8580804m250348l737933k210703k237282k203711J379250N468151K977504
39873A3765732m642240p071013q28897M794717K726369j187157K26501K762110
39865A0546122o42883o344820n908158l95290K185489L50578m74712R66936M90550
39856G73812k248450k531442O60323K629896Q68503j747771k698651k781645k471149
39847i546574q52303R53091L84527j722185j586978J479842L846244L083731P51244
39838c209361r52907j608332j037110J221477M072304N104508L260060l15691
39830F534948l550820m239007j317246K788774L479174k8898k908300j729900
$$ y = [7414179, 8624411, 7595544, 9447732, 14641239, 19451995, 21572482, 21205588, 18580804, 14330456, 10592523, 8381820, 6144538, 3940827, 5320077, 10788228, 13765732, 9123492, 2052479, 1223582, 6018299, 8744668, 7557511, 7784012, 10546122, 9903239, 3558419, -2349739, -2745029, -559540, -208962, -683674, 283262, 773812, -1474638, -4006080, -3345757, -715861, 152642, -1595129, -4293780, -7075425, -9546574, -10398877, -9445786, -9061259, -10783444, -12370422, -10890580, -7044336, -3960605, -3209361, -4162268, -5770600, -6807710, -5586233, -1513929, 3590579, 6850639, 6534948, 2984128, -1254879, -2572125, 216649, 3695823, 3666925, 758625, -971275]
39822i71275L01097r67789l401868k328804J324891K707534J196556P57952K690948
39813A309242L647812J277446k620470m978934m190138m96383L269915K839034
39805E7524k060472n408248k209026M070168O249911L451172N77520m57079k114032
39796B157438m244968k975155J932115M844646J974460l419501o066498m975880
39788a0773343k213959J044402M103456M772556J379576l594509m689586K77619
39780i693788O213755N483759k359335q347581m783946M150890P673554L052363
39772A389671j917575j513461R44709J283265J262241K600818K049817j710299
39764D389186l512391o40224R27850l110778o120968j133231N884935M622030
$$ y = [-971275, -670178, -1637967, -5039835, -7368639, -6043748, -3336214, -2139658, -1381706, 1309242, 4957054, 6234500, 3614030, -1364904, -5555042, -6051425, -2781510, 57524, -2002948, -7411196, -9620222, -5550054, 699857, 4151029, 4728549, 4271470, 2157438, -2087530, -5062685, -3130570, 1714076, 3688536, 269035, -5797463, -10773343, -12987302, -11942900, -7839444, -3066888, -1687312, -5281821, -9971407, -9693788, -3480033, 2003726, -355609, -8703190, -13487136, -9336246, -1662692, 1389671, -527904, -2041365, -1096656, 186609, 1448850, 4049668, 6099485, 4389186, 876795, 236571, 1164421, -1946357, -8067325, -9200556, -3315621, 1306409]
39756A306409k674367n144270r88635J522762n97328j332688K087472M791357
39748a029288L843357K082476P37314k316931n541700m363331j17465J062921
39740e642647o19054J262668O610385P117809J92655o113616n815580k473993
39732e481373j20368K782321N670124L023636m691673p571116j060217N430263
39724b018403K997067k704393j699247L676307L721091k086777n058145j593370
39716d765870K867173L888534L219827K980400J847266j021840l334870l017976
39708B662644j234441o83285k382293m557110m320686j133720J824332J695950
39700h128609M22907J720449M522960M466102J582322L24943J359066L89618l197898
$$ y = [1306409, -1367958, -6512228, -7500863, -5978101, -6575429, -7908117, -5820645, -1029288, 2814069, 4896545, 5633859, 3316928, -2224772, -6588103, -6705568, -5642647, -6261701, -4999033, 1611352, 8729161, 8921816, 2808200, -3007380, -5481373, -5601741, -2819420, 2850704, 5874340, 1182667, -6388449, -7448666, -2018403, 978664, -1725729, -3424976, 251331, 3972422, 1885645, -3172500, -4765870, -1898697, 1989837, 5209664, 8190064, 10037330, 9015490, 5680620, 2662644, 1428203, 744918, -1637375, -6194485, -10515171, -11648891, -9824559, -8128609, -7705702, -5985253, -1462293, 3003809, 4586131, 4911074, 6270140, 6659758, 3461860]
39691C461860m167779p71248J485400o26025k391436J1210K460007P40073j472383
39682a270321M48141L214766J538254k095062j839526J091045Q05041k902365
39674a010027m465613j517994K822819N538944N726285K547858l062772o206548
39666C72952l236784K219835L819286J358290m66390k36663m69131j335620l26854
39657A698921J949454J771328j257594l105307j654846M03829K60865j125243
39649a058593j198878O14206K468485K020180j001156l578313k420079J261730
39641b892418K959812J669573J080856K370984J650333k106266l173657J416116
39633B975333M814257L59708o520835n614942K117181N870130J292041m252037
$$ y = [3461860, -705919, -1477167, 8233, -617792, -3009228, -2998018, -538011, 202062, -1270321, -822180, 2392586, 3930840, 1835778, -3748, 1087297, 1892338, -1010027, -5475640, -6993634, -4170815, 1368129, 7094414, 9642272, 6579500, 372952, -2863832, -643997, 3175289, 4533579, 4067189, 3830526, 3361395, 2025775, 1698921, 3648375, 5419703, 4162109, 1056802, -598044, -194215, 66650, -1058593, -2257471, -1643265, 825220, 2845400, 1844244, -1734069, -4154148, -2892418, 67394, 1736967, 2817823, 5188807, 6839140, 4732874, 1559217, 2975333, 7789590, 8149298, 1628463, -3986479, -1869298, 4000832, 5292873, 1040836]
39625A040836l723841Q44950L939168L859595J687277j481766l656028k639419
39617a29228M50462J920895O90901q38940j279454j509252j374193L52323K376291
39608F59805J764332j105528k789118k204543j359946o95641J210132L038816
39600a481691J521172k131190k397470K014260N325924L079549j628978l577929
39592G23647k682996j969443j811259n75321J128006J079380m44501o61288J486753
39583c727022L581493K913658J5896j908796q02511J695633K087420p74827m294379
39574a213435n156952k651222J282617L947858L606198J010365o39753O35612
39566H21288K253180N11416l006150l158894K19466J561995q65293j640386J905000
$$ y = [1040836, -2683005, -1838055, 2101113, 5960708, 7647985, 6166219, 2510191, -129228, 321234, 2242129, 2933030, 2094090, 814636, -694616, -2068809, -1716486, 659805, 2424137, 1318609, -1470509, -3675052, -5034998, -5730639, -4520507, -1481691, 39481, -2091709, -4489179, -2474919, 2851005, 5930554, 4301576, 723647, -1959349, -3928792, -5740051, -6315372, -5187366, -4107986, -4552487, -5213775, -3727022, -145529, 2768129, 2784025, 875229, 72718, 1768351, 3855771, 3080944, -1213435, -6370387, -9021609, -7738992, -3791134, -184936, 825429, 185676, 821288, 3074468, 3585884, 579734, -2579160, -2359694, -797699, -1662992, -3303378, -1398378]
39557a398378L823369m72711n085967k417443M043806M751990j280541o001171
39549d037046m765578p45754K220765L278464J658874k356512m182180M1389O003407
39540b884171O351492K142781P81636L344623L395546j169406m778138m271657
39532B912706l081871l125572j508543J936448K527957o30134k136041L38360
39524b766690K306214J267596O68861J556420m68787n449270n867026P92471N676324
39515b283887K183510k816763k87747O044688O340596N95751k921836j742138
39507E112174j027454k691659k534506J083516L688716J603669l083924n776719
39499c626187l855900K071986Q087309Q926640L333435l542852n788998l101473
$$ y = [-1398378, 2424991, 1952280, -3133687, -5551130, -1507324, 3244666, 1964125, -4037046, -8802624, -9548378, -7327613, -4049149, -2390275, -4746787, -8928967, -8887578, -2884171, 3467321, 5610102, 6391738, 9736361, 13131907, 11962501, 7184363, 2912706, -169165, -3294737, -4803280, -2866832, -338875, -969009, -3105050, -2766690, -460476, 807120, 1475981, 3032401, 2563614, -2885656, -8752682, -7960211, -2283887, -100377, -2917140, -3204887, 2839801, 9180397, 9776148, 6854312, 5112174, 4084720, 1393061, -1141445, -57929, 3630787, 5234456, 2150532, -3626187, -7482087, -5410101, 2677208, 11603848, 14937283, 11394431, 5605433, 2503960]
39491B503960P39374K882539K139326j702006n771730n044622O81989M636318
39483A065148K228149j956768j512386J832097K008254j253560l109856j891977
39475b590899Q9341J918936L685117K850939k175456o810608n639599j061061
39467i733290P79714N38317L427302P783286O056096j847949o311722k180675
39459a488921L672128L242896j677473m503947l638373j830819l38437J090056
39451e472890J540287N23916j22758R04146J933066J109310q72728k595545l554504
39442f607700k697823Q45510M146991K308037l807238o714617k423946L583976
39434a1366810M615344K115207J421784K409132J070897k125595k643269N4203
$$ y = [2503960, 3243334, 6125873, 8265199, 6563193, 791463, -4253159, -3571170, 1065148, 3293297, 1336529, -175857, 1656240, 3664494, 2410934, -698922, -2590899, -2501558, -582622, 3102495, 5953434, 3777978, -3032630, -8672229, -9733290, -8953576, -8415259, -4987957, 2795329, 8851425, 7003476, 691754, -1488921, 2183207, 5426103, 3748630, -755317, -4393690, -6224509, -6562946, -5472890, -3932603, -3408687, -3531445, -2627299, -694233, 415077, -457651, -3053196, -6607700, -9305523, -8460013, -4313022, -2004985, -5812223, -12526840, -14950786, -11366810, -6751466, -4636259, -3214475, -805343, 265554, -1860041, -4503310, -4449107]
39426d449107J459746l82059k116213j297862r5219n37487n70136K032429N070929
39417h84979M750925J336122j198009n29735J423687J348783j541407m684316
39409B1071m682933p80072M021993N879297M106895J278156m14182r84849o02714
39400G842662J552349M825984O106262L953798J565836K101202K805481j252238
39392B9501336p975953q950415j599483N140466K071082p271740j0976263m465284
39384d526254M452335O722243K578855j371688j455541J60740J47816j388300
39376E320206j466827J327589L833070J532581m589308p488813l082850L271714
39368a342638L844631m83539k503398m57070K68007k216606k513432K065013N608003
$$ y = [-4449107, -2989361, -3371420, -5487633, -6785495, -6880714, -7418201, -7988337, -5955908, -884979, 3865946, 5202068, 4004059, 3474324, 4898011, 6246794, 4705387, 21071, -4661862, -5441934, -1419941, 4459356, 8566251, 9844407, 9430225, 8445376, 7842662, 9395011, 14220995, 20327257, 24281055, 25846891, 27948093, 30753574, 29501336, 21525383, 12574968, 10975485, 16115951, 18187033, 10915293, -60970, -4526254, -73919, 6648324, 9227179, 7855491, 6399950, 6560690, 6708506, 5320206, 3853379, 5180968, 9014038, 10546619, 5957311, -1531502, -4614352, -1342638, 2501993, 2018454, -484944, -942014, -674007, -2890613, -5404045, -3339032, 2268971]
39359B268971K869882j994494k159848J314131K334925k36845k093134j024048
39351A279540Q30572J192485k79502k766053l877488j076031L423074L388231
39343B114828j821011m045085J247495N607287k44813r987293r215787K719483
39335a3624896J1147429P368707p67207l090159p00120L22854n45980r20008j558212
39326b367592k962123j664348L579231O975876L708475j618306j498700K916807
39318G069320M038647l87460m785315m614482j652737L34291N83109O53839J566019
39309B805231K627471K055441p88340l368174k321697J271583K226701j284418
39301C223798m314171k087142L150577N799666M305723J116232j719669k870825
$$ y = [2268971, 5138853, 3144359, 984511, 2298642, 4633567, 4396722, 2303588, 1279540, 2110112, 3302597, 3023095, 257042, -3620446, -4696477, -1273403, 2114828, 293817, -3751268, -2503773, 3103514, 2858701, -7128592, -16344379, -13624896, -2477467, 4891240, 4124033, 1033874, 333754, 656608, 110628, -809380, -2367592, -5329715, -6994063, -3414832, 3561044, 7269519, 5651213, 4152513, 7069320, 11107967, 10720507, 5935192, 1320710, -332027, 2264, 585373, 1239212, 2805231, 5432702, 7488143, 6699803, 3331629, 1009932, 2281515, 4508216, 3223798, -1090373, -3177515, -26938, 5772728, 10078451, 11194683, 9475014, 6604189]
39293F604189p61055L176637L423810k187290o989318l771576L776034N322075
39285H593506j273345p166976n368360R94816N308061N687480L495734n25253
39277I745663m643926n138295j129892K717006K023875j337107k429248j16742
39269c08666K522000K870098R00109j965748l658638k565234O3244O16603j769872
39260c296104k899862P00892N753065N885839L80371m723871m383693K3182L731892
39251A171711M176873K372013P26255O79422J488049J041143j200461k685162
39243G769843r22527K527940L711925J621990j091326k810830m614086o177924
39235A5005m292293J666951O340553M666177o41826k598897R7871J709546j543697
$$ y = [6604189, 5843134, 9019771, 12443581, 10256291, 3266973, -504603, 3271431, 8593506, 7320161, 153185, -5215175, -4220359, 1087702, 6775182, 10270916, 9745663, 5101737, -36558, -1166450, 1550556, 3574431, 2237324, -191924, -308666, 2213334, 5083432, 5983541, 4017793, 359155, -2206079, -2142835, -1526232, -3296104, -6195966, -5495074, 257991, 6143830, 6524201, 1800330, -2583363, -2560181, 1171711, 5348584, 7720597, 8446852, 9126274, 10614323, 11655466, 10455005, 7769843, 6847316, 9375256, 13087181, 14709171, 13617845, 10807015, 6192929, 15005, -4277288, -2610337, 3730216, 8396393, 7754567, 5155670, 5253541, 6963087, 5419390]
39226E419390o060255o367684k157714K768572N650927O104967M553009K147914
39218A2059126P43795N96767l75081k957837m418692k701169n79156j749377m401409
39209c783033l424374J424549M614414K976676l2245k35318J224498P62896j698274
39200A829789l104150k021721m4964Q98638N43584k7932N02915K183251K853067
39191C612477L53657l637024m453192o92452L036056K144455j488353k504788
39183c629164R0599K159380J156833n25031k7972J588653J581939j4364p24785
39174A656088K80361P31214j429222m540939m559275k29788M374337M152006n23302
39165h8520l854137j920707K410057L723131J267156r19959j97905J651913K028312
$$ y = [5419390, -640865, -7008549, -9166263, -6397691, -746764, 5358203, 9911212, 12059126, 12802921, 13399688, 13024607, 10066770, 5648078, 2946909, 2367753, 618376, -3783033, -7207407, -5782858, -1168444, 1808232, 1775987, 1540669, 2765167, 3528063, 1829789, -1274361, -3296082, -3341046, -2442408, -1898824, -1926756, -1423841, 759410, 3612477, 3966134, 329110, -4124082, -4816534, -1780478, 363977, -1124376, -3629164, -3538565, -1379185, -222352, -747383, -775355, 813298, 2395237, 2380873, 1656088, 1936449, 2667663, 1238441, -3302498, -7861773, -8091561, -3717224, 434782, -88520, -3942657, -5863364, -3453307, 269824, 1536980, 617021, 419116, 2071029, 4099341]
39156D099341J180265O99710M00904j010865k944439l001550o27850J177131m76742
39147e04095l775086l684105J261476O021197N044582m08617m030350k889923
39139b964921l34077J43760j37469J423294L452766K509856j239531l797383k654669
39130c598374L41694J849550Q97747p03798p90675P93139K124247J697716N83008
39121C194254Q19334J974315J545198q57566k422807j302866Q21076J757917J638706
39112G167561J106249k62798j704598q32057J962951K375032j206556l930285
39104D675499j768522J370598l33329m740992n021956q04741J787699O91804L40083
39095c803857K619297L459298Q98465q85931P70906J930599q31627l743731j595730
$$ y = [4099341, 5279606, 5979316, 6380220, 5369355, 2424916, -576634, -1204484, -27353, -504095, -4279181, -7963286, -6701810, -680613, 4363969, 3955352, -74998, -2964921, -3298998, -3155238, -3292707, -1869413, 1583353, 4093209, 2853678, -943705, -3598374, -3256680, -1407130, -509383, -1213181, -2003856, -1210717, 913530, 2611246, 3194254, 4013588, 5987903, 7533101, 6675535, 4252728, 2949862, 3770938, 5528855, 7167561, 8273810, 8011012, 6306414, 5474357, 7437308, 9812340, 8605784, 4675499, 2906977, 4277575, 3944246, -796746, -5818702, -6623443, -4835744, -4143940, -3803857, -1184560, 2274738, 3173203, 2287272, 3058178, 4988777, 4157150, 413419, -1182311]
39086a182311L734517N757912K039999l705053o389255l584908K968375P660647
39078G299923N720906l55569k794870R15481M316964J974318k393105k759873
39070A1924175o09072j216541l891268l516149J43513K161421Q87276k16783O08450
39061F275022J067356M4959n22663j06461p06617k296627k047860M64702J815307
39052C987118L9013k636570l586905k380451J100886O403088R409761N118085
39044A7454025m260412r433164n516531J527339L772041J863589J591019L795518
39036A0793424M100857J014964j970080k552333k612122l683370l603403k489
39028A485448N337419P968724N735573Q07349k886895l377712j807509m11560
$$ y = [-1182311, 2552206, 8310118, 10350117, 6645064, 255809, -3329099, -360724, 7299923, 13020829, 12665260, 9870390, 10785871, 15102835, 17077153, 14684048, 11924175, 11315103, 10098562, 6207294, 2691145, 2834658, 4996079, 5883355, 5666572, 6275022, 7342378, 7387337, 6864674, 6758213, 6051596, 3754969, 1707109, 2171811, 3987118, 4026131, 1389561, -2197344, -4577795, -3476909, 2926179, 12335940, 17454025, 13193613, 3760449, -1756082, -228743, 3543298, 5406887, 6997906, 10793424, 14894281, 15909245, 13939165, 11386832, 8774710, 5091340, 1487937, 1485448, 6822867, 14791591, 20527164, 21334513, 18447618, 15069906, 13262397, 12850837]
39020A2850837n2202k47937r15868k469471m034265l458953k08113L108731L498108
39011H070867J121144j150846j251325J17850R44448M83471o7692N20991J449214
39002A0238122Q67661q94115r54031J916386M556398L161236j608476n773826
38994A1509355o901546m982522l14445N436074P661936L614289j916261j695763
38986A2411117L162625M364612n95233m552347k644705J47580j379793l215391
38978G698465L27404N720284N536872N89482k088871p44042L71520Q4037J263863
38969A8759014L285884K146833j561305k906706j370330j195982k374292k42752
38961A4540364M408481M612923k59742j283385N653587J1848533R185783K974111
$$ y = [12850837, 12798635, 12550698, 11634830, 9165359, 5131094, 1672141, 1464028, 4572759, 8070867, 9192011, 8041165, 6789840, 6907690, 7852138, 8335609, 8267917, 8788908, 10238122, 11105783, 10211668, 9257637, 11174023, 15730421, 18891657, 17283181, 11509355, 4607809, -374713, -689158, 4746916, 12408852, 16023141, 14106880, 12411117, 15573742, 19938354, 19343121, 14790774, 12146069, 12293649, 10913856, 7698465, 8025869, 13746153, 19283025, 19872507, 17783636, 17039594, 17411114, 17495151, 18759014, 22044898, 24191731, 22630426, 19723720, 18353390, 17157408, 14783116, 14540364, 18948845, 23561768, 23302026, 22018641, 27672228, 39520761, 48706544, 51680655]
38953E1680655K590935O320313N889629J356004J95679L538379M276849n90587
38945G5257856n398264n607498l931069l838349m041236k928350k427744l482559
38937D3602787k808590J422519M918692L259876o02902m02625L554246M562294
38929E7506297Q3759l543844n8951P005236Q633320L271490l33523M590188J2761309
38920H9915281J4144799Q336003M581066P724608J2203051J2880237J3918328
38913A63703373K0682156K9033223L1372546K9938910L4261072M5643071N3670356
38906D08304707N0309262L8908175K5305587Q150717j5036834l7709784m8973838
38899D29257992m7221414m1807563m0252995l9825702l4443655k5169363j9017148
$$ y = [51680655, 54271590, 60591903, 66481532, 67837536, 68033215, 71571594, 75848443, 75257856, 69859592, 64252094, 60321025, 56482676, 52441440, 49513090, 47085346, 43602787, 40794197, 42216716, 47135408, 50395284, 49792382, 49389757, 52944003, 57506297, 57590056, 54046212, 53987261, 60992497, 69625817, 72897307, 72563784, 77153972, 89915281, 104060080, 112396083, 116977149, 124701757, 136904808, 149785045, 163703373, 184385529, 213418752, 244791298, 274730208, 308991280, 354634351, 408304707, 458613969, 497522144, 522827731, 530978448, 515941614, 478231830, 429257992, 382036578, 340229015, 299976020, 260150318, 225706663, 200537300, 181520152]
38892A81520152j8869060j9558146j5548387r017384o746279j0296401j3630260
38885H7854235j1432492n824658k292886k105502k343877j356434j31907P24896
38877F3091375J497210J252725j181654m258487n003945l252790j672052j867075
38869D8605307l260170m994152n853057l686790J252839M080194J145488l559521
38861C3730138l675651n40861o14336l641309k504183L772020O622696J384490
38853C4533004m893583m622770p07749K31838j294602j210085n46517k295081
38845A9194455l883258j088513L673164M858791K978978K586442L502113K029260
38837C3851432r43083j288815Q3957j344149m520173l589177J701635M776434
$$ y = [181520152, 162651092, 143092946, 127544559, 118527175, 111780896, 101484495, 87854235, 76421743, 70597085, 68304199, 66198697, 63854820, 62498386, 62366479, 63091375, 64588585, 65841310, 64659656, 60401169, 55397224, 52144434, 50472382, 48605307, 45345137, 40350985, 34497928, 30811138, 32063977, 36144171, 37289659, 33730138, 30054487, 29513626, 28899290, 25257981, 22753798, 26525818, 33148514, 34533004, 29639421, 25016651, 24308902, 24540740, 23246138, 22036053, 21489536, 19194455, 15311197, 14222684, 17895848, 22754639, 25733617, 28320059, 31822172, 33851432, 32908349, 31619534, 31703491, 30359342, 25839169, 22249992, 23951627, 28728061]
38829B8728061K844962P78386K133075L740146K375331L91556J104265L646769
38821D5742551N550326O114993M912774J413554j884388p48471M135853O599615
38813G1836807L526955p66150j449758P5978l60823l332783o325818p782224p744205
38804D7677979o590939n084819l884958k431343o14018q48805m630041p889678
38796A5703378n208430J420665M203539O63497l318231k932592k14106J543808
38788A1861528K332112J974550j037019m566533l612434J209981L341378J158258
38780A2661821O43752L719120L780713j822871n253078j449664K317772n62250
38772A4035315l392395J881828Q704632N768166l362177n457639J153216N672802
$$ y = [28728061, 31573023, 32351409, 34484484, 38224630, 40599961, 40991517, 42095782, 45742551, 51292877, 57407870, 62320644, 63734198, 61849810, 61101339, 65237192, 71836807, 75363762, 74597612, 73147854, 73223832, 72863009, 69530226, 63204408, 55422184, 47677979, 41087040, 36002221, 32117263, 29685920, 29071902, 28223097, 23593056, 15703378, 10494948, 11915613, 16119152, 16782649, 13464418, 10531826, 10317720, 11861528, 14193640, 16168190, 15131171, 10564638, 6952204, 8162185, 11503563, 12661821, 13305573, 17024693, 20805406, 18982535, 13729457, 12279793, 14597565, 14035315, 10642920, 12524748, 21229380, 26997546, 23635369, 18177730, 19330946, 25003748]
38764B5003748L642745J673792K790535J531636l606162n913721k612509K11070
38756B2721134j044438j884249K04989M77653l168406m833474j053182K310932
38748A3730959J0564l707871k840593P28175K012160J218714P50692n11134l521030
38739G870636m694811j473697K209304J809385q33817j778495j569467j935530
38731c96492p69685L379540O317698M243654O49852N31508J823369m8973k811239
38722A2919232q74913M142035M974034K2999m602576m438385j332613J465218
38714A2275031K765139J698348j802924m452481k715654J500670L259797K180211
38706A4708137J996686K986467J358713l095012n298061k773431M72503L94161
$$ y = [25003748, 28646493, 30320285, 33110820, 34642456, 31036294, 25122573, 22510064, 22721134, 21676696, 19792447, 19997436, 20475089, 17306683, 12473209, 11420027, 13730959, 13741523, 10033652, 7193059, 7921234, 9933394, 11152108, 11902800, 11391666, 7870636, 3175825, 1702128, 3911432, 5720817, 4887000, 3108505, 1539038, -396492, -1166177, 2213363, 8531061, 12774715, 13424567, 13956075, 15779444, 15730471, 12919232, 12044319, 16186354, 21160388, 21183387, 16580811, 12142426, 10809813, 12275031, 15040170, 16738518, 14935594, 10483113, 7767459, 9268129, 12527926, 14708137, 16704823, 19691290, 21050003, 17954991, 12656930, 9883499, 10356002, 10750163]
38698A0750163j654874k516802j982920j230996j03238J408308J876904Q92276
38690G438821K34753Q27999J131278J80874m94893K29752Q47005j75966j720359
38681H499264j827722m75683R87556J677577J273284k57467k113018l167213l470073
38672A126505l758031l474473j345106J911344L721108K925518R06828o74154
38664A339539j178668k73059J569069K159282R5953k162147j108991K157438L051172
38655E649588M01341k118679j997825o06392R70455L474859N216170K184718m646611
38646H527624p991906m282971N88528O41245p02156K587745P541171O281568o13839
38637A2577009m455494k251048o83954l861655n941640j001830O514259P748998
$$ y = [10750163, 9095289, 6578487, 4595567, 3364571, 3261333, 4669641, 6546545, 7438821, 7673574, 8501573, 9632851, 9813725, 9318832, 9548584, 10395589, 10219623, 8499264, 6671542, 6195859, 7183415, 8860992, 10134276, 9876809, 7763791, 4596578, 1126505, -2631526, -6105999, -7451105, -5539761, -1818653, 1106865, 2013693, 1339539, 160871, -112188, 1456881, 3616163, 3712116, 1549969, 440978, 2598416, 5649588, 6050929, 3932250, 1934425, 1328033, 2298488, 5773347, 10989517, 13174235, 8527624, 535718, -3747253, -3158725, -2517480, -3219636, -631891, 6909280, 13190848, 12577009, 8121515, 5870467, 5186513, 1324858, -4616782, -5618612, 895647, 8644645]
38629H644645J833620l951702m343294r06261K351261L357449K055466n4059l12788
38620H674337K100416L861821J333758l701032n796509l398583n74391l13753
38612B186064m70122J340816K731091K45731m238823n121410o24372M790120O013665
38603F852760K678786j755866m158842l839170j894757K38698J788872K622881
38595B533362K393483M64488k667278m750877l868731p94434J799897K115208
38587b774882L64349j969221k777907l59977M307443P162460N177293M56084k081560
38578G504082q44105J111226R18166p01637j585650j218300m71589N5905M31975
38569E200073J196091L008712N327809N859392L101765j082173l575710m015058
$$ y = [8644645, 10478265, 6526563, 2183269, 1277008, 3628269, 6985718, 9041184, 8987125, 8674337, 10774753, 14636574, 15970332, 12269300, 6472791, 3074208, 2499817, 2186064, 1715942, 3056758, 5787849, 6033580, 1794757, -3326653, -3951025, 839095, 6852760, 9531546, 7775680, 3616838, -222332, -2117089, -1878391, -89519, 2533362, 4926845, 5391333, 2724055, -2026822, -5895553, -6689987, -4890090, -2774882, -2410533, -4379754, -7157661, -7517638, -3210195, 3952265, 9129558, 9585642, 7504082, 6659977, 7771203, 8689369, 7987732, 6402082, 5183782, 4712193, 4768098, 5200073, 6396164, 9404876, 14732685, 20592077, 23693842, 22611669, 19035959, 15020901]
38561A5020901m085383l691729j376238J772657K654791R89198k87940R657k1009
38552A0984905j121112j618795j273221j769239k433257n94453K561525K369376
38544G105729j210374k345565J027838L319343J052476p15420K660549O801159
38536A7695735N552839J038569j134617j567817l715208n430365l004962M7391
38528I481565j887945n360159k486800M590923N259874k719081q887487n513809
38520g522919K196487N383447L104834l3835j663658k335069k409380j742342
38512e022435j19951K840547N599073M052259k486132p157989m008903J940457
38504d363074J539870l636602l779651K482847N920410K598414o31717J65181
$$ y = [15020901, 10935518, 7243789, 5867551, 7640208, 10294999, 11284197, 10996257, 11005914, 10984905, 9863793, 8244998, 6971777, 5202538, 2769281, 2174828, 4736353, 7105729, 5895355, 3549790, 4577628, 7896971, 8949447, 8234027, 10894576, 17695735, 23248574, 24287143, 23152526, 21584709, 17869501, 12439136, 9434174, 9481565, 7593620, 2233461, -253339, 4337584, 9597458, 6878377, -2009110, -7522919, -5326432, 57015, 3161849, 3128014, 1464356, -870713, -3280093, -5022435, -5142386, -2301839, 3297234, 7349493, 4863361, -2294628, -6303531, -4363074, -2823204, -6459806, -10239457, -7756610, -1836200, 762214, 130497, 295678]
38496B95678m56752m914014o196526q78165L169267L71618k276545J859287O243701
38487b782451K598355l804083k882541L185342M730511J255925J19742K019461
38479D440261Q69680l424295m292011m15825K451173J858699J207723J643019
38471D338424L66553k512305l518809k353050j661578j148388Q41699J734924
38463c912530j248193l821352m07384N204377N044427N97437p1466K792470J403501
38454E581287m056775m471297J752978M994147Q73613k815169o52911J646114
38446B851987o42007k341442Q28783L374084K72073l535283k446735o2696r36215
38437b637451j091430L550968P138632K896867m225965m740831O15002L798534
$$ y = [295678, -161074, -5075088, -11271614, -12149779, -8980512, -8608894, -10885439, -9026152, -2782451, -184096, -3988179, -6870720, -3685378, 1045133, 2301058, 2420800, 4440261, 5309941, 1885646, -2406365, -2822190, -371017, 1487682, 2695405, 4338424, 4704977, 2192672, -1326137, -3679187, -5340765, -6489153, -5647454, -3912530, -5160723, -8982075, -9389459, -4185082, 859345, 1456782, 1385316, 4177786, 5581287, 1524512, -2946785, -1193807, 3800340, 4673953, 1858784, 1205873, 2851987, 2209980, -131462, 697321, 4071405, 4343478, 808195, -1638540, -1701236, -2637451, -3728881, -177913, 6960719, 9857586, 5631621, 890790, 1505792, 5304326]
38429E304326K839434J855915J241053j722859m973502m308436j884568k687184
38421d335821m635006j869567L908629N498610K463345J021198K159051O55140
38413D865579l358666l048849K408093M484411r67559o053121k723137N079172
38405F85923P604318K539615l877454n739172k688943J640096L064819K67090
38397C496292l496115l852522q26549J775617K083194J464615O30752q45919j438227
38388a008862N71801K511967O13790k374741l30293N018943M914626k148633o556625
38379A211973k430973K999496J440436l425454l351440O86339J765355m30103
38371a534371l53072K462762K813185l26193j916719M00241K780541J664850j842641
$$ y = [5304326, 8143760, 9999675, 11240728, 9517869, 4544367, 235931, -1648637, -4335821, -8970827, -10840394, -6931765, -1433155, 1030190, 2051388, 4210439, 4865579, 1506913, -1541936, 866157, 5350568, 4383009, -1670112, -4393249, 685923, 8290241, 10829856, 6952402, 1213230, -1475713, 164383, 3229202, 3496292, 177, -3852345, -4678894, -2903277, -820083, 644532, 1275284, 429365, -1008862, -437061, 2074906, 2688696, 313955, -16338, 5002605, 9917231, 7768598, 1211973, -1219000, 1780496, 3220932, -204522, -3555962, -2869623, -1104268, -1534371, -1887443, 575319, 3388504, 3062311, 1145592, 1545833, 4326374, 5991224, 4148583]
38362D148583m955249n770006k742029L577877Q421592P277471K161735j372083
38354A0747891k422279m150019o097521m367855K05704J709193j280690k991494
38346h647070M6862L602841L241515R35779J27924j80271j872684l122341j992213
38337g859658l99445r7875J031456M102572N096113J025281l741448l376647M05731
38328c813920J591515m91753j456017L3492J233853J408016K279481K931911R08406
38319D624984j728632l78703L539949L317837k161772n653358k660568J596776
38311D96513O94896l383160m552567k157781l61751p89816j374898j082209q90073
38302a3400846o98276O51798K503140K861301J592242M18603O7083j03684j04526
$$ y = [4148583, -806666, -6576672, -9318701, -5740824, 2680768, 9958239, 12119974, 10747891, 8325612, 4175593, -1921928, -6289783, -6084079, -4374886, -5655576, -8647070, -8600208, -4997367, -1755852, -820073, -692149, -872420, -2745104, -5867445, -7859658, -8259103, -8356978, -7325522, -3222950, 1873163, 2898444, -843004, -4219651, -3813920, -2222405, -2714158, -4170175, -4136683, -2902830, -1494814, 784667, 3716578, 4624984, 2896352, 2517649, 6057598, 9375435, 7213663, 1560305, -1100263, 496513, 1191409, -2191751, -6744318, -8902099, -9263850, -10053666, -11428564, -12510773, -13400846, -14099122, -13447324, -10944184, -8082883, -6490641, -6072038, -6004955, -6108639, -6213165]
38293f213165O19144J501045J451724P52312L88379J83005l29799q4115J905520
38284A74050L746486K385190j847837n098187m815813k357699k16699J028708
38276g001801J983764K586254K397846J645157Q22084r5514j255582k253977k434755
38267c606524j562217L9676J625514K212048J200113q47208k380345k223437q14888
38258f357268J25023n14740j699093j266573J152259L208438K823080J092544
38250a436330N29476J221815J135129l9712k56195J109941J779059J67601k045345
38241B165439k501617j137801Q15769K459088K446762n31805m526438m779927
38233e590530k82266L244922P64711m343723m783276J81727M244133L578083J139718
$$ y = [-6213165, -5594021, -4092976, -2641252, -1888940, -1500561, -1317556, -1647355, -1731470, 174050, 3920536, 6305726, 4457889, -640298, -5456111, -7813810, -8030509, -7001801, -5018037, -2431783, -33937, 1611220, 2433304, 2337790, 1082208, -1171769, -3606524, -5168741, -5129065, -3503551, -1291503, -91390, -938598, -3318943, -5542380, -6357268, -6232245, -6746985, -8446078, -9712651, -8560392, -5351954, -2528874, -1436330, -906854, 314961, 1450090, 1410378, 1154183, 2264124, 4043183, 4210784, 2165439, -336178, -1473979, -658210, 1800878, 4247640, 3715835, -810603, -5590530, -5872796, -2627874, -1863163, -6206886, -10990162, -10808435, -6564302, -2986219, -1846501]
38224a846501N34290J008852Q24266J003540K438215K743457j54169l595977l434930
38215d78957n01703L89107k046391l235002L46224N316894N632761Q66700l548314
38206B741319l986653k408113j404811J12180L208134M678911J351222l660781
38198F31408m581647j663302j00179p39005P67334M489914M276035j383843m913496
38189c216781j580579K075916o13448m111268K81077Q344913Q342833K62087l699259
38180F085491J070060M618716l85651o721636n295748K71838J378567o42176J423376
38171A802837N917876L753623n603264j0809299m668609N267077P532614K026478
38163E219333k168650o78274J870326J031427r81307o08250M76611j388878m940301
$$ y = [-1846501, -1312211, -303359, 520907, 1524447, 3962662, 6706119, 6551950, 2955973, -478957, -980660, -591553, -2637944, -5872946, -5526722, -209828, 5422933, 6289633, 2741319, -1245334, -3653447, -5058258, -4946078, -1737944, 2940967, 4292189, 631408, -3950239, -5613541, -5713720, -6452725, -5685391, -1195477, 3080558, 1696715, -3216781, -4797360, -2721444, -3334892, -7446160, -7165083, 1179830, 9522663, 9784750, 6085491, 7155551, 11774267, 11388616, 4666980, -628768, -356930, 1021637, 379461, 1802837, 7720713, 11474336, 5871072, -4938227, -9606836, -4339759, 3192855, 5219333, 3050683, 2372409, 4242735, 5274162, 4292855, 3684605, 4161216, 2772338, -2167963]
38154b167963n444907k095511J020868J504749J285833J684894R73607r96241
38146d234671q39934K373436L947207O56402l285777k493775J132294K117555
38138f27263M30274J39670J330481N22119k006859k450265o69888l16161j769026
38129e416918j724272l3503k3209j453462l49334L076837L656015R6753k563099
38120d734192j375110O70326J362481K585868M411013L362030l56981j435429
38112D490006J324677K131746j548244m052684j634009Q70501o26235j807824
38104h52066J211460L408506k36446m460295k071959L236196K915122j994025
38096A156493l362839j02584J205999j304024k248339O65142K954560J460408
$$ y = [-2167963, -7612870, -9708381, -8687513, -7182764, -5896931, -4212037, -3238430, -4234671, -5074605, -2701169, 1246038, 1902440, -1383337, -3877112, -2744818, -627263, -196989, -57319, 1273162, 1795281, -211578, -2661843, -3331731, -3647892, -5416918, -7141190, -7174693, -7197902, -8651364, -9000698, -5923861, -2267846, -2171093, -4734192, -6109302, -5438976, -4076495, -1490627, 2920386, 6282416, 5925435, 4490006, 5814683, 7946429, 6398185, 2345501, 711492, 1581993, 955758, -852066, 359394, 3767900, 3531454, -928841, -3000800, 235396, 3150518, 1156493, -2206346, -2308930, -1102931, -2406955, -4655294, -3990152, -1035592, 424816]
38088D24816j401227k790550k559003o51792K752555M615950K372873q09563k25979
38079A728080K157456P69333l349858l545547J160007M179035K079008p68842
38071D408672m43698R19906O12737P1490R66337J695946N34631j766291m014918
38062B984812n320948l708017J194204M627324J928459l257959l191617J741856
38054c001886L532637Q0848j441344K516899N446310J975194l366036m538009
38046A204613l366658l840555l870798j79353M022479L765279N93827p96684n30832
38037b998682j557817l035017k212715r4405P79933J281682K703517K355917j473559
38028d251146l830035K15960O253869O093878M33806k721113r73701L72812r84066
$$ y = [424816, -976411, -3766961, -6325964, -6977756, -4225201, 390749, 2763622, 1954059, 1728080, 3885536, 4654869, 1305011, -2240536, -1080529, 3098506, 5177514, 4408672, 3964974, 4884880, 5497617, 5569107, 6535444, 8231390, 8766021, 6999730, 2984812, -2336136, -6044153, -4849949, -222625, 1705834, -1552125, -4743742, -3001886, 530751, 611599, -829745, 1687154, 7133464, 9108658, 5742622, 1204613, -2162045, -6002600, -9873398, -10052751, -6030272, -2264993, -1671166, -2467850, -2998682, -4556499, -7591516, -9804231, -9898636, -9118703, -7837021, -5133504, -2777587, -4251146, -8081181, -7865221, -1611352, 4482526, 4916332, 2195219, 1221518, 1594330, 610264]
38019F10264j190621O99449n1209m387554n842995q97424M536266M273190J024027
38010a226607N00925J990472J522718j5604O82257J820631q65824n391404n103942
38001f086378P93795N388584M233599J043890O17691J618120K95679k608210l194427
37992B102343n99333J982385J615120j620168n274521o042309k137405L760424
37984f213464N743860J452725m124239m669548p26688J881659O46783j175044
37976g183956o90324P52368J075495Q25546J073347J140841L90619l19963n86176
37967c522203j250380j848236k83624L171913M719359K196820j461714k436599
37959g14664j009625K16293L68938j77695j608943l020523j792515K070799L948809
$$ y = [610264, -580357, 119092, 67883, -4319671, -10162666, -11060090, -6523824, -2250634, -1226607, -725682, 1264790, 2787508, 2771904, 3454161, 5274792, 4408968, -982436, -6086378, -5292583, 96001, 4329600, 5373490, 5991181, 7609301, 7904980, 5296770, 2102343, 1503010, 3485395, 5100515, 3480347, -1794174, -7836483, -9973888, -6213464, -469604, 983121, -3141118, -7810666, -8537354, -6655695, -6008912, -7183956, -7874280, -7121912, -6046417, -5220871, -4147524, -3006683, -2616064, -2936027, -3522203, -4772583, -6620819, -6904443, -3732530, 986829, 3183649, 1721935, -714664, -1724289, -1507996, -1139058, -1316753, -2925696, -5946219, -7738734, -5667935, -1719126]
37950a719126R22905k775223j408089L515457N584100L091533M58725M80250J013460
37941I163992J75859m70789L39692R12361k85857k037329k740558k831878l250492
37932a024999l485430k562566o86327J016524J720605J714142K199239L477344
37924B368532L493748M43057l125200k670918Q93867J415241k363064l347255
37916b891992K347030P084644K622348o153160q124274k981473l56797l368672
37908a1822346m719542l44574M230873M381482L350619M366198M365563P15948
37900D524221k871865k347630L86368J560138Q96929m74700k245592k421442J395022
37891a598551N757155L557959m387842p900779j955331N487511N734984J394274
$$ y = [-1719126, -796221, -3571444, -4979533, -1464076, 4120024, 7211557, 7670282, 8150532, 9163992, 9339851, 8869062, 9208754, 10121115, 9835258, 7797929, 5057371, 2225493, -1024999, -4510429, -7072995, -7759322, -6742798, -5022193, -3308051, -1108812, 2368532, 5862280, 6305337, 3180137, 509219, 1403086, 2818327, 455263, -2891992, -544962, 6539682, 9162030, 3008870, -5115404, -8096877, -8453674, -11822346, -16541888, -16886462, -12655589, -8274107, -4923488, -557290, 3808273, 4524221, 1652356, -695274, -308906, 1251232, 2148161, 1673461, -572131, -2993573, -1598551, 4158604, 7716563, 3328721, -4572058, -6527389, -1039878, 4695106, 6089380]
37883F089380p15760r94274k972329m277636j204442K425830O60880l697917l198803
37874g885071J575273L082300l66950k338144M83853L346359J895459j355226
37866a562147k000516k05680P64200n71315k581114k535187N47262M062283L991763
37857i0451K61625k347756p07281K117232J671516j476263l485642k709926j69557
37848f936503K594334L219497k25076m583390l094387M308095P930140J528291
37840D741001p118683o748712J009282N232004K492147m66539J48421J30307l040290
37831c621062m926206k000409K375818L497280J552092o27052j690089j307699
37823f747327O88547K847791K790270L92601k195688l493903l002674r313M368076
$$ y = [6089380, 5373620, 4379346, 1407017, -2870619, -4075061, -1649231, -988351, -4686268, -7885071, -6309798, -3227498, -3594448, -5932592, -5448739, -2102380, -206921, -1562147, -3562663, -3768343, -3004143, -3575458, -6156572, -8691759, -8144497, -4082214, -90451, 171174, -2176582, -2883863, -766631, 904885, -571378, -4057020, -6766946, -6936503, -4342169, -1122672, -1347748, -5931138, -9025525, -4717430, 3212710, 4741001, -2377682, -9126394, -8117112, -2885108, -392961, -859500, -711079, -580772, -3621062, -8547268, -10547677, -8171859, -4674579, -3122487, -3749539, -5439628, -6747327, -6058780, -3210989, -420719, -28118, -2223806, -5717709, -8720383, -8729696, -4361620]
37814d361620N880833K351223j831806j476543J378617J136309j877378k705176
37806a505541r82619r12334k511322j224517K995430M360644P45476k889323k703328
37797d627434q68124j28180J60106M73712l57316j282357L69258L077001K296286
37788h87048j352778k097151J257270L168927J070765o25080Q60062J860048l23465
37779B931550k581917k412148k049090k440760n04716L570187M061003o21270
37771d7161l915819j902604J66002j905899l224138M79231L601872L86395l644707
37762a0006828o05470N533852N325700q434j197372K793536L720316r32332l982772
37753F40196j456584J293681k86369k789889j978284K72071N63666k07271K31464
$$ y = [-4361620, 1519213, 3870436, 2038630, 562087, 1940704, 3077013, 1199635, -1505541, -2488160, -3400494, -5911816, -7136333, -4140903, 219741, 965217, -1924106, -4627434, -5495558, -5623738, -5463632, -4989920, -5347236, -6629593, -6260335, -3183334, -887048, -2239826, -4336977, -3079707, 89220, 1159985, 534905, 1394967, 3255015, 2931550, 349633, -2062515, -4111605, -6552365, -7057081, -3486894, 574109, -47161, -3962980, -5865584, -5699582, -7605481, -10829619, -10350388, -6748516, -6362121, -10006828, -10612298, -5078446, 247254, 238820, -958552, 1834984, 5555300, 4622968, 640196, -816388, 477293, 190924, -2598965, -4577249, -4305178, -3741512, -3948783, -3717319]
37744c717319J202140J171399O75936N06508R1181m05692M35367K150341K049330
37735D159191m60921k451993j887187l92304j62959r86404j695500j893145j106317
37726f877539J066153K976829J963651j519734l622877k180890O48208K156315
37718e389884K726516L847674M749202L319906o04825m488501n382628k603751
37710c826291J350119K849382R82685j354361j391255k09475n49804k190584k315341
37701f654925Q3020K876636L649848J678749k218002n567274n283476j579097
37693a3014521Q47264r99767l080908L2415N899457O868113J626596k828340j868582
37684f518273J117251K037208K015562K363815M69708m111291n554075k98559
$$ y = [-3717319, -2515179, -1343780, -667844, -161336, -70155, -475847, -40480, 2109861, 4159191, 3698270, 1246277, -640910, -1033214, -1196173, -2182577, -3878077, -5771222, -6877539, -5811386, -2834557, -870906, -2390640, -6013517, -8194407, -7546199, -5389884, -2663368, 1184306, 5933508, 9253414, 8648589, 4160088, -1222540, -3826291, -2476172, 373210, 1355895, 1534, -1389721, -1599196, -2149000, -4339584, -6654925, -6571905, -3695269, -45421, 1633328, -584674, -6151948, -11435424, -13014521, -12167257, -13167024, -16247932, -16215517, -10316060, -3447947, -1821351, -4649691, -6518273, -5401022, -3363814, -1348252, 1015563, 1485271, -2626020, -8180095, -8478654]
37676h478654N302058L511514k340285k686883K978858N296914R8379n276027
37668a594126l985763K46921M76407k319381k169233J596035M005504K976246
37660g67390J757607K463380K537640n30628m744326o135088l589633O16645L571320
37651d820473L628866R23171k459649l508053r24141L127533M648680J708048
37643B323982l212800n351618k971033O4679j036923m872890m743122J812826
37635a7986899Q262407P453793J450120k191253j597841j331962k767184j568897
37627a0277716L592276P317321N765471K057735l92816l184027o695783n646252
37619g463791K190776Q960064O798551L1084j936755L08470r57543n409842m766439
$$ y = [-8478654, -3176596, 334918, -2005367, -4692250, -1713392, 3583522, 3681901, -1594126, -5579889, -5332968, -4856561, -7175942, -9345175, -7749140, -3743636, -767390, 990217, 3453597, 5991237, 5460609, 716283, -5418805, -9008438, -8391793, -4820473, -1191607, -268436, -2728085, -6236138, -7160279, -4032746, 615934, 2323982, -888818, -6240436, -9211469, -9146790, -10183713, -15056603, -19799725, -17986899, -9724492, -2270699, -820579, -3011832, -4609673, -5941635, -8708819, -10277716, -6685440, 631881, 6397352, 8455087, 8062271, 4878244, -1817539, -7463791, -5273015, 3687049, 10485600, 10516684, 8579929, 8888399, 7930856, 2521014, -2245425]
37610b245425J885515N353629J456352k743849j856019l16060k147654k906512
37602c520023R98414L938757L16196n152005m960870n17865K156157K796604M101807
37593A57172L728011j231732n855599l598738K134897K863748r43567j574906
37585d320714J708289J994323j507543j367742L882612N531503m94873n550447
37577a24592j914034M690637M640002n92535k396171N63283J556709k276691n833574
37568a686966m453681R0229L357472L355671P68451k316278l070190l28559L091253
37559a192598L129255j76352k807276k520113j445444j984220l086935k542495
37551a2626178p29936M42691R94012K324461L557784J755845k987892n654238
$$ y = [-2245425, -359910, 4993719, 6450071, 3706222, 1850203, 1534143, -613511, -3520023, -2521609, 1417148, 1733344, -3418661, -8379531, -8897396, -6741239, -3944635, 157172, 3885183, 2653451, -3202148, -6800886, -4665989, -1802241, -2745808, -4320714, -2612425, -618102, -2125645, -3493387, 389225, 5920728, 5425855, -124592, -2038626, 2652011, 7292013, 6699478, 4303307, 4866590, 6423299, 4146608, -1686966, -6140647, -6050418, -2692946, 662725, 1431176, -885102, -3955292, -4283851, -1192598, 1936657, 1760305, -1046971, -3567084, -5012528, -6996748, -10083683, -12626178, -13356114, -12913423, -11919411, -9594950, -6037166, -4281321, -7269213, -12923451]
37543a2923451k260387M090519O604659L503985n10455j540792p78601k82431
37535d096954P23331K560237K518048n21309k670888q76452J302729o73221l962896
37526e697375k506625K378988L509805l22793k343706Q98788M382319L789349
37518D088750K097947K453342J471339m085196r296138p042698J059095O559764
37510b693795N508735J803406j07387k27085k94197o62936j083237j649033k176893
37501a582422k381598k402693j853041J49520K365565J402080l028631n711993
37493a3043213k635904K519324L335372k3725j969485n32244R96335J051923J752965
37484h548652L041492J572840k447166l628389K55458L957655K700583o18202
$$ y = [-12923451, -15183838, -11093319, -4488660, -984675, -1495130, -3035922, -3814523, -4096954, -3373623, -813386, 1704662, 1183353, -1487535, -2363987, -1061258, -1734479, -5697375, -8204000, -5825012, -2315207, -2638000, -4981706, -4082918, 299401, 4088750, 6186697, 8640039, 10111378, 6026182, -3269956, -10312654, -9253559, -2693795, 2814940, 4618346, 4510959, 4283874, 3989677, 3326741, 2243504, 594471, -1582422, -3964020, -6366713, -8219754, -8070234, -5704669, -4302589, -7331220, -13043213, -15679117, -13159793, -9824421, -9848146, -11817631, -12349875, -11353540, -10301617, -8548652, -5507160, -3934320, -6381486, -10009875, -9754417, -5796762, -3096179, -3714381]
37476c714381p54384J667531K468989J064691j84782j238514l402687m849450
37468h942987k699319J406156L048897J605024K6112r37062k556618l004116O92924
37459a1360989N318475L857622k922703n465711K36923N519086K410955l304494
37451e710836j286457O266616P561134l77744p240366n165361P30157J847226
37443c375631j476688k987346r31052J029135R82458J066107K770724M121587
37435A199294K580309j301526m094590l054434N58963K433938N80644j585187
37427b682589r9161L008858K344686k125205m550273k438405k26047r40917p72176
37418h481229L307430O405561K986526k966764l079532K360085M914730J288513
$$ y = [-3714381, -4468765, -2801234, -332245, 732446, 547664, -690850, -4093537, -8942987, -11642306, -10236150, -7187253, -5582229, -5556117, -6493179, -9049797, -12053913, -11360989, -6042514, -2184892, -5107595, -10573306, -10336383, -4817297, -2406342, -5710836, -6997293, -730677, 6830457, 6452713, -787653, -5953014, -5222857, -3375631, -4852319, -7839665, -8770717, -7741582, -6759124, -5693017, -2922293, 1199294, 3779603, 2478077, -1616513, -4670947, -4111984, -1678046, -1097402, -2682589, -2781750, 227108, 2571794, 446589, -4103684, -6542089, -6768136, -7709053, -8481229, -5173799, 1231762, 4218288, 1251524, -1828008, 532077, 5446807, 6735320]
37410F735320k329519j038094J376960l18767m194890m908057k233933n13997
37402g424977j383601j851819M84837L913769N116416L069940l83018k592129
37394a050582k067287P22436L659240M357063K120224j148796k712486k191423
37386A688389j925954l060753k986727O19344M633106L794202r56721l024350
37378a219464n33700K71221m189193p113066j115399Q860227J0945743K865339
37370H771708n380404n585630m13654L200455K960442Q10721j131812j381272
37362A850554M33252J987149M88551k660213l247090o99780J374384J466350J655584
37353B648741K062449q1867m063751m670692l52360L449116K460229m03500q15118
$$ y = [6735320, 4405801, 3367707, 4744667, 4425900, 231010, -4677047, -6910980, -7424977, -8808578, -10660397, -10175560, -6261791, -1145375, 1924565, 1541547, -1050582, -3117869, -2395433, 1263807, 5620870, 7741094, 6592298, 3879812, 1688389, -237565, -3298318, -6285045, -5665701, -1032595, 2761607, 1804886, -1219464, -1753164, -1481943, -5671136, -12784202, -13899601, -5039374, 5906369, 8771708, 3391304, -2194326, -2607980, 592475, 3552917, 4363638, 3231826, 1850554, 2283806, 4270955, 4759506, 2099293, -1147797, -1847577, -473193, 993157, 2648741, 4711190, 4629323, 565572, -4105120, -4457480, -1008364, 1451865, 1048365, 233247]
37344B33247M42556P84962P26055J173843M07632j953088k528163r8635R14665
37335A03074k183012m533863j143954M438692N429542J914152j159982k529875
37327C34774l857207l629728J49813L628961J980206j181010J451459P482672
37319F359940O588812k811471r136694m187195M848485O229322j48309m775467
37311B967423k794095J267982K019967K08716k32427J595758K709053P11633k724692
37302E729318l998555k620935j756574k881617k992766K81740L740570K812095
37294a686724j367012l660380k307719J66936K199880M103301M589669K033407
37286D071358j159542j191754M99389m14138k591119n61347M475330M306278l009986
$$ y = [233247, 675803, 1460765, 2186820, 3360663, 3768295, 1815207, -712956, -811591, 103074, -2079938, -6613801, -7757755, -3319063, 2110479, 4024631, 2864649, 334774, -3522433, -7152161, -7002348, -3373387, -1393181, -2574191, -1122732, 6359940, 12948752, 10137281, 1000587, -3186608, 1661877, 7891199, 7742890, 2967423, 173328, 1441310, 3461277, 3669993, 3437566, 5033324, 7742377, 8454010, 5729318, 1730763, -890172, -2646746, -5528363, -8521129, -8239389, -4498819, -1686724, -3053736, -6714116, -9021835, -8854899, -6655019, -2551718, 2037951, 4071358, 2911816, 1720062, 2219451, 1805313, -785806, -1347153, 3128177, 7434455, 4424469]
37277D424469q345172m775911K245150M088628J427356K79614J164205M08426
37269I16765j379330m11140K519460K811677j08570k183166j775501j570043l036511
37260d216359l894641j974819J890110N260896N942770L085266j320033l429197
37252A343993k156410n90521p68545o23487R76011Q72196k219804l291233R91745
37243e466055M744250J262651n066346m849497J010294L046340o00303j740963
37235g659629K510942M223326r83621n302508j496078M966066N051802M10940
37227A721240q47236K102403K805219r15197m046307k906222K62667J973502J695656
37218A845725N57256m73323o25371p8751l58320k029615l207005k212443J15895
$$ y = [4424469, -3920703, -8696614, -6451464, -2362836, -935480, -655866, 508339, 916765, -462565, -873705, 1645755, 4457432, 4348862, 2165696, 390195, -1179848, -4216359, -8111000, -10085819, -8195709, -2934813, 3007957, 6093223, 4773190, 1343993, -812417, -1402938, -2171483, -2794970, -1818959, -946763, -3166567, -6457800, -5466055, -721805, 540846, -4525500, -9374997, -8364703, -5318363, -5918666, -7659629, -5148687, -925361, -1908982, -7211490, -8707568, -3741502, 1310300, 1721240, 874004, 2976407, 5781626, 4866429, 820122, -2086100, -1823433, 150069, 1845725, 2402981, 1929658, 1304287, 1225536, 867216, -1162399, -4369404, -6581847, -6465952]
37209f465952K491278M812893N753029K519521l831099o884194k973533K798311
37201a779746L501630m4879k126209j366367o58514k73235J808440L911682K255436
37192E228238j712538k522419M21492J941669p5571j755180p07562K39653q15351
37183B42431j174999Q77477K314468P16088j362991j116586m48343k168979m451488
37174f572922l263562J449255N323949M569534k20529m374012l190561K489530
37166c789318N769274K053998l623385l019590K618325L846019k076390o370661
37158d591728k502325L695897L779112m45116j588148P80605Q87926k502185m306266
37149f792228j651251K401535M062938K844773K24531j862185j557165P32149
$$ y = [-6465952, -3974674, 838219, 6591248, 9110769, 5279670, -1604524, -4578057, -1779746, 1721884, 1677005, -449204, -1815571, -2474085, -2747320, -938880, 2972802, 5228238, 3515700, 993281, 1414773, 3356442, 3280871, 1525691, 818129, 1057782, 242431, -932568, -55091, 2259377, 2975465, 1612474, 495888, 47545, -2121434, -6572922, -9836484, -8387229, -3063280, 1506254, 1285725, -3088287, -6278848, -3789318, 1979956, 4033954, 410569, -2609021, 9304, 3855323, 1778933, -4591728, -7094053, -3398156, 380956, -64160, -1652308, -871703, 16223, -2485962, -6792228, -8443479, -6041944, -1979006, 865767, 1090298, -771887, -2329052, -1596903]
37141a596903J818276K29211j025541N17613K001131j61262l874010m592041k308660
37132h992186R752K168082M911734N221466O14885m094298k450952K607625K347089
37123B343197l361184n136655O25528N606947K893586k525776k716851Q78882
37115a392326J429392j751339l217705o29592K600181L305891K251795J616058
37107D212355K073841K613083J554336j591010m391459l525721L76915K608396
37099C930736P35364j963952j764287q7997n08149k598013k809628l65007J615083
37090c815850R37742q33350j240026m80062o51932k212263k713734p896L942817
37081g074554M629608J206076j514215L67130L813306L232482j022403l513084
$$ y = [-1596903, 221373, 450584, -574957, -57344, 1943787, 1782525, -2091485, -6683526, -8992186, -8982434, -6814352, -1902618, 3318848, 3933733, -160565, -2611517, -3892, 2343197, -1017987, -6154642, -5529114, 77833, 2971419, 445643, -2271208, -1392326, 37066, -1714273, -4931978, -5561570, -2961389, 344502, 2596297, 4212355, 6286196, 8899279, 10453615, 8862605, 4471146, 945425, 1322340, 3930736, 4666100, 2702148, 937861, 849864, 341715, -2256298, -5065926, -5430933, -3815850, -2878108, -3711458, -4951484, -5431546, -6083478, -8295741, -11009475, -11017371, -7074554, -2444946, -1238870, -2753085, -2385955, 1427351, 4659833, 3637430, 124346]
37073A24346k236163o35730p66152m10052J319814J264664j962519m292546j908232
37064i502570L024151N636772M353639Q98687k568917l820047j390251K393959
37056i74577K708966q60117k631649Q65279N101390M138673p41749l808628l385923
37047D11665k477549k737537k738058j507189J18240J260238J406336N1975j898141
37038h110020k089081j01965J502066J558160K395621M798257M753214o65227
37030D041025p380855q882286m365992J770753O043761P329358M933646q0435
37022C408975l732550l501872j661347p57645N93649L167319L159009j242566
37014e67028m080117j07317N108442K788110m377220n743801K93784M159910R43829
$$ y = [124346, -2111817, -2747547, -3513699, -3923751, -2603937, -1339273, -3301792, -7594338, -9502570, -6478419, -841647, 3511992, 4410679, 1841762, -1978285, -3368536, -974577, 1734389, 874272, -1757377, -892098, 4209292, 8347965, 7606216, 3797588, 411665, -2065884, -4803421, -7541479, -9048668, -8930428, -7670190, -6263854, -6211879, -8110020, -10199101, -10301066, -8799000, -7240840, -4845219, -46962, 4706252, 4041025, -3339830, -12222116, -16588108, -14817355, -8773594, -1444236, 3489410, 3408975, -323575, -3825447, -5486794, -6244439, -5650790, -2483471, 675538, -567028, -4647145, -4754462, 353980, 3142090, -1235130, -6978931, -6685147, -2525237, -1581408]
37005a581408k752725q78432L229941M462540L669581K883732N15980l573186
36997E976023n144635k721380r42886j897806n29302N265679P736221Q28326p808201
36988G62039o500148K816174P372065K311550l972633l939852m51297P67879k0150
36979h54373P4243K80323j430347l211240j646728K381255M181518J400810k969751
36970a794290m089585n08855M248170N081704Q28091l777277l096625K246193
36962h62474N370413J629912n008947o773367k220551K100181R22092k592711
36954g435452k047240K470641M752295K180478m40456J118512L614121J603637
36946E816536l777799o495665m339711p39106J414399K489429K569232N57718
$$ y = [-1581408, -4334133, -5212565, -1982624, 2479916, 6149497, 9033229, 9549209, 5976023, 831388, -1889992, -2832878, -4730684, -5259986, 5693, 7741914, 8570240, 762039, -5738109, -2921935, 4450130, 6761680, 2789047, -1150805, -1602102, -834223, -854373, -780130, -499807, -1930154, -5141394, -6788122, -4406867, -225349, 1175461, -1794290, -5883875, -6392730, -2144560, 2937144, 3765235, -12042, -3108667, -862474, 4507939, 6137851, 1128904, -5644463, -7865014, -5764833, -4842741, -7435452, -9482692, -7012051, -2259756, -79278, -519734, 598778, 4212899, 5816536, 2038737, -4456928, -8796639, -9535745, -8121346, -5631917, -3062685, -2504967]
36938b504967k036189j439054K397765M652149K647791k76921m76020O05740m3222
36929C527072j756311k128211j253589m68854N11640J797613J427746j052709
36921F04397k013448R26730L716458J238141m198765n660613j847661J733513
36913e501248J817964R82874R81193o80388m477782n491116j066227L244895J538625
36904h651210k316342O1849P640867R779079J737069p403434p060548M10425M260562
36895a541683R87776k361625j60462M146455M710335J475164k016269m302750
36887I36941n184836l070434J888487M896415K142682k711715l290691j43770
36879d536921P45895j672296k048447J378503K915762j131758n634658m111584
$$ y = [-2504967, -4541156, -5980210, -3582445, 1069704, 3717495, 3440574, 2964554, 3570294, 3527072, 1770761, -357450, -1611039, -2079893, -1568253, 229360, 1657106, 604397, -1409051, -482321, 3234137, 4472278, 273513, -5387100, -7234761, -5501248, -3683284, -2700410, -1719217, -2399605, -6877387, -12368503, -13434730, -10189835, -8651210, -10967552, -10905703, -3264836, 6514243, 8251312, 847878, -6212670, -5802245, -1541683, -553907, -2915532, -3075994, 1070461, 5780796, 7255960, 5239691, 936941, -4247895, -7318329, -5429842, -533427, 1609255, -1102460, -4393151, -4536921, -3791026, -5463322, -7511769, -6133266, -3217504, -4349262, -9983920, -14095504]
36871a4095504J716518N097121L660626N66277j365208j705682k43660K460014
36863c909498L295565m2758m255534l408143K755208P388805M909365k048646
36855D684364n977446l319377J893526L156975q66452n010505m266551n7425K347935
36846g414956J411012N30480J703261K578901J300403k74047n87641j155269k273263
36837d181119p12555M120739O480251K353917k950860k241946J835020Q40539
36829E543986n376940p943340k937280K990775L599844J407091R91029J228961
36821d95874m29157j841597m07395J105000p33033l021292r50692L278282L154492
36812c41266j491416l780692m50959L479052K890052l71105j914599j616222j791668
$$ y = [-14095504, -12378986, -7281865, -3621239, -3054962, -4420170, -6125852, -6369512, -3909498, -613933, -656691, -4912225, -8320368, -5565160, 1823645, 6733010, 4684364, -1293082, -4612459, -2718933, 438042, -428410, -5438915, -9705466, -9762891, -7414956, -6003944, -5473464, -3770203, -1191302, 109101, -164946, -752587, -1907856, -4181119, -4893674, -772935, 5707316, 8061233, 5110373, 2868427, 4703447, 5543986, 167046, -7776294, -10713574, -7722799, -4122955, -2715864, -1724835, -495874, -925031, -2766628, -3174023, -2069023, -2802056, -5823348, -6774040, -3495758, -341266, -1832682, -5613374, -6064333, -2585281, 304771, -66334, -1980933, -3597155, -5388823]
36803e388823j935758j06393K275864J890421p32899j581325K19064P89201j668144
36794f238792k868179J027512O092665N059144j950817o628985l552663K809114
36786f251001M858939J787231j161450q83031O57675R49984J81623n58818j045779
36777a464627j026573j93468K54052j334820l627693k890937J450142M710578
36769d123346K886214j523677k816847j5243K062673j31850l907090l958953Q77341
36760a0650778O306018P365893L272891k325235n004732l374097K33301K540592
36752a636147K532774J522714M74996j167962l243301l253640O07954N446380
36744A283768N824247Q38949l929524l546850j17348J033836o49726j216044M76807
$$ y = [-5388823, -7324581, -7430974, -5155110, -3264689, -3997588, -5578913, -5359849, -4570648, -6238792, -9106971, -8079459, -1986794, 3072350, 1121533, -5507452, -9060115, -6251001, -1392062, 395169, -766281, -1649312, -991637, -41653, 139970, -418848, -1464627, -2491200, -2684668, -2430616, -3765436, -7393129, -10284066, -8833924, -4123346, -1237132, -2760809, -5577656, -5592899, -3530226, -3662076, -7569166, -11528119, -10650778, -4344760, 3021133, 6294024, 3968789, -1035943, -4410040, -4176739, -1636147, 896627, 2419341, 2894337, 1726375, -1516926, -4770566, -4162612, 1283768, 7108015, 7946964, 4017440, 470590, 353242, 1387078, 737352, -478692, -1885]
36735a885R98559j170264k561689o89387J286597m37150l917379m345086j154081
36726a1991765K051288L217065L142373J979758r43082l756248k957783J268730
36718g989664M282681K869339j008435l480144l133577j069429Q90892J079049
36710g559288n63730j254093J705805O191570O801377K282353k257646k485307
36702B861041m85308m16917j901764j676052M04602J348539J15014j140875p85071
36693a676791M91956J652714K358521J935860j46819k510779k889187j250254
36685b034779J77697K51664J95875J179897K637676L503664L308316J669995j354016
36676I535989l936429l625236p09803J454364N47915j927863k974041j574507
$$ y = [-1885, 996674, -173590, -2735279, -3424666, -2138069, -2575219, -6492598, -10837684, -11991765, -9940477, -6723412, -3581039, -1601281, -2544363, -6300611, -9258394, -7989664, -3706983, -837644, -1846079, -5326223, -8459800, -9529229, -8638337, -7559288, -8123018, -9377111, -7671306, -1479736, 5321641, 7603994, 5346348, 2861041, 2375733, 1958816, 57052, -1619000, -1214398, 134141, 249155, -891720, -1676791, -1184835, 467879, 2826400, 4762260, 4615441, 2104662, -784525, -2034779, -1857082, -1605418, -1409543, -229646, 2408030, 5911694, 9220010, 10890005, 9535989, 5599560, 1974324, 1264521, 2718885, 3266800, 1338937, -1635104, -3209611]
36668c209611J146845L453294L468376J46356m436343n694636j895067K623657
36660d397129K583935r13216j920309J493885M128962J210174m486787o367260
36652h667745k885052J142036J704696M10487R23048L309643M208085J617440
36644A762638k453655m227456k047531K110668M522111L129993n97423l260626
36636a061281k936106o14824J518536K192408J281854o19009k024661j322406
36628c585489R89000K045782K79942j849045j071739J677441K514329N79265r74816
36619F04670o95899j318903m293026n863894k505912K740930M277415K461598
36611d593021K488822N284218N760243J497509k867768k947154j074385j273999
$$ y = [-3209611, -2062766, 1390528, 4858904, 5005260, 568917, -5125719, -7020786, -4397129, -1813194, -2726410, -4646719, -3152834, 976128, 2186302, -2300485, -8667745, -11552797, -10410761, -8706065, -8295578, -7372530, -4062887, 145198, 1762638, -691017, -4918473, -6966004, -4855336, -333225, 2796768, 2199345, -1061281, -3997387, -4612211, -3093675, -901267, 380587, -238422, -2263083, -3585489, -2596489, -550707, -270765, -2119810, -3191549, -1514108, 1000221, 1579486, 604670, -91229, -1410132, -5703158, -11567052, -14072964, -11332034, -7054619, -4593021, -2104199, 3180019, 8940262, 10437771, 7570003, 4622849, 3548464, 2274465]
36603B274465k115985L163L455417L443827J55460j347003N12218J497031j000226
36594F878367l532331k209717J430827L240952K062364n07118l456691o244010
36586b337357o967237l897112J514451N339024N010917J647928j034620n5115
36578g79121L420731M393952q3660n874204o053516l08917M432392L817421J272546
36569D237624R55031J075009j431812m312068l588642l64360J462063J446473
36561e20682J202249j59016l169166l753490J007544N607684K911284l796187
36553f69780n051667m81825J120769k306250k461752L455921N924877p91826p149133
36544h410666k969156N552822N622388j697336m245551J088827M752489J431722
$$ y = [2274465, 158480, 161643, 3617060, 7060887, 7216347, 5869344, 6381562, 7878593, 6878367, 3346036, 1136319, 2567146, 5808098, 7870462, 7363344, 3906653, -2337357, -9304594, -13201706, -11687255, -6348231, -1337314, 310614, -724006, -779121, 2641610, 7035562, 6951902, 1077698, -4975818, -5284735, -852343, 2965078, 4237624, 5192655, 6267664, 4835852, 523784, -3064858, -3429218, -1967155, -520682, 681567, 522551, -2646615, -6400105, -5392561, 215123, 3126407, -669780, -5721447, -6203272, -5082503, -7388753, -9850505, -6394584, -469707, -1261533, -8410666, -11379822, -5827000, -204612, -1901948, -6147499, -5058672, -306183, 1125539]
36536A125539k308229o74216K077489O22841j750939N70568N323076N684050P43269
36527A1413448l750204l941779j952559j312361k264744k664796j232445J252811
36519d452629L079565L241220K040020K36494j819090l569343l542311q13868
36511e599942K994381M859808L792456J725892O94868N49372J2190j219335k244407
36502E565283k206779j180325r483N29493L88898m5319o01022j069649q32848
36493E38249M2227m809j733695k682613j66512L515136L180350j026361k683981
36484a022009J167994M780734K494088k190746k375065J160681J896939j458955
36476D453661l609806j947994R7337o6479n32851K43868P26891L29802Q89627
$$ y = [1125539, -1182690, -1856906, 220583, 843424, -907515, -336947, 4986129, 10670179, 11413448, 7663244, 3721465, 1768906, 456545, -1808199, -4472995, -5705440, -4452629, -1373064, 1868156, 3908176, 4144670, 2325580, -1243763, -4786074, -5599942, -2605561, 2254247, 6046703, 7772595, 8467463, 9016835, 9029025, 7809690, 5565283, 3358504, 2178179, 2168696, 2698189, 3087087, 3041768, 2440746, 1371097, 538249, 580476, 575667, -1158028, -3840641, -4007153, -492017, 2688333, 1661972, -1022009, 145985, 4926719, 7420807, 5230061, 2854996, 4015677, 5912616, 4453661, 843855, -1104139, -1006802, -1073281, -1606132, -1362264, -635373, -305571, 584056]
36467E84056K240169J501563j231952j837877P93610K093908p22603l799781l057052
36458c435959n91527j89183p89857M05484J869110N23285j877524j079968K199297
36449b966842K903334l27211k978584j553947J633804K352835J54649j854771
36441b636733j367108O83721J695822P14571k31285J189196L814979L746842l67195
36432G242810m906310n678565k936289j37431P06733L25549M9088M97040J630141
36423c207234K501655J871191K47418k44874O76069M32665j927653k913068M53681
36414b110150N014207N074840N89227k814459k041998k33560r86391k861605k104826
36405b474715J680558N108706N032189J328687l321227n347381l246405L16924
$$ y = [584056, 2824225, 4325788, 3093836, 1255959, 2049569, 4143477, 3420874, -378907, -3435959, -4027486, -4216669, -5006526, -4601042, -2731932, -2208647, -4086171, -5166139, -2966842, -63508, -390719, -3369303, -4923250, -3289446, -936611, -781962, -2636733, -4003841, -3320120, -1624298, -909727, -1141012, 48184, 3863163, 7610005, 7242810, 2336500, -3342065, -6278354, -6415785, -5709052, -5383503, -5334415, -4837375, -3207234, -705579, 1165612, 1413030, 1168156, 1844225, 2276890, 349237, -2563831, -2110150, 2904057, 7978897, 8568124, 5753665, 3711667, 3478107, 2491716, -369889, -2474715, -794157, 4314549, 9346738, 10675425, 7354198, 2006817, -1239588, -922664]
36397i22664Q21918k451659m767692j836469M099215O764666L765290j055919
36389D416686l329489k866471j424394O89331K948340K466322k152113o366448
36381e618236m227452K695614O258178K772392k422873l706764k545902k112091
36373h907134n21193M186996P096175K669079m796294n948939o11269K228551
36365d604028p52636k459103J594249N313226K598789k330072k254428J639027
36357a254976L218551J626522M54316J49075j271703k399160o04854J741597L38470
36348A997838l023231k673653J329582L131445Q62830q36460N79665J452805j020517
$$ y = [-922664, -100746, -2552405, -7320097, -9156566, -5057351, 1707315, 5472605, 4416686, 1087197, -1779274, -3203668, -2514337, 434003, 2900325, 748212, -5618236, -9845688, -7150074, -891896, 1880496, -542377, -4249141, -6795043, -8907134, -9428327, -5241331, 1854844, 4523923, -272371, -6221310, -6832579, -4604028, -5356664, -7815767, -6221518, -908292, 1690497, -639575, -2894003, -1254976, 1963575, 3590097, 4044413, 4193488, 2921785, 522625, -82229, 1659368, 1997838, -1025393, -3699046, -2369464, 761981, 1624811, 788351, 1368016, 2820821, 1800304]
$$ [...]
##END NTUPLES=NMR SPECTRUM
##END=
