##TITLE=31Pdec_SR124_rek5T_1'
 DMSO, 24 sc
 9.6.2022
##JCAMPDX= 6.0         $$ Bruker NMR JCAMP-DX V2.0
##DATA TYPE= NMR SPECTRUM
##DATA CLASS= NTUPLES
##ORIGIN= UXNMR, Bruker Analytische Messtechnik GmbH
##OWNER= root
$$ XWIN-NMR		Version 3.5
$$ Thu Jun  9 14:37:53 2022 Russian Standard Time (UT+4h)  she@DPX200
##.OBSERVE FREQUENCY= 81.013821
##.OBSERVE NUCLEUS= ^31P
##.ACQUISITION MODE= SIMULTANEOUS
##.ACQUISITION SCHEME= undefined
##.AVERAGES= 24
##.DIGITISER RES= 16
##SPECTROMETER/DATA SYSTEM= spect
##.PULSE SEQUENCE= zgpg30
##.SOLVENT NAME= Acetone
##.SHIFT REFERENCE= (INTERNAL, Acetone, 0, 248.564)
##AUDIT TRAIL= $$ (NUMBER, WHEN, WHO, WHERE, WHAT)
$$ ##TITLE= Audit trail, XWIN-NMR		Version 3.5
$$ ##JCAMPDX= 5.01
$$ ##ORIGIN= Bruker BioSpin GmbH
$$ ##OWNER= she
$$ F:/spectra/data/she/nmr/P31/1/pdata/1/auditp.txt
$$ ##AUDIT TRAIL=  $$ (NUMBER, WHEN, WHO, WHERE, WHAT)
(   1,<2022-06-09 14:35:02.64 +0400>,<she>,<DPX200>,
      <created by zg, POWCHK disabled, PULCHK disabled
       configuration hash MD5:
       00 E9 B6 7A A2 85 ED C7 34 08 36 98 17 FE 4E 26
       data hash MD5: 32K
       2B C8 DA 71 92 C8 B0 D0 6D D3 8A AA DF A2 C8 AC>)
(   2,<2022-06-09 14:35:18.14 +0400>,<she>,<DPX200>,
      <Start of raw data processing
       efp BC_mod = 2 LB = 1 FT_mod = 6 PKNL = 1 PHC0 = -9913.706 PHC1 = -821.1464 SI = 64K 
       data hash MD5: 64K
       B8 1F 82 78 6B DA 95 32 B7 F0 EA B9 FC 93 CA EF>)
(   3,<2022-06-09 14:35:48.32 +0400>,<she>,<DPX200>,
      <pk PHC0 = -336.739 PHC1 = 823.9999 
       data hash MD5: 64K
       E5 6D 22 7D 26 DF 86 E4 39 BF 1E 7E 7C 73 B9 D1>)
$$ ##END=
$$ 
$$ hash MD5
$$ FC 86 12 8B 4F 14 47 85 F0 50 D1 7F 68 12 C4 12
##$RELAX= 
##$RELAX= 
##$RELAX= 
##$RELAX= 
##$RELAX= 
##$RELAX= 
##$RELAX= 
##$RELAX= 
$$ Bruker specific parameters
$$ --------------------------
##$DU= <F:/spectra>
##$EXPNO= 1
##$NAME= <P31>
##$PROCNO= 1
##$TYPE= <nmr>
##$USER= <she>
##$AMP= (0..31)
100 100 100 100 100 100 100 100 100 100 100 100 100 100 100 100 100 100 
100 100 100 100 100 100 100 100 100 100 100 100 100 100 
##$AQSEQ= 0
##$AQ_mod= 1
##$AUNM= <au_zg>
##$AUTOPOS= <>
##$BF1= 81.014009
##$BF2= 200.13
##$BF3= 200.13
##$BF4= 200.13
##$BF5= 200.13
##$BF6= 200.13
##$BF7= 200.13
##$BF8= 200.13
##$BYTORDA= 1
##$CFDGTYP= 0
##$CFRGTYP= 5
##$CHEMSTR= <none>
##$CNST= (0..31)
1 1 145 1 1 1 1 1 1 1 1 1 1 1 1 1 1 1 1 1 1 1 1 1 1 1 1 1 1 1 1 1 
##$CPDPRG= <waltz16>
##$CPDPRG1= <>
##$CPDPRG2= <waltz16>
##$CPDPRG3= <>
##$CPDPRG4= <mlev>
##$CPDPRG5= <mlev>
##$CPDPRG6= <mlev>
##$CPDPRG7= <mlev>
##$CPDPRG8= <mlev>
##$CPDPRGB= <>
##$CPDPRGT= <>
##$D= (0..31)
0 1 0 0 0 0 0 0 0 0 0 0.03 2e-05 3e-06 0 0 0 0 0 0 0 0 0 0 0 0 0 0 0 0 
0 0 
##$DATE= 1654770902
##$DBL= (0..7)
120 120 120 11 120 120 24 19 
##$DBP= (0..7)
150 150 150 150 150 150 150 150 
##$DBP07= 0
##$DBPNAM0= <>
##$DBPNAM1= <>
##$DBPNAM2= <>
##$DBPNAM3= <>
##$DBPNAM4= <>
##$DBPNAM5= <>
##$DBPNAM6= <>
##$DBPNAM7= <>
##$DBPOAL= (0..7)
0.5 0.5 0.5 0.5 0.5 0.5 0.5 0.5 
##$DBPOFFS= (0..7)
$$ [...]
##$SUBNAM2= <"">
##$SUBNAM3= <"">
##$SUBNAM4= <"">
##$SUBNAM5= <"">
##$SUBNAM6= <"">
##$SUBNAM7= <"">
##$SUBNAM8= <"">
##$SUBNAM9= <"">
##$SW= 501.771253377433
##$SWIBOX= (0..15)
0 1 3 0 0 0 0 0 0 0 0 0 0 0 0 0 
##$SW_h= 40650.406504065
##$TD= 32768
##$TD0= 1
##$TE= 0
##$TE2= 300
##$TE3= 300
##$TEG= 300
##$TL= (0..7)
0 120 53 12 22 120 120 120 
##$TP= (0..7)
150 150 150 150 150 150 150 150 
##$TP07= 0
##$TPNAME0= <>
##$TPNAME1= <>
##$TPNAME2= <>
##$TPNAME3= <>
##$TPNAME4= <>
##$TPNAME5= <>
##$TPNAME6= <>
##$TPNAME7= <>
##$TPOAL= (0..7)
0.5 0.5 0.5 0.5 0.5 0.5 0.5 0.5 
##$TPOFFS= (0..7)
0 0 0 0 0 0 0 0 
##$TUNHIN= 0
##$TUNHOUT= 0
##$TUNXOUT= 0
##$USERA1= <user>
##$USERA2= <user>
##$USERA3= <user>
##$USERA4= <user>
##$USERA5= <user>
##$V9= 5
##$VALIST= <valist>
##$VCLIST= <CCCCCCCCCCCCCCC>
##$VD= 0
##$VDLIST= <DDDDDDDDDDDDDDD>
##$VPLIST= <PPPPPPPPPPPPPPP>
##$VTLIST= <TTTTTTTTTTTTTTT>
##$WBST= 1024
##$WBSW= 4
##$XGAIN= (0..3)
0 0 0 0 
##$XL= 0
##$YL= 0
##$YMAX_a= 2622
##$YMIN_a= -2358
##$ZGOPTNS= <>
##$ZL1= 120
##$ZL2= 120
##$ZL3= 120
##$ZL4= 120
##$ABSF1= 0
##$ABSF2= 0
##$ABSG= 0
##$ABSL= 0
##$ALPHA= 0
##$AQORDER= 0
##$ASSFAC= 0
##$ASSFACI= 0
##$ASSFACX= 0
##$ASSWID= 0
##$AUNMP= <proc_1d>
##$AZFE= 0.1
##$AZFW= 0.5
##$BCFW= 0
##$BC_mod= 2
##$BYTORDP= 0
##$COROFFS= 0
##$CY= -3
##$DATMOD= 1
##$DC= 0
##$DFILT= <>
##$DTYPP= 0
##$F1P= 0
##$F2P= 0
##$FCOR= 1
##$FTSIZE= 65536
##$FT_mod= 6
##$GAMMA= 0
##$GB= 0
##$INTBC= 1
##$INTSCL= 5.30512e-09
##$ISEN= 30
##$LB= 1
##$LEV0= 0
##$LPBIN= 0
##$MAXI= 10000
##$MC2= 0
##$MEAN= 0
##$ME_mod= 0
##$MI= 50
##$NCOEF= 0
##$NC_proc= -8
##$NLEV= 6
##$NOISF1= 182.463
##$NOISF2= 159.3651
##$NSP= 0
##$NTH_PI= 0
##$NZP= 0
##$OFFSET= 248.5645
##$PC= 4
##$PHC0= -10250.45
##$PHC1= 2.853455
##$PH_mod= 1
##$PKNL= yes
##$PPARMOD= 0
##$PSCAL= 0
##$PSIGN= 0
##$REVERSE= no
##$SF= 81.014009
##$SI= 65536
##$SIGF1= 159.3651
##$SIGF2= -187.1042
##$SINO= 113.3802
##$SIOLD= 16384
##$SREGLST= <1H.CDCl3>
##$SSB= 0
##$STSI= 65536
##$STSR= 0
##$SW_p= 40650.406504065
##$SYMM= 0
##$S_DEV= 0
##$TDeff= 32768
##$TDoff= 0
##$TI= <>
##$TILT= no
##$TM1= 0
##$TM2= 0
##$TOPLEV= 0
##$USERP1= <user>
##$USERP2= <user>
##$USERP3= <user>
##$USERP4= <user>
##$USERP5= <user>
##$WDW= 1
##$XDIM= 65536
##$YMAX_p= 123603118
##$YMIN_p= -435192751
$$ End of Bruker specific parameters
$$ ---------------------------------
##NTUPLES= NMR SPECTRUM
##VAR_NAME=  FREQUENCY,     SPECTRUM/REAL,   SPECTRUM/IMAG
##SYMBOL=    X,             R,               I
##VAR_TYPE=  INDEPENDENT,   DEPENDENT,       DEPENDENT
##VAR_FORM=  AFFN,          ASDF,            ASDF
##VAR_DIM=   65536,         65536,           65536
##UNITS=     HZ,            ARBITRARY UNITS, ARBITRARY UNITS
##FACTOR=    0.620285442955139, 1,           1
##FIRST=     20137.2065510759, 0,            0
##LAST=      -20513.1999529892, 0,           0
##MIN=       -20513.1999529892, -435192751,  0
##MAX=       20137.2065510759, 123603118,    0
$$ Real data points
##PAGE= N=1
##DATA TABLE= (X++(R..R)), XYDATA
$$ [...]
##PAGE= N=2
##DATA TABLE= (X++(I..I)), XYDATA
13018F729721m437878k830260J3269j119725l474788j486338L072860L812520
$$ 6729721 2291843 -538417 -525148 -1644873 -5119661 -6605999 -3533139 279381
13010B79381K89773j950842q75554K43980L45513J914435M014670K107755l287291
$$ 279381 569154 -1381688 -2257242 -2013262 -1667749 246686 4261356 6369111 3081820
13001C081820n718360l127439r36330j634203k04830N208872P316192J522656
$$ 3081820 -2636540 -5763979 -6700309 -8334512 -8539342 -3330470 3985722 5508378
12993E508378m577753k544597L068434K571872k700180l729680K82804J798022
$$ 5508378 930625 -1613972 1454462 4026334 1326154 -2403526 -2120722 -322700
12985c22700o44660n01794L402300L777764j840202n832070l171549M34333j080595
$$ -322700 -967360 -1469154 1933146 5710910 3870708 -1961362 -5132911 -4698578 -5779173
12976e779173m044099k226874K451811L740166J035899j232645j035087L47919
$$ -5779173 -9823272 -12050146 -9598335 -5858169 -4822270 -6054915 -7090002 -6742083
12968f742083K304086M525116M826035K149716j65208J252324L772677J760401
$$ -6742083 -4437997 87119 4913154 7062870 6897662 8149986 11922663 13683064
12960A3683064n142249j0870120j0115360l671668L359835O460052M974078K114282
$$ 13683064 8540815 -2329305 -12444665 -16116333 -12756498 -6296446 -1322368 791914
12952G91914J372373K377926J774795j396815l864710k890977J7400J953279K332161
$$ 791914 2164287 4542213 6317008 4920193 1055483 -1835494 -1818094 135185 2467346
12943B467346J725909q5456k429548k948848j241504n17053k600121m171135j695426
$$ 2467346 4193255 4107799 1678251 -1270597 -2512101 -3029154 -5629275 -9800410 -11495836
12934a1495836K492207L440778J053329n10625J08693J17358j531802j835136
$$ -11495836 -9003629 -5562851 -4509522 -5020147 -4911454 -4794096 -6325898 -8161034
12926h161034J001572L886107L013940o35625k661752j079137J564905K000803
$$ -8161034 -7159462 -3273355 -259415 -895040 -3556792 -4635929 -3071024 -1070221
12918a070221L77133n25628N29812J549803L79552k020723k881924j340680R11207
$$ -1070221 -693088 -1218716 -688904 860899 1240451 -780272 -3662196 -5002876 -4091669
12909d091669K132751J859063K81079j639807j990383j18696J617789Q92718o93345
$$ -4091669 -1958918 -99855 181224 -1458583 -3448966 -3567662 -1949873 -1057155 -1750500
12900a750500J1353K365728L044677J851770J495423J660588q30709m954106n041795
$$ -1750500 -1739147 626581 3671258 5523028 7018451 8679039 7848330 2894224 -2147571
12891b147571Q5230L813060J363591k933304k768744O40675J827977J57729m58086
$$ -2147571 -2062341 1750719 3114310 181006 -2587738 -1947063 -119086 38643 -419443
12882d19443J202674K330416J133626j055554k185851j163363J590954L258691
$$ -419443 783231 3113647 4247273 3191719 1005868 -157495 1433459 4692150
12874D692150Q45293l730935m587023n45393K030256j033641m630669k640607
$$ 4692150 5537443 1806508 -2780515 -3325908 -1295652 -2329293 -6959962 -9600569
12866i600569J971054K615461K59338M75851K421010N82242l688675k803311L799903
$$ -9600569 -7629515 -5014054 -4754716 -4278865 -1857855 -1275613 -4964288 -7767599 -3967696
12857c967696O982722J742081m937108m810559K4164J979219n58646k708853j368496
$$ -3967696 3015026 4757107 -180001 -4990560 -4966396 -2987177 -3545823 -6254676 -7623172
12848g623172J386872K468945J608876P33458J293463K469587J967754p30532
$$ -7623172 -6236300 -3767355 -2158479 -1425021 -131558 2338029 4305783 3575251
12840C575251k731881j206987K279382L496141J190969j741743k551207j412896
$$ 3575251 843370 -363617 1915765 5411906 6602875 4861132 2309925 897029
12832H97029m0009J08159j346045k590448o78334L849627N626376J332365m469874
$$ 897029 857020 965179 -380866 -2971314 -3649648 199979 5826355 7158720 2688846
12823B688846n058976j024280J553961P52741J59355J258221J353790m43101j666226
$$ 2688846 -2370130 -3394410 -1840449 -1087708 -928353 329868 1683658 1240557 -425669
12814d25669j783355k763103l571191q39424L749347L967486r62806m119896j505542
$$ -425669 -2209024 -4972127 -8543318 -9382742 -5633395 -1665909 -2628715 -6748611 -8254153
12805h254153K223696K266452Q81732J477521K002282k22333k492053j339917
$$ -8254153 -6030457 -3764005 -2882273 -1404752 597530 375197 -2116856 -3456773
12797c456773J254042J755759J137558J710573J875460k98653j867821N53768
$$ -3456773 -2202731 -446972 690586 2401159 4276619 3977966 2110145 2663913
12789B663913M069194L400470o11606k488965p26163Q78535r6816j909453k607702
$$ 2663913 6733107 10133577 9521971 7033006 6306843 7185378 7088562 5179109 2571407
12780B571407k489571k256546j850984j224831k36244J359058K348037O89370
$$ 2571407 81836 -2174710 -4025694 -5250525 -5486769 -4127711 -1779674 -1090304
12772a090304k524800k955635N66564L275472J587060j072574j80769K029117
$$ -1090304 -3615104 -6570739 -6004175 -2728703 -1141643 -2214217 -2394986 -365869
12764c65869N72686l291544l777637Q9892L363360L154272J845415J866778K387835
$$ -365869 206817 -3084727 -6862364 -6772472 -3409112 -254840 1590575 3457353 5845188
12755E845188K110454J218187j93480k256539l719192l243161j930672j610326
$$ 5845188 7955642 9173829 8980349 6723810 3004618 -238543 -2169215 -3779541
12747c779541j642039o71172L3031j018990j458129J787359O330860O517714J500665
$$ -3779541 -5421580 -6092752 -6059721 -7078711 -8536840 -6749481 -418621 6099093 7599758
12738G599758l739234n396810m235894k069684L64613J731999Q36770n43455L49304
$$ 7599758 3860524 -1536286 -5772180 -7841864 -7477251 -5745252 -4908482 -5451937 -5102633
12729e102633K460140K360210J19536r93146l65303l81680j006751K23559K311178
$$ -5102633 -2642493 -282283 -162747 -1155893 -1521196 -1902876 -2909627 -2686068 -374890
12720c74890R84026l822967o451261l496261J806037N077436N731875M569466
$$ -374890 609136 -3213831 -9665092 -13161353 -11355316 -6277880 -546005 4023461
12712D023461J539931j850026k606211q38243J87809j2127J475551M101518K897157
$$ 4023461 5563392 3713366 1107155 268912 456721 444594 1920145 6021663 8918820
12703H918820k796589o300588l333830J400306K053608J42715k20500J8310j539186
$$ 8918820 6122231 -178357 -3512187 -2111881 -58273 84442 -136058 -117748 -1656934
12694a656934k263442J094970N051952L913870q27755k986679j740112j632241
$$ -1656934 -3920376 -2825406 2226546 6140416 5312661 2325982 585870 -1046371
12686a046371l453036k938234Q32412L005757Q45024j927327j113620K335762
$$ -1046371 -4499407 -7437641 -6605229 -3599472 -2754448 -4681775 -5795395 -3459633
12678c459633M978778N255026L185243p91721m673958n514306k957924J69266
$$ -3459633 1519145 6774171 9959414 9167693 4493735 -1020571 -3978495 -3809229
12670c809229J799253K542806K945220J947778o25627k822955l144485k020659
$$ -3809229 -2009976 532830 3478050 5425828 4800201 1977246 -1167239 -3187898
12662c187898N302K687005L984316J288393l674497n058555o65339M017114L061649
$$ -3187898 -3182596 -495591 3488725 4777118 1102621 -3955934 -4621273 -604159 2457490
12653B457490j542144l214788n39801J586179L13509j109621N22799K742426J447659
$$ 2457490 915346 -2299442 -2839243 -1253064 -939555 -2049176 -1526377 1216049 2663708
12644B663708k210627l234979j65631L019093K883550Q03873k84453k88951n71094
$$ 2663708 453081 -2781898 -2947529 71564 2955114 3758987 3474534 3185583 2614489
12635B614489n43382R28269K010357l30777n022287o981577l521451K265969N705857
$$ 2614489 2071107 2999376 5009733 4678956 -343331 -7324908 -10846359 -8580390 -2874533
12626b874533N478976L149487N37883p47940K55924J948128J087950k332650l840564
$$ -2874533 2604443 5753930 6291813 5543873 5799797 7747925 8835875 6503225 2662661
12617B662661p50074L037992K101612k710922n763613m724492k666559k194728
$$ 2662661 1912587 4950579 7052191 4341269 -1422344 -6146836 -8813395 -11008123
12609a1008123j889186K66520L385873N265093N147477L581837J333510n30127
$$ -11008123 -12897309 -12630789 -9244916 -3979823 1167654 4749491 6083001 5552874
12601E552874r83009k97305J99230k9872k98359j51682M4821p7152o81598j964625
$$ 5552874 4569865 4272560 4471790 4441918 4143559 3991877 4036698 3959546 3277948 1313323
12591A313323l345819l210917j059018J071593J224928L92484M86735R20838K02187
$$ 1313323 -2032496 -5243413 -6302431 -5230838 -4005910 -3613426 -3126691 -2205853 -2003666
12582b003666n32969N77975J829084K22519k498747j601273K336743K985348j798121
$$ -2003666 -2536635 -1958660 -129576 92943 -2405804 -4007077 -1670334 1315014 -483107
12573d83107n643679l010418K411513L674739Q86359m48682J093569J541152p89994
$$ -483107 -6126786 -9137204 -6725691 -3050952 -2164593 -2613275 -1519706 21446 -768548
12564g68548k337472l20181K926526L754246K102779L81033l22749o59218q56967
$$ -768548 -3106020 -3426201 -499675 3254571 5357350 5738383 5415634 4756416 3899449
12555C899449k03259J386185K465535J253279k252015n534757n581173k045268
$$ 3899449 3696190 5082375 7547910 8801189 6549174 1014417 -4566756 -6612024
12547f612024K180450M058582L367913J940521Q99811o9517j149089j563310p50396
$$ -6612024 -4431574 -372992 2994921 4935442 5835253 5765736 4616647 3053337 2302941
12538B302941M23192L37873j336496k659443j342341K045873M000533K299677
$$ 2302941 2726133 3064006 1727510 -931933 -2274274 -228401 3772132 6071809
12530F071809r08937k006385p80167P4697m63469q39539m74471p23084j744482
$$ 6071809 5162872 3156487 2376320 2451017 1987548 1148009 673538 -49546 -1794028
12521a794028j921360j264091j676404k618346p05166M263424P101795M147877
$$ -1794028 -3715388 -4979479 -6655883 -9274229 -9979395 -5715971 1385824 5533701
12513E533701j261285l649523k448939n58971Q84464K106173J954181J49285k10529
$$ 5533701 4272416 622893 -1826046 -2385017 -1500553 605620 2559801 2709086 2498557
12504B498557K827399N348713K570588l411428o484460n525979m413388m061083
$$ 2498557 5325956 10674669 13245257 9833829 3349369 -2176610 -6589998 -10651081
12496a0651081j322805L749344O217691L600506m95588j940716p29175J316012
$$ -10651081 -11973886 -8224542 -2006851 1593655 1098067 -842649 -1571824 -255812
12488b55812L030601K958408M08790j663756L08329L890018K757403l333453p058114
$$ -255812 2774789 5733197 6141987 4478231 4786560 8676578 11433981 8100528 1042414
12479A042414m317403p5825Q023k249802k104041N63012K908701M078894M099630
$$ 1042414 -3274989 -3350814 -3342791 -5592593 -7696634 -7133622 -4224921 -146027 3953603
12470C953603J803350k002998l336042j016045N48376j278408k312139R84067
$$ 3953603 5756953 3753955 417913 -598132 -49756 -1328164 -3640303 -2656236
12462b656236M297964K294702j997327k157899R93751J866069K89740M66751J575525
$$ -2656236 1641728 3936430 1939103 -218796 774955 2641024 2930764 3397515 4973040
12453D973040j164948o285778o327756K10713N701809M651125N74872j353776
$$ 4973040 3808092 -2477686 -8805442 -8594729 -2892920 1758205 2333077 979301
12445I79301j521688j998595j580776Q44784K655085J451853q83689j571160j082392
$$ 979301 -542387 -2540982 -4121758 -3276974 -621889 829964 -53725 -1624885 -2707277
12436b707277q45607q9095J847720K978666J653350k91509l22885P53278K03994
$$ -2707277 -3552884 -3641979 -1794259 1184407 2837757 2546248 2223363 2976641 3180635
12427C180635k534728n182631n068896j297723M250563P760503O958913L551717
$$ 3180635 645907 -4536724 -9605620 -10903343 -6652780 1107723 8066636 11618353
12419A1618353L96058k363779n341006o226758l034816N69026m37861l595371
$$ 11618353 12014411 9650632 4309626 -1917132 -4951948 -4382922 -4820783 -8416154
12411h416154k013170L538520M615551p44287l733757P80982N281368K194437
$$ -8416154 -10429324 -6890804 -2275253 -3019540 -6753297 -5972315 -690947 1503490
12403A503490l203070j896436L532916L661703j775404m123790n67632K406655
$$ 1503490 -1699580 -3596016 -63100 3598603 1823199 -2300591 -2868223 -461568
12395d61568J044366k38603J977686M017034J958158j965538l784475l574371
$$ -461568 582798 344195 2321881 6338915 8297073 6331535 2547060 -1027311
12387a027311l117728j877096J018027L666017L532480R79407j444372j884813
$$ -1027311 -4145039 -6022135 -5004108 -1338091 2194389 3173796 1729424 -155389
12379a55389l30248J557540J412415j159640l084717j439616J945204K723836
$$ -155389 -485637 1071903 2484318 1324678 -1760039 -3199655 -1254451 1469385
12371A469385N49013n87326J131660K739240J638317n85122j399775j064807j023937
$$ 1469385 2018398 1431072 2562732 5301972 6940289 6355167 4955392 3890585 2866648
12362B866648j292474j477977k090289k985786k619283n85973J051650O68910
$$ 2866648 1574174 96197 -1994092 -4979878 -7599161 -8185134 -7133484 -6464574
12354f464574m62803k82913J007350J598870O93588p47473j106399N16064L026209
$$ -6464574 -6927377 -7210290 -6202940 -4604070 -3910482 -4657955 -5764354 -5248290 -2222081
12345b222081L578120P87503k545523k388135P43671K037591o58976l425404j882308
$$ -2222081 1356039 2143542 -401981 -2790116 -2046445 -8854 -667830 -4093234 -5975542
12336e975542K465523M401526J974194j742380l397779k978725k020940o61368
$$ -5975542 -3510019 891507 2865701 1123321 -2274458 -5253183 -7274123 -7935491
12328g935491J517688K870963Q43606l505748n031516j095151L687461L396931
$$ -7935491 -6417803 -3546840 -2703234 -6208982 -11240498 -12335649 -8648188 -5251257
12320e251257m0959M34697N164831O217180L42332m727961k600264R29902k052092
$$ -5251257 -5292216 -4857519 307312 6524492 6866824 2138863 -461401 468501 -1583591
12311a583591p100984m457574L322095M318160k605422m998588K431122Q259786
$$ -1583591 -8684575 -13142149 -9820054 -5501894 -8107316 -13105904 -10674782 -2414996
12303b414996K830824n754342m676870L336272N214601j777705p136159l898359
$$ -2414996 415828 -5338514 -10015384 -6679112 -1464511 -3242216 -10378375 -14276734
12295a4276734K761594N412580L949860K096067R15242k89958q51093o6742P48552
$$ -14276734 -11515140 -6102560 -2152700 -56633 858609 568651 -282442 -349184 399368
12286C99368P5372j453704k051901r34924J363928L576648L991047J524588k540877
$$ 399368 474740 -978964 -3030865 -3965789 -2601861 974787 4965834 6490422 3949545
12277C949545m764000k704024J965516M439760K038499j900889j665552K663739
$$ 3949545 -814455 -3518479 -1552963 2886797 4925296 3024407 1358855 4022594
12269D022594M231356o79749n761321l228186L711273M864522j225931m940998
$$ 4022594 8253950 7574201 1812880 -1415306 2295967 7160489 5934558 993560
12261I93560r69314L679716J935210k036905j287510J418925r51400o393938o285653
$$ 993560 24246 3703962 5639172 3602267 2314757 3733682 2782282 -3611656 -9897309
12252i897309N75512N880657M230382l18922j694626N20801K790151K388225q62579
$$ -9897309 -9321797 -3441140 789242 470320 -1224306 -703505 2086646 4474871 3612292
12243C612292m215070l422434K004800O132705L472121k994576n753130l186218
$$ 3612292 -602778 -4025212 -2020412 4112293 7584414 4589838 -1163292 -4349510
12235d349510q1301R80210J678824J886069n26470k994816K25326P467376Q959193
$$ -4349510 -4430811 -3450601 -1771777 114292 -412178 -3406994 -3181668 4285708 13244901
12226A3244901Q72006p644343p199546j310179L87803k952995l853210M43850
$$ 13244901 14116907 6472564 -726982 -2037161 -1649358 -4602353 -8455563 -8011713
12218h011713M125410K694961n95626r13357Q15088N55061j869786k602741J77738
$$ -8011713 -3886303 -1191342 -1786968 -2700325 -1885237 -1330176 -3199962 -5802703 -5624965
12209e624965L446369L568260J148946l12705K93801K99186k240678n013497m396105
$$ -5624965 -2178596 1389664 2538610 2225905 2519706 2818892 578214 -4435283 -8831388
12200h831388n84238K610753K716999J185734P67968J957873K699801R88578k478088
$$ -8831388 -9415626 -6804873 -4087874 -2902140 -2134172 -176299 2523502 3512080 1033992
12191A033992m431228k703709N31555J302638k58428J31058L789970N967855K778270
$$ 1033992 -3397236 -6100945 -5569390 -4266752 -4525180 -4394122 -604152 5363703 8141973
12182H141973k528825m350375k635067j140123m87314J235553K728293Q07771
$$ 8141973 5613148 1262773 -1372294 -2512417 -2999731 -1764178 964115 1771886
12174A771886k983226l439920J41570K760922J602067n49031j075632j088337
$$ 1771886 -1211340 -4651260 -4509690 -1748768 -146701 -695732 -1771364 -2859701
12166b859701j289857L34873L976414N653444K417508l366282p137838o660285
$$ -2859701 -4149558 -3814685 161729 5815173 8232681 4866399 -2271439 -8931724
12158h931724k308816L553715O523640L668253j682134k998833M66228K736344
$$ -8931724 -11240540 -7686825 -1163185 2505068 822934 -2175899 -1709671 1026673
12150A026673N45591k079953j195737R76557J032745K17819Q90875J553978J9967
$$ 1026673 1572264 -507689 -1703426 -726869 305876 523695 1414570 2968548 2988515
12141B988515k047265k162675j433850j817048k003421j83599J821839J212232
$$ 2988515 941250 -1221425 -2655275 -4472323 -6475744 -6659343 -4837504 -3625272
12133c625272j356509l356248l809878k276461K054909P014831P373807K178944
$$ -3625272 -4981781 -8338029 -12147907 -14424368 -12369459 -5354628 2019179 4198123
12125D198123k140264p38669K151204N59750k930763j838742K571113L071134
$$ 4198123 2057859 1319190 3470394 4030144 1099381 -739361 1831752 4902886
12117D902886j431492m451709k953866j303758k318810k317275J348225M439450
$$ 4902886 3471394 -980315 -3934181 -5237939 -7556749 -9874024 -8525799 -4086349
12109d086349K330815k247985l043876Q16278M308692L681761M39691j683497
$$ -4086349 -1755534 -4003519 -7047395 -6231117 -1922425 1759336 2199027 515530
12101E15530j079045R51234K315183K194481J134611l61537k366383m340946m706625
$$ 515530 -563515 387719 2702902 4897383 6031994 5670457 3304074 -1036872 -5743497
12092e743497k687976L94884K731743L802941L545875J428260j951459l877161
$$ -5743497 -8431473 -8036589 -5304846 -1501905 2043970 3472230 1520771 -2356390
12084b356390k278556J399018L752793K977583j70538l385550l861016p15780
$$ -2356390 -4634946 -3235928 516865 3494448 3323910 -61640 -3922656 -4638436
12076d638436K494388R82355l841991m502644J846086P707251N365792j540924
$$ -4638436 -2144048 -1161693 -5003684 -9506328 -7660242 47009 5412801 3871877
12068C871877l511246O06122L078053K04118k761698j180082K065786K395999
$$ 3871877 360631 966753 4044806 4248924 1487226 307144 2372930 4768929
12060D768929K62734j577192k733874l513861k614665n7995J094392n45961j629382
$$ 4768929 5031663 3454471 720597 -2793264 -5407929 -5465924 -4371532 -4917493 -6546875
12051f546875N12312K696230Q58447k426318j293654L436264M151642k022986
$$ -6546875 -6034563 -3338333 -2479886 -4906204 -6199858 -2763594 1388048 -634938
12043f34938p447907l959712N106274Q686639K781040m658658n215216o36445
$$ -634938 -8082845 -12042557 -6936283 1750356 4531396 -127262 -5342478 -5978923
12035e978923K060204J412753J077343J297784j164359m681483k966431L840542
$$ -5978923 -3918719 -2505966 -1428623 -130839 -1295198 -5976681 -8943112 -5102570
12027e102570O641413Q01841n435982k893237M440677N973335Q13270k465729
$$ -5102570 1538843 2340684 -3095298 -5988535 -1547858 4425477 5238747 2773018
12019B773018l47966J680253O8946j748405j507402k392291n411395n319457P26169
$$ 2773018 2425052 4105305 4174251 2425846 918444 -1473847 -6885242 -12204699 -11478530
12010a1478530O624711N311826j015038m391081j954889K054880L528695K727045
$$ -11478530 -4853819 458007 -557031 -4948112 -6903001 -4848121 -1319426 1407619
12002A407619J507276K65868j325274k627379k340460l34023J316285K88767k314683
$$ 1407619 2914895 3180763 1855489 -771890 -3112350 -3446373 -2130088 -1841321 -4156004
11993d156004k253972J852999N219293L207137j236688j658914J779062K790952
$$ -4156004 -6409976 -4556977 662316 3869453 2632765 973851 2752913 5543865
11985E543865m50844k622214q75798M37744j730236l068608K67317L797771J498404
$$ 5543865 5093021 2470807 1595009 2032753 302517 -2766091 -2498774 1298997 2797401
11976B797401l821635m415942M03615L556946J041293l138879l914746j650577
$$ 2797401 -1024234 -5440176 -5036561 -1479615 -438322 -3577201 -7491947 -9142524
11968i142524K66969M95725J15959J79320P40700J367439J698729J828587K002956
$$ -9142524 -8875555 -8379830 -8263871 -8084551 -7343851 -5976412 -4277683 -2449096 -446140
11959d46140J686257n8555k653109l894438k699515m33511J395433K797140L591762
$$ -446140 1240117 1181562 -1471547 -5365985 -8065500 -8499011 -7103578 -4306438 -714676
11950g14676K582285J53893r34029M02056J343476l36030k249444j238118J279992
$$ -714676 1867609 2021502 1087473 1489529 2833005 2496975 247531 -990587 289405
11941B89405J911879J139158J673419K373959l44763m931230m767022J961383
$$ 289405 2201284 3340442 5013861 7387820 7043057 2111827 -2655195 -693812
11933f93812P852518N677458j573986m876898j447452K492214J407140k249508
$$ -693812 7158706 12836164 11262178 6385280 4937828 7430042 8837182 6587674
11925F587674l072850j262297j440015m167835m223418Q64844N473301L402439
$$ 6587674 3514824 2252527 812512 -3355323 -7578741 -6713897 -1240596 2161843
11917B161843k426509l733482O87130L167645o00441m354886q40248O471042P802305
$$ 2161843 -264666 -3998148 -3311018 -143373 -743814 -5098700 -5938948 532094 8334399
11908H334399J020622n628982n104150j5611K687093J047623j319900j526024
$$ 8334399 9355021 3726039 -1378111 -1393722 1293371 2340994 1021094 -504930
11900e04930n10353k11633n92705n40135j05800k60941q32130l37263J513696
$$ -504930 -1015283 -1226916 -1819621 -2359756 -2465556 -2726497 -3558627 -3895890 -2382194
11891b382194K557208Q41251k299118l646925k195646J30586J630329K324656
$$ -2382194 175014 1016265 -1282853 -4929778 -7125424 -6994838 -5364509 -3039853
11883c039853K149441M50347j822715k181752k95408R89363P7405o15963J225387
$$ -3039853 -890412 -440065 -2262780 -4444532 -4739940 -3750577 -3673172 -4289135 -3063748
11874c063748L421717K287973j537711l729166k121517J122072K980601K555301
$$ -3063748 357969 2645942 1108231 -2620935 -4742452 -3620380 -639779 1915522
11866A915522O34493j354078j906577q90253j20309o78300p14165J406692K986261
$$ 1915522 2550015 1195937 -710640 -1600893 -1721202 -2399502 -3113667 -1706975 1279286
11857A279286J14994n222351o079570k24526N815623N553633J372363o672K062879
$$ 1279286 1394280 -3828071 -9907641 -10132167 -4316544 1237089 2609452 2602780 4665659
11848D665659K291293r05427k597756J15745K744827L93343m335953n380745k285902
$$ 4665659 6956952 6051525 3453769 3569514 6314341 6707684 2371731 -3009014 -5294916
11839e294916K85054N67620J277150L212515L252458K78014k119856j203618J051456
$$ -5294916 -5009862 -4442242 -3165092 47423 3299881 3577895 1458039 254421 1305877
11830A305877K056886K190970J651765j448376o240946p184939j740472M340466
$$ 1305877 3362763 5553733 7205498 5757122 -483824 -7668763 -9409235 -5068769
11822e068769M830204K077525J871392L048548K34228n340807o653792k215926
$$ -5068769 -238565 1838960 3710352 6758900 6993128 1652321 -5001471 -7217397
11814g217397J898164K166516J696980K637737K406469k9431j413929n82145o15478
$$ -7217397 -5319233 -3152717 -1455737 1182000 3588469 3559038 2145109 1562964 947486
11805I47486j745540M51781N999369P317909M02194p546551p864631k226109J676855
$$ 947486 -798054 -346273 5653096 12971005 13373199 5826648 -2037983 -4264092 -2587237
11796b587237J420567J99148j80409j69180N61394J407263m95708m584403m361262
$$ -2587237 -1166670 -967522 -1147931 -1317111 -755717 651546 155838 -4428565 -8789827
11787h789827K930613Q867765M398275n779190q904443k303719M146646L546469
$$ -8789827 -5859214 3008551 7406826 1627636 -7276807 -9580526 -5433880 -1887411
11779a887411r3178j266313r26673j294976n46367K460383M095233J629001j477442
$$ -1887411 -1980589 -3246902 -4173575 -5468551 -6014918 -3554535 540698 2169699 692257
11770F92257p97043J979227J956492j284691l515200k326164J53474J012005Q2412
$$ 692257 -104786 1874441 3830933 2546242 -968958 -3295122 -3141648 -2129643 -2047231
11761b047231r48865j062899m89247M28331J775646L151077L142726J053177j230689
$$ -2047231 -2996096 -4058995 -4548242 -4119911 -2344265 806812 3949538 5002715 3772026
11752C772026j067340J057999J862981K5205k269005l378208m089676l921120
$$ 3772026 2704686 3762685 5625666 5650871 3381866 3658 -4086018 -8007138
11744h007138k90735N514625O634975l7689p170347o043404J001473M491256J885251
$$ -8007138 -8297873 -2783248 3851727 3814038 -3356309 -9399713 -8398240 -3906984 -2021733
11735b021733o18852M39033J408679j22584j035855M64396J096384q21775j504233
$$ -2021733 -2640585 -2201552 -792873 -915457 -1951312 -1486916 -390532 -1212307 -2716540
11726b716540J414476M046758K840196O30868J102875K038785k50492l752429
$$ -2716540 -1302064 2744694 5584890 6215758 7318633 9357418 9106926 5354497
11718E354497m038433j634134o4740Q08455L015798M166649L38089n378713n071127
$$ 5354497 1316064 -318070 -382810 425645 3441443 7608092 7946181 2567468 -2503659
11709b503659J996956O953870L696139k872474n004667k750966j110631j139111
$$ -2503659 -506703 6447167 10143306 7270832 2266165 -484801 -1595432 -2734543
11701b734543m67165J25522k160816n344028m060599J538988M905594K891774
$$ -2734543 -3201708 -3076186 -5237002 -10581030 -14641629 -13102641 -8197047 -5305273
11693e305273J26217P94262K271146J141650k40003J109589K025909j460281n682205
$$ -5305273 -5179056 -4384794 -2113648 -971998 -1212001 -102412 1923497 463216 -5218989
11684e218989m185332J245282K955063o7310j098639K211896L959328P90683k242330
$$ -5218989 -9404321 -8159039 -5203976 -5271286 -6369925 -4158029 -198701 591982 -1650348
11675a650348q50889J327231K3692k021337p80740J408851M29229j950291j511494
$$ -1650348 -2501237 -1174006 -1150314 -3171651 -3952391 -2543540 -2114311 -4064602 -5576096
11666e576096R40199J768638J053400J026645R31843o98783j545843O82650K759242
$$ -5576096 -4635897 -2867259 -1813859 -787214 144629 -554154 -2099997 -1417347 1341895
11657A341895O61599k792605j980541J847581K364890j320330l437304j048726
$$ 1341895 2003494 -789111 -2769652 -922071 1442819 122489 -3314815 -4363541
11649d363541K152383K603692J382717M87497k31421q24083j76233J383651J751693
$$ -4363541 -2211158 392534 1775251 2262748 2031327 1207244 1031011 2414662 4166355
11640D166355J35998k214751m181945n012018l458759K15752K889942K581712
$$ 4166355 4302353 2087602 -2094343 -7106361 -10565120 -10349368 -7459426 -4877714
11632d877714J738400K767456L117729j72853l821575k487608K250674L862811
$$ -4877714 -3139314 -371858 2745871 2573018 -1248557 -3736165 -1485491 2377320
11624B377320Q59105j898697j504965L364J083446K602227L661756J654240k412044
$$ 2377320 3236425 1337728 -167237 -163873 919573 3521800 7183556 8837796 6425752
11615F425752m091635k060341L51733Q06937M52972L93088J50608j87786k74501
$$ 6425752 2334117 273776 625509 1432446 1885418 2278506 2429114 2241328 1966827
11606A966827j219267l106069k792008J101503L870657J356098k370978j316959
$$ 1966827 747560 -2358509 -5150517 -4049014 -178357 1177741 -1193237 -2510196
11598b510196J701705k79664n381767n070534J357667N312997K720388j131715
$$ -2510196 -808491 -1088155 -6469922 -11540456 -10182789 -4869792 -2149404 -3281119
11590c281119k061558k124513k222675L24632M117855L290119k183716n035388
$$ -3281119 -5342677 -7467190 -9689865 -9365233 -5247378 -1957259 -4140975 -9176363
11582i176363k339461P75936J501633L102830N379362K678068m327510o367748
$$ -9176363 -11515824 -10739888 -9238255 -6135425 -756063 1922005 -2405505 -8773253
11574h773253m99277M045365J186660k327561j19554K406151p77283m199868q31326
$$ -8773253 -9272530 -5227165 -4040505 -6368066 -6487620 -4081469 -4858752 -9058620 -9889946
11565i889946M578960L670113r61570r73626L309343M894439K432264R6030j464610
$$ -9889946 -5310986 -1640873 -2602443 -3576069 -266726 4627713 7059977 7156007 5691397
11556E691397m265690n986675l085548J483865K154196l6150p2422J836040J751106
$$ 5691397 1425707 -4560968 -7646516 -6162651 -4008455 -4044605 -4117027 -2280987 -529881
11547e29881K32284Q52943K354723L49189m145265n218866q93645M434586O064881
$$ -529881 -297597 555346 2910069 3259258 -886007 -6104873 -6998518 -2563932 3500949
11538C500949L170221j858474m905557l284516J88932K19836k190147o96842M194198
$$ 3500949 6671170 4812696 -92861 -3377377 -3188445 -2968609 -5158756 -5855598 -1661400
11529a661400L508846m408128p579672J275103J0721227O974823m477703p805356
$$ -1661400 1847446 -2560682 -10140354 -8865251 1855976 8830799 4353096 -3452260
11521c452260j005627M165592K597629M75197P24105j112624n264959n404299
$$ -3452260 -4457887 -292295 2305334 2780531 3504636 2392012 -2872947 -8277246
11513h277246m20660K849942J248716l42881J514047M112975N209549N756619
$$ -8277246 -8697906 -5847964 -4599248 -4942129 -3428082 684893 5894442 11651061
11505A1651061M696455n55218p225858q865562m840261o24663J281398K804215
$$ 11651061 16347516 15792298 8566440 -299122 -5139383 -5764046 -4482648 -1678433
11497a678433L492340J127514j579095j83738K467966K99822m077885k711555
$$ -1678433 1813907 2941421 1362326 1178588 3646554 3946376 -131509 -2843064
11489b843064L072657L803726j825600m814255j778049L63330j375990p62267
$$ -2843064 229593 4033319 2207719 -2606536 -4384585 -4021255 -5397245 -6159512
11481f159512M131636N454557k41440m702505j838502K539997K213123P59921
$$ -6159512 -2027876 3426681 3185241 -1517264 -3355766 -815769 1397354 2157275
11473B157275K238484K285454k380579n244444o91261M974583L383064k310246
$$ 2157275 4395759 6681213 4300634 -943810 -1635071 3339512 6722576 4412330
11465D412330l876774j541160o24320l46535L099422O525617L715093l076611
$$ 4412330 535556 -1005604 -1629924 -1976459 1122963 7648580 11363673 8287062
11457H287062n510907j670288K412474K594894L50794k240793m263019l770484
$$ 8287062 2776155 1105867 3518341 6113235 6464029 4223236 -39783 -3810267
11449c810267m8417L219276K529834K28030K00107R54298p36380k586849o37243
$$ -3810267 -3858684 -639408 1890426 2118456 2318563 3272861 2536481 -50368 -687611
11440f87611K366659P06968l865265m121436O82391L609849J632681j50073J821510
$$ -687611 1679048 2386016 -1479249 -5600685 -4918294 -1308445 324236 174163 1995673
11431A995673L508272O77638l838541m781941j969990J093469K851023L836883
$$ 1995673 5503945 6181583 2343042 -2438899 -4408889 -3315420 -464397 3372486
11423C372486L430786N42092l245197m522913k291826Q85052K440841K669048
$$ 3372486 6803272 7345364 4100167 -422746 -2714572 -1829520 611321 3280369
11415C280369K930741K522664k58713m056201m593659o53145K959332J689126
$$ 3280369 6211110 8733774 8475061 4418860 -174799 -827944 2131388 3820514
11407C820514j865019j943729J044958J300494k196483l250328J480877O464006
$$ 3820514 1955495 11766 1056724 2357218 160735 -3089593 -1608716 4855290
11399D855290N408491K30016k843671k072171k21085R27231J171041l20414l022872
$$ 4855290 10263781 10493797 7650126 5577955 5356870 6284101 7455142 7134728 4111856
11390D111856l215853J070181N350180L899709j985015n963386n540305l716401
$$ 4111856 896003 1966184 7316364 11216073 9231058 3267672 -2272633 -5989034
11382e989034k605561j080222R26958J228500j02904K97412L501649N540918K946307
$$ -5989034 -8594595 -9674817 -8747859 -7519359 -7622263 -7324851 -3823202 1717716 4664023
11373D664023j814648l572607j510506K81209r18353k704487j499281J882368
$$ 4664023 2849375 -723232 -2233738 -1952529 -2870882 -5575369 -7074650 -5192282
11365e192282L443875K178548J411053K860047L344814M54736k273954q25228
$$ -5192282 -1748407 430141 1841194 4701241 8046055 8500791 6226837 5401609
11357E401609J657354m91834m852354l471201L448291N947367k76002o263898
$$ 5401609 7058963 6567129 1714775 -1756426 1691865 7639232 7363230 1099332
11349A099332l619865K490466K586855j600956j422260K927941K817607l177168
$$ 1099332 -2520533 -30067 2556788 955832 -466428 2461513 5279120 2101952
11341B101952n719499K16856O628512M419459l088465n504205j73543N337567
$$ 2101952 -3617547 -3400691 3227821 7647280 4558815 -945390 -1118933 4218634
11333D218634M398770r34586m332656l258619m09165Q08285k42365k052834k984735
$$ 4218634 8617404 7682818 3350162 91543 -317622 490663 248298 -1804536 -4789271
11324d789271k025020Q00397L491452L067043n17995k882653n96178L138195K407481
$$ -4789271 -6814291 -6013894 -2522442 544601 26606 -2856047 -3452225 -314030 2093451
11315B093451k162103l649278L26306L343104M75753l156856m16443N575222N314734
$$ 2093451 -68652 -3717930 -3391624 -48520 427233 -2729623 -3146066 2429156 7743890
11306G743890k357650p816160m348927K975756N521817K492619n89407j034850
$$ 7743890 5386240 -2429920 -6778847 -3803091 1718726 4211345 3621938 2587088
11298B587088j016573j749184j061668J990741L974369J289638m200283o681890
$$ 2587088 1570515 -178669 -1240337 750404 4724773 6014411 1814128 -4867762
11290d867762l484308J762622L980287K637460J058189J059830R24901j181576
$$ -4867762 -8352070 -6589448 -2609161 28299 1086488 2146318 3071219 1889643
11282A889643m050971m799578k406075R27042J858232m00459k506373n78992M026321
$$ 1889643 -2161328 -6960906 -9366981 -8439939 -6581707 -6982166 -9488539 -10067531 -6041210
11273f041210N095669k22714o375601o267034r29704K608967J816458R47284K582471
$$ -6041210 -945541 -1168255 -7543856 -13810890 -14740594 -12131627 -10315169 -9367885 -6785414
11264f785414L403532P46875k231378j513966J746258L698368L112083J102200
$$ -6785414 -3381882 -2635007 -4866385 -6380351 -4634093 -935725 2176358 3278558
11256C278558j469399l270185k074412J718858L742887J138117k893046l315313
$$ 3278558 1809159 -1461026 -3535438 -1816580 1926307 3064424 171378 -3143935
11248c143935r5281K530140K092800q3796j945000k797951k623589j484706K54619
$$ -3143935 -3239216 -709076 1383724 1299928 -645072 -3443023 -6066612 -7551318 -7296699
11239g296699J992159K827865J676612j010195k171795M35217L932545L107815
$$ -7296699 -5304540 -2476675 -800063 -1810258 -3982053 -3546836 385709 3493524
11231C493524k028140n584419l820574L98197K764576K795022J825908K4863j995143
$$ 3493524 1465384 -4119035 -7939609 -7541412 -4776836 -1981814 -155906 -131043 -2126186
11222b126186k379349j299997j343626k629968j840448J741867M129770L208428
$$ -2126186 -4505535 -5805532 -7149158 -9779126 -11619574 -9877707 -5747937 -2539509
11214b539509K160889L160371L234371L31828k161899j574418r35004k599957
$$ -2539509 -378620 2781751 6016122 6347950 4186051 2611633 1676629 -923328
11206i23328k747575J467029M892016K017435l173964l279385N14480J372819
$$ -923328 -3670903 -2203874 2688142 4705577 1531613 -1747772 -1233292 139527
11198A39527j218340j865437J34817L34544j216933L57597M500880M169543k336957
$$ 139527 -1078813 -2944250 -2809433 -2474889 -3691822 -3334225 1166655 5336198 2999241
11189B999241p079436m023977K174073L725306O21058j245093O15769K934017
$$ 2999241 -4080195 -8104172 -5930099 -2204793 -1583735 -2828828 -2213059 720958
11181G20958K323311n05925k382359j664277J61865Q72107P27118J417117J939797
$$ 720958 3044269 2538344 155985 -1508292 -1346427 -474320 252798 1669915 3609712
11172C609712p26636n421331o100062p36896M014055K187801k068338j154138
$$ 3609712 2883076 -2538255 -8638317 -9375213 -5361158 -3173357 -5241695 -6395833
11164f395833L762495N353379K425515N24296J242033M28154k357930k150410
$$ -6395833 -2633338 2720041 5145556 5669852 6911885 7340039 4982109 2831699
11156B831699J551667K363673k029692m941620j416751L557770L240172p01922
$$ 2831699 4383366 6747039 4717347 -224273 -1641024 1916746 5156918 4454996
11148D454996k478781j658971j708738k573471j347801J625954L196362K833732
$$ 4454996 1976215 317244 -1391494 -3964965 -5312766 -3686812 -490450 2343282
11140B343282K608052K589001R76728j595793k379449j285786j210124k901396
$$ 2343282 4951334 7540335 8517063 6921270 4541821 3256035 2045911 -855485
11132h55485l398532j044884J346376O92913j482465j399195J100236K452463
$$ -855485 -4254017 -5298901 -3952525 -3259612 -4742077 -6141272 -5041036 -2588573
11124b588573J130055q2070R62680J826739m89013l922456l898935m55346J795731
$$ -2588573 -1458518 -1540588 -577908 1248831 759818 -3162638 -7061573 -7516919 -5721188
11115e721188Q42772m39141m7248K79656k23121Q10450L377071K965395j836150
$$ -5721188 -4878416 -5317557 -5364805 -5085149 -5308270 -4497820 -1120749 1844646 8496
11106H496m879939j288325L832785K592773l022451l889525K009808O445034L257211
$$ 8496 -4871443 -6159768 -2326983 265790 -2756661 -6646186 -4636378 1808656 5065867
11097E065867l301957n381155j614224K797545L088745m27766l259014j425654
$$ 5065867 1763910 -3617245 -5231469 -2433924 654821 227055 -3031959 -4457613
11089d457613L738055O344479L140816k025014l658978k160555j862958l447951
$$ -4457613 -719558 5624921 8765737 6740723 3081745 921190 -941768 -4389719
11081d389719l311397J14683M012526N234743L197168p88005l932529l096710
$$ -4389719 -7701116 -7586433 -3573907 1660836 4858004 4069999 137470 -2959240
11073b959240J030449K834534j082521o013641n263833K62909M277695M613855
$$ -2959240 -1928791 905743 -176778 -6190419 -11454252 -11191343 -6913648 -2299793
11065b299793L944579K884942p9376k652167p02211L557950L197927k561508o615212
$$ -2299793 1644786 4529728 4450352 1798185 1095974 4653924 7851851 5290343 -1324869
11056a324869m686645n51943J374535J611736J422820j25528k189967j631633
$$ -1324869 -6011514 -6563457 -5188922 -3577186 -2154366 -2279894 -4469861 -6101494
11048f101494Q51424M85088k962210l229755K174083O668837M337773j139161
$$ -6101494 -5250070 -4764982 -7727192 -10956947 -8782864 -2114027 2223746 1084585
11040A084585k829140p94040o81j629316k415746p02523J653297K389678P63151
$$ 1084585 -1744555 -2538595 -2539276 -4168592 -6584338 -7286861 -5633564 -3243886 -2480735
11031b480735k325681m190766k405303J603014L740427L029670K469798L029639
$$ -2480735 -4806416 -8997182 -11402485 -9799471 -6059044 -3029374 -559576 2470063
11023B470063J695012k293156m433163j605529K758047L908087K208702N12728
$$ 2470063 4165075 1871919 -2561244 -4166773 -1408726 2499361 4708063 5220791
11015E220791j033712l220554m078402j655081J725961K245366L8698j684274
$$ 5220791 4187079 966525 -3111877 -4766958 -3040997 -795631 -756933 -2441207
11007b441207j399066Q0940K098255M054130M104749J084990k945315m543998
$$ -2441207 -3840273 -3759333 -1661078 2393052 6497801 7582791 4637476 93478
10999I3478k834708K1874J564924R62333r27134k374151k280823j135510K20168
$$ 93478 -2741230 -2719356 -1154432 -192099 -1119233 -3493384 -5774207 -6909717 -6689549
10990f689549J979391M038586M673231K986943J127339R17820J74078l418155
$$ -6689549 -4710158 -671572 4001659 6988602 8115941 9033761 9207839 5789684
10982E789684o683523m731774Q58968L843817K706184J516158J572494j26407
$$ 5789684 -893839 -5625613 -4766645 -922828 1783356 3299514 4872008 4745601
10974D745601l130533k492833K099681M076605L45852l467788k276377Q97969
$$ 4745601 1615068 -877765 1221916 5298521 5644373 2176585 -99792 798177
10966G98177J349041L21315R00445J771745N78613j051378r23090n98178j743653
$$ 798177 2147218 2468533 3368978 5140723 5719336 4667958 3744868 3146690 1403037
10957A403037k298254o03292Q73141J10669o08364M46148N66180j934161l379463
$$ 1403037 -895217 -1498509 -625368 -514699 -1123063 -676915 -110735 -2044896 -5424359
10948e424359r12680J798717N21838k321303k113468L13761J285046Q81714J231132
$$ -5424359 -6337039 -4538322 -4016484 -6337787 -8451255 -8137494 -6852448 -5970734 -4739602
10939d739602J527984K36019q86969r378R04709J29521l3691J591671J097809
$$ -4739602 -3211618 -2975599 -3862568 -3871946 -2967237 -2837716 -2871407 -1279736 -181927
10930a81927l354455n669763n09140O704798O854331P24515l274621k464470j708879
$$ -181927 -3536382 -9206145 -9715285 -3010487 3843844 4568359 1293738 -1170732 -2879611
10921b879611k982874k403130J531249M614652L575641J20622k810099l940461
$$ -2879611 -5862485 -8265615 -6734366 -2119714 1455927 1576549 -1233550 -5174011
10913e174011k531313J030837L713767L105868J176846O98926K28139k280758
$$ -5174011 -7705324 -6674487 -2960720 145148 1321994 2020920 2249059 -31699
10905c1699l807226p82224L261664K183318k340827l114545P55333L047591J481695
$$ -31699 -3838925 -4621149 -1359485 823833 -1516994 -4631539 -3876206 -828615 653080
10896F53080M94203J734518J026942k448518k820629K315111O186173K812464
$$ 653080 1147283 2881801 3908743 1460225 -1360404 954707 7140880 9953344
10888I953344l488535m637120l63452K830717J518400j351155j835781M17374
$$ 9953344 6464809 1827689 1464237 4294954 5813354 4462199 2626418 3043792
10880C043792K643665J767186k449662n971447m166077J969161N909841L520122
$$ 3043792 5687457 7454643 5004981 -966466 -5132543 -3163382 2746459 6266581
10872F266581j922832m584667l112774k95067J701722K504237J723065m76704
$$ 6266581 4343749 -240918 -3353692 -3648759 -1947037 557200 2280265 1803561
10864A803561j713786L63448M028427M630593O71140l808854m522733k532908
$$ 1803561 89775 453223 4481650 9112243 9783383 5974529 1451796 -1081112
10856a081112j942782l213497k536920J501002M614663K800655j483910k880679
$$ -1081112 -3023894 -6237391 -8774311 -7273309 -2658646 142009 -1341901 -4222580
10848d222580o36256J833627L094603M104341L645498k78737m543183l447438
$$ -4222580 -4858836 -3025209 69394 4173735 7819233 7540496 2997313 -450125
10840d50125J751013L360336o19695l159631n05426J213086k468231n124364l18405
$$ -450125 1300888 4661224 4041529 881898 376472 1589558 -878673 -6003037 -6321442
10831f321442N880046L996965k658607l114765K784239M012606l148807q721875
$$ -6321442 -441396 3555569 896962 -2217803 566436 4579042 1430235 -7291640
10823g291640m665001L413796N588779J126641l138074k866792N72486L811613
$$ -7291640 -11956641 -8542845 -2954066 -1827425 -4965499 -7832291 -7259805 -3448192
10815c448192M452170K321908k4089l1621Q89464q53257m859619o360888l132300
$$ -3448192 1003978 3325886 3301797 3270176 4159640 3306383 -1553236 -7914124 -11046424
10806a1046424J302667L005711K355350J561136R83815K00304q0299O28659J341209
$$ -11046424 -9743757 -6738046 -4382696 -2821560 -1837745 -1637441 -1717740 -1089081 252128
10797B52128J215134O08285l24465k008024l727615l670155j363469J676226L790049
$$ 252128 1467262 2075547 1751082 -256942 -3984557 -7654712 -9018181 -7341955 -3551906
10788c551906L925617J380667k655921m383920j577004K373458K453203o87266
$$ -3551906 373711 1754378 -901543 -5285463 -6862467 -4489009 -2035806 -2723072
10780b723072j964919K3048J476377N25875P0827J599143J806065j380438m172435
$$ -2723072 -4687991 -4664943 -3188566 -2662691 -2591864 -992721 813344 -567094 -4739529
10771d739529k458912J602387K952909J023263p60763j109798j724967k611281
$$ -4739529 -7198441 -5596054 -2643145 -1619882 -2380645 -3490443 -5215410 -7826691
10763g826691j361624J948093L324946N42637k794207j914864K234410M326572
$$ -7826691 -9188315 -7240222 -3915276 -3372639 -6166846 -8081710 -5847300 -1520728
10755a520728K214505p60271j602331j609928k383881j971260J238402M058534
$$ -1520728 693777 -66494 -1668825 -3278753 -5662634 -7633894 -6395492 -2336958
10747b336958K861952n2217j55293J228551m61286l442672j269212N085642O393288
$$ -2336958 524994 472777 317484 1546035 1084749 -2357923 -3627135 1458507 7851795
10738G851795k89444n714822k622820K941739K052462k883300l601889m375J535960
$$ 7851795 7562351 1847529 -775291 2166448 4218910 1335610 -2266279 -2270654 -734694
10729g34694K07316N69583K202001N2607m875462n165950R21132N734956L540808
$$ -734694 -527378 42205 2244206 2296813 -2578649 -7744599 -6823467 -1088511 2452297
10720B452297j672817l195254o86457J465267Q69318j083844j863683l99432J501517
$$ 2452297 779480 -2415774 -3102231 -1636964 -767646 -1851490 -3715173 -4114605 -2613088
10711b613088N31503l301089m905815o99064M957713M920110k90563l013690N16705
$$ -2613088 -2081585 -5382674 -10288489 -10987553 -6029840 -1109730 -1400293 -4413983 -3897278
10702c897278N458220N899262K076056j829357l179531k222970p19862o61992
$$ -3897278 1560942 7460204 9536260 7706903 4527372 2304402 1584540 922548
10694I22548k526906m373774m112508k032178L54107K294419K882669P88019k688076
$$ 922548 -1604358 -5978132 -10090640 -12122818 -11768711 -9474292 -6591623 -5803604 -8491680
10685h491680l441720l76302K309031J944561J763943M021525M363102m79734
$$ -8491680 -11933400 -12309702 -10000671 -8056110 -6292167 -2270642 2092460 1612726
10677A612726m762492j817659M192497M074035j779677m570590j207585K885301
$$ 1612726 -3149766 -4967425 -774928 3299107 1519430 -3051160 -4258745 -1373444
10669a373444M337070N076816M957417J242840l696343l996102p36852r27280
$$ -1373444 2963626 8040442 12997859 14240699 10544356 6548254 5811402 4884122
10661D884122m866439n184868n33755J287265k437603l753708J564065N263053
$$ 4884122 17683 -5167185 -5700940 -4413675 -6851278 -10604986 -9040921 -3777868
10653c777868K48294o668510n327767J755993M368121Q18635j305053J472127
$$ -3777868 -3529574 -10198084 -15525851 -13769858 -9401737 -8583102 -9888155 -8416028
10645h416028L999516J898569k024177k862616l31984J959220J638710J73092
$$ -8416028 -4416512 -2517943 -4542120 -7404736 -7736720 -5777500 -4138790 -3965698
10637c965698N64880K960180L826578Q51181l076127l723420j713703o66475o12575
$$ -3965698 -3400818 -440638 3385940 4237121 1160994 -2562426 -4276129 -4942604 -5555179
10628e555179J180501L567743K378907j663860k996008o35046j42412l604037
$$ -5555179 -4374678 -806935 1571972 -91888 -3087896 -3722942 -3865354 -7469391
10620g469391n244688j121479L815947L635437M14474o28374K6143j190722l264369
$$ -7469391 -12714079 -13835558 -10019611 -6384174 -5969700 -6598074 -6571931 -7762653 -11027022
10611a1027022k467645L69534J116558k09407M49354L515851M061243n22864n621936
$$ -11027022 -13494667 -13125133 -12008575 -12217982 -11768628 -8252777 -4191534 -4714398 -10336334
10602a0336334n007008J095349O333388N802206J057138k637395k356203K54497
$$ -10336334 -15343342 -14247993 -7914605 -2112399 -1055261 -3692656 -6048859 -5794362
10594e794362J770298M66280k602578m422891k326393K620896N209801J927923
$$ -5794362 -4024064 -3557784 -6160362 -10583253 -12909646 -10288750 -5078949 -3151026
10586c151026l324604l340592K429164O821796M889488l83076m011060m929605
$$ -3151026 -6475630 -9816222 -7387058 -565262 4324226 3941150 -69910 -4999515
10578d999515l511455O39234M946908M165170j389097m114530k06682M137899
$$ -4999515 -8510970 -7871736 -2924828 1240342 -148755 -4263285 -4469967 -332068
10570c32068K807449r89275j779373r31638j519432j221205J557527J543412m343428
$$ -332068 2475381 1486106 -293267 -1224905 -2744337 -3965542 -2408015 -864603 -5208031
10561e208031q597378l852274M263174N743391J929376J206592M065430M397472
$$ -5208031 -13805409 -17657683 -13394509 -7651118 -5721742 -4515150 -449720 3947752
10553C947752J672728J90809k80384k233427k943603j9R70647m279115p682184
$$ 3947752 5620480 5811289 5530905 3297478 353875 353856 1324503 -2954612 -10636796
10544a0636796p93152Q376098N858686n539771j0304448l994671L272767N218087
$$ -10636796 -11429948 -3053850 2804836 -2734935 -13039383 -17034054 -13761287 -8543200
10536h543200N269781M818623P63571m987574o564114m104135j788806O93709
$$ -8543200 -3273419 1545204 2308775 -2678799 -9242913 -13347048 -15135854 -14442145
10528a4442145M024450L021039l471578n231227L021653Q878437J933212o705897
$$ -14442145 -10417695 -7396656 -10868234 -16099461 -13077808 -4199371 -2266159 -8972056
10520h972056l790940J715705l291230q990761r64966R468784M380199n960458
$$ -8972056 -12762996 -11047291 -14338521 -23329282 -24294248 -14825464 -10445265 -16405723
10512a6405723k042089O019479k058395j3200541k354125J5776713Q143068j3850246
$$ -16405723 -18447812 -12428333 -14486728 -27687269 -30041394 -14264681 -6121613 -19971859
10504a9971859j1043606J0707996R319848j3757523j4358955R145088R836402
$$ -19971859 -31015465 -20307469 -10987621 -24745144 -39104099 -29959011 -20122609
10497b0122609j6540922j9776127N346807K419422l2665502k8446679K1191110
$$ -20122609 -36663531 -56439658 -51092851 -48673429 -81338931 -109785610 -88594500
10490h8594500J3762678p9087011j08015630M2263281K32769022K30052717L7455473
$$ -88594500 -74831822 -153918833 -261934463 -219671182 13097840 243150557 280606030
10483B80606030j11671349q4825245M059609J4165303k6361690k5067436Q239666
$$ 280606030 168934681 84109436 88169045 102334348 75972658 50905222 59144888
10476E9144888Q155994j8848515j9604319M018198Q926133o503600r411793J484824
$$ 59144888 67300882 48452367 28848048 32866246 41792379 35288779 25876986 27361810
10468B7361810J437446p236012l483683O809693K661793r027847o612782M331711
$$ 27361810 28799256 21563244 18079561 24889254 27551047 18523200 11910418 16242129
10460A6242129L243860n116941j867394P504245L816394q036625q195158J322107
$$ 16242129 19485989 14369048 12501654 20005899 23822293 15785668 7590510 8912617
10452H912617L031336k245510p24266M386989J89108p212135k629027P444071
$$ 8912617 11943953 9698443 8974177 13361166 13550274 6338139 3709112 11153183
10444A1153183M957990n753298n087769O154555Q759964n67741o095559k611032
$$ 11153183 16111173 10357875 5270106 11424661 20184625 19616884 13521325 10910293
10436A0910293p10587l293758k271177J677155j37530m706410j164268P029720
$$ 10910293 10199706 6905948 4634771 6311926 6174396 1467986 303718 7333438
10428G333438O296879k195506m453344R21473K038611k388667j630831M289931
$$ 7333438 13630317 11434811 6981467 7902940 9941551 7552884 5922053 10211984
10420A0211984L585142l850585m656641L281800O272878o51013n540274j531372
$$ 10211984 13797126 9946541 5289900 8571700 14844578 14193565 8653291 7121919
10412G121919K473117q8924k446020P28126L159536m25271m670649l873510q97104
$$ 7121919 9595036 9506112 7060092 7788218 10947754 10522483 5851834 1978324 1081220
10403A081220J10714K73511Q42888K32447r78165k27734R62708m88567j652589
$$ 1081220 1191934 1465445 2308333 2540780 1562615 1334881 2297589 1809022 156433
10394A56433J834275N764641L191958k168412j232877L898553L080728l394519
$$ 156433 1990708 7755349 10947307 8778895 7546018 11444571 14525299 11130780
10386A1130780n076884l91620R16697l576300m375482J743242M722804j401078
$$ 11130780 6053896 5662276 6578973 3002673 -1372809 370433 5093237 3692159
10378C692159q040143o151383R64862N871185P536574P117564K845789m173704
$$ 3692159 -4347984 -10499367 -9534505 -3663320 3873254 10990818 13836607 9662903
10370I662903p242377l236364K346014M016466L062265K031180j09189l389466
$$ 9662903 2420526 -815838 1530176 5546642 8608907 10640087 10530898 7141432
10362G141432m355561j908239M34799O91975P36121R65509m77743k028467J64955
$$ 7141432 2785871 877632 1312431 2004406 2740527 3706036 3228293 1199826 1364781
10353A364781M235985L840687j194444l921837j651568M32891q99538k303879
$$ 1364781 5600766 9441453 8247009 4325172 2673604 3106495 2206957 -96922
10345i6922j563839j253970j952616k80607L469622M193250J257967K70906K630940
$$ -96922 -1660761 -2914731 -4867347 -5147954 -1678332 2514918 3772885 4043791 6674731
10336F674731K470746k271519n020789j593456K631441K060201m95935m79932
$$ 6674731 9145477 6873958 1853169 259713 2891154 4951355 4455420 3975488
10328C975488K02077j982374m831750m026031O1915L873783N226471L264729j561898
$$ 3975488 4177565 2195191 -2636559 -6662590 -6600675 -2726892 2499579 5764308 4202410
10319D202410n057406k424879L750572N191805L21990k635599J135733M921954
$$ 4202410 -854996 -3279875 470697 5662502 5984492 3348893 4484626 9406580
10311I406580J484761n132000o284787j761018J712939J325320J07507K12711
$$ 9406580 10891341 5759341 -525446 -2286464 -573525 751795 859302 1072013
10303A072013P45612J080914J263771L27290j709624k041909P27640K917718Q64480
$$ 1072013 1817625 2898539 4162310 4489600 2779976 738067 1465707 4383425 5247905
10294E247905k418777j051039M193613N830212M9888p508852q745673l004811
$$ 5247905 2829128 1778089 5971702 11801914 11851802 4342950 -4402723 -7407534
10286g407534K864722L313836J14606j289255O83802K559121J749666K13512N85278
$$ -7407534 -4542812 -1228976 -1114370 -2403625 -1719823 839298 2588964 2802476 3387754
10277C387754J747320J169264n71747j085556n20688j009324k585799l082728
$$ 3387754 5135074 6304338 5732591 4647035 4126347 3117023 531224 -2551504
10269b551504j696257L05891J991463L248608L539859K613487J546110R12711
$$ -2551504 -4247761 -3941870 -1950407 1298201 4838060 7451547 8997657 9910368
10261I910368n83807l416762n197730l870178p41124K040223M124204M706623
$$ 9910368 9326561 5909799 712069 -3158109 -3899233 -1859010 2265194 6971817
10253F971817J795334k951553l617010J172257M202240L57762m286197j883550
$$ 6971817 8767151 5815598 2198588 3370845 7573085 7930847 3644650 1761100
10245A761100L765231L026695l712013o902405l341949P5232j119412k766196
$$ 1761100 5526331 8553026 4841013 -2061392 -5403341 -5328109 -6447521 -9213717
10237i213717o91385K908246M426011L511307R00970k493006l571391j58680L906184
$$ -9213717 -9905102 -6996856 -2570845 940462 1841432 -651574 -4222965 -4381645 -475461
10228d75461L222599l90252q68301J552178J443581j064270o24099K267812J476936
$$ -475461 2747138 2356886 1488585 3040763 4484344 3420074 2795975 5063787 6540723
10219F540723k460345j982621L118447L419851l631732p486647j526757N298311
$$ 6540723 4080378 2097757 5216204 8636055 5004323 -2482324 -4009081 1289230
10211A289230K794806m316006m976639Q37565M268680K299871j07347M996O27652
$$ 1289230 4084036 -231970 -5208609 -4371044 -102364 2197507 2090160 2095156 2722808
10202B722808O70539J315233J987110R13041q67684r23539J5399p46066l037882
$$ 2722808 3393347 4708580 6695690 7608731 6741047 5817508 5832907 5086841 2048959
10193B048959m018753k442848K33201K047482J724864p24308k897572j711030
$$ 2048959 -1969794 -4412642 -4179441 -2131959 -407095 -1131403 -4028975 -5740005
10185e740005K236793M677398L407569P98809p03300j632868k384828j440689
$$ -5740005 -3503212 1174186 4581755 5380564 4677264 3044396 659568 -781121
10177g81121R84693J809782J54185o33261J372335L198391J926954r33788k670021
$$ -781121 203572 2013354 2167539 1534278 2906613 6105004 8031958 7098170 4428149
10168D428149k886092j539241J867907M768106K644828l285054n360598m23912
$$ 4428149 1542057 2816 1870723 6638829 9283657 5998603 638005 214093
10160B14093M459802K315856l260263m195702o3913K830995J623751o18704j172502
$$ 214093 4673895 6989751 3729488 -466214 -530127 2300868 3924619 3305915 2133413
10151B133413o67810l83384q10729k156100l145274j128571L557389N920893K608429
$$ 2133413 1465603 1082219 271490 -1884610 -5029884 -6158455 -2601066 3319827 5928256
10142E928256k847864n009439l855920k564408q76771L466102Q247469Q052982
$$ 5928256 3080392 -1929047 -5784967 -8349375 -9226146 -5760044 2487425 10540407
10134A0540407K414897k591498k353946O23053J009520k100313m580061l028676
$$ 10540407 12955304 10363806 8009860 8632913 9642433 7542120 2962059 -66617
10126f6617P87604K192607j62177k280872m50507L145002L535220L55681k007541
$$ -66617 720987 2913594 2751417 470545 20038 3165040 6700260 7055941 5048400
10117E048400j196107Q30120K404874L915044M149323N10205n297114p295729
$$ 5048400 3852293 4682413 7087287 11002331 15151654 15661859 10364745 3069016
10109C069016l503940R82412J879659J286843K036064K071889r17937l981317
$$ 3069016 -434924 547488 2427147 3713990 5750054 7821943 6904006 2922689
10101B922689l243162k48403R93645L99175N48487J475547J155526o09892k373608
$$ 2922689 -320473 -568876 424769 823944 1372431 2847978 4003504 3393612 1020004
10092A020004l311976k699582K41881L554709L134662j094105l676066j582346
$$ 1020004 -2291972 -4991554 -4749673 -1194964 1939698 845593 -2830473 -4412819
10084d412819R71144j40514j751541P69265M737506M072245p05795l398662j698409
$$ -4412819 -3441675 -3582189 -5333730 -4564465 173041 4245286 3539491 140829 -1557580
10075a557580P10375J136607R35517J237567Q68745n06936j222303m69115P09671
$$ -1557580 -847205 289402 1224919 2462486 3331231 2824295 1601992 1132877 1842548
10066A842548J559499K097634J678610l25485k697827l445387k180305J82871
$$ 1842548 3402047 5499681 7178291 6852806 4154979 709592 -1470713 -1287842
10058a287842K727044L919662K015497j671196k641933O31511L307663P97965
$$ -1287842 1439202 5358864 7374361 5703165 3061232 3692743 7000406 7798371
10050G798371l901808m381810m64284J927255Q3930j999484o65780J772580J145670
$$ 7798371 3896563 -485247 -949531 977724 1061654 -937830 -1603610 168970 1314640
10041A314640k011429l355108j050509J856698K025852N43182Q31739K736547
$$ 1314640 -696789 -4051897 -5102406 -3245708 -1219856 -676674 155065 2891612
10033B891612K231919j839854m728766k694928P25578L84763j635616L33578M883512
$$ 2891612 5123531 3283677 -1445089 -4140017 -3414439 -3029676 -4665292 -4331714 551798
10024E51798M755926j127457n426587l857949n31265P19791J727414L154781J219890
$$ 551798 5307724 4180267 -1246320 -5104269 -5635534 -4915743 -3188329 -33548 1186342
10015A186342l711373m043902L022063Q575181M833703k533425l722106J64938
$$ 1186342 -2525031 -6568933 -3546870 5028311 9862014 7328589 3606483 3771421
10007C771421J308954r29507j125533P57246m9873k965811k767024M74627J725287
$$ 3771421 5080375 4150868 3025335 3782581 3732708 766897 -2000127 -1525500 199787
9998A99787N89599J106396K349530p45080o439960o321776J222801P119024M834374
$$ 199787 789386 1895782 4245312 3500232 -2939728 -9261504 -8038703 -919679 3914695
9989C914695q59589k723692j207857n42966q39211l420Q45796k71196j289269
$$ 3914695 3055106 331414 -876443 -1419409 -2258620 -2262040 -1416244 -1687440 -2976709
9980b976709R94778M627592M125819j535428o496569n013240J336755N536548
$$ -2976709 -1981931 2645661 6771480 5236052 -1260517 -6273757 -4937002 599546
9972E99546L774283j33317m78004K196083K388881j411996m161742k272672R84376
$$ 599546 4373829 4240512 3762508 5958591 8347472 6935476 2773734 501062 1485438
9963A485438J423409N38334J547696K862075J061135k483406l657115k211857
$$ 1485438 2908847 3447181 4994877 7856952 8918087 6434681 2777566 565709
9955E65709r79921m67949L98106J97919k508836m489839j871994K568983K754015
$$ 565709 -414212 -882161 -484055 -286136 -2794972 -7284811 -9156805 -6587822 -3833807
9946c833807r56728k259169R64567L871962K771351k92020k235713k602617j417187
$$ -3833807 -4790535 -7049704 -6085137 -2213175 558176 266156 -1969557 -4572174 -5989361
9937e989361J390773L510565K191169q41607j498528k75290j082062l130567j319074
$$ -5989361 -4598588 -1088023 1103146 261539 -1236989 -1512279 -2594341 -5724908 -7043982
9928g043982L945280N184731o33103o183036m128361K361756M921428J660462
$$ -7043982 -3098702 2086029 1452926 -4730110 -8858471 -6496715 -1575287 85175
9920H5175k101652k202569M70987L217738M250616K497258j794607n737087n530468
$$ 85175 -2016477 -4219046 -3748059 -530321 3720295 6217553 4422946 -1314141 -6844609
9911f844609o51925M705259N555252J637789k074631j570154Q22554K35400k479628
$$ -6844609 -7496534 -2791275 2763977 4401766 2327135 756981 1579535 1814935 -664693
9902f64693j645746L103558M559018m24205m400616j050230L590558J135536l789942
$$ -664693 -2310439 793119 5352137 4927932 527316 -522914 3067644 4203180 413238
9893D13238j007782N476440Q67141j5261660k3064194r380230J2005957J8120993
$$ 413238 -594544 4881896 5749037 -9512623 -32576817 -41957047 -29951090 -11830097
9885a1830097O620295m296905j814933P572966J0555760M056085l851144n146156
$$ -11830097 -5209802 -9506707 -11321640 -3748674 6807086 10863171 7012027 1865871
9877A865871k49926L688612J282671m936891p743117m041691K039034N082172
$$ 1865871 1615945 5304557 6587228 1650337 -6092780 -10134471 -8095437 -3013265
9869c013265M092758J262683j361700k110343J13273L562107M290324J155777
$$ -3013265 1079493 2342176 980476 -1129867 -1016594 2545513 6835837 7991614
9861G991614k373782l159617k256486j993112k299836k149229j688753o87975
$$ 7991614 5617832 2458215 201729 -1791383 -4091219 -6240448 -7929201 -8617176
9853h617176K084105N535478N638366J209312k788715j444800L004659M315795
$$ -8617176 -6533071 -997593 4640773 5850085 3061370 1616570 4621229 8937024
9845H937024Q94664k774659k769404j00287J888265J682369K80847p03273q21364
$$ 8937024 9831688 7057029 4287625 4187338 6075603 7757972 8038819 7335546 6514182
9836F514182j027814k074130k840732j438458J804243M003236L022324k48088
$$ 6514182 5486368 3412238 571506 -866952 937291 4940527 7962851 7714763
9828G714763l416301m839990l881367q56880K272233K877494O56613j470095o16206
$$ 7714763 4298462 -541528 -4422895 -5279775 -3007542 -130048 526565 -943530 -1559736
9819a559736K528154M174626J403616m193834o987967k966162M511122P241662
$$ -1559736 968418 5143044 6546660 2352826 -4635141 -7601303 -3090181 4151481
9811D151481K353038l288066k460579J846874J187489m733060o862997n05673
$$ 4151481 6504519 3216453 755874 2602748 3790237 -942823 -7805820 -8311493
9803h311493P147771P140202Q63607l315185k173091l72838j840410l885601j937055
$$ -8311493 -1163722 5976480 6840087 3524902 1351811 978973 -861437 -4747038 -6684093
9794f684093L026917N119727J422251l626816l699801J149772M919626M000006
$$ -6684093 -3657176 1462551 2884802 -742014 -4441815 -3292043 1627583 5627589
9786E627589R77180p94445j667437k405278j333002J534770K209252q57673k725189
$$ 5627589 6604769 5810324 4142887 1737609 404607 1939377 4148629 3290956 565767
9777E65767K51012L449896J480743k229312j563313J113618j45963k584375P96289
$$ 565767 816779 4266675 5747418 3518106 1954793 3068411 2922448 338073 1134362
9768A134362O736551N169338k888404n363559N70859L245282l228403q296705
$$ 1134362 7870913 13040251 10151847 4788288 5359147 8604429 5376026 -2920679
9760b920679l004722M738890M017397j138599n64256L826609K805299k610549
$$ -2920679 -5925401 -1186511 2830886 1692287 1128031 4954640 7759939 5149390
9752E149390k759241L537145O612149J363982n790102p242727l100329K071840
$$ 5149390 2390149 5927294 12539443 13903425 8113323 870596 -2229733 -157893
9744a57893M793359L677147K16994j168287J500471L616483M54608m413793l958063
$$ -157893 4635466 8312613 8529607 7361320 8861791 12478274 12932882 8519089 4561026
9735D561026Q51094K472836q31486k745244k12752J572517j391403m957574l860839
$$ 4561026 5412120 7884956 7053470 4308226 4095474 5667991 4276588 -680986 -4541825
9726d541825J4107J549300O02601R77171L320530M044341J180663k369194k615582
$$ -4541825 -4527718 -2978418 -2375817 -1398646 1921884 5966225 7146888 4777694 2162112
9717B162112L31935K394488O75183k809349l733470j136476J665126K011811R98120
$$ 2162112 2494047 4888535 5563718 2754369 -979101 -2115577 -450451 1561360 2559480
9708B559480N49931L70860k33757k64580P42872R03189q94049k467628j830087
$$ 2559480 3109411 3480271 3246514 2981934 3724806 4627995 3733946 1266318 -563769
9699e63769o57578j054876j503583J46287K160486J839103P82558K164839M240920
$$ -563769 -1221347 -2276223 -3779806 -3633519 -1473033 366070 1148628 3313467 7554387
9690G554387K180011l921320q205533o867393k257194J595314L329949L145277
$$ 7554387 9734398 5813078 -2392455 -9259848 -11517042 -9921728 -6591779 -3446502
9682c446502J373483l58997Q8697J992591K144325j23679j386101P06976L584894
$$ -3446502 -2073019 -2432016 -2343319 -350728 1793597 1669918 283817 990793 4575687
9673D575687L399823L68243k183149k791993k934368l279465j911690K064929
$$ 4575687 7975510 8343753 6160604 3368611 434243 -2845222 -4756912 -2691983
9665b691983N218675L252487k391764n040831j603442K674259J721930k179416
$$ -2691983 2526692 5779179 3387415 -1653416 -3256858 -582599 1139331 -1040085
9657a040085k143419K072997L445369j020226n316862l603357J489567L704934
$$ -1040085 -3183504 -1110507 2334862 1314636 -4002226 -7605583 -6116016 -2411082
9649b411082J889306l65810o68179M14763J427675J246751J14500L91334L252038
$$ -2411082 -521776 -887586 -1555765 -1141002 286673 1533424 1647924 2039258 5291296
9640E291296M831302Q51724m960590m512746J439469K993925k776874n989304
$$ 5291296 10122598 10974322 6013732 1500986 2940455 5934380 3157506 -2831798
9632b831798k76643N811388K825582l855586l879220M56856n8876l868283j567037
$$ -2831798 -3108441 2702947 5528529 1672943 -2206277 -1749421 -1808297 -5676580 -7243617
9623g243617O187892Q533336K168504m227729m627676k403224p85421J541275
$$ -7243617 -1055725 7477611 9646115 5418386 790710 -1612514 -2397935 -856660
9615h56660L140031k52004n791796m935344K177875N390804J228802j382994K700236
$$ -856660 2283371 2031367 -3760429 -8695773 -6517898 -1127094 101708 -1281286 1418950
9606A418950N474954J28440o571214n474074O55607L715898L291502L263830K261769
$$ 1418950 6893904 7022344 451130 -5022944 -4367337 -651439 2640063 5903893 8165662
9597H165662k127038n072444j035733N305958M922704j480597n065103k818584
$$ 8165662 6038624 966180 -69553 5236405 10159109 8678512 3613409 794825
9589G94825l70940j345810k807004k165292j076520r35462m07157J198984K664524
$$ 794825 423885 -921925 -3728929 -5894221 -6970741 -7906203 -8313360 -7114376 -4449852
9580d449852L450940L605287J711962k712753n817386l387370K454411N528825
$$ -4449852 -998912 2606375 4318337 1605584 -4211802 -7599172 -5144761 384064
9572C84064M031085J569574L04271j217555l023943k391605P75136K218876n75885
$$ 384064 4415149 5984723 6288994 5071439 2047496 -344109 431027 2649903 2074018
9563B074018m225695l896881M68080M376027L877795n90740m601609m042935J43638
$$ 2074018 -2151677 -6048558 -5580478 -1204451 2673344 2082604 -2519005 -6561940 -6418302
9554f418302K736359J020660j469920n12014K096336J479160k307363m063318
$$ -6418302 -3681943 -2661283 -4131203 -4643217 -2546881 -1067721 -3375084 -7438402
9546g438402j042268L590007N389110L212517j173986m867613n025913j351899
$$ -7438402 -8480670 -4890663 498447 3710964 2536978 -2330635 -7356548 -8708447
9538h708447K540870L028392J247139Q79266K121549J901344l59541j750210j024419
$$ -8708447 -6167577 -3139185 -1892046 -1012780 1108769 3010113 2650572 900362 -124057
9529a24057m19343j420863k533506k248635r35906P40547K129615J611636r30453
$$ -124057 -543400 -1964263 -4497769 -6746404 -7682310 -6941763 -4812148 -3200512 -4130965
9520d130965j612025K382036O190679K675229n396098p072831M78343O539143
$$ -4130965 -5742990 -3360954 2829725 5504954 108856 -6963975 -6485632 53511
9512E3511K770613m131541l534177K473637L661347j393302m142979p82797K668440
$$ 53511 2824124 -1307417 -4841594 -2367957 1293390 -99912 -4242891 -5025688 -2357248
9503b357248J576668n42973J04837R48821j035055l033007j364147J825471K194545
$$ -2357248 -780580 -1323553 -1218716 -269895 -1304950 -4337957 -5702104 -3876633 -1682088
9494a682088K22374n88414r1726q77975k696820k573649j98851J304203M77606
$$ -1682088 -1459714 -2048128 -2139854 -3017829 -5714649 -8288298 -8487149 -7182946 -6705340
9485f705340m25555N48153K182066K514320J607352N65246j22345K7881J731879
$$ -6705340 -7130895 -6582742 -4400676 -1886356 -279004 286242 163897 191778 1923657
9476A923657L950731L510820r78355n886291n959113j041334L146141K013308
$$ 1923657 5874388 9385208 8406853 2520562 -3438551 -4479885 -1333744 679564
9468F79564k288856m281984k553915n37695k53788O32672L753005N856989L402946
$$ 679564 -1609292 -5891276 -8445191 -8982886 -9236674 -8604002 -4850997 1005992 4408938
9459D408938j231260k862709j394125j019711j951521K07626N192896N727285
$$ 4408938 3177678 314969 -1079156 -2098867 -4050388 -3842762 1350134 7077419
9451G077419j097564o923313l540920M061612M907275r78252l269644J357326
$$ 7077419 5979855 -943458 -4484378 -422766 4484509 3506257 236613 1593939
9443A593939L931620j495599p552125n153780K313783M754504N23769k871335
$$ 1593939 5525559 4029960 -3522165 -8675945 -6362162 -1607658 -1083889 -3955224
9435c955224j068360K314819L058768J625021p6100j613810k150563k46117K668098
$$ -3955224 -5023584 -2708765 350003 1975024 1898924 285114 -1865449 -2111566 556532
9426E56532K561835j427723m775237l307043J352241M189307K806903q26250l256509
$$ 556532 3118367 1690644 -3084593 -6391636 -5039395 -850088 1956815 1130565 -2125944
9417b125944k653653Q627J886045J143969q27098j217087L59709J724860J801685
$$ -2125944 -4779597 -4770970 -2884925 -1740956 -2568054 -3785141 -3425432 -1700572 101113
9408A01113J808497K167432J218244j343951k542761k42885K865767K590477o89240
$$ 101113 1909610 4077042 5295286 3951335 1408574 1165689 4031456 6621933 5932693
9399E932693k808988k284463j986560l402091l333679P79082N314289M648956
$$ 5932693 3123705 839242 -1147318 -4549409 -7883088 -7104006 -1789717 2859239
9391B859239l40786k911449j29953L109428K018281r34288r87667O87467l04966
$$ 2859239 2518453 -392996 -522949 2586479 4604760 3670472 2682805 3370272 3065306
9382C065306k891868j692427L221102N155356J277135k857026k683292j664434
$$ 3065306 173438 -1518989 1702113 6857469 8134604 5277578 2594286 929852
9374I29852l731805n004441m85417N499165M543292k140287m643231N23431N254335
$$ 929852 -2801953 -7806394 -8291811 -2792646 1750646 -389641 -5032872 -4509441 744894
9365G44894K652281k861936l200701J373446M007067J933726o40832K51226K971613
$$ 744894 3397175 535239 -2665462 -1292016 2715051 4648777 4007945 4259171 7230784
9356G230784L279291J12186l252462l355425q94745K16112j561410k877658p73008
$$ 7230784 10510075 10622261 7369799 4014374 3119629 3335741 1774331 -1103327 -1876335
9347a876335J717991l84612n149019m726362L121928J0060356P667134j080965
$$ -1876335 -158344 -542956 -5691975 -10418337 -7296409 2763947 10431081 9350116
9339I350116n827384k278925L558091M377364J91590l521326l140926j3636K486929
$$ 9350116 3522732 1243807 4801898 9179262 9370852 5849526 2708600 2694964 5181893
9330E181893K787167J619852K236j824542l306928l075479r18360Q92389K51526
$$ 5181893 7969060 9588912 9591148 7766606 4459678 1384199 465839 1358228 1609754
9321A609754j535017j553903J40955P26787n36828j096513K64292J031210q35571
$$ 1609754 74737 -1479166 -1338211 -611424 -1148252 -2244765 -1980473 -949263 -1784834
9312a784834l137286k378252J421650N038256N676666K714541k254967n458812
$$ -1784834 -4922120 -7300372 -5878722 -840466 4836200 7550741 5295774 -163038
9304a63038l372110K596481O020410K745197l630117o449391m323656j282211
$$ -163038 -3535148 -938667 5081743 7826940 4196823 -2252568 -6576224 -7858435
9296g858435m6727O40856K183981L637445L874973L176175J804068l15789j820134
$$ -7858435 -7905162 -7264306 -5080325 -1442880 2432093 5608268 7412336 7096547 5276413
9287E276413p70340J571742R31741l898218p778337n134882K190875O480377L692114
$$ 5276413 4506073 6077815 7009556 3111338 -4666999 -9801881 -7611006 -1130629 2561485
9278B561485j642484k638952J046652L392832O82982l258834k516679K254824
$$ 2561485 919001 -1719951 -673299 2719533 3402515 143681 -2372998 -118174
9270a18174M333090M99516l745876j543059N035476O695014o09352r311652r274972
$$ -118174 4214916 4714432 968556 -574503 4460973 11155987 10546635 1234983 -8039989
9261h039989n26947P131487O544599Q17954k754873k265011j196133j353848o91321
$$ -8039989 -8566936 -1435449 5109150 5927104 3172231 907220 -288913 -1642761 -2334082
9252b334082J717941L082462J264358j497776j941119o58971o73907k502834l649667
$$ -2334082 -616141 2466321 3730679 2232903 291784 -367187 -1041094 -3543928 -7193595
9243g193595k400357N51146L854854O265359N935224J857806l563154n960576
$$ -7193595 -9593952 -9042806 -5187952 1077407 7012631 8870437 5307283 -653293
9235f53293l837886k5657K134203K037040R17354M4471M58119K172253K908563
$$ -653293 -4491179 -4516836 -2382633 -345593 571761 616232 1074351 3246604 6155167
9226F155167K15423m079783m512786Q65738O634141O274093N49564l792247k913306
$$ 6155167 6370590 2290807 -2221979 -1356241 5277900 11551993 12101557 8309310 5396004
9217E396004J69890J008689l54185q97918J44060M45059j436353l775142m150730
$$ 5396004 5565894 6574583 6220398 5322480 5466540 5911599 4475246 700104 -3450626
9208c450626k444208k05994J561185K444948J718739m07670j510955K92660K737440
$$ -3450626 -5894834 -6100828 -4539643 -2094695 -375956 -783626 -2294581 -2001921 735519
9199G35519J939280j323474k016957J282696L594104J189325k498900k461333
$$ 735519 2674799 1351325 -665632 617064 4211168 5400493 2901593 440260
9191D40260M62954K436630L151339L836644K131990l999077r487457p324260K02661
$$ 440260 903214 3339844 6491183 10327827 12459817 8460740 -1026717 -8350977 -8148316
9182h148316L701316N50481j997301O45079L606615J980786j116952j140428R2676
$$ -8148316 -4447000 -3896519 -5893820 -5248741 -1642126 338660 -778292 -1918720 -1826044
9173a826044p99288j794271L21118L245900L004957Q48496K45887L47086j367001
$$ -1826044 -2625332 -4419603 -4098485 -852585 2152372 3000868 3246755 3593841 2226840
9164B226840k982941j284891J497709Q82869j803446j570466J327257J989352
$$ 2226840 -756101 -2040992 -543283 339586 -1463860 -3034326 -1707069 282283
9156B82283m3365J4987L036615L597985q12780m919021l627576M73318J798888
$$ 282283 238918 253905 3290520 6888505 6075725 1156704 -2470872 -1997554 -198666
9147a98666p9679j438593q67638k57548m97890q6600J756845L245989K256123
$$ -198666 -278345 -1716938 -2584576 -2842124 -3340014 -3426614 -1669769 1576220 3832343
9138C832343p02313k581711j015258K688532M452714J883645k901227n667803
$$ 3832343 3130030 548319 -466939 2221593 6674307 8557952 5656725 -11078
9130a1078m406616m10822L609980N027104K420115k549971n378582l220488J404282
$$ -11078 -4417694 -4828516 -1218536 3808568 6228683 3678712 -1699870 -4920358 -3516076
9121c516076L567626J953930l86855p65939K27970N96294m12222j844930j993970
$$ -3516076 51550 2005480 1618625 852686 1080656 1676950 1264728 -580202 -2574172
9112b574172m0949K440150K770420Q40854n34334j98792n10538k303463j852160
$$ -2574172 -2615121 -174971 2595449 3436303 2901969 2703177 2192639 -110824 -1962984
9103a962984K971766P076038M544178j779278l996740j211190o7351k912002l938998
$$ -1962984 1008782 8084820 12628998 10849720 6852980 5641790 5574439 2662437 -1276561
9094a276561J16112L517409Q38355l686054k629226L065137N911905L025730j176987
$$ -1276561 -1160449 2356960 3195315 -490739 -3119965 -54828 5857077 8882807 7705820
9085G705820k741923k575854k327125j043764J981098M564421M226793J417568
$$ 7705820 4963897 2388043 60918 -982846 998252 5562673 9789466 11207034
9077A1207034j633001l715797m698458m171778k057347M4595J97250j025210j025469
$$ 11207034 9574033 5858236 1159778 -3012000 -5069347 -5024752 -4827502 -5852712 -6878181
9068f878181O97115J132282j478461l444344k4617O463167P897004J475016n298934
$$ -6878181 -6181066 -5048784 -6527245 -9971589 -9996206 -3533039 4363965 5838981 540047
9059E40047m591905Q22137K196943k107969n065494k319720J893907K300803J73826
$$ 540047 -4051858 -3229721 -1032778 -3140747 -8206241 -10525961 -8632054 -6331251 -6157425
9050f157425k71086J233500J994687J518340J434056J677218N88475j557817k328979
$$ -6157425 -6428511 -5195011 -3200324 -1681984 -247928 1429290 2017765 459948 -1869031
9041a869031q19402Q33632M85822j006025j003607J243646L416789L144726J195833
$$ -1869031 -2688433 -1854801 -1368979 -2375004 -3378611 -2134965 1281824 4426550 5622383
9032E622383O3154j36030j559033l840466l209916J087269L412127o05725n986620
$$ 5622383 5685537 5549507 3990474 150008 -3059908 -1972639 1439488 833763 -5152857
9023e152857m251219L843379Q408869M051491l281351n339974j597962K876740
$$ -5152857 -9404076 -5560697 2848172 6899663 3618312 -1721662 -3319624 -442884
9015d42884M598997L169979l27484l014351j806392J771990K133002k196754n382220
$$ -442884 4156113 7326092 6998608 3984257 2177865 3949855 6082857 3886103 -1496117
9006a496117k856566J545370J754186j331436k377739k28003J837900K229751
$$ -1496117 -4352683 -2807313 -1053127 -2384563 -4762302 -4990305 -3152405 -922654
8998i22654J822189M00447k205863l083540N6441L573334K238692k181612l062244
$$ -922654 899535 1299982 -905881 -3989421 -3932980 -359646 1879046 -302566 -3364810
8989c364810P28261L289424J177031k076650k576888j279179l17832O37816J740059
$$ -3364810 -2636549 652875 1829906 -246744 -2823632 -4102811 -4420643 -3782827 -2042768
8980b042768J231797r39816j738730J94863K022193J268618o24981j480588j487858
$$ -2042768 -810971 -1750787 -3489517 -3294654 -1272461 -3843 -628824 -2109412 -3597270
8971c597270r91853R34504L308647K752318q97640k663576L22043L665768K180311
$$ -3597270 -4589123 -3654619 -345972 2406346 1508706 -1154870 -832827 2832941 5013252
8962E013252j973078k671600J100764M726505M928338K440093j144587m507093
$$ 5013252 3040174 368574 1469338 6195843 11124181 13564274 12419687 7912594
8954G912594n332653k436897J163953J460208o30268p36926J841367L036206M80938
$$ 7912594 2579941 143044 1306997 2767205 2136937 1400011 3241378 6277584 6758522
8945F758522l201171m553398l085349p1836L009906M125650K176816n21210o41971
$$ 6758522 3557351 -996047 -4081396 -4153232 -1143326 2982324 5159140 4637930 3995959
8936C995959J015124P23911j686369k485260r56129q70429l085829k921917J510254
$$ 3995959 5011083 5734994 4048625 1563365 607236 -263193 -3349022 -6270939 -4760685
8927d760685M450005J227135l336911j963792L397493M561397j51933m062439
$$ -4760685 -310680 916455 -2420456 -4384248 -986755 3574642 3422709 -639730
8919f39730k911347L6246J105768J565862K989828K951361o60870m912699n437717
$$ -639730 -3551077 -3514831 -2409063 -843201 2146627 5097988 4437118 -475581 -5913298
8910e913298k396544N49457J526426J731817K460794L337006L191841J277621
$$ -5913298 -8309842 -7760385 -6233959 -4502142 -2041348 1295658 4487499 5765120
8902E765120j977757m685559m753236k010489J559394L641481K891069m76228
$$ 5765120 3787363 -898196 -5651432 -7661921 -6102527 -2461046 430023 -46205
8894d6205l650526k423658L429406P421998L518080m694104p609823k745623K313769
$$ -46205 -3696731 -6120389 -2690983 4731015 8249095 3554991 -4054832 -6800455 -4486686
8885d486686J986315L52778K438923M783780J642575m216344n049481j40161L590661
$$ -4486686 -2500371 -2147593 291330 5075110 6717685 2501341 -2548140 -2688301 902360
8876I02360K326986m79754j149114m76702o4496N11233J185668P12660r4987J144818
$$ 902360 3229346 2749592 1600478 1123776 1059280 1570513 2756181 3468841 3373854 4518672
8866D518672L394505K379924k488844n965126m112199L81447K561443J388989
$$ 4518672 7913177 10293101 7804257 1839131 -2273068 -1891621 669822 2058811
8858B058811q82345k263091j563904J574181M920671M903426J596031q62633o68542
$$ 2058811 1176466 -1086625 -2650529 -1076348 3844323 8747749 10343780 9481147 8812605
8849H812605r09869l136369l424234P91704M603844K293885l239742m487464p91046
$$ 8812605 7902736 4766367 1342133 2133837 6737681 9031566 5791824 1304360 513314
8840E13314J414553p01700k788325j524282N26257P61495J054504K806933K844059
$$ 513314 1927867 1226167 -1562158 -3086440 -2560183 -1798688 -744184 2062749 4906808
8831D906808j003197m346471j946211L476529M201274j242397n554807k783627
$$ 4906808 3903611 -442860 -2389071 1087458 5288732 4046335 -1508472 -4292099
8823d292099L685678O087417K320443k443379l266678j252483p12352k500932
$$ -4292099 -606421 5480996 7801439 5358060 2091382 838899 126547 -2374385
8815b374385k772172J075100N494605M614734j463327n764668l413027J840206
$$ -2374385 -5146557 -4071457 1423148 6037882 4574555 -1190113 -4603140 -2762934
8807b762934L297834Q69149M1165K402204L208203l37885m150850l797873j231016
$$ -2762934 534900 1404049 1445214 3847418 7055621 6717736 2566886 -1230987 -2462003
8798b462003o76692j562626p12672J188992J214075N44437K733399O094914M732236
$$ -2462003 -3138695 -4701321 -5413993 -4225001 -3010926 -2466489 266910 6361824 11094060
8789A1094060j713161o027295l671272R23951J762977l94386j494880j430958
$$ 11094060 9380899 3353604 -317668 606283 2369260 1974874 479994 -950964
8781i50964k571530m137002l287919j07544K796463M195648M196198K220971j328681
$$ -950964 -3522494 -7659496 -10947415 -11054959 -8258496 -4062848 133350 2354321 1025640
8772A025640l397793j959493O10361J263648P50654O21763p87644m410131n978738
$$ 1025640 -2372153 -4331646 -3721285 -2457637 -1706983 -1085220 -1872864 -6282995 -12261733
8763a2261733j799421L823560M051179K68016m58455K728937L804013Q70417j292678
$$ -12261733 -14061154 -10237594 -6186415 -5918399 -6376854 -3647917 156096 1026513 -266165
8754b66165q34588j747310m701831m068205J888869O081481L020106k695266l691051
$$ -266165 -1100753 -2848063 -7549894 -11618099 -9729230 -3647749 -627643 -3322909 -7013960
8745g013960P9222L570408L917679J104526l596731o147000k445167M037837M347653
$$ -7013960 -6934738 -3364330 553349 1657875 -1938856 -8085856 -10531023 -6493186 -2145533
8736b145533k240728n166730J022809O834406K957998m027192k652365M198317
$$ -2145533 -4386261 -9552991 -8530182 -1695776 1262222 -2764970 -5417335 -1219018
8728a219018M908247p67332k349747K280322L797072j161290m048248L6842L794163
$$ -1219018 3689229 2921897 572150 2852472 6649544 5488254 1440006 1476848 5271011
8719E271011P66798l971452l375111J32613M78107j599110j533458N54415J260972
$$ 5271011 6037809 2066357 -1308754 -1176141 -698034 -2297144 -3830602 -3276187 -2015215
8710b015215K80728l12731j92221K52169J759637L286741J431015l266220m375302
$$ -2015215 -1734487 -2047218 -2239439 -1987270 -227633 3059108 4490123 1223903 -3151399
8701c151399R69555N563976J618137p016199r547795l160387M168525N326499
$$ -3151399 -2181844 3382132 5000269 -2015930 -11563725 -14724112 -10555587 -5229088
8693e229088J745890j451434k154428j118760O15893J853474J369198m29492j559923
$$ -5229088 -3483198 -4934632 -7089060 -8207820 -7591927 -5738453 -4369255 -4798747 -6358670
8684f358670q52472J113337L354887M981241M567448J232128l304197n592926
$$ -6358670 -7211142 -6097805 -2742918 2238323 6805771 8037899 4733702 -859224
8676h59224m122896j006708N42635k63063j271971k79908J986303K670206R59708
$$ -859224 -4982120 -5988828 -5446193 -5709256 -6981227 -7261135 -5274832 -2604626 -1644918
8667a644918j88286J720019M370376L624518j19309k505583j968016j348608k119061
$$ -1644918 -1833204 -113185 4257191 7881709 7762400 5256817 3288801 1940193 -178868
8658a78868j968735J18672J362634L89362J85456K503042L823258J040364k781397
$$ -178868 -2147603 -2028931 -666297 -276935 -91479 2411563 6234821 7275185 4493788
8649D493788k987601l82290J087666P79153M93519k03482k431998l871950j799750
$$ 4493788 1506187 1123897 2211563 2990716 3484235 3280753 848755 -3023195 -4822945
8640d822945J279145P95351k044921j593631L038192N987891L170140k016856
$$ -4822945 -3543800 -2748449 -4793370 -6387001 -3348809 2639082 5809222 3792366
8632C792366l613452n59921K723075J768054k750926n150605j376775M601652
$$ 3792366 178914 -381007 2342068 4110122 1359196 -3791409 -5168184 -566532
8624e66532M923490n21342k647460K956322P818681L259884n108534n517618J624367
$$ -566532 4356958 3835616 1188156 4144478 11963159 15223043 10114509 4596891 6221258
8615F221258N279088J840163r84765Q53338J603921j998242m042342n67979K609984
$$ 6221258 11500346 13340509 12355744 13209082 14813003 12814761 8772419 8204440 10814424
8606A0814424k52515n347209o198076l040649N72466L699608M999730J233504
$$ 10814424 10561909 5214700 -983376 -4024025 -3451559 248049 5247779 6481283
8598F481283n210449n369774K552604P052751J2393q833624n800795N071025Q164748
$$ 6481283 1270834 -4098940 -1546336 5506415 5518808 -3314816 -9115611 -4044586 4120162
8589D120162M01428n640532k455599K899616K960566Q31531J654796L161506J335696
$$ 4120162 4521590 -1118942 -3574541 -674925 2285641 3117172 4771968 7933474 9269170
8580I269170j612787j360315J186663J995964J02986k283658l327476k513386
$$ 9269170 7656383 6296068 7482731 9478695 9581681 7298023 3970547 1457161
8572A457161m16351R08793p8239j398716P7188L051608K949963p94249l515700
$$ 1457161 1040810 1949603 1871364 472648 549836 3601444 6551407 5757158 2241458
8563B241458k535543o22773o29179j541081j807085j896847j488746J181194M865330
$$ 2241458 -294085 -916858 -1546037 -3087118 -4894203 -6791050 -8279796 -7098602 -2233272
8554b233272M921132J49691m294606l745086J17219K961262L477023K546318N29530
$$ -2233272 2687860 2837551 -1457055 -5202141 -5084922 -2123660 1353363 3899681 4429211
8545D429211j628471j917421n44359m52761k385766l168152j135236R09488P45862
$$ 4429211 2800740 883319 338960 -113801 -2499567 -5667719 -6802955 -5893467 -5147605
8536e147605L84565J705771K824134K043776J074742R39865o60682m100445m924474
$$ -5147605 -4763040 -3057269 -233135 1810641 2885383 3825248 3164566 -935879 -5860353
8527e860353q61941L052273J806519j512347j074871K079162K579895P0575j019957
$$ -5860353 -6722294 -3670021 -1863502 -3375849 -4450720 -2371558 208337 278912 -741045
8518g41045O06008K047966K124466K316596K386044N79621k159194l040926j916499
$$ -741045 -135037 1912929 4037395 6353991 8740035 9319656 7160462 4119536 2203037
8509B203037o87226L46974J255347k5389l783004m962771J7630N513294L500993
$$ 2203037 1515811 1862785 3118132 3092743 -690261 -5653032 -5635402 -122108 3378885
8500C378885l608468n824391o79285M000552L291260J259918J238595j97215m825917
$$ 3378885 -229583 -6053974 -6733259 -2732707 558553 1818471 3057066 2859851 -1966066
8491a966066o996015k436901L975732N686302L893260K913750J513532l310871
$$ -1966066 -8962081 -11398982 -7423250 -1736948 2156312 5070062 6583594 3272723
8483C272723p804108n461601J866092N110715P81132m443865l802670P50324L018698
$$ 3272723 -4531385 -9992986 -8126894 -3016179 -2235047 -6678912 -10481582 -9731258 -6712560
8474f712560J679388P93426K846583N079856L563402j115660m201143k809703
$$ -6712560 -5033172 -4239746 -1393163 3686693 7250095 6134435 1933292 -876411
8466h76411L12255O81423j626395k409726J60414K871960K432321P2007q14167
$$ -876411 -564156 117267 -1509128 -3918854 -3758440 -886480 1545841 1617848 803681
8457H03681N59393K063231J621937j122509m608223n601056j778378M319169O395059
$$ 803681 1363074 3426305 5048242 3925733 -682490 -6283546 -8061924 -3742755 2652304
8448B652304J909098l719084l583781J643622M942187K664407j163157j353016
$$ 2652304 4561402 842318 -2741463 -1097841 3844346 6508753 5345596 3992580
8440C992580J232590J696199j508863m478154l404365K99178K081996K49637k269117
$$ 3992580 5225170 6921369 5412506 934352 -2470013 -2170835 -88839 160798 -2108319
8431b108319k119284N25496K885168K748103j25115m002619n616908k806307J872276
$$ -2108319 -4227603 -3702107 -816939 1931164 1806049 -2196570 -7813478 -10619785 -8747509
8422h747509K899223o53093k613945J565525O840221M973389k960855p367701
$$ -8747509 -5848286 -6501379 -9115324 -7549799 -709578 4263811 1302956 -6064745
8414f064745l598156K358015L611208J306507K63185J075059J275297P16377R94223
$$ -6064745 -9662901 -7304886 -3693678 -2387171 -2123986 -1048927 226370 942747 1936970
8405A936970J699333J292471J40967o01852j485789l101310l784638k209619m59934
$$ 1936970 3636303 4928774 5069741 4467889 2982100 -119210 -3903848 -6113467 -6573401
8396f573401r25146j682149Q68617N477093O608815K181427l120461l971645j056720
$$ -6573401 -7498547 -9180696 -8312079 -2834986 3773829 5955256 2834795 -1136850 -2193570
8387b193570P52693o09240j899419N75318N419394P217932L081160l594674p033510
$$ -2193570 -1440877 -2050117 -3949536 -3374218 2045176 9263108 12344268 8749594 1716084
8378A716084n540460k353568q13099q69799m73926J397080L568512L655016O23163
$$ 1716084 -3824376 -6177944 -6991043 -7860842 -8334768 -6937688 -3369176 285840 909003
8369I09003k965621k976999N67485K427221l70696l145895m48145M389410L380064
$$ 909003 -2056618 -5033617 -4466132 -2038911 -2409607 -5555502 -6003647 -1614237 1765827
8360A765827l484177p561027m399180P26999K565046L130246M932168M518130
$$ 1765827 -1718350 -9279377 -13678557 -12951558 -10386512 -7256266 -2324098 2194032
8352B194032q26290n670496l191205M066731P194952K866740l658380o225465
$$ 2194032 1367742 -4302754 -7493959 -3427228 3767724 6634464 2976084 -3249381
8344c249381l400391K426101O913590N844422m40723n784159n146452j135464
$$ -3249381 -6649772 -4223671 2689919 8534341 8093618 2309459 -2836993 -3972457
8336c972457L60832j079777j067073J612369L270031J678737o84469p22639J475635
$$ -3972457 -3611625 -4691402 -5758475 -4146106 -876075 802662 118193 -604446 871189
8327H71189L769845M375795K772033O3322j764156k149250k280504k190222k18337
$$ 871189 4641034 9016829 11788862 11852184 10088028 7938778 5658274 3468052 3249715
8318C249715K960913L374363l84700m014234l720127j757667j626650j832973
$$ 3249715 6210628 9584991 9200291 5186057 1465930 -291737 -1918387 -3751360
8310c751360L05992K442619R87626k001486k293103j040668j788631k548212J005992
$$ -3751360 -3445368 -1002749 -15123 -2016609 -4309712 -5350380 -7139011 -9687223 -8681231
8301h681231O157723N861584M22338k513354k58936J625589m562r42065J598611
$$ -8681231 -2523508 3338076 3760414 1247060 988124 2613713 2609151 1667086 3265697
8292C265697L559107J460064j873597l224644m122406n778564n156391q55309
$$ 3265697 6824804 8284868 6411271 3186627 -935779 -6714343 -11870734 -12726043
8284a2726043K853010K877796K680797N320105O493934J270738o278328p583654
$$ -12726043 -9873033 -6995237 -4314440 1005665 7499599 8770337 2492009 -5091645
8276e091645j653434M086941M180884N27504k453580k934369j380883Q77595J925399
$$ -5091645 -6745079 -2658138 1522746 2050250 -403330 -3337699 -4718582 -3840987 -1915588
8267a915588P72520j051359j280305J53506J694257K641441L082662K491330N34429
$$ -1915588 -1143068 -2194427 -3474732 -3321226 -1626969 1014472 4097134 6588464 7122893
8258G122893j611742k543224k266100j297042K37096J338487K95710k205229k831599
$$ 7122893 5511151 2967927 701827 -595215 -358119 980368 1276078 -929151 -3760750
8249c760750o14867R13862m91755j325194K084521O439973N466706m67455m557388
$$ -3760750 -4375617 -3461755 -3953510 -5278704 -3194183 3245790 8712496 8245041 3687653
8240C687653l152411M64795K441106K871766K398200k06187m136765m923718n93312
$$ 3687653 535242 1000037 3441143 6312909 8711109 8504922 4368157 -555561 -1148873
8231a148873M029862L433897p61499k638940q07754O64408m61339j579421l54745
$$ -1148873 2880989 6314886 5553387 2914447 2106693 2771101 2309762 730341 375596
8222C75596J729769K614348K520045J612767j271637m935751m820624M42833M851815
$$ 375596 2105365 4719713 7239758 8852525 7580888 2645137 -2175487 -1732654 3119161
8213C119161K346212m034303n922311j301875L607480M004577J816714L25510
$$ 3119161 5465373 1431070 -4491241 -5793116 -2185636 1818941 3635655 3961165
8205C961165m19436p10448P13780K985683K639496l81967j481684P60770J351939
$$ 3961165 3541729 2831281 3545061 6530744 9170240 8788273 7306589 8067359 9419298
8196I419298k393157n025093j578543L578751L558716q2130j246997l99842k537643
$$ 9419298 7026141 2001048 422505 4001256 7559972 7477842 6230845 5831003 3293360
8187C293360o288152n071787R15413L712650L73437k344550O39365M697574L508518
$$ 3293360 -2994792 -8066579 -7151166 -3438516 -3065079 -5409629 -4770264 -72690 3435828
8178C435828j246439l509024j739455Q35456J911493J692041O41368r02970j937224
$$ 3435828 2189389 -1319635 -3059090 -2223634 -312141 1379900 2021268 1118298 -818926
8169h18926j844634j344016j194512j086252m32312Q79498K447038K958832J021206
$$ -818926 -2663560 -4007576 -5202088 -6288340 -6720652 -5841154 -3394116 -435284 585922
8160E85922k014255k261372J114686L457447J430828j281168k80505J368425j481110
$$ 585922 -1428333 -3689705 -2575019 882428 2313256 1032088 751583 2120008 638898
8151F38898n648640l781118K575795M328367l46595l154182J88617L530157J867401
$$ 638898 -5009742 -8790860 -6215065 -1886698 -2233293 -5387475 -5198858 -1668701 198700
8142A98700o18617N49678K123474K22529k232563j622909l05535q22186p5311
$$ 198700 -419917 129761 2253235 2475764 243201 -1379708 -1685243 -2507429 -2582740
8133b582740L993475O267838K311130l333687m236012k203266k419025l390516
$$ -2582740 1410735 7678573 9989703 6656016 2420004 216738 -2202287 -5592803
8125e592803n34391L955875L986626O0112j762988j10985N98998j168967j800383
$$ -5592803 -6127194 -2171319 1815307 1875419 112431 1446 600444 -568523 -2368906
8116b368906N90427L173062L003941M5558m172905o992874n134920J010572N541012
$$ -2368906 -1778479 1394583 4398524 4444082 271177 -6721697 -11856617 -10846045 -5305033
8107e305033M026498K7758l16761K411990K818183l27539l239842l735176k726567
$$ -5305033 -1278535 -1250777 -1567538 844452 3662635 3335096 95254 -3639922 -6366489
8098f366489m51304L007157M811992K698203l54368m42593M84993j355567l342244
$$ -6366489 -6817793 -3810636 1001356 3699559 3345191 2902598 3387591 2032024 -1310220
8089a310220k76932N120068M684634k055747o382444l710832K95835m4348k065948
$$ -1310220 -1587152 3532916 8217550 6161803 -220641 -3931473 -3635638 -3679986 -5745934
8080e745934j021618J771268K251827N55075l70536j58053o68584j848158j420268
$$ -5745934 -6767552 -4996284 -2744457 -2189382 -2559918 -2717971 -3386555 -5234713 -6654981
8071f654981J547270M593180L818843j678586p151631o163102J202996P065208
$$ -6654981 -5107711 -514531 3304312 1625726 -5525905 -11689007 -10486011 -3420803
8063c420803N557598M06239j598893p99716j916971m183467k505846K541009M548949
$$ -3420803 2136795 2543034 944141 144425 -1772546 -5956013 -8461859 -5920850 -1371901
8054a371901J855191J2669J804096K742496l47060l484124k453869L69785O71267
$$ -1371901 483290 495959 2300055 5042551 4695491 1211367 -1242502 -872717 -201450
8045b01450j043775j770084j342424j265562j019404Q10801L650024N725820N999543
$$ -201450 -1245225 -3015309 -4357733 -5623295 -6642699 -5831898 -2181874 3543946 9543489
8036I543489L926076l51047m561892n827341m390661k915683j941407J56636K637739
$$ 9543489 13469565 13118518 8556626 2729285 -1661376 -4577059 -6518466 -6361830 -3724091
8027c724091K677753Q63160J107432L740046M188820N57581l006880l101028j781992
$$ -3724091 -1046338 -183178 924254 4664300 8853120 9410701 6403821 3302793 1520801
8018A520801j426483l53300K444703L252740p51113n696640n893988j720460J953554
$$ 1520801 94318 -258982 2185721 5438461 4687348 -1009292 -6903280 -8623740 -6670186
8009f670186K834408K223951R17884j292677k877664j383680K803867O118164
$$ -6670186 -3835778 -1611827 -693943 -1986620 -4864284 -6247964 -3444097 2674067
8001B674067N517577J332087l131270m259716j536537J512633J340645j064817
$$ 2674067 8191644 9523731 6392461 2132745 596208 2108841 3449486 2384669
7993B384669k138172j467367j629146k502269q17736L497898N737162L371167
$$ 2384669 246497 -1220870 -2850016 -5352285 -6170021 -2672123 3065039 6436206
7985F436206j40457j115088o96940j105342j201597M70438J873624P06114j336610
$$ 6436206 6295749 5180661 4483721 3378379 2176782 2647220 4520844 5226958 3890348
7976C890348j242906N59833J390303M78685p01591p74934N56139K151176J404606
$$ 3890348 2647442 3207275 4597578 5076263 4374672 3599738 4155877 6307053 7711659
7967G711659k708058o378613m750574O19884L072612N36338j922974q92585O51877
$$ 7711659 5003601 -1375012 -6125586 -5505702 -2433090 -1896752 -3819726 -4712311 -4060434
7958d060434K14614N24387L307104M709661J796844k107872l364008l474180l794841
$$ -4060434 -3845820 -3321433 -14329 4695332 6492176 4384304 1020296 -2453884 -6248725
7949f248725j436097L729329N090125k71436m116007R18724Q055353N996630k847537
$$ -6248725 -7684822 -3955493 1134632 863196 -3252811 -2334087 5721266 11717896 8870359
7940H870359n955948j99765M831159L152617l3565M12779J310246j536944n769893
$$ 8870359 2914411 2714646 7545805 10698422 10664857 11077636 12387882 10850938 5081045
7931E081045o778436m079538j89397K497670K107537j007586k518643R42268N458222
$$ 5081045 -1697391 -5776929 -5966326 -3468656 -1361119 -2368705 -4887348 -3945080 1513142
7922A513142M480922p27543k581723Q26265L368420J626079n48387m50633r95753
$$ 1513142 5994064 5266521 2684798 3511063 6879483 8505562 7957175 7506542 6510789
7913F510789l447556l766507m07336J631653q47587l665795k748862n83517k25662
$$ 6510789 3063233 -703274 -1110610 521043 -326544 -3992339 -6741201 -7324718 -7550380
7904g550380N50981L506644M642137R79987l007690k432975k81708j568261l961120
$$ -7550380 -6999399 -3492755 1149382 2129369 -878321 -3311296 -3593004 -5161265 -9122385
7895i122385k148872K139244K802049l11887j833905l00046M88442r40908j764031
$$ -9122385 -11271257 -9132013 -6329964 -6641851 -8475756 -8775802 -8287360 -9228268 -10992299
7886a0992299o70895M01450O23244J114056J509463N83891j76592J490878L881871
$$ -10992299 -11663194 -11261744 -10638500 -9524444 -8014981 -7431090 -7607682 -6116804 -2234933
7877b234933L487438Q32359j038948k313646m581140n032167n0037O229677N570648
$$ -2234933 1252505 2084864 1045916 -1267730 -5848870 -10881037 -10931074 -4701397 869251
$$ [...]
##END NTUPLES=NMR SPECTRUM
##END=
