##TITLE=31Pdec_SR124_rek5T_1''
 DMSO, 24 sc
 9.6.2022
##JCAMPDX= 6.0         $$ Bruker NMR JCAMP-DX V2.0
##DATA TYPE= NMR SPECTRUM
##DATA CLASS= NTUPLES
##ORIGIN= UXNMR, Bruker Analytische Messtechnik GmbH
##OWNER= root
$$ XWIN-NMR		Version 3.5
$$ Thu Jun  9 15:17:47 2022 Russian Standard Time (UT+4h)  she@DPX200
##.OBSERVE FREQUENCY= 81.013821
##.OBSERVE NUCLEUS= ^31P
##.ACQUISITION MODE= SIMULTANEOUS
##.ACQUISITION SCHEME= undefined
##.AVERAGES= 24
##.DIGITISER RES= 16
##SPECTROMETER/DATA SYSTEM= spect
##.PULSE SEQUENCE= zgpg30
##.SOLVENT NAME= Acetone
##.SHIFT REFERENCE= (INTERNAL, Acetone, 0, 248.564)
##AUDIT TRAIL= $$ (NUMBER, WHEN, WHO, WHERE, WHAT)
$$ ##TITLE= Audit trail, XWIN-NMR		Version 3.5
$$ ##JCAMPDX= 5.01
$$ ##ORIGIN= Bruker BioSpin GmbH
$$ ##OWNER= she
$$ F:/spectra/data/she/nmr/P31/1/pdata/1/auditp.txt
$$ ##AUDIT TRAIL=  $$ (NUMBER, WHEN, WHO, WHERE, WHAT)
(   1,<2022-06-09 15:16:39.62 +0400>,<she>,<DPX200>,
      <created by zg, POWCHK disabled, PULCHK disabled
       configuration hash MD5:
       00 E9 B6 7A A2 85 ED C7 34 08 36 98 17 FE 4E 26
       data hash MD5: 32K
       BE 67 8D 30 C5 E8 32 AB 42 51 4D 23 DB 81 A1 BE>)
(   2,<2022-06-09 15:16:42.15 +0400>,<she>,<DPX200>,
      <Start of raw data processing
       efp BC_mod = 2 LB = 1 FT_mod = 6 PKNL = 1 PHC0 = -10258.48 PHC1 = 2.853455 SI = 64K 
       data hash MD5: 64K
       1A 12 4C 1E 98 ED 69 70 75 67 41 15 27 67 84 E3>)
(   3,<2022-06-09 15:17:09.73 +0400>,<she>,<DPX200>,
      <abs ABSG = 5 
       data hash MD5: 64K
       94 30 FE 5F 77 93 AF 32 0E 41 EF 32 A1 D9 0D 3A>)
$$ ##END=
$$ 
$$ hash MD5
$$ C2 3E B4 11 10 C3 57 73 42 D2 87 74 8C CB 96 B7
##$RELAX= 
##$RELAX= 
##$RELAX= 
##$RELAX= 
##$RELAX= 
##$RELAX= 
##$RELAX= 
##$RELAX= 
$$ Bruker specific parameters
$$ --------------------------
##$DU= <F:/spectra>
##$EXPNO= 1
##$NAME= <P31>
##$PROCNO= 1
##$TYPE= <nmr>
##$USER= <she>
##$AMP= (0..31)
100 100 100 100 100 100 100 100 100 100 100 100 100 100 100 100 100 100 
100 100 100 100 100 100 100 100 100 100 100 100 100 100 
##$AQSEQ= 0
##$AQ_mod= 1
##$AUNM= <au_zg>
##$AUTOPOS= <>
##$BF1= 81.014009
##$BF2= 200.13
##$BF3= 200.13
##$BF4= 200.13
##$BF5= 200.13
##$BF6= 200.13
##$BF7= 200.13
##$BF8= 200.13
##$BYTORDA= 1
##$CFDGTYP= 0
##$CFRGTYP= 5
##$CHEMSTR= <none>
##$CNST= (0..31)
1 1 145 1 1 1 1 1 1 1 1 1 1 1 1 1 1 1 1 1 1 1 1 1 1 1 1 1 1 1 1 1 
##$CPDPRG= <waltz16>
##$CPDPRG1= <>
##$CPDPRG2= <waltz16>
##$CPDPRG3= <>
##$CPDPRG4= <mlev>
##$CPDPRG5= <mlev>
##$CPDPRG6= <mlev>
##$CPDPRG7= <mlev>
##$CPDPRG8= <mlev>
##$CPDPRGB= <>
##$CPDPRGT= <>
##$D= (0..31)
0 1 0 0 0 0 0 0 0 0 0 0.03 2e-05 3e-06 0 0 0 0 0 0 0 0 0 0 0 0 0 0 0 0 
0 0 
##$DATE= 1654773399
##$DBL= (0..7)
120 120 120 11 120 120 24 19 
##$DBP= (0..7)
150 150 150 150 150 150 150 150 
##$DBP07= 0
##$DBPNAM0= <>
##$DBPNAM1= <>
##$DBPNAM2= <>
##$DBPNAM3= <>
##$DBPNAM4= <>
##$DBPNAM5= <>
##$DBPNAM6= <>
##$DBPNAM7= <>
##$DBPOAL= (0..7)
0.5 0.5 0.5 0.5 0.5 0.5 0.5 0.5 
##$DBPOFFS= (0..7)
0 0 0 0 0 0 0 0 
##$DE= 6
$$ [...]
##$SUBNAM3= <"">
##$SUBNAM4= <"">
##$SUBNAM5= <"">
##$SUBNAM6= <"">
##$SUBNAM7= <"">
##$SUBNAM8= <"">
##$SUBNAM9= <"">
##$SW= 501.771253377433
##$SWIBOX= (0..15)
0 1 3 0 0 0 0 0 0 0 0 0 0 0 0 0 
##$SW_h= 40650.406504065
##$TD= 32768
##$TD0= 1
##$TE= 0
##$TE2= 300
##$TE3= 300
##$TEG= 300
##$TL= (0..7)
0 120 53 12 22 120 120 120 
##$TP= (0..7)
150 150 150 150 150 150 150 150 
##$TP07= 0
##$TPNAME0= <>
##$TPNAME1= <>
##$TPNAME2= <>
##$TPNAME3= <>
##$TPNAME4= <>
##$TPNAME5= <>
##$TPNAME6= <>
##$TPNAME7= <>
##$TPOAL= (0..7)
0.5 0.5 0.5 0.5 0.5 0.5 0.5 0.5 
##$TPOFFS= (0..7)
0 0 0 0 0 0 0 0 
##$TUNHIN= 0
##$TUNHOUT= 0
##$TUNXOUT= 0
##$USERA1= <user>
##$USERA2= <user>
##$USERA3= <user>
##$USERA4= <user>
##$USERA5= <user>
##$V9= 5
##$VALIST= <valist>
##$VCLIST= <CCCCCCCCCCCCCCC>
##$VD= 0
##$VDLIST= <DDDDDDDDDDDDDDD>
##$VPLIST= <PPPPPPPPPPPPPPP>
##$VTLIST= <TTTTTTTTTTTTTTT>
##$WBST= 1024
##$WBSW= 4
##$XGAIN= (0..3)
0 0 0 0 
##$XL= 0
##$YL= 0
##$YMAX_a= 2978
##$YMIN_a= -2251
##$ZGOPTNS= <>
##$ZL1= 120
##$ZL2= 120
##$ZL3= 120
##$ZL4= 120
##$ABSF1= 248.5645
##$ABSF2= -253.2056
##$ABSG= 5
##$ABSL= 3
##$ALPHA= 0
##$AQORDER= 0
##$ASSFAC= 0
##$ASSFACI= 0
##$ASSFACX= 0
##$ASSWID= 0
##$AUNMP= <proc_1d>
##$AZFE= 0.1
##$AZFW= 0.5
##$BCFW= 0
##$BC_mod= 2
##$BYTORDP= 0
##$COROFFS= 0
##$CY= -3
##$DATMOD= 1
##$DC= 0
##$DFILT= <>
##$DTYPP= 0
##$F1P= 0
##$F2P= 0
##$FCOR= 1
##$FTSIZE= 65536
##$FT_mod= 6
##$GAMMA= 0
##$GB= 0
##$INTBC= 1
##$INTSCL= 5.30512e-09
##$ISEN= 30
##$LB= 1
##$LEV0= 0
##$LPBIN= 0
##$MAXI= 10000
##$MC2= 0
##$MEAN= 0
##$ME_mod= 0
##$MI= 50
##$NCOEF= 0
##$NC_proc= -8
##$NLEV= 6
##$NOISF1= 182.463
##$NOISF2= 159.3651
##$NSP= 0
##$NTH_PI= 0
##$NZP= 0
##$OFFSET= 248.5645
##$PC= 4
##$PHC0= -10258.48
##$PHC1= 2.853455
##$PH_mod= 1
##$PKNL= yes
##$PPARMOD= 0
##$PSCAL= 0
##$PSIGN= 0
##$REVERSE= no
##$SF= 81.014009
##$SI= 65536
##$SIGF1= 159.3651
##$SIGF2= -187.1042
##$SINO= 113.3802
##$SIOLD= 16384
##$SREGLST= <1H.CDCl3>
##$SSB= 0
##$STSI= 65536
##$STSR= 0
##$SW_p= 40650.406504065
##$SYMM= 0
##$S_DEV= 0
##$TDeff= 32768
##$TDoff= 0
##$TI= <>
##$TILT= no
##$TM1= 0
##$TM2= 0
##$TOPLEV= 0
##$USERP1= <user>
##$USERP2= <user>
##$USERP3= <user>
##$USERP4= <user>
##$USERP5= <user>
##$WDW= 1
##$XDIM= 65536
##$YMAX_p= 178978935
##$YMIN_p= -360655894
$$ End of Bruker specific parameters
$$ ---------------------------------
##NTUPLES= NMR SPECTRUM
##VAR_NAME=  FREQUENCY,     SPECTRUM/REAL,   SPECTRUM/IMAG
##SYMBOL=    X,             R,               I
##VAR_TYPE=  INDEPENDENT,   DEPENDENT,       DEPENDENT
##VAR_FORM=  AFFN,          ASDF,            ASDF
##VAR_DIM=   65536,         65536,           65536
##UNITS=     HZ,            ARBITRARY UNITS, ARBITRARY UNITS
##FACTOR=    0.620285442955139, 1,           1
##FIRST=     20137.2065510759, 0,            0
##LAST=      -20513.1999529892, 0,           0
##MIN=       -20513.1999529892, -360655894,  0
##MAX=       20137.2065510759, 178978935,    0
$$ Real data points
##PAGE= N=1
##DATA TABLE= (X++(R..R)), XYDATA
$$ [...]
13032a92975K381084L81123k003470m07524K565104K058979r54535j873745p6200
$$ -192975 2188109 2569232 565762 158238 2723342 4782321 3827786 1954041 1877841
13023A877841J101879L61514n37239p27493q84364p90355M243K89468n41174k76353
$$ 1877841 2979720 3341234 2803995 2076502 1192138 401783 406026 695494 154320 -122033
13013a22033K079568K648649j618928n990983l627867K955679M183913j990537
$$ -122033 1957535 4606184 2987256 -3003727 -6631594 -3675915 507998 -1482539
13005a482539o199232j607397N827675O480970P81004k956369j251461J035205
$$ -1482539 -7681771 -9289168 -3461493 3019477 3800481 844112 -407349 627856
12997F27856n31091l740813m048290j172834J278843J115177J2747N48943K448354
$$ 627856 96765 -3644048 -7692338 -8865172 -7586329 -6471152 -6458405 -5909462 -3461108
12988c461108L209473K017419R13994J219848J120030j021302l003540j808915
$$ -3461108 -251635 1765784 2679778 3899626 5019656 3998354 994814 -814101
12980h14101J031642J304136r54761j167976K088967L952163N17293m682055n248035
$$ -814101 217541 1521677 566916 -601060 1487907 5440070 5957363 1275308 -3972727
12971c972727o40697L597275L389562L93123j472116j050992l31352r71923j769378
$$ -3972727 -4613424 -1016149 2373413 2766536 1294420 243428 -87924 -1059847 -2829225
12962b829225k34456L408932N318861K704827j849694l540165k200374k123734
$$ -2829225 -3063681 345251 5664112 8368939 6519245 2979080 778706 -1345028
12954a345028m510246m838545k91468M627778M280815N23374m32118J848678J550938
$$ -1345028 -5855274 -10693819 -10985287 -6357509 -2076694 -1553320 -1985438 -136760 1414178
12945A414178l163577o124867k476624L457123M606232J618690O37551K640319
$$ 1414178 -1749399 -7874266 -10350890 -6893767 -2287535 -668845 -31294 2609025
12937B609025K354658j701913l705893k72029L014223K96489m527485l661256
$$ 2609025 4963683 3261770 -444123 -716152 2298071 2594560 -1932925 -5594181
12929e594181J997605M363697J087333j661094j84795J450599j53265j785056
$$ -5594181 -3596576 767121 1854454 193360 8565 1459164 1305899 -479157
12921d79157k29128J908860J711742J253305K369357K050281j303986k968336
$$ -479157 -708285 1200575 2912317 4165622 6534979 8585260 7281274 4312938
12913D312938J62616K554437j174790n899311l807606J965829K406897j778816
$$ 4312938 4475554 7029991 5855201 -44110 -3851716 -1885887 521010 -1257806
12905a257806j802429L050207L888232j669570m709990l71297L846904J162808
$$ -1257806 -3060235 -10028 3878204 2208634 -2501356 -2872653 974251 2137059
12897B137059l332065k087303K558761L541176M01666k273893k952479k690384
$$ 2137059 -1195006 -3282309 -723548 2817628 3219294 945401 -2007078 -4697462
12889d697462p79385K634697L531102j10735l291196j191953K472548J225599
$$ -4697462 -5476847 -2842150 688952 578217 -2712979 -3904932 -1432384 -206785
12881b06785l408809m417445l06421L826274M852364M193345K703150j61142k341302
$$ -206785 -3615594 -8033039 -8339460 -4513186 339178 4532523 7235673 7074531 4733229
12872D733229r27249J939471J225946k492806l163811Q61019L484501M441n790986
$$ 4733229 3805980 5745451 6971397 4478591 1314780 2175799 5660300 5664741 -126245
12863a26245p116528k916022K296161M600868L621104J140242o26076m34239N84020
$$ -126245 -7242773 -10158795 -7862634 -3261766 359338 1499580 873504 439265 1023285
12854A023285o7446k612174l732345n88788M768773O972397L563649j839620l780040
$$ 1023285 955839 -1656335 -5388680 -5977468 -1208695 5763702 9327351 7487731 3707691
12845C707691j649388o2441j954984m031096j795265K985949M321045Q97951k296626
$$ 3707691 2058303 1995862 40878 -3990218 -5785483 -2799534 1521511 2419462 122836
12836A22836k088919j179873j841784j456693J608235L095460m44606m304415
$$ 122836 -1966083 -3145956 -4987740 -6444433 -4836198 -1740738 -2185344 -6489759
12828f489759j909561M234016N521845K98352l819952j694533K407305K393780
$$ -6489759 -8399320 -4165304 1356541 1654893 -2165059 -3859592 -1452287 941493
12820I41493r73610k891754j874293n382J612625L400411M347089K400189j748859
$$ 941493 -32117 -2923871 -4798164 -4803546 -3190921 209490 4556579 6956768 5207909
12811E207909m139930k229051J510634K471196k15504k776626k157373O4477P50267
$$ 5207909 1067979 -1161072 349562 2820758 2605254 -171372 -2328745 -2264268 -1514001
12802a514001l6455k28278l7600j101778k183937l87116L223933M215986J853019
$$ -1514001 -1550456 -1778734 -1816334 -2918112 -5102049 -5489165 -2265232 1950754 3803773
12793C803773K58750J042482O31459k520681m241293j934265M22864o14721j587060
$$ 3803773 4062523 5105005 5736464 3215783 -1025510 -2959775 -2536911 -3151632 -4738692
12784d738692J307091M601592L397729J83822R9464J273538j432989n760804m555326
$$ -4738692 -3431601 1169991 4567720 4751542 4851006 6124544 4691555 -1069249 -5624575
12775e624575K040524O072137L815021r8070j528810j754202j987948o43360J719546
$$ -5624575 -3584051 2488086 6303107 6205037 4676227 2922025 934077 290717 2010263
12766B010263J594409j040585j850218K96985J363397k24890q07735J080874J485590
$$ 2010263 3604672 2564087 713869 1010854 2374251 2149361 1341626 2422500 3908090
12757C908090j453191l531901k001435n55873k186207l208125R6946M239898L998862
$$ 3908090 2454899 -1077002 -3078437 -3634310 -5820517 -9028642 -8931696 -4691798 -692936
12748f92936Q66212j31739J295235J628672J19204j309506k589002m369790m223850
$$ -692936 173276 41537 1336772 2965444 3084648 1775142 -813860 -5183650 -9407500
12739i407500J80044N187711M393127k064901o719483m383468J720200M972991
$$ -9407500 -9227456 -4039745 353382 -1711519 -8431002 -12814470 -11094270 -6121279
12731f121279L211051k84342j519187K67604K560270K492489r9662k649751k929482
$$ -6121279 -2910228 -3194570 -4713757 -4446153 -1885883 606606 506944 -2142807 -5072289
12722e072289j260935O74651J908681K246490J515861j39185j927903k964504
$$ -5072289 -6333224 -5658573 -3749892 -1503402 12459 -126726 -2054629 -5019133
12714e019133k554464k34441L121771M802675L006276k71288j560348o12323L36827
$$ -5019133 -7573597 -7808038 -4686267 116408 3122684 2851396 1291048 678725 1015552
12705A015552J316254M216792P453577O294921J73323n355216o388487n552337
$$ 1015552 2331806 6548598 14002175 20297096 20470419 15115203 8726716 3174379
12697C174379o030313n706130j734776L074933L794095Q42138j075912j094J667713
$$ 3174379 -2855934 -8562064 -10296840 -7221907 -3427812 -2585674 -3661586 -3662680 -1994967
12688a994967J564561k69186k431713k770020L59379M732910M777438j058438
$$ -1994967 -430406 -699592 -3131305 -5901325 -5541946 -809036 3968402 2909964
12680B909964o372383m779606Q57695K725179l92631k402241k07734K180995J181488
$$ 2909964 -3462419 -8242025 -7384330 -4659151 -5051782 -7454023 -7661757 -5480762 -4299274
12671d299274q75277n09635J389027J999436J138455L76882N2124j95541J79798
$$ -4299274 -5174551 -5684186 -4295159 -2295723 -1157268 -780386 -728262 -923803 -744005
12662g44005J394956K056160J115158k12720k43735O43618Q63550p3613j533233
$$ -744005 650951 2707111 3822269 3609549 3365814 4009432 4872982 4799369 3266136
12653C266136k856467l045303q20474K916102M047523j35362n589506m811671
$$ 3266136 409669 -2635634 -3456108 -540006 3507517 3372155 -2217351 -7029022
12645g029022K925740Q563946M326036m930105p281178k34277N453922J262717
$$ -7029022 -4103282 4460664 8786700 3856595 -3424583 -3658860 1795062 3057779
12637C057779o668823o801082R91419O331174M102348L6860l58179N48011o19763
$$ 3057779 -3611044 -10412126 -9420707 -3089533 1012815 1049675 691496 1239507 619744
12628F19744j489955O93350K866193J150982k262865k909014j209345l81096l33821
$$ 619744 -870211 -176861 2689332 3840314 1577449 -1331565 -2540910 -2922006 -3255827
12619c255827P37154J411396n01036k830173k181946j48022l63852j333499J061515
$$ -3255827 -2518673 -1107277 -1608313 -4438486 -6620432 -6768454 -7132306 -8465805 -7404290
12610g404290N198777N206736O30567k699538k083896j005223j506058r40885
$$ -7404290 -2205513 3001223 3631790 932252 -1151644 -2156867 -3662925 -4603810
12602d603810J334467J347011j901414l030355R56072M609220K357694k215973
$$ -4603810 -3269343 -1922332 -3823746 -6854101 -5898029 -1288809 1068885 -1147088
12594a147088k007780K330547L907113N92464k516006j653380P48685J146912
$$ -1147088 -3154868 -824321 3082792 3675256 1159250 -494130 254555 1401467
12586A401467k4815n13775q2210J32159j0936J29827N30530N33872l13630j881557
$$ 1401467 1376652 862877 780667 912826 901890 1031717 1562247 2096119 1782489 -99068
12576i9068l155804k474329N81850L576976L280333j83742l001679k378578J01582
$$ -99068 -3254872 -5729201 -5147351 -1570375 1709958 1526216 -1475463 -3854041 -3752459
12567c752459J217452O68569O48133J625584J432323q29240k617834j470468J167843
$$ -3752459 -2535007 -1866438 -1218305 407279 1839602 1010362 -1607472 -3077940 -1910097
12558a910097J938699K59667j462645j569766l86585J755647M448165N204795
$$ -1910097 28602 288269 -1174376 -2744142 -3130727 -1375080 3073085 8277880
12550H277880J518478m128327n570226j292688K760555J645596j558623j345921
$$ 8277880 9796358 5668031 97805 -1194883 1565672 3211268 1652645 306724
12542C06724J490736K270843O94014K10401P55105q18931l377870k046035K697459
$$ 306724 1797460 4068303 4762317 4972718 5727823 4908892 1531022 -515013 2182446
12533B182446L931335q65203m842750k032490L374459L627943j168538m563290
$$ 2182446 6113781 5248578 405828 -1626662 1747797 5375740 4207202 -356088
12525c56088l801670j858407p23807J052172L759020M738598K593687n70927k385290
$$ -356088 -4157758 -6016165 -6739972 -5687800 -1928780 2809818 5403505 4832578 2447288
12516B447288k717208k001514p60K459609L004703O29915k474783l400390j782153
$$ 2447288 -269920 -2271434 -2272194 187415 3192118 3822033 1347250 -2053140 -3835293
12507c835293L55672J172502O84585L40304J203025K341146J616168j228699l352924
$$ -3835293 -3479621 -2307119 -1622534 -1282230 -79205 2261941 3878109 2649410 -703514
12498g03514k243371N86157J547844J23012p30313M37732J274544k65433k206886
$$ -703514 -2946885 -2360728 -812884 -689872 -1420185 -982453 292091 26658 -2180228
12489b180228j390816J587336L034219J262566j421111k083187n44811J254272
$$ -2180228 -3571044 -1983708 1050511 2313077 891966 -1191221 -1736032 -481760
12481d81760J744831O91907j193228k558778k087187K6164J683731J086758p87718
$$ -481760 1263071 1954978 761750 -1797028 -3884215 -3858051 -2174320 -1087562 -1875280
12472a875280j022201J641879M946747N504895K640452p95515j581433J48335
$$ -1875280 -2897481 -1255602 3691145 9196040 11836492 11040977 9459544 9607879
12464I607879Q47595k155905o638303p374054k819579K123269K253591o95208
$$ 9607879 10455474 8299569 1661266 -5712788 -8532367 -6409098 -4155507 -4850715
12456d850715o94273L211575N065841J116837m066443m172827q3958K516779J931360
$$ -4850715 -5544988 -2333413 2732428 3849265 -217178 -4390005 -4473963 -1957184 -25824
12447b5824J367054K275800K544206J493713J172065J565874k21371m125146n463727
$$ -25824 1341230 3617030 6161236 7654949 8827014 10392888 10171517 6046371 582644
12438E82644j921311K224784K288356j90319r08363K42144J58259j586784k361863
$$ 582644 -1338667 886117 3174473 2984154 2075791 2317935 2476194 889410 -1472453
12429a472453j113540M03435P02063R965q64669q72399J018071L811548M440203
$$ -1472453 -2585993 -2182558 -1480495 -1470530 -2335199 -3207598 -2189527 1622021 6062224
12420F062224K061516P5203Q56663J325654j953672n897292m798845M18100L173177
$$ 6062224 8123740 8198943 9055606 10381260 8427588 2530296 -2268549 -1850449 1322728
12411A322728J138270j337351j368396j338300k620984k153055J302724L327087
$$ 1322728 2460998 1123647 -244749 -1583049 -4204033 -6357088 -5054364 -1727277
12403a727277P49103k424286j095733K685322L216985L23795r11553J382630L276121
$$ -1727277 -978174 -3402460 -4498193 -1812871 1404114 1727909 816356 2198986 5475107
12394E475107J519709j793768k612847k33340K345588K128655p05411l152899
$$ 5475107 6994816 5201048 2588201 2354861 4700449 6829104 6123693 2970794
12386B970794l012422j608481j345456j291193J389534N381286N402546M60361
$$ 2970794 -41628 -1650109 -2995565 -4286758 -2897224 2484062 7886608 8346969
12378H346969l174270r38383K845129J846112k376591l746235j835277j277099
$$ 8346969 5172699 4234316 7079445 8925557 6548966 2802731 967454 -309645
12370c09645k667210j895961J482750K813650M43010j705792j428937j448962
$$ -309645 -2976855 -4872816 -3390066 -576416 -133406 -1839198 -3268135 -4717097
12362d717097k934396k305405K088442N766552M535465N34987j785312j620806
$$ -4717097 -7651493 -9956898 -7868456 -2101904 2433561 2968548 1183236 -437570
12354d37570m46620J176619K223161Q17005j709443j016390K795209L481555j376253
$$ -437570 -884190 292429 2515590 3332595 1623152 606762 3401971 6883526 5507273
12345E507273m804384q44442N106734M106790k431012n470364k499056L29231
$$ 5507273 702889 -141553 4965181 9071971 6640959 1170595 -1328461 -999230
12337i99230l71228p35144J953258M254126K760724o73617k670152k687150j559748
$$ -999230 -1370458 -2105602 -152344 4101782 6862506 6188889 3518737 831587 -728161
12328g28161K31997J274986Q3206j692185q87736J702301J971772p08526k365998
$$ -728161 -496164 778822 862028 -830157 -1717893 -15592 1956180 1247654 -1118344
12319a118344j177844j4592n74889m54643J527674K362407K61289j748385j001753
$$ -1118344 -2296188 -2310780 -2885669 -3340312 -1812638 549769 811058 -937327 -1939080
12310a939080M08985p5463r54057j76321P49420J69817P1490K064792L088018
$$ -1939080 -1530095 -1605558 -2559615 -2735936 -1986516 -1816699 -1745209 319583 3407601
12301C407601J21716l699857l194876O01057J940589p67178l074817j652407J509517
$$ 3407601 3529317 -170540 -3365416 -2764359 -823770 -1590948 -4665765 -6318172 -4808655
12292d808655L025883K395551J077953J53381O1144O57410R19599K02084l31928
$$ -4808655 -1782772 612779 1690732 1844113 1905257 2562667 3482266 3684350 3352422
12283C352422N76568J566669J52396l067896m423813k135014J123413J887146
$$ 3352422 3928990 5495659 5648055 2580159 -1843654 -3978668 -2855255 -968109
12275i68109K78241r73593o99792l35761p92204m44135K170894M824347L491104
$$ -968109 -689868 -1663461 -2363253 -2699014 -3491218 -3935353 -1764459 3059888 6550992
12266F550992j701584n203311k690844L179128O329872M769127J256746j911203
$$ 6550992 4849408 -353903 -3044747 134381 6464253 11233380 12490126 10578923
12258A0578923m480341n364727l119940K77336Q10497j419761j885052J317881
$$ 10578923 6098582 733855 -2386085 -2108749 -1298252 -2718013 -4603065 -3285184
12250c285184M622351M660881K216343r95033m463987o002437k464383L840918
$$ -3285184 1337167 5998048 8214391 7219358 2755371 -3247066 -5711449 -1870531
12242a870531N376056j90278n570977m454666o22292n86898k593575n32588M870196
$$ -1870531 3505525 3315247 -2255730 -6710396 -7332688 -7919586 -10513161 -11045749 -6175553
12233f175553O861653L017521k262849m764110l998504p99333K982359L552087
$$ -6175553 686100 3703621 1440772 -3323338 -7321842 -8121175 -5138816 -1586729
12225a586729n35594m454719k899153J939247M006252K852423K540026K893294
$$ -1586729 -2122323 -6577042 -9476195 -7536948 -3530696 -678273 1861753 4755047
12217D755047R337m912353n745143j489803J773538P45794q14711N4336Q06355
$$ 4755047 4764384 -147969 -5893112 -7382915 -5609377 -4863583 -5678294 -5623958 -4817603
12208d817603l65404n63650J597582K150145j179444l541671k7717N828523O296780
$$ -4817603 -5183007 -5746657 -4149075 -1998930 -3178374 -6720045 -6747762 -919239 5377541
12199E377541J23926n874094n344652O37727N242128L316085k712324n142453
$$ 5377541 5501467 -372627 -5717279 -5079552 162576 3478661 766337 -4376116
12191d376116o48311M598741L146848k798668m773414j151596J087300j410324
$$ -4376116 -5024427 -425686 2721162 -77506 -4850920 -6002516 -4915216 -6325540
12183f325540k987901P72668N279948M655708R36751m48451M19492k07853k421571
$$ -6325540 -9313441 -8540773 -3260825 1394883 2331634 1883183 2302675 2094822 -326749
12174c26749l067630j326919R07561K395514K580341O40800k125913k010609J474106
$$ -326749 -3394379 -4721298 -3813737 -1418223 1162118 1802918 -322995 -2333604 -859498
12165h59498L242938P1662l478220j748350K904149L867034O27872j419830l65898
$$ -859498 2383440 2455102 -1023118 -2771468 132681 3999715 4627587 3207757 2841859
12156B841859j03431k767785m892004k934850J640839M697069L991202L05810
$$ 2841859 2738428 -29357 -4921361 -7856211 -6215372 -1518303 2472899 2778709
12148B778709l654057m839864k346681J293000K800670J883891Q66800J357578
$$ 2778709 -875348 -5715212 -8061893 -6768893 -3968223 -2084332 -1217532 140046
12140A40046K887974M051393L552422J095927j691730k633133j960568j674292
$$ 140046 3028020 7079413 10631835 11727762 10036032 7402899 5442331 3768039
12132C768039j518713P39093L928996L309411j648302m651272j803749J868713
$$ 3768039 2249326 2988419 6917415 10226826 8578524 3927252 2123503 3992216
12124C992216N25253k940656k468556L35425m68330l684884k482204L258732N874482
$$ 3992216 4517469 1576813 -891743 -556318 -1024648 -4709532 -7191736 -3933004 1941478
12115A941478K549920l55176J308826K486104j697403o724190n340882J261823
$$ 1941478 4491398 4136222 5445048 7931152 6233749 -490441 -5831323 -4569500
12107d569500N411820L498446j052647l893212l962285k050496Q17132L110145
$$ -4569500 842320 4340766 3288119 -605093 -4567378 -6617874 -5800742 -2690597
12099b690597L521503K502734J651200J573501J389213K06751j550434k223680
$$ -2690597 830906 3333640 4984840 6558341 7947554 8154305 6603871 4380191
12091D380191n59723K168416K622439n16341l990781l843227r31101N35658n86890
$$ 4380191 3820468 5988884 8611323 8094982 4104201 260974 -670127 -134469 -721359
12082g21359j278354J08098J479090J388259J586836L042711L177838r08l937667
$$ -721359 -1999713 -1891615 -412525 975734 2562570 5605281 8783119 8782211 4844544
12073D844544m854641k914253j054846l81609K52246J192427J419676O87811N1249
$$ 4844544 -10097 -2924350 -3979196 -4360805 -4108559 -2916132 -1496456 -808645 -757396
12064g57396K99975J113788J418289J4004l021738n098294l223450J667466M756657
$$ -757396 -457421 656367 2074656 2088660 -933078 -6031372 -9254822 -7587356 -2830699
12055b830699L246044j08152j367572r01253j608079l498055l662422j119027
$$ -2830699 415345 307193 -1060379 -1961632 -3569711 -7067766 -10730188 -11849215
12047a1849215J580640J990494O93816K0299J310157L692606M682785K448871
$$ -11849215 -10268575 -8278081 -7584265 -7563966 -6253809 -2561203 2121582 4570453
12039D570453j618114l666077j985707N91848P55254m62729K70270K849647L635785
$$ 4570453 2952339 -713738 -2699445 -2107597 -1352343 -1815072 -1544802 1304845 4940630
12030D940630J164551j533082j447930L28507O85206j180563l130716k819700
$$ 4940630 6105181 4572099 3124169 3452676 4137882 2957319 -173397 -2993097
12022b993097p6263K829530L136564O81495j424880p02619J000370K89858k062022
$$ -2993097 -3069360 -239830 2896734 3578229 2153349 1450730 2451100 2740958 678936
12013F78936k111945L13195O44978k490258l682063P90536N555851L417065k958463
$$ 678936 -1433009 -1119814 -474836 -2965094 -6647157 -5856621 -300770 3116295 157832
12004A57832m186046J747117O587622M550459J07108p11942K27441j706981m667462
$$ 157832 -4028214 -2281097 4306525 8856984 8964092 8252150 8479591 6772610 2105148
11995B105148l586333L63122J282476j566474k873127o15812R98656k78737n50127
$$ 2105148 -1481185 -1118063 164413 -1402061 -4275188 -4891000 -3892344 -4171081 -4721208
11986d721208K816056N578436L225422j334670k213464L51467J183971j095758
$$ -4721208 -1905152 3673284 6898706 5564036 3350572 3702039 4886010 3790252
11978C790252k446008o18408J325489K60625k276326k781972m66343K809482N161727
$$ 3790252 1344244 725836 2051325 2311950 35624 -2746348 -3212691 -403209 4758518
11969D758518N207036J779501m205496q407413o576145j60455M006387J554289
$$ 4758518 9965554 11745055 7539559 -867854 -7443999 -7604454 -3598067 -2043778
11961b043778l420778l171971L138696P616906M270534k413226l884363j2699
$$ -2043778 -5464556 -8636527 -5497831 2119075 6389609 3976383 92020 79321
11953G9321J178714l679767p756461m383040K855262N593379K489019m38340M87208
$$ 79321 1258035 -2421732 -10178193 -14561233 -11705971 -6112592 -3623573 -4061913 -3574705
11944c574705K504346K112858j46027j829119j922795p60080Q18955J422633L72529
$$ -3574705 -1070359 1042499 896472 -932647 -2855442 -3615522 -2796567 -1373934 -1001405
11935a001405p38625M2319J704816J493040o44632j851098q92981K60764J15110
$$ -1001405 -1740030 -1697711 7105 1500145 855513 -995585 -1888566 -1627802 -1512692
11926a512692j95153M34478J123987J147572J469830K521547K659390O02411k316118
$$ -1512692 -1707845 -1273367 -149380 998192 2468022 4989569 7648959 8251370 5935252
11917E935252l870850l493073j964955r6238J273730J480269J069629J080493
$$ 5935252 2064402 -1428671 -3393626 -3489864 -2216134 -735865 333764 1414257
11909A414257R52503o16855k403440j428802J873281K910070m05164l769705k575894
$$ 1414257 2366760 1749905 -653535 -2082337 -209056 2701014 2295850 -1473855 -4049749
11900d049749J120852J927266p00964k410602j122364P35696J325677J869697
$$ -4049749 -2928897 -1001631 -1702595 -4113197 -5235561 -4499865 -3174188 -1304491
11892a304491K780999J805654j643403l947861k160152J153653J337166j578486
$$ -1304491 1476508 3282162 1638759 -2309102 -4469254 -3315601 -1978435 -3556921
11884c556921k891190L26541N527403P762363M736229j323809n636556n001541
$$ -3556921 -6448111 -6121570 -594167 7168196 11904425 10580616 4944060 -57481
11876e7481j033729J485880N19653o97639R47406K853974N31880m333266n168584
$$ -57481 -1091210 394670 914323 216684 1164090 4018064 4549944 216678 -4951906
11867d951906m61950L450144J931738j322296j256289K35612j110332l184153
$$ -4951906 -5413856 -1963712 -31974 -1354270 -2610559 -2374947 -3485279 -6669432
11859f669432r13686L808720M015669o89118k896396N51859L608272J501651j681509
$$ -6669432 -7583118 -3774398 241271 -447847 -3344243 -2792384 815888 2317539 636030
11850F36030r95725P02032j281558m358516l209578M09913O68579j787140q07276
$$ 636030 -359695 342337 -939221 -5297737 -8507315 -8097402 -7428823 -9215963 -10023239
11841a0023239M233437O697494L241492j244146j667349N01414J531378J322490
$$ -10023239 -5789802 907692 4149184 2905038 1237689 1739103 3270481 4592971
11833D592971J501387J541866J85869j936496l532552m095627k733139J266485
$$ 4592971 6094358 7636224 7822093 5885597 2353045 -1742582 -4475721 -3209236
11825c209236N319900M938749L05843k637126m19876K775999J769143j716654
$$ -3209236 2110664 7049413 7355256 4718130 4298254 7074253 8843396 7126742
11817G126742k553500o43926k86900k545398l780221j831770J063159K319363
$$ 7126742 4573242 3929316 3642416 1097018 -2683203 -4514973 -3451814 -1132451
11809a132451K138750J602521Q16067j8471l53377q52954k536674l843158j796258
$$ -1132451 1006299 2608820 3424887 3406416 3053039 2200085 -336589 -4179747 -5976005
11800e976005K778118M780519J811712j679660o03621K962082K746573j917199
$$ -5976005 -3197887 1582632 3394344 1714684 1111063 4073145 6819718 4902519
11792D902519m499907p19544N013004N615847O72959m088025m882212l217818
$$ 4902519 402612 -316932 4696072 10311919 10984878 6896853 2014641 -1203177
11784a203177j689285p67324n32370j561558k405820P8503N340864P502510K713095
$$ -1203177 -2892462 -3659786 -4192156 -5753714 -8159534 -8081031 -2740167 4762343 7475438
11775G475438m446837o233589j829731K455267K298605l42951k324243l395205
$$ 7475438 3028601 -3204988 -5034719 -2579452 -280847 -623798 -2948041 -6343246
11767f343246l463168p41008M141173O048937J577659m964371o152572r57698
$$ -6343246 -9806414 -10547422 -6406249 -357312 1220347 -3744024 -9896596 -10854294
11759a0854294M431927N111111K753463J354269J198423l18268l531975n137775
$$ -10854294 -6422367 -1311256 1442207 2796476 3994899 3676631 144656 -4993119
11751d993119k448177K657524N435738L774499O84678L24382K384892K488261
$$ -4993119 -7441296 -4783772 651966 4426465 5111143 5435525 7820417 10308678
11743A0308678j456962n724454n543344j681657Q18870k42o41746J698592M267641
$$ 10308678 8851716 3127262 -2416082 -4097739 -3278869 -3279111 -3920857 -2222265 2045376
11734B045376L052035o24553k011081k78946R06796L65666J443372N005438N975567
$$ 2045376 5097411 4472858 2461777 2182831 3089627 3455293 4898665 9904103 15879670
11725A5879670J123508m404968m287444j162554k039631n662449l725359M571667
$$ 15879670 17003178 12598210 8310766 7148212 5108581 -553868 -4279227 292440
11717B92440Q955314L034948n667426o791560j553407J335885o93773k727247
$$ 292440 9247754 12282702 6615276 -176284 -1729691 -393806 -1087579 -3814826
11709c814826j913236l10928Q29842K484611L624286J828035j588730k606615
$$ -3814826 -5728062 -6038990 -5209148 -2724537 899749 2727784 1139054 -1467561
11701a467561q82947J54081l82531L5163J571514J135683j630962k868077o14994
$$ -1467561 -2350508 -2196427 -2578958 -2543795 -972281 163402 -1467560 -4335637 -4950631
11692d950631K282921K978463K110167J130091J19753o25634n59759r18488k880499
$$ -4950631 -2667710 310753 2420920 3551011 3670764 3045130 2485371 1566883 -1313616
11683a313616l959988j096172L040265K800045j262183k732352L01411K655238
$$ -1313616 -5273604 -6369776 -3329511 -529466 -1791649 -4524001 -4222590 -1567352
11675a567352J541180O71342J932495J184925l186891n390219j632468K661656
$$ -1567352 -26172 645170 2577665 3762590 575699 -4814520 -6446988 -3785332
11667c785332J659804j196253J93036L719929L183950o99516k001845J76769J308097
$$ -3785332 -2125528 -3321781 -3128745 591184 3775134 3075618 1073773 1250542 2558639
11658B558639j72122j498793j622031j823393j282042J366515L150909L88553
$$ 2558639 2386517 887724 -734307 -2557700 -3839742 -2473227 677682 1066235
11650A066235l709169k571306K804923M499467K09341l095503o16270K958772
$$ 1066235 -2642934 -5214240 -2409317 2090150 2299491 -796012 -1412282 1546490
11642A546490J807502j902860k713467q76152n36775j825123j055733J948687
$$ 1546490 3353992 1451132 -1262335 -2138487 -2675262 -4500385 -5556118 -3607431
11634c607431K552763j225711m319554r80800O380524Q764177J900096p335157
$$ -3607431 -1054668 -2280379 -6599933 -7580733 -1200209 7563968 9464064 2128907
11626B128907q961156k474822L270208K695360K20227J741169M917903L406142
$$ 2128907 -6832249 -9307071 -6036863 -3341503 -3121276 -1380107 3537796 6943938
11618F943938k471868n767032l012830J330826J539363k333482n523997m207753
$$ 6943938 4472070 -1294962 -4307792 -2976966 -1437603 -3771085 -9295082 -13502835
11610a3502835Q34324M907796M082839L2094j701961M77196J748087q65222k347226
$$ -13502835 -12668511 -7760715 -3677876 -3645782 -5347743 -4870547 -3122460 -3987682 -6334908
11601f334908K482606Q646687O578323l069412q864611m372765L491472N341439
$$ -6334908 -3852302 4794385 11372708 8303296 -561315 -4934080 -1442608 3898831
11593C898831J695811o90917O2173j35793l287473n800799l663625K127184O513041
$$ 3898831 5594642 4903725 4965898 4830105 1542632 -4258167 -7921792 -5794608 718433
11584G18433N622980N63862l871068m247418j627170P73388J508536R26801q66215
$$ 718433 6341413 6905275 3034207 -1213211 -2840381 -2066993 -558457 368344 -497871
11575d97871l221906l503970p2403L912298L608345n38708k952407p11865K733639
$$ -497871 -3719777 -7223747 -7296150 -3383852 224493 -314215 -3266622 -3978487 -1244848
11566a244848K970584K73970k000133k063111q80349l52221j434376k938655k253222
$$ -1244848 1725736 1999706 -427 -2063538 -2943887 -3296108 -4730484 -7669139 -9922361
11557i922361J230023M281233L754264J153008J02422M96852o44273l197833l701241
$$ -9922361 -8692338 -4411105 -656841 496167 598589 1095441 451168 -2746665 -6447906
11548f447906j259904J210863K258551L411748M506414K894487r47842k413883
$$ -6447906 -7707810 -6496947 -4238396 -826648 3679766 6574253 5626411 3212528
11540C212528R4643K075079O8782k840574k425502o6058K04511j743825k847148
$$ 3212528 3307171 5382250 5451032 2610458 184956 118898 323409 -1420416 -4267564
11531d267564j926373k95367J014926J583842Q57714l98859M1021K244893K904643
$$ -4267564 -6193937 -6489304 -5474378 -3890536 -3032822 -3431681 -3390660 -1145767 1758876
11522A758876K99299k392953j826878L10813M70954r35729j029106J57864J65013
$$ 1758876 2058175 -334778 -2161656 -1850843 -1379889 -2315618 -3344724 -3186860 -3021847
11513c021847j176459j670013p61377J80784J099537K987437M588442L237955
$$ -3021847 -4198306 -5868319 -6629696 -6448912 -5349375 -2361938 2226504 5464459
11505E464459n51788k996012k541560k039709l634937m558851j128993M692859
$$ 5464459 4912671 1916659 -624901 -2664610 -6299547 -10858398 -11987391 -7294532
11497g294532O642647K587197j965232j297844K265391K014569k259829l278715
$$ -7294532 -651885 1935312 -29920 -1327764 937627 2952196 692367 -2586348
11489b586348J911119N803548J350105o380107p134897p79841L368235J363300
$$ -2586348 -675229 5128319 6478424 98317 -7036580 -7816421 -4448186 -3084886
11481c084886r68578M87755K088815J051552Q71185L258287L032502k692898p427107
$$ -3084886 -4053464 -3565709 -1476894 -425342 445843 3704130 6736632 4043734 -3383373
11472c383373m595524J851653L556361j40197l452795l560923j735816J344987
$$ -3383373 -7978897 -6127244 -2570883 -2711080 -6163875 -9724798 -11460614 -10115627
11464a0115627M603242M449495L19690j746943J904557M899853O97876n087443
$$ -10115627 -5512385 -1062890 -743200 -2490143 -585586 4314267 5012143 -75300
11456g5300l054220L459436L248865l339630m463402K663451O348026J55926o027836
$$ -75300 -3129520 329916 3578781 239151 -4224251 -1560800 4787226 4943152 -1084684
11447a084684k474729M689712M259727k446129n650092k873490O6434L44072N25326
$$ -1084684 -3559413 1130299 5390026 2943897 -2706195 -5579685 -5513251 -5169179 -4643853
11438d643853J241239J13011k218292k092557Q39156L004339K721543J600369
$$ -4643853 -3402614 -3289603 -5507895 -7600452 -6761296 -3756957 -1035414 564955
11430E64955L64602j670402k894103k51960N247230Q128860M985937j596702o564555
$$ 564955 929557 -740845 -3634948 -3886908 1360322 9489182 14475119 12878417 6313862
11421F313862p265757m291406n9405K592120K280662K44456j297968j502914o01397
$$ 6313862 -951895 -5243301 -5302706 -2710586 -429924 -185468 -1483436 -2986350 -3587747
11412c587747J354478L611569M059698J798772r62008k035662k678755m779088
$$ -3587747 -2233269 1378300 5437998 7236770 6274762 4239100 1560345 -3218743
11404c218743o236754l342439K756375O314079M259004m62058l452832l256360
$$ -3218743 -9455497 -12797936 -10041561 -3727482 531522 69464 -3383368 -6639728
11396f639728n06182L416236N531622K949264k509816m930768k129390O19450
$$ -6639728 -7145910 -3729674 1801948 4751212 2241396 -2689372 -4818762 -4199312
11388d199312j816886o224511n350272J264955O452032N696160K664172K291076
$$ -4199312 -6016198 -12240709 -17590981 -16326026 -9873994 -4177834 -1513662 777414
11380G77414L270589J516914k178238l192991o34137J364158L61862j194730j078937
$$ 777414 4048003 5564917 3386679 193688 -440449 923709 1285571 90841 -988096
11371i88096r53760k089274j641839K481268O271541M571960m92491k102641P87533
$$ -988096 -1941856 -4031130 -5672969 -3191701 3079840 7651800 7159309 5056668 5844201
11362E844201K120281j133565m225078k858123p9213n26689k678944k200993M92423
$$ 5844201 7964482 6830917 2605839 -252284 -331497 -858186 -3537130 -5738123 -5245700
11353e245700J682835R50066P41650J088829L44370j67663J799805L565760L14343
$$ -5245700 -3562865 -2612799 -1871149 -782320 -437950 -605613 1194192 4759952 5074295
11344E074295o066797p954617l383451N34172j335095m298099j833200M030156
$$ 5074295 -992502 -8947119 -12330570 -11796398 -13131493 -17429592 -19262792 -15232636
11336a5232636O445697M198139J870556J588781J157250l8169M95944K940968
$$ -15232636 -8786939 -4588800 -2718244 -1129463 27787 -10382 485562 3426530
11328C426530L523641L45365l281825l739038k016612j037984p94157O06960K764673
$$ 3426530 6950171 7295536 4013711 274673 -1741939 -2779923 -3574080 -2967120 -202447
11319b02447L386947K296306J640564J739920R3829l844895n952821k767528K216271
$$ -202447 3184500 5480806 7121370 8861290 8955119 5110224 -842597 -3610125 -1393854
11310a393854K077356l528667o874925k992931K813670K905397j080440j431263
$$ -1393854 683502 -2845165 -9720090 -12713021 -9899351 -6993954 -8074394 -9505657
11302i505657K665928L922760k04242k582833J396927N139424J631698l823534
$$ -9505657 -6839729 -2916969 -3121211 -5704044 -4307117 832307 2464005 -1359529
11294a359529j452635O419195P937308J76458o396902m355526L74763k40733l744667
$$ -1359529 -2812164 3607031 11544339 11720797 5323895 968369 1343132 1102399 -2642268
11285b642268l141104R99696K671248Q54689j68169R94667J546949O67583O02511
$$ -2642268 -5783372 -4783676 -2112428 -1257739 -1425908 -431241 1115708 1783291 2385802
11276B385802J600160J322276l70076r61311Q8395Q09627Q65341J546710J744868
$$ 2385802 3985962 5308238 4938162 3976851 4065246 4874873 5740214 7286924 9031792
11267I031792p88527l941720k962210J329010K488279j353917m059357j657375
$$ 9031792 8243265 4301545 1339335 2668345 5156624 3802707 -256650 -1914025
11259a914025J012046q46602k936794P06610N911389L431389n793795j0128135
$$ -1914025 -901979 -1748581 -4685375 -3978765 1932624 5364013 -429782 -10557917
11251a0557917l523671N988991P686904J654802l734729l385863M78225L305539
$$ -10557917 -14081588 -8092597 -405693 1249109 -2485620 -5871483 -5393258 -2087719
11243b087719K745706o79629m031799l772443L86467M339934M351333J590736
$$ -2087719 657987 -21642 -4053441 -7825884 -7439417 -3099483 1251850 2842586
11235B842586k95667l70647j78669O0526J157202J622861r84291n034300n547203
$$ 2842586 2546919 2176272 1997603 2058129 3215331 4838192 3853901 -1180399 -6727602
11226f727602j376534K415614J712679q38312n38556J835682J711027j570385
$$ -6727602 -8104136 -5688522 -3975843 -4814155 -5352711 -3517029 -1806002 -3376387
11218c376387l557336j428654K263334L803087K867624J162986o56635k440069
$$ -3376387 -6933723 -8362377 -6099043 -2295956 571668 1734654 1078019 -1362050
11210a362050k920017j157267J426268K600040K328609K382707L274886L341081
$$ -1362050 -4282067 -5439334 -4013066 -1413026 915583 3298290 6573176 9914257
11202I914257J168975k144393l676780j574437K531982M359875J392351l606846
$$ 9914257 11083232 8938839 5262059 3687622 6219604 10579479 11971830 8364984
11194H364984n305950k401366Q78019Q97475p01667p33763P2561q00421k071118
$$ 8364984 3059034 657668 1535687 2433162 1731495 997732 1070293 269872 -1801246
11185a801246j72072M044342N339587J957332j456320j156207k9409k266734n765859
$$ -1801246 -1973318 2071024 7410611 9367943 7911623 6755416 6726007 4459273 -1306586
11176a306586m880612P43930N190887M376491P43319j432926j631703j662504
$$ -1306586 -6187198 -5443268 -252381 4124110 4867429 3434503 1802800 140296
11168A40296j582179l39606R65544M6124k365983k578594O39230L493197K186721
$$ 140296 -1441883 -1781489 -815945 -769821 -3135804 -5714398 -5075168 -1581971 604750
11159F04750j571593l086751j514000m20909j452257j645951J154280M013867
$$ 604750 -966843 -4053594 -5567594 -5988503 -7440760 -9086711 -7932431 -3918564
11151c918564L270911M43820k59167J270033J173299j865409m597906m322503
$$ -3918564 -647653 -203833 -463000 807033 1980332 114923 -4482983 -8805486
11143h805486k225634n15406M86111J119499J211792J351460K537689L581288
$$ -8805486 -11031120 -11546526 -11060415 -9940916 -8729124 -7377664 -4839975 -1258687
11135a258687K025019j338613k690330j410322j556172m545193n300159k9340
$$ -1258687 766332 -572281 -3262611 -4672933 -6229105 -10774298 -16074457 -16103797
11127a6103797O451599O972061K595808L63549K083297K625897l93451k533495
$$ -16103797 -9652198 -2680137 -84329 279220 2362517 4988414 4594963 2061468
11119B061468m63164K185944P33729l170347m399984j900839O65830M94914j411574
$$ 2061468 1598304 3784248 4517977 1347630 -3052354 -4953193 -4287363 -3792449 -5204023
11110e204023k320444n75442L166913O052618N282685J459443j587178j489816
$$ -5204023 -7524467 -8099909 -4932996 1119622 6402307 7861750 6274572 4784756
11102D784756j07021k5267m39086Q10730K635745J633264k532340n890919n143187
$$ 4784756 4677735 4652468 4213382 5024112 7659857 9293121 6760781 869862 -4273325
11093d273325j416159K060054L828830M108369K691936m29254l038103k305831
$$ -4273325 -5689484 -3629430 199400 4307769 6999705 6570451 3532348 1226517
11085A226517Q43230J801754j315347l824629n81086N502636O157147k93334n381216
$$ 1226517 2069747 3871501 2556154 -1268475 -1849561 3653075 9810222 9516888 4135672
11076D135672k225691M280646M734708q04491l643379k84195K804794J29911m593335
$$ 4135672 1909981 6190627 10925335 10120844 6477465 6193270 8998064 9127975 4534640
11067D534640n211718k280665k79515P3025J148351K829426L000872J945841J475517
$$ 4534640 -677078 -2957743 -3237258 -3164233 -2015882 813544 3814416 5760257 7235774
11058G235774R89270j138492l460150l200193j094845j20027l89844J84549J222583
$$ 7235774 8225044 7086552 3626402 426209 -668636 -788663 -1178507 -993958 228625
11049B28625P55319k53850L18337M97268k835273o319323l307904M414795O842643
$$ 228625 983944 730094 1048431 1545699 -1289574 -7608897 -10916801 -6502006 340637
11040C40637O55741m855126j842695M329237M479553k31080k393068j368264k094170
$$ 340637 996378 -3858748 -5701443 -1372206 3107347 2876267 483199 -885065 -2979235
11031b979235l922005j416874M283887N398696K98163l229922m97042L059599
$$ -2979235 -6901240 -8318114 -4034227 1364469 1662632 -1567290 -2064332 995267
11023I95267J681840j647947j533282Q02649J156637J51673P88334J814264K58037
$$ 995267 2677107 1029160 -504122 298527 1455164 1606837 2395171 4209435 4467472
11014D467472j945567o25936K817299L001310n14060k521832r86324m0370k213302
$$ 4467472 2521905 1895969 4713268 7714578 7200518 4678686 3692362 3651992 1438690
11005A438690l710260r78129K781188K299921j518090l007745k20189K675550
$$ 1438690 -2271570 -3249699 -468511 1831410 313320 -2694425 -2914614 -239064
10997b39064J909026q33540j619211M0206J226298K87310j177783j418495j373464
$$ -239064 1669962 836422 -782789 -742583 483715 771025 -406758 -1825253 -3198717
10988c198717k715671m339485l324286N38663L780975L973232L012637L519420
$$ -3198717 -5914388 -10253873 -13578159 -13039496 -9258521 -5285289 -2272652 1246768
10980A246768L971031R96650m059157n188419k8016N363250L475883m464295r226008
$$ 1246768 5217799 6214449 2155292 -3033127 -3061143 2302107 5777990 1313695 -7912313
10971g912313m937454L670956P353950L390748k397077l769289q33142K064214
$$ -7912313 -12849767 -9178811 -1824861 1565887 -831190 -4600479 -5433621 -3369407
10963c369407K258146N20875j256139j659414O1288L063823M606893K811141o00332
$$ -3369407 -1111261 -590386 -1846525 -3505939 -3444651 -380828 4226065 7037206 6436874
10954F436874k372864j955734j160939k63260K011046M425542L310506j752330
$$ 6436874 4064010 2108276 947337 684077 2695123 7120665 10431171 8678841
10946H678841o043688n800115k977885j314908p67797P40010K608339K614305
$$ 8678841 2635153 -3164962 -6142847 -7457755 -8225552 -7485542 -4877203 -2262898
10938b262898J098822K24442O8939q84262k141950j739175J05508J406165K033817
$$ -2262898 -1164076 -939634 -870695 -1754957 -3896907 -5636082 -5530574 -4124409 -2090592
10929b090592L182595L511698J88755n470957p655231l259103L632790O462947
$$ -2090592 1092003 4603701 4792456 -678501 -8333732 -11592835 -7960045 -1497098
10921a497098L290427k228772n022722k738712K369874M899144J611952m212525
$$ -1497098 1793329 -435443 -5458165 -8196877 -5827003 -927859 684093 -3528432
10913c528432o053144k133647K744051M010077K526551J455776J358364R19393
$$ -3528432 -9581576 -11715223 -8971172 -4961095 -2434544 -978768 379596 1298989
10905A298989m7577j026883k297083l574648k989635J23982L093226L096416J011812
$$ 1298989 1251412 224529 -2072554 -5647202 -8636837 -8512855 -5419629 -2323213 -1311401
10896a311401l81968m30919n1930J121768L414855M081298K3056o311382q238356
$$ -1311401 -1693369 -2124288 -2176218 -1054450 2360405 6441703 6464759 153377 -8084979
10887h084979l570695J899820K208109p68705q03241L207095N870007L405079
$$ -8084979 -11655674 -9755854 -7547745 -8316450 -9119691 -5912596 -42589 3362490
10879C362490j223747l004088j373437O22125J243222Q27211p34359l294624l884050
$$ 3362490 2138743 -865345 -2238782 -1616657 -373435 453776 -280583 -3575207 -7459257
10870g459257M88307O768302P585341J334545m303555k779225J800729J296278
$$ -7459257 -6970950 -202648 7382693 8717238 4413683 1634458 3435187 4731465
10862D731465l491941m066416K133782P443773N593122M56786j212709j48208
$$ 4731465 1239524 -2826892 -693110 6750663 12343785 12800571 11587862 11439654
10854A1439654j584673n346749n843559j339100K975888K616083k32155r43867
$$ 11439654 9854981 4508232 -1335327 -2674427 301461 2917544 2685389 1741522
10846A741522O25108Q02967j798314m227180l509032m91924J860478K356052J952089
$$ 1741522 2366630 3169597 1371283 -2855897 -6364929 -6856853 -4996375 -2640323 -688234
10837f88234J218004j62626j334120m11435K199782L147483P65352j866161j180984
$$ -688234 529770 367144 -966976 -1378411 821371 3968854 4734206 2868045 1687061
10828A687061J448618K025767L12154m06357M47921l26275l440410m620173j083956
$$ 1687061 3135679 5161446 5473600 5067243 5515164 5188889 1748479 -2871694 -3955650
10819c955650L321912L144011r81171l558863j962287P84196Q97177j518987l455259
$$ -3955650 -633738 2510273 1529102 -2029761 -3992048 -3207852 -2310675 -3829662 -7284921
10810g284921k635648O74253M289945N846724M566909J753146o05424j568036
$$ -7284921 -9920569 -9246316 -4956371 890353 5457262 7210408 6604984 5036948
10802E036948j429188p97044j82079j37056q93411j727762j416185J85961J451001
$$ 5036948 3607760 2810716 2628637 2491581 1598170 -129592 -1545777 -1359816 91185
10793I1185P01376j386467k254596q91397O73410O33329M09622J775553K549312
$$ 91185 792561 -593906 -2848502 -3739899 -3066489 -2433160 -2023538 -247985 2301327
10784B301327n76296n281698n124672P42591M986956K378847k578473k803628
$$ 2301327 1725031 -3556667 -8681339 -7938748 -2951792 -572945 -3151418 -5955046
10776e955046J163304L665714K897124J143559r64396l724782m208843k3486M434366
$$ -5955046 -4791742 -1126028 1771096 2914655 1950259 -1774523 -5983366 -6006852 -1572486
10767a572486L079784j665041k043832K151017L164317j240259l801060m25161
$$ -1572486 1507298 -157743 -2201575 -50558 3113759 1873500 -1927560 -2352721
10759b352721K682733k03167m585975l464725J419886L256822Q56999j185932
$$ -2352721 330012 126845 -4459130 -7923855 -6503969 -3247147 -2390148 -3576080
10751c576080m78673R02861P60706r25448k931049l293409p36467K632926L060272
$$ -3576080 -4054753 -3151892 -2391186 -3316634 -6247683 -9541092 -10277559 -7644633 -4584361
10742d584361J047259J127303L772989L255522k818114p754992m946265K082475
$$ -4584361 -3537102 -2409799 1363190 4618712 1800598 -5954394 -10900659 -8818184
10734h818184N045706K664794M57829J183020K116857J022750p91972j494218
$$ -8818184 -3772478 -1107684 -649855 533165 2650022 3672772 2880800 1386582
10726A386582q18860P12203J884095J104655j117030j947003o52444k90976k276348
$$ 1386582 567722 1279925 3164020 4268675 3151645 1204642 552198 261222 -2015126
10717b015126l005452J88207L378238J429090l628619n111410j141596L495270
$$ -2015126 -5020578 -4832371 -1454133 -25043 -3653662 -8765072 -9906668 -6411398
10709f411398M362034J920946p79921j555198j91273J641349J978883J185468
$$ -6411398 -2049364 -128418 -908339 -2463537 -2654810 -1013461 965422 2150890
10701B150890J362285K360538J365444k226327n159781n355892m585644m061252
$$ 2150890 3513175 5873713 7239157 5012830 -146951 -5502843 -10088487 -14149739
10693a4149739j972837J872944L831285K204008N27747J531529K649196J331458
$$ -14149739 -16122576 -14249632 -10418347 -8214339 -7686592 -6155063 -3505867 -2174409
10685b174409k39702J19678L15222j232138j858656j98674L51445j526256j307207
$$ -2174409 -2414111 -2294433 -1979211 -3211349 -5070005 -5268679 -4917234 -6443490 -7750697
10676g750697K751899M435735q9515m116956j004920L995127K390872l085144
$$ -7750697 -4998798 -563063 -652578 -4769534 -5774454 -1779327 611545 -2473599
10668b473599l738183k886N54220k591421k609990J974230N200355M143518J819878
$$ -2473599 -6211782 -6214668 -5660448 -8251869 -10861859 -8887629 -3687274 456244 2276122
10659B276122j81755k971317m601211j699105L407939N068527K840600K43923
$$ 2276122 2094367 -876950 -5478161 -7177266 -3769327 1299200 4139800 4383723
10651D383723k505192o081858n833114J630283Q584909M874512n329986q224259
$$ 4383723 1878531 -4203327 -10036441 -8406158 178751 5053263 -276723 -8500982
10643h500982j213532M443220K650490L1354J527319K192322j489029m197954
$$ -8500982 -9714514 -5271294 -2620804 -2589450 -1062131 1130191 -358838 -4556792
10635d556792j906035Q16878k74068j937748r74280l57496k067294j871794K666171
$$ -4556792 -6462827 -5645949 -5920017 -7857765 -8832045 -9189541 -11256835 -13128629 -10462458
10626a0462458O177150L567912j958448m360495k784829L33266L646798N336254
$$ -10462458 -4285308 -717396 -2675844 -7036339 -9821168 -9487902 -5841104 -504850
10618e04850K819018k173955l821188p90542J484429J94050k58060K894972M723188
$$ -504850 2314168 140213 -3680975 -4471517 -2987088 -2793038 -3051098 -156126 4567062
10609D567062J009459l652595k786687J652018K712239p02428k849785j72255
$$ 4567062 5576521 1923926 -862761 789257 3501496 2799068 -50717 -222972
10601b22972L732670L122087k379569o835541m994394O47000K703079n70797k575031
$$ -222972 3509698 6631785 4252216 -2583325 -7577719 -6930719 -4227640 -4798437 -7373468
10592g373468Q83949M236285J296315m001618l987973K35537J809741O6631k85967
$$ -7373468 -6489519 -2253234 -956919 -4958537 -8946510 -8710973 -6901232 -6834601 -7120568
10583g120568Q62583K073j238623J350144N050910L741736p64397j587795P83529
$$ -7120568 -6257985 -6255912 -7494535 -6144391 -1093481 2648255 1883858 296063 1079592
10574A079592P5161l529672m358969k678849l080516l542755R55863O181049M075767
$$ 1079592 1154753 -2374919 -6733888 -9412737 -12493253 -16036008 -15080145 -8899096 -4823329
10565d823329j790099j468311K911375R37579n521512m570016L096790M321681
$$ -4823329 -6613428 -8081739 -5170364 -4232785 -9754297 -14324313 -11227523 -6905842
10557f905842k120740k840421M681169O203335l259092r435586l527598L744235
$$ -6905842 -9026582 -11867003 -7185834 -982499 -4241591 -13677177 -17204775 -13460540
10549a3460540K827429M15328K877029L407132k300185n066427P05218N282141
$$ -13460540 -10633111 -10217783 -7340754 -3933622 -6233807 -11300234 -10595016 -5312875
10541e312875J079585l753131j167622K579962L75662k768208j462619l47652
$$ -5312875 -4233290 -7986421 -9154043 -6574081 -6198419 -8966627 -10429246 -10776898
10533a0776898k479918k031191K173203J716285m169684m039228M299439P168387
$$ -10776898 -13256816 -15288007 -13114804 -11398519 -15568203 -19607431 -15307992 -8139605
10525h139605m66414m728372J984766P270470K230285l508082k819220l939255
$$ -8139605 -8606019 -13334391 -11349625 -4079155 -1848870 -5356952 -8176172 -12115427
10517a2115427r374179o767931N273495Q610497k333196q041152Q44208O519125
$$ -12115427 -21489606 -28257537 -22984042 -14373545 -16706741 -24747893 -23903685 -17384560
10509a7384560n07217k901357O674202P284698q467916j4227323J619836J0258201
$$ -17384560 -17891777 -20793134 -14118932 -6834234 -15302150 -29529473 -27909637 -17651436
10501a7651436l830505j0873798N796357J1927843j2007729k4890073p42991J2178947
$$ -17651436 -21481941 -32355739 -26559382 -14631539 -26639268 -51529341 -52272332 -40093385
10493d0093385k0696840m1068965j372677K0346869o0194100j48029132o9547664
$$ -40093385 -60790225 -101859190 -103231867 -82884998 -143079098 -291108230 -360655894
10486c60655894J44472405K54783662J40378762l5981227p4328599k765695K4963013
$$ -360655894 -216183489 38600173 178978935 142997708 68669109 65903414 90866427
10479I0866427j8945721l8673066l551751J8515871j830693j5532448J104179
$$ 90866427 71920706 33247640 29695889 48211760 46381067 30848619 31952798
10472C1952798R332238q483780j6390074K641076J5358345K074901j0765041m101305
$$ 31952798 41285036 32801256 16411182 19052258 34410603 36485504 25720463 21619158
10464B1619158K378927n760233j0605556l29292P453333R34726m585031J209337
$$ 21619158 23998085 18237852 7632296 7303004 14756337 15691063 11106032 12315369
10456A2315369M473764l101818p197879N89819O380553J008240l847486n6244
$$ 12315369 16789133 13687315 6489436 7079255 13459808 14468048 10620562 10564318
10448A0564318K388006k258031l577243K641893M435908k540791n135540K153449
$$ 10564318 12952324 10694293 7117050 9758943 14194851 11654060 6518520 8671969
10440H671969N797539j374004o582368j162304M125411O84364k434836J884459
$$ 8671969 14469508 13095504 6513136 5350832 9476243 10160607 7725771 9610230
10432I610230M123826k697109p908221k056293N863275M621463p90624r29159
$$ 9610230 13734056 11036947 3128726 1072433 6935708 11557171 10766547 9837388
10424I837388J437475j46772k646676j250971L95190j640019l328773j576880
$$ 9837388 11274863 11128091 8481415 7230444 7625634 5985615 2656842 1079962
10416A079962q28453k960866j927531M057205O963247K990911k13244K169141
$$ 1079962 251509 -2709357 -4636888 -579683 6383564 9374475 9161231 11330372
10408A1330372L492704q89181m568823k748404r78555k802323j891688M516471
$$ 11330372 14823076 13933895 9365072 6616668 5638113 2835790 944102 5460573
10400E460573P680829K517702k480753o47037Q97016m145354p988128k940085
$$ 5460573 13141402 15659104 13178351 12531314 13428330 9282976 1294848 -1645237
10392a645237L437229J410669l489135j002885N035933L945720k702928m638442
$$ -1645237 1791992 3202661 -286474 -1289359 3746574 7692294 4989366 350924
10384C50924q05614P40517k056440l317339q81198J306008J621367K365386L835801
$$ 350924 -454690 285827 -1770613 -5087952 -5969150 -4663142 -3041775 -676389 3159412
10375C159412M231044L854985L382249R63350l236779l987435J110842N382510
$$ 3159412 7390456 11245441 14627690 15591040 12354261 8366826 9477668 14860178
10367A4860178J880606n736863q341437l831899K112773M491745K352156k825868
$$ 14860178 16740784 11003921 2662484 -1169415 943358 5435103 7787259 4961391
10359D961391o939660n277948R10409M537351K995333J870068M239714M558083
$$ 4961391 -1978269 -7256217 -6345808 -1808457 1186876 3056944 7296658 11854741
10351A1854741p73689n388133l279490R30666P76690p35364J682988M372702J548070
$$ 11854741 11081052 5692919 2413429 3344095 4120785 3385421 5068409 9441111 10989181
10342A0989181k992606k571721m90510l646899p821823l231315P405443J0507246
$$ 10989181 7996575 5424854 4934344 1287445 -6534378 -9765693 -2360250 8146996
10334H146996J917893p259714p364374j514938K875772M039207L245783L54990
$$ 8146996 10064889 2805175 -4559199 -6074137 -3198365 840842 4086625 4441615
10326D441615l552153m928118k688232M0487J086429J745990K911814L319007
$$ 4441615 889462 -4038656 -6726888 -6686401 -5599972 -3853982 -942168 2376839
10318B376839K747950K537598K167136j79761l130793k987072J49569J801123
$$ 2376839 5124789 7662387 9829523 9649762 6518969 3531897 3681466 5482589
10310E482589k55251l103393l610448k257975p66001O14860K067424L143025L649339
$$ 5482589 5227338 2123945 -1486503 -3744478 -4510479 -3895619 -1828195 1314830 4964169
10301D964169L586276K213451p46296l545991m212480k939376p35976K340975
$$ 4964169 8550445 10763896 10017600 6471609 2259129 -680247 -1416223 924752
10293I24752N151049M514857o3299l592802k055442J091721K79985k918904k643826
$$ 924752 6075801 10590658 10527359 6934557 4879115 5970836 6250821 3331917 688091
10284F88091P98247J199846k613156m146722K16648N118313M357074m00703l277411
$$ 688091 1486338 2686184 73028 -4073694 -3857046 1261267 5618341 5217638 1940227
10275A940227k482042o67316K48044O12304Q65189Q55733N34423l61926k066004
$$ 1940227 -541815 -1209131 -961087 -348783 516406 1372139 1906562 1544636 -521368
10266e21368l175961j453876K320556L833281Q13994l164240l393760p72186j40044
$$ -521368 -3697329 -5151205 -2830649 1002632 1816626 -1347614 -4741374 -5513560 -5653604
10257e653604k545814l397325M36446N283992N350410P79236k572431j207749
$$ -5653604 -8199418 -11596743 -11160297 -5876305 -525895 253341 -2319090 -3526839
10249c526839J720886J568484j284845k732928j069242J356180K181190J729484
$$ -3526839 -1805953 -237469 -1522314 -4255242 -5324484 -3968304 -1787114 -57630
10241e7630J177981N68959k27318l79093P18836K076213K017693K25224j571258
$$ -57630 1120351 1689310 1461992 1082899 1801735 3877948 5895641 6120865 4549607
10232D549607j139728J569635L569042K086010j419849k962723k070980k274524
$$ 4549607 3409879 4979514 8548556 10634566 9214717 6251994 4181014 1906490
10224A906490m085154k706646L409354P091526J982440o533976q031456k149649
$$ 1906490 -2178664 -4885310 -1475956 5615570 7598010 1064034 -6967422 -9117071
10216i117071K124651J236227R07123M054421N356771J573781k101916j215113
$$ -9117071 -6992420 -5756193 -4849070 -794649 4562122 6135903 4033987 2818874
10208B818874M69494j429986l841088k264924J038166J599826N25014J092012
$$ 2818874 3288368 1858382 -1982706 -4247630 -3209464 -1609638 -1084624 7388
10200G388J915375J72777k033379j144978J067573N05440k042483k601106o83640
$$ 7388 1922763 2095540 62161 -1082817 -15244 490196 -1552287 -4153393 -4837033
10191d837033J082791J744830J676316J69104k168557k026980J149437K687041
$$ -4837033 -3754242 -2009412 -333096 -163992 -2332549 -4359529 -3210092 -523051
10183e23051M91360k83971L487575N500248K22044n889501l962996J921906J536515
$$ -523051 -31691 -315662 3171913 8672161 8894205 3004704 -958292 963614 2500129
10174B500129l280735j797835N736841P342062R1451m465877l96544K723776k268299
$$ 2500129 -780606 -2578441 3158400 10500462 10591913 6126036 5729492 8453268 6184969
10165F184969o807512k005903M898587K729262m309054m195252K242274L765414
$$ 6184969 -622543 -2628446 2270141 4999403 690349 -3504903 -1262629 2502785
10157B502785j117304k212624L510108O148965R7345o015396l540274K405633
$$ 2502785 1385481 -827143 2682965 8831930 8929275 2913879 -626395 1779238
10149A779238K171460k752438l179093K563251O584290L910028j282333l387602
$$ 1779238 3950698 1198260 -1980833 582418 7166708 11076736 9794403 6406801
10141F406801k786565k594528k612347m43857L457234N382047K961752j773275
$$ 6406801 3620236 1025708 -1586639 -2030496 1426738 6808785 9770537 7997262
10133G997262m518386l306709m80636L57627r31817r53288J819501L889008J530394
$$ 7997262 3478876 172167 -308469 49158 -882659 -1835947 -16446 3872562 5402956
10124E402956l052452m281797j278743J274494R10945P54383K862174L457596
$$ 5402956 2350504 -1931293 -3210036 -1935542 -1024597 -270214 2591960 6049556
10116F049556q87328o289860o197800o91309M186544M943098L229435R64205j508842
$$ 6049556 5162228 -1127632 -7325432 -8016741 -3830197 1112901 4342336 5306541 3797699
10107C797699k596806m72484K475582J606225k555884m226919j103348K281710
$$ 3797699 1200893 728409 3203991 4810216 2254332 -1972587 -3075935 -794225
10099g94225J980673o4959q83796j248700j998792o47490L782470O764731M251233
$$ -794225 1186448 1121489 237693 -1011007 -3009799 -3657289 125181 6889912 11141145
10090A1141145n85197j899893o271m4559l147923m581512j070608M393916O298715
$$ 11141145 10555948 8656055 8649784 8605225 5457302 875790 -194818 4199098 10497813
10081A0497813K626161l544425o975265m981773k00754K295466J221775J81424
$$ 10497813 13123974 9579549 2604284 -2377489 -2578243 -282777 938998 1120422
10073A120422J555979K723730Q54542j869219j537170J365145L072840K163226
$$ 1120422 2676401 5400131 6254673 4385454 2848284 4213429 7286269 9449495
10065I449495L14006j244134k339601j924484P98841L763198L771737P16145k436887
$$ 9449495 9763501 8519367 6179766 4255282 5054123 8817321 12589058 13305203 10868316
10056A0868316l505874k834569j805592j465630j906829j814724K7192K145715
$$ 10868316 7362442 4527873 2722281 1256651 -650178 -2464902 -2437710 -291995
10048b91995J847848l4638K03788K410915J791835k364911l406470K265661P555035
$$ -291995 1555853 1521215 1725003 4135918 5927753 3562842 156372 2422033 9977068
10039I977068M547173k930834n255655j970308r40111m187881n166921j044850
$$ 9977068 14524241 11593407 6337752 4367444 3427333 -760548 -5927469 -6972319
10031f972319K362658Q73472j520071m48787J715484J135566q81941j098276M01240
$$ -6972319 -4609661 -3736189 -5256260 -5705047 -3989563 -2853997 -3735938 -4834214 -4432974
10022d432974K017285L579638M319340K305040j072277r43230L264706N139171
$$ -4432974 -2415689 1163949 5483289 7788329 6716052 5772822 9037528 14176699
10014A4176699P15051m583297l910509O23816K035439n16422k010153r13199p98532
$$ 14176699 14891750 10308453 6397944 7021760 9057199 8540777 6530624 5617425 4818893
10005D818893k835817l577525j414072O15302L48270n9175J474197L124177K291077
$$ 4818893 1983076 -1594449 -3008521 -2393219 -2044949 -2104124 -629927 2494250 4785327
9996D785327m41406k766207l628141k871866l84368K462044K857400J71189k510237
$$ 4785327 4343921 1577714 -2050427 -4922293 -5306661 -2844617 12783 183972 -2326265
9987b326265k457077p88871J87769O79373J672593J863454j10241k167799j491591
$$ -2326265 -4783342 -5572213 -5384444 -4705071 -3032478 -1169024 -1279265 -3447064 -4938655
9978d938655O51216J107789N61951J817656L216331L90088m822566m771704K029025
$$ -4938655 -4287439 -3179650 -2617699 -800043 2416288 2806376 -2016190 -6787894 -4758869
9969d758869O896407L551292k404185k902413J73709K08663j754914J36099M434232
$$ -4758869 2137538 5688830 3284645 382232 555941 764604 -990310 -854211 3580021
9960C580021M040921q98386k674205M98153J431657l023987o302352l645531K01566
$$ 3580021 7620942 6722556 4048351 4546504 5978161 2954174 -3348178 -6993709 -6792143
9951f792143K21292m93851K061339M639259K783179r65100j752429k48662M50404
$$ -6792143 -6570851 -7064702 -5003363 -364104 2419075 1453975 -298454 -547116 -96712
9942i6712P72110J530277J48629l719636m461248N86466M271119j40192p165486
$$ -96712 675398 2205675 2354304 -1365332 -5826580 -5240114 -968995 -1109187 -8274673
9933h274673o893097l12119L272702J284665j14010K205708M525542M263210K979488
$$ -8274673 -15167770 -15479889 -12207187 -10922522 -11036532 -8830824 -4305282 -42072 2937416
9924B937416J115853k360035n016605l227144Q55422J931433L18101L24498J244311
$$ 2937416 4053269 1693234 -3323371 -6550515 -5695093 -3763660 -3445559 -3121061 -1876750
9915a876750j014187m220466j913085M453782O026504Q84524k664317k5589K697084
$$ -1876750 -2890937 -7111403 -9024488 -4570706 1455798 2340322 -323995 -349584 2347500
9906B347500L541l983266l296236N48953K519620J562292m10256k139197k404854
$$ 2347500 2351041 -1632225 -4928461 -4379508 -1859888 -297596 -707852 -2847049 -5251903
9897e251903m88979R55594j279583m812636m766103k248896j070208K624842J4857818
$$ -5251903 -5740882 -4785288 -6064871 -10877507 -15643610 -17892506 -18962714 -16337872 -1480054
9888a480054K7271709K1999396j376893j9567603j5773436j811680K077798l730964
$$ -1480054 25791655 47791051 46414158 26846555 11073119 9261439 11339237 7608273
9880G608273n202955l49924Q37865k908344k326340L948871N975965K6951m829662
$$ 7608273 2405318 2055394 2893259 -15085 -2341425 1607446 7583411 7610362 2780700
9871B780700j909710L185899L001303r10097k878812j650244O43366K459952K360582
$$ 2780700 870990 4056889 7058192 6148095 3269283 1619039 2262405 4722357 7082939
9862G082939n73258l570549k348987K018352L772498J227581j152985r30543j256006
$$ 7082939 6509681 2939132 590145 2608497 6380995 7608576 6455591 5525048 4269042
9853D269042l721124m332226n09135L573817L164287l3574j479383o88257N7934
$$ 4269042 547918 -3784308 -4293443 -719626 2444661 2411087 931704 243447 301381
9844C01381Q15553K951542M914579L703348o1016k384779j385290M29439n716
$$ 301381 1116934 4068476 8983055 12686403 12625387 10240608 8855318 9284757 9279041
9835I279041k340648l733652k595970j87584J352103J362892L34400j559151l692624
$$ 9279041 6938393 3204741 608771 421187 1773290 3136182 3470582 1911431 -1781193
9826a781193l665810L629L871301K607125k710746m562847o7045L794948J030694
$$ -1781193 -5447003 -5443374 -1572073 1035052 -1675694 -6238541 -6305586 -2510638 -1479944
9817a479944l146823o05880N751439O201982J83676k965762L12450K690280m28302
$$ -1479944 -4626767 -5232647 518792 6720774 6904450 3938688 4251138 6941418 6513116
9808F513116l020683K43676M242455K405027k030202k186359P52327R39036j211778
$$ 6513116 3492433 3736109 7978564 10383591 8353389 6167030 6919357 7858393 6646615
9799F646615q11603J360875K969m226149m582589M67244M214840K225246j415762
$$ 6646615 5835012 7195887 7198856 2972707 -1609882 -1142638 3072202 5297448 3881686
9790C881686j527871O31024J024342p49655k426358k803330j459831J836824M877582
$$ 3881686 2353815 2984839 4009181 3259526 833168 -1970162 -3429993 -1593169 3284413
9781C284413L902580n94145l032638p84962J478550m88795l163667j242873L034823
$$ 3284413 7186993 6592848 3560210 2775248 4253798 3765003 601336 -641537 2393286
9772B393286L598925R23177O81137L020150J809719m263789q257701n729030j454403
$$ 2393286 5992211 6915388 7596525 10616675 12426394 8162605 -95096 -5824126 -7278529
9763g278529r21149j657396J069783N074889M773406P55718j199865O80716K352813
$$ -7278529 -8199678 -9857074 -8787291 -3712402 1061004 1816722 616857 1297573 3650386
9754C650386J036096j551110l365119m375834m001314q54599L701808N729046
$$ 3650386 4686482 3135372 -229747 -4605581 -8606895 -9461494 -5759686 -30640
9746c0640L908597J331374Q72626J736874J763704M82614j284148k693091l023552
$$ -30640 3877957 5209331 6081957 7818831 9582535 10065149 8781001 6087910 3064358
9737C064358k365775k095487k727419k286040M71513K799419J871423L02143K401097
$$ 3064358 698583 -1396904 -4124323 -6410363 -5938850 -3139431 -1268008 -965865 1435232
9728A435232N979304M662823j336549m372419j245871J865073k9042k882023j719145
$$ 1435232 7414536 12077359 10740810 6368391 5122520 6987593 6958551 4076528 2357383
9719B357383L64387j513870m226566j623890M045111M619540j144805n503881
$$ 2357383 2721770 1207900 -3018666 -4642556 -597445 4022095 2877290 -2626591
9711b626591l141816K341078M946733L588677Q81620r61252j079251L3006L74419
$$ -2626591 -5768407 -3427329 1519404 5108081 5989701 5028449 3949198 3982204 4356623
9702D356623j147606k288457n49455K065378J492423j657185k631431o5237K069441
$$ 4356623 3209017 920560 371105 2436483 3928906 2271721 -359710 -424947 1644494
9693A644494J032336j090668j875827j899653j698113n6910K316114J983278j482328
$$ 1644494 2676830 1586162 -289665 -2189318 -3887431 -3944341 -1628227 355051 -1127277
9684a127277l338434p03879K394644J168627k345368k662521Q98272M323323N230927
$$ -1127277 -4465711 -5169590 -2774946 -1606319 -3951687 -6614208 -5715936 -1392613 3838314
9675C838314M105553R91688l534955n288122n95868O425314P111056J40053n964902
$$ 3838314 7943867 8935555 5400600 112478 -483390 5941924 13052980 13193033 7228131
9666G228131m675447K03870J854088N16954O27224J986167P43264k619341l232682
$$ 7228131 2552684 2756554 4610642 5127596 5754820 7740987 8484251 5864910 2632228
9657B632228J01745K916531K311343P71693Q79243J089357n57304k559329k810414
$$ 2632228 2733973 5650504 7961847 8733540 9612783 10702140 10144836 7585507 4775093
9648D775093k133952k093555k061746j141633l06579j13411P68243K207329J356035
$$ 4775093 2641141 547586 -1514160 -2655793 -2962372 -3075783 -2307540 -100211 1255824
9639A255824k074688l285508N55045M644363L407192m87939o49579K213201J884277
$$ 1255824 -818864 -4104372 -3549327 1095036 4502228 4014289 3364710 5577911 7462188
9630G462188k171682l763433p09137J730629K40981j454591p3834J573907L55967
$$ 7462188 5290506 1527073 817936 2548565 2789546 1334955 1261121 2835028 3190995
9621C190995j746798k147527k243401l234828k455528J429726M192251K117640
$$ 3190995 1444197 -703330 -2946731 -6181559 -8637087 -7207361 -3015110 -897470
9613h97470j565287j507760J733352L538281K406423N20839o29569r32364m3905
$$ -897470 -2462757 -3970517 -2237165 1301116 3707539 4228378 3598809 2666445 2622540
9604B622540J325300R80866q72483p47505K031421K965010N9851j681285J105075
$$ 2622540 3947840 4928706 4056223 3308718 5340139 8305149 8365000 6683715 7788790
9595G788790K994346j310697o470851m388518J646380J814078l531188m283754
$$ 7788790 10783136 9472439 3001588 -1386930 259450 2073528 -1457660 -5741414
9587e741414K076391O138901K489919j891052m84531K058902n87416m803123l659054
$$ -5741414 -3665023 2473878 4963797 3072745 2588214 4647116 4059700 -743423 -4402477
9578d402477R72360K155256j95177k33750K984147M279629J740143n34612k38844
$$ -4402477 -3430117 -1274861 -1470038 -1703788 1280359 5559988 7300131 6765519 6526675
9569F526675m09293k795282l798492p14976K762934J910366j507451k315042m80171
$$ 6526675 6117382 3322100 -476392 -1191368 1571566 3481932 1974481 -340561 -820732
9560h20732n25898k753668j991327K654599L823676k893133r442421n272418O237409
$$ -820732 -1346630 -4100298 -6091625 -3437026 386650 -2506483 -11948904 -17221322 -10983913
9551a0983913J1273077N451837n83864J444984N315186K322926l837521m024725
$$ -10983913 289164 5741001 5157137 6602121 11917307 14240233 10402712 6377987
9543F377987P72910J854739k399934m960308k412696J005255J882078J360834
$$ 6377987 7150897 9005636 6605702 1645394 -767302 237953 2120031 3480865
9535C480865j43710l542533n693383j976415M592514N544808j5959l527359n52954
$$ 3480865 3337155 -205378 -5898761 -7875176 -3282662 2262146 2246187 -1281172 -1834126
9526a834126L033108K029343k24968J11704K70726k153600l134407L3966K148466
$$ -1834126 1198982 3228325 3003357 3115061 3385787 1232187 -1902220 -1868254 280212
9517B80212j243671n099673k926893K102570K807294N3001n7024K534024K841338
$$ 280212 -963459 -6063132 -8990025 -6887455 -4080161 -4027160 -4084184 -1550160 1291178
9508A291178Q12942R38510L045726K418748j162109k836236j346891n01449j538864
$$ 1291178 2104120 3042630 6088356 8507104 7344995 4508759 3161868 2660419 1121555
9499A121555j640000o06898j300708k563932J76684N656107O527827J037119l402706
$$ 1121555 -518445 -1125343 -2426051 -4989983 -4813299 842808 7370635 8407754 5005048
9490E005048k011396L09168j146727k095588K312334O885909L424961n423387
$$ 5005048 2993652 3302820 2156093 60505 2372839 9258748 12683709 7260322
9482G260322q886342l588885K404078K063266j713120k489561K43745K012071
$$ 7260322 -1626020 -5214905 -2810827 -747561 -2460681 -4950242 -4706497 -2694426
9474b694426M66980k200480k765404n02802K519801L781533L096530K557314K877221
$$ -2694426 -2227446 -4427926 -7193330 -7696132 -5176331 -1394798 1701732 4259046 7136267
9465G136267J498510l056062o582944l531941M038122P217187J967160n054453
$$ 7136267 8634777 5578715 -1004229 -4536170 -498048 6719139 8686299 3631846
9457C631846n976242k274092m76027j085999P72474N045850N455356M8361m680637
$$ 3631846 -2344396 -4618488 -5094515 -6180514 -5408040 -362190 5093166 5141527 460890
9448D60890l846393j598123l188350n308266j530014O156223R305054N327334
$$ 460890 -3385503 -4983626 -8171976 -13480242 -15010256 -8854033 451021 5778355
9440E778355J13907j933012k908340m625665m158167J9533L341989J604769k052634
$$ 5778355 5892262 3959250 1050910 -3574755 -7732922 -7713389 -4371400 -2766631 -4819265
9431d819265j855587J758729L339666R57384j549782p16637K282775M084864K935547
$$ -4819265 -6674852 -4916123 -1576457 -619073 -2168855 -2885492 -602717 3482147 6417694
9422F417694m02074l323044k909329J149872N202130N110515J034428k930565
$$ 6417694 6015620 2692576 -216753 933119 6135249 11245764 12280192 9349627
9414I349627l612765j593275M58414N33328j418729l464167l311389j134380K06977
$$ 9349627 5736862 4143587 4602001 5135329 3716600 252433 -3058956 -4193336 -3986359
9405c986359p97065j670736K07239K686411J457289k855186m469019n25949M343254
$$ -3986359 -4783424 -6454160 -6246921 -3560510 -2103221 -4958407 -9427426 -9953375 -5610121
9396e610121M088374n51997l071775L15791N956830P158640J853394n128006p222771
$$ -5610121 -1521747 -2073744 -5145519 -4829728 1127102 8285742 10139136 5011130 -2211641
9387b211641l025963K444663L485743j5112l029345j845183J527599K386964k69239
$$ -2211641 -5237604 -2792941 692802 677690 -2351655 -4196838 -2669239 -282275 -551514
9378e51514k355956l24945L492870L436654j624236n768803l341289L198161O076256
$$ -551514 -2907470 -3232415 260455 3697109 2072873 -3695930 -7037219 -3839058 2237198
9369B237198K289696k983966l955443j349331M62611L32692O17946K073301K412528
$$ 2237198 4526894 1542928 -2412515 -3761846 -3299235 -2966543 -2348597 -275296 2137232
9360B137232K55093k373611k527669J67541L192111L592000P85690k564355l085946
$$ 2137232 2392325 18714 -2508955 -2341414 850697 4442697 5228387 2664032 -421914
9351d21914o48097J415342Q58054n28298j63234J123472Q81049m06546q3992J715667
$$ -421914 -1070011 345331 1203385 675087 511853 1635325 2516374 2109828 2025836 3741503
9341C741503J599989j725954m845201m162133q16519J099839M6441j432370o21410
$$ 3741503 5341492 3615538 -1229663 -5391796 -6208315 -5108476 -5062035 -6494405 -7115815
9332g115815J668429K421616Q28220m25006P11018J993841K17026k639545j098886
$$ -7115815 -5447386 -3025770 -2197550 -2622556 -1911538 82303 299329 -2340216 -3439102
9323c439102M772010P226973J536182n729298n132398J804094M757821l7154m857880
$$ -3439102 1332908 8559881 10096063 4366765 -765633 1038461 5796282 5759128 901248
9314I01248l015900J456200J362433k372974l359996k36220K180864J126053o81803
$$ 901248 -2114652 -658452 703981 -1668993 -5028989 -5265209 -3084345 -1958292 -2640095
9305b640095l73266J062831J575277J373989J562228J674277M66188j853817l496182
$$ -2640095 -3013361 -1950530 -375253 998736 2560964 4235241 4701429 2847612 -648570
9296f48570k979676p76955Q70597J89244j805899k150827K87839L135830L674044
$$ -648570 -3628246 -4405201 -3534604 -3345360 -5151259 -7302086 -7014247 -3878417 -204373
9287b04373K256124J025847O66549N26183P66568J808862K385510R08551j572440
$$ -204373 2051751 3077598 3744147 4270330 5036898 6845760 9231270 10139821 8567381
9278H567381k556040j990016j936061k421541j311758J054368J235479j590483
$$ 8567381 6011341 4021325 2085264 -336277 -1648035 -593667 641812 -948671
9270i48671l371164j417139R56214o6796k010680j10084M019286M089136o70659
$$ -948671 -4319835 -5736974 -4780760 -4847556 -6858236 -6968320 -2949034 1140102 469443
9261D69443l626816q44721K991127K253634j086126j484492J162986K240007L18962
$$ 469443 -3157373 -4002094 -1010967 1242667 156541 -1327951 -164965 2075042 2394004
9252B394004j426830j369189j516335k630563k226464O87280K990539K013655
$$ 2394004 967174 -402015 -1918350 -4548913 -6775377 -6088097 -3097558 -1083903
9244a083903m80593j304399j10471J692492L616880N042580L955019j89925m213486
$$ -1083903 -1564496 -2868895 -2979366 -1286874 2330006 7372586 11327605 11137680 6924194
9235F924194m801556k723151p55080N47093J782744J630930j030813l600085k838835
$$ 6924194 2122638 -600513 -1355593 -808500 974244 2605174 1574361 -2025724 -4864559
9226d864559j57985R56304J275303L649683N674647K192513m452620n477629L91638
$$ -4864559 -5022544 -4066240 -2790937 858746 6533393 8725906 4273286 -1204343 -812705
9217h12705L333389k040488o814252j795268O412008M879189m734673q009912
$$ -812705 2520684 480196 -6334056 -8129324 -1717316 3161873 -1572800 -9582712
9209i582712J29193Q269662O419857o03475l243383j044990P74815J268837K300545
$$ -9582712 -9453519 -1183857 5236000 4632525 1389142 344152 1118967 2387804 4688349
9200D688349K250978j011335m383032l906910j973834l091816n041062j989890
$$ 4688349 6939327 5927992 1544960 -2361950 -4335784 -7427600 -12468662 -14458552
9192a4458552M901549P933968M169033r01547k086820m90306P74708J067416N29099
$$ -14458552 -9557003 -1623035 2545998 1644451 -442369 -932675 -157967 909449 1438548
9183A438548j039881j939981M6630K834719J820363k272629l310392N44890L546099
$$ 1438548 398667 -1541314 -1494684 1340035 3160398 887769 -2422623 -1877733 1668366
9174A668366J799438o88362K73255J756801r2010k223012r9435L357752K042841
$$ 1668366 3467804 2779442 3052697 4809498 4717488 2494476 2395041 5752793 7795634
9165G795634k875895m736855k238194o25399k089909k536493O93717M380654M867747
$$ 7795634 4919739 182884 -2055310 -2680709 -4770618 -7307111 -6613394 -2232740 2635007
9156B635007K781492L44910j488324j599651R90453L631391J628943m302848o850879
$$ 2635007 5416499 5761409 4273085 2673434 3663887 7295278 8924221 4621373 -2229506
9147b229506j691890N671359O745888R74881m537917m818939k188490j280981
$$ -2229506 -3921396 1749963 8495851 9470732 4932815 113876 -2074614 -3355595
9139c355595k333149j597609K514131O087580M229233j886582n632364l662236
$$ -3355595 -5688744 -7286353 -4772222 1315358 5544591 3658009 -1974355 -5636591
9131e636591l58450o30841k107858K57035M615113M456673l17741k513044P66635
$$ -5636591 -5995041 -6625882 -8733740 -8476705 -3861592 595081 277340 -2235704 -1469069
9122a469069L524174J158253k027433p02626K306656J230384k697185l628275
$$ -1469069 2055105 3213358 1185925 483299 2789955 4020339 1323154 -2305121
9114b305121q24544J005774j0663p73377N22481J656749J020803M29246J665903
$$ -2305121 -3129665 -2123891 -2134554 -2907931 -2385450 -728701 292102 721348 2387251
9105B387251L439865L335415Q26883k436612m047916k734647o8718P19856r53018
$$ 2387251 5827116 9162531 9989414 7552802 3504886 770239 701521 1421377 468359
9096D68359j722830P08709L649669L515483J417649O79573Q81088p26967l266597
$$ 468359 -1254471 -545762 3103907 6619390 8037039 8716612 9597700 8870733 5604136
9087E604136l221643q98481j02853j058481J96861L955302M737556r50m773521
$$ 5604136 2382493 1484012 1381159 322678 519539 4474841 9212397 9211447 4437926
9078D437926l851454M91447K397054J363199J099029J862354K58230l697105n194826
$$ 4437926 586472 1077919 3474973 4838172 5937201 7799555 8057785 4360680 -834146
9069h34146j755563K718160L251580J49938k277344j402669J449021L308655K415335
$$ -834146 -2589709 128451 3380031 3529969 1252625 -150044 1298977 4607632 7022967
9060G022967o26727l259900k964165J41821K946194K379167j285003m589338m217476
$$ 7022967 6396240 3136340 172175 313996 3260190 5639357 4354354 -234984 -4452460
9051d452460o4077M532954N531680J898844l160553n456031m357449k767741k375355
$$ -4452460 -4516537 16417 5548097 7446941 4286388 -1169643 -5527092 -8294833 -10670188
9042a0670188j309660J980951N103329N070022L424423L751692M913748K149603
$$ -10670188 -11979848 -9998897 -4895568 174454 3598877 7350569 12264317 14413920
9034A4413920m271399p457908l801571J184747J515106M3849K537425O370286
$$ 14413920 10142521 2684613 -1116958 67789 1582895 1626744 4164169 10534455
9026A0534455L809462m632316r305332n374505O64334J590412q39974j333172
$$ 10534455 14343917 9711601 406269 -4968236 -4303902 -2713490 -3553464 -4886636
9018d886636R0577L14089m71660l03986Q4694m06669L09256L459942N041091J412190
$$ -4886636 -4796059 -4481970 -4953630 -5257616 -5172922 -5579591 -5270335 -1810393 3230698 4642888
9008D642888l517520l306523P99326J856042j461163l145826j26642L140001K567160
$$ 4642888 1125368 -2181155 -1381829 474213 -986950 -4132776 -4259418 -1119417 1447743
8999A447743M68246L65700R99471m53426k891936l101793q02863J540409K569743
$$ 1447743 1915989 2281689 3281160 2827734 -64202 -3165995 -3968858 -2428449 141294
8990A41294K956500L268946K995783J554162o63576k198854j775191k48527k02710
$$ 141294 3097794 6366740 9362523 10916685 10253109 8054255 6279064 6030537 5827827
8981E827827k265221l560166k097363m90884j679266l087795k89871M658052M916736
$$ 5827827 3562606 2440 -2094923 -2585807 -4265073 -7352868 -7642739 -2984687 1932049
8972A932049n82481m775863k637889K254849M191418K924663J272826l8876j113376
$$ 1932049 1349568 -3426295 -6064184 -3809335 382083 3306746 4579572 4540696 3427320
8963C427320n55745J505429J705671j291770l484749j684907P86671n13164l478205
$$ 3427320 2871575 4377004 6082675 4790905 1306156 -378751 407920 -105244 -3583449
8954c583449k871145J105057L640901L112989K123859J678108J72723j930894
$$ -3583449 -6454594 -5349537 -1708636 1404353 3528212 5206320 5379043 3448149
8946C448149j903413K70060J427458L22168r81869j066913n04858O34800K384056
$$ 3448149 1544736 1814796 3242254 3564422 2582553 1515640 1010782 1645582 4029638
8937D029638K408826j173057m856623l352770J673171K977009r53791l118944
$$ 4029638 6438464 5265407 408784 -2943986 -1270815 1706194 752403 -2366541
8929b366541O59850M753062K758664k555781m325038j992661m7280M30866J970195
$$ -2366541 -1706691 3046371 5805035 3249254 -1075784 -3068445 -3115725 -2684859 -714664
8920g14664M059380L153564o13865k636314q10484J459788O88734k091230l802763
$$ -714664 3344716 6498280 5884415 3248101 2437617 3897405 4586139 2494909 -1307854
8911a307854l475042k255840j171260j49604J543108L967035N165941K735753
$$ -1307854 -4782896 -7038736 -8209996 -8359600 -6816492 -2849457 2316484 5052237
8903E052237k000274m007614j324256J204356r65001m272660k264820L530574
$$ 5052237 3051963 -955651 -2279907 -1075551 -2040552 -6313212 -8578032 -5047458
8895e047458N443313J956581k47300J901384K812426j090974m022852m73436M592972
$$ -5047458 395855 2352436 2105136 4006520 6818946 5727972 1705120 1231684 5824656
8886E824656L078462l441463o713978m599628k185217j634827J56272L457995
$$ 5824656 8903118 5461655 -1252323 -5851951 -8037168 -9671995 -9515723 -6057728
8878f057728L783777J22539k288499l96329J840447O27752j277047K87783L780322
$$ -6057728 -2273951 -2151412 -4439911 -4836240 -2995793 -2368041 -3645088 -3357305 423017
8869D23017M738741K628747M49519m35699j076437j881213k171998j973721j756800
$$ 423017 5161758 7790505 8240024 7804325 6727888 4846675 2674677 700956 -1055844
8860a055844j291785n80012n36463j103955n35088J695610L434383L240883K712753
$$ -1055844 -2347629 -2927641 -3464104 -4568059 -5103147 -3407537 26846 3267729 5980482
8851E980482L050971K139235j687145n488272n331040k252500m05792n54981N2589
$$ 5980482 9031453 11170688 9483543 3995271 -1335769 -3588269 -3994061 -4549042 -4496453
8842d496453J950920K394203M87620j019456l14366Q10269M36241n28355p26324
$$ -4496453 -2545533 -151330 336290 -683166 -997532 -187263 248978 -279377 -1005701
8833a005701r49904k114705k610846k14871M069166O120977L104191k835540n843895
$$ -1005701 -1955605 -4070310 -6681156 -6896027 -2826861 3294116 6398307 3562767 -2281128
8824b281128k235353M581363O746289J063082o311201p005410q49413M652066
$$ -2281128 -4516481 64882 6811171 7874253 1563052 -5442358 -6291771 -1639705
8816a639705M664518K038748R98508R10240o04084k389829j956637m91433r99266
$$ -1639705 3024813 5063561 6062069 6972309 6368225 3978396 2021759 1530326 531060
8807E31060k705420k156791L32748N22292k282560k880348J550022N415289K206777
$$ 531060 -2174360 -4331151 -3998403 -3476111 -5758671 -8639019 -7088997 -1673708 533069
8798E33069m737380n699186J345079P210062M634124j567074k631119Q61168J235121
$$ 533069 -4204311 -9903497 -8558418 -1348356 3285768 1718694 -912425 -51257 1183864
8789A183864l094747n227002j443068K699704J451619k318357k450983Q73191
$$ 1183864 -1910883 -7137885 -8580953 -5881249 -4429630 -6747987 -9198970 -8325779
8781h325779K614033J327201L32131J383754K313291J254717p31948j909949j857240
$$ -8325779 -5711746 -4384545 -4052414 -2668660 -355369 899348 167400 -1742549 -3599789
8772c599789p96658Q08530J917708J973573J824734K001090J365688n10075j490221
$$ -3599789 -4396447 -3587917 -1670209 303364 2128098 4129188 5494876 4984801 3494580
8763C494580j91703Q10488j250518m042938l060159J122822L376299J693409n36530
$$ 3494580 3302877 4113365 2862847 -1180091 -4240250 -3117428 258871 1952280 1415750
8754A415750n46823K43588j4995n88099o36944r93590j700100j154423O46984
$$ 1415750 868927 1112515 1097520 509421 -127523 -1121113 -2821213 -3975636 -3328652
8745c328652J350728L59257K34049K092268L111163J024688k046639k911064j734761
$$ -3328652 -1977924 -1618667 -1384618 707650 3818813 4843501 2796862 -114202 -1848963
8736a848963n53591J25053O08596K64956q51776q18675J063826K211533O36124
$$ -1848963 -2402554 -2277501 -1668905 -1403949 -2255725 -3074400 -2010574 200959 837083
8727H37083j295155k73617K533246L065517L16034k748944l694419k932383j692674
$$ 837083 -458072 -731689 1801557 4867074 5183108 2434164 -1260255 -4192638 -5885312
8718e885312l79200R06983K117994L296976L531785J261990k420685k952483J735378
$$ -5885312 -6264512 -5357529 -3239535 57441 3589226 4851216 2430531 -521952 1213426
8709A213426O189914L355521m719048p816789j151883P221013O660008k024247
$$ 1213426 7403340 10758861 6039813 -1776976 -2928859 4292154 10952162 8927915
8701H927915q143993n332110J535785M521773K588341K57927j82179n32785j807566
$$ 8927915 783922 -4548188 -3012403 1509370 4097711 4355638 4173459 3640674 1833108
8692A833108k121598m98118P77026k77658j876572j131336J379264K446484R09745
$$ 1833108 -288490 -786608 -9582 -287240 -2163812 -3295148 -1915884 530600 1440345
8683A440345j135159j718684j232573q89115q75723p47394l72477O4563K28173
$$ 1440345 305186 -1413498 -2646071 -3535186 -4410909 -5158303 -5530780 -5466217 -5238044
8674e238044j99339p55330p7578K371744N005228N700887M049723J002153k404818
$$ -5238044 -5437383 -6192713 -6270291 -3898547 1106681 6807568 10857291 11859444 9454626
8665I454626m498830l107438J156683L536049O06694m115582m242921M23612L716356
$$ 9454626 4955796 1848358 3005041 6541090 7147784 3032202 -1210719 -787107 2929249
8656B929249K290468k55000p8548J140863J60128k147667k808606j702799q51371
$$ 2929249 5219717 4964717 4886169 6027032 6187160 4039493 1230887 -471912 -1323283
8647a323283n84822K38717J344403J240046l10767k066010k913282k327399l21547
$$ -1323283 -1908105 -1669388 -324985 915061 604294 -1461716 -4374998 -6702397 -7023944
8638g023944J853839K343162J080653j04896n86862j726403l415706k932671O02029
$$ -7023944 -5170105 -2826943 -1746290 -1851186 -2438048 -4164451 -7580157 -10512828 -9910799
8629i910799L602435K811722K83547J61159K275458K665795l22857l799377m139044
$$ -9910799 -6308364 -3496642 -3213095 -3051936 -776478 1889317 1566460 -2232917 -6371961
8620f371961p33162L854893N853297L225386j780063m206486k051102J280954
$$ -6371961 -7105123 -3250230 2603067 5828453 4048390 -158096 -2209198 -928244
8612i28244J837620J97704o31907J0019Q54919J761094K771356J948953j767611
$$ -928244 909376 1107080 475173 485192 1340111 3101205 5872561 7821514 6053903
8603F053903m915303l220358J676826L788897J063428k419093l039286j902916
$$ 6053903 1138600 -2081758 -404932 3383965 4447393 2028300 -1010986 -2913902
8595b913902j244573p95403K08981Q29681N45394Q56232K478550L155983O41655
$$ -2913902 -4158475 -4953878 -4744897 -3915216 -3369822 -2513590 -35040 3120943 3762598
8586C762598l590734n637239l386903J613915N574277N293000J067570k890105
$$ 3762598 171864 -5465375 -8852278 -7238363 -1664086 3628914 4696484 1806379
8578A806379k741411J73219J243481o34257j709085K72952K554898K434471J586005
$$ 1806379 -935032 -761813 481668 -152589 -1861674 -1588722 966176 3400647 4986652
8569D986652J770506L12102m877846q869104n261096K878768N342593n89951n460610
$$ 4986652 6757158 7069260 2191414 -6677690 -11938786 -9060018 -3717425 -4307376 -9767986
8560i767986j357557O383078P345357J147867l365532j937912L73196j021509
$$ -9767986 -11125543 -4742465 2602892 3750759 385227 -1552685 -1179489 -2200998
8552b200998l337848k382954M61064J536521J130116J763750K905749J971913
$$ -2200998 -5538846 -7921800 -7460736 -5924215 -4794099 -3030349 -124600 1847313
8544A847313q04175k566934k156469p65840R94773L201901M273422K257905j295191
$$ 1847313 1043138 -1523796 -3680265 -4446105 -3451332 -249431 4023991 6281896 4986705
8535D986705k330977p7127J359495j203442n114855n040585Q0279N295692N186923
$$ 4986705 2655728 2578601 3938096 2734654 -2380201 -7420786 -7340507 -2044815 3142108
8526C142108K12823l574789j678846L128819M244315j87717n325286o626668m679942
$$ 3142108 3354931 -219858 -1898704 1230115 5474430 5286713 -38573 -6665241 -11345183
8517a1345183j491325L105026P901931Q084878J905813m208195l533747R07532
$$ -11345183 -12836508 -9731482 -1829551 6255327 8161140 3952945 419198 1326730
8509A326730J288918k344229k776723J655130M174645R43950l179803l309238
$$ 1326730 2615648 271419 -2505304 -850174 3324471 4268421 1088618 -2220620
8501b220620j466516j016360p26116J178505K514240J262051k74536M22439J732332
$$ -2220620 -3687136 -4703496 -5429612 -4251107 -1736867 -474816 -749352 -326913 1405419
8492A405419J251367k65788j430553k769361l990454k955875Q6063J946562K364528
$$ 1405419 2656786 2390998 960445 -1808916 -5799370 -8755245 -8669182 -6722620 -4358092
8483d358092M602734P701178N473517k650638p611842l509772K946872L015093
$$ -4358092 244642 7945820 13419337 10768699 3156857 -352915 2593957 5609050
8475E609050r42191j502109O96565n0746k823308k160482P97092Q038l851444
$$ 5609050 4666859 3164750 3861315 3810569 987261 -1173221 -376129 -368091 -4219535
8466d219535m007937K08509K114854j68926l73866M282262P233675K820559m616329
$$ -4219535 -8227472 -8018963 -5904109 -6073035 -6446901 -2164639 5069036 7889595 3273266
8457C273266o862292k347186L579464N641342K977576j132020k318509K07720
$$ 3273266 -3589026 -5936212 -2356748 3284594 6262170 5130150 2811641 3019361
8449C019361K291797N69049k304594k170841o03242j695719l726102j620458L117066
$$ 3019361 5311158 5880207 3575613 1404772 801530 -894189 -4620291 -6240749 -3123683
8440c123683L505075j174097l546278k51265K760684O32855k768704k488043o47161
$$ -3123683 381392 -792705 -4338983 -4590248 -1829564 -1196709 -3965413 -6453456 -7100617
8431g100617j165748k126002K14689M073799N045161L259172J866922P75744k361000
$$ -7100617 -8266365 -10392367 -10177678 -6103879 -1058718 2200454 4067376 4843120 2482120
8422B482120o152988n829665Q4036P071137R312999N296233j131796m304530k156203
$$ 2482120 -3670868 -9500533 -9416497 -2345360 6967639 12263872 11132076 6827546 4671343
8413D671343J415115J127860k720566m619782j701270K273267K426894q56699
$$ 4671343 6086458 7214318 4493752 -126030 -1827300 445967 2872861 2016162
8405B016162l336211k463412N16317K536297J566984j285535k495738n55967J465895
$$ 2016162 -1320049 -3783461 -3267144 -730847 836137 -449398 -2945136 -3501103 -2035208
8396b035208O77134k36216K753887O809667N045624k206386o514963l716152M16163
$$ -2035208 -1358074 -1594290 1159597 7969264 13014888 10808502 4293539 577387 993550
8387I93550K62402j331007J74396K621154J948483J28471J273124L542582K016954
$$ 993550 1255952 -75055 99341 2720495 4668978 4797449 6070573 9613155 11630109
8378A1630109k687607n202308l441035k84510J615574J847843L45630k063210
$$ 11630109 8942502 3740194 299159 14649 1630223 3478066 3823696 1760486
8370A760486k733126q69859K02036j302789j157875L898526Q331557M848120l046451
$$ 1760486 -972640 -1842499 -1640463 -2943252 -4101127 -202601 8128956 12977076 9930625
8361I930625m900209N40354L135444k449478q291114n987123N81535K481648l94105
$$ 9930625 5030416 5570770 8706214 6256736 -2034378 -8021501 -7439966 -4958318 -5352423
8352e352423j096747K124150L899008J386524j648808j559871K71302J124315
$$ -5352423 -6449170 -4325020 -426012 960512 -688296 -2248167 -1976865 -852550
8344h52550R27282M97486l92500j134979R6183K744382L282512O34071j404582
$$ -852550 74732 572218 179718 -955261 -859078 1885304 5167816 5801887 4397305
8335D397305l31316K42218l399902p409098n017370K591759P054211M806681J246269
$$ 4397305 4065989 4308207 908305 -6500793 -11518163 -8926404 -1872193 2934488 4180757
8326D180757J088649J634425o93070l422727k817260o54956n08111j053598R99532
$$ 4180757 5269406 6903831 6210761 2788034 -29226 -684182 -1192293 -2245891 -1246359
8317a246359M305303N090998L451351J686269r46509n439090p656681l321624
$$ -1246359 3058944 8149942 11601293 13287562 12341053 6901963 -754718 -4076342
8309d076342L302599L886357j431424m413224j806705Q68455N532p86284J022474
$$ -4076342 -773743 3112614 1681190 -2732034 -4538739 -3670284 -3664752 -4451036 -3428562
8300c428562K019678L58017j1038K496829K486311k857203o795064k978243L580950
$$ -3428562 -1408884 -1050867 -1061905 1434924 3921235 1064032 -5731032 -8709275 -5128325
8291e128325L837983j289174l214510L65662K863077J77763l320336k298011J887952
$$ -5128325 -1290342 -2579516 -5794026 -5428364 -2565287 -2387524 -5707860 -8005871 -6117919
8282f117919M001799J950839j578835k869751r45704J892338K764579J246318
$$ -6117919 -2116120 -165281 -1744116 -4613867 -5559571 -3667233 -902654 343664
8274C43664q66660k211545k507201j164551J885874M205567L215201N42246j34288
$$ 343664 -522996 -2734541 -5241742 -6406293 -4520419 -314852 2900349 3442595 3308307
8265C308307N18040j315743m544934l259158L010607O590809L108895j594470
$$ 3308307 3826347 2510604 -2034330 -5293488 -2282881 4307928 7416823 5822353
8257E822353j192535J405206N80795k028196j852002m29503j557319k636080Q31959
$$ 5822353 4629818 6035024 6615819 4587623 2735621 2306118 748799 -1887281 -1055322
8248a055322N171056K942874m032442o168448q31082M097096K984712j84723j74562
$$ -1055322 4115734 7058608 3026166 -3142282 -3973364 123732 3108444 2923721 2749159
8239B749159J547917J160859j199782l346096m676942m822522k708383N25416
$$ 2749159 4297076 5457935 4258153 912057 -3764885 -8587407 -11295790 -10770374
8231a0770374J581400J06384k49096K134234L971717K561118n776q57804p59201
$$ -10770374 -9188974 -9082590 -9331686 -7197452 -3225735 -664617 -670393 -1528197 -2287398
8222b287398j428892j785362k93166J462526R29334j325693k480420j179111J732013
$$ -2287398 -3716290 -5501652 -5794818 -4332292 -3402958 -4728651 -7209071 -8388182 -6656169
8213f656169M795789O284143M454694j94367l868752l010711J267698M074257
$$ -6656169 -1860380 4423763 8878457 8684090 4815338 1804627 3072325 7146582
8205G146582K345096j707665l492576j735118J07393j199388l788818l191236
$$ 7146582 9491678 7784013 4291437 2556319 2663712 1464324 -2324494 -5515730
8197e515730P94015L366506J923555j17654O06290J572122q95752m246948l060524
$$ -5515730 -4721715 -1355209 568346 450692 1056982 2629104 1733352 -2513596 -5574120
8188e574120J729827L574996N53223j668538Q75732M080774K342654k833365n307750
$$ -5574120 -3844293 -269297 283926 -1384612 -508880 3571894 5914548 3081183 -2226567
8179b226567k931028P39282K408208K652547K957829K383459o02796m247974m258423
$$ -2226567 -5157595 -4418313 -2010105 642442 3600271 5983730 5380934 1132960 -3125463
8170c125463N41192N255883M194641j565069n199058l238448K15082L20817j464483
$$ -3125463 -2584271 2671612 6866253 5301184 102126 -3136322 -2921240 -2600423 -4064906
8161d064906r10539J527111J765188q32017k521810j284519N64510N42837p97891
$$ -4064906 -4975445 -3448334 -1683146 -2515163 -5036973 -6321492 -5756982 -5214145 -6012036
8152f012036j646737j031985J317129M523296N826184L151936j363081l272296
$$ -6012036 -7658773 -8690758 -7373629 -2850333 2975851 6127787 4764706 1492410
8144A492410j504011P01419P81302l05200q42566r10264r88250n34308O25655
$$ 1492410 -11601 689818 1471120 1165920 323354 -586910 -1575160 -2109468 -1483813
8135a483813J278272M43261j112619j720566m74928J945197L445820K158147j139795
$$ -1483813 -205541 237720 -874899 -2595465 -3070393 -1125196 2320624 4478771 3338976
8126C338976l208905k101212M44455J543772O24568r17865j747003j001264J169444
$$ 3338976 130071 -1971141 -1526686 17086 641654 -276211 -2023214 -3024478 -1855034
8117a855034K384961L13700k680366j427368L526311M742381j098710o852344
$$ -1855034 529927 843627 -1836739 -3264107 262204 5004585 3905875 -2946469
8109b946469n057012J055622L646261K425785K317355K949799K66571l705388
$$ -2946469 -8003481 -6947859 -3301598 -875813 1441542 4391341 4657912 952524
8101I52524k982384J308166K157291j020110j664219J552084K465626m57404q82287
$$ 952524 -2029860 -721694 1435597 415487 -1248732 303352 2768978 2311574 1429287
8092A429287L059868M322010j84430l131753J40074K383780l068097r484371o814815
$$ 1429287 4489155 8811165 8626735 5494982 5635056 8018836 4950739 -4533632 -11348447
8083a1348447J964470N723114K306230k56406K091128M376988K171497k297275
$$ -11348447 -9383977 -3660863 -1354633 -1611039 480089 4857077 7028574 4731299
8075D731299n212675n854934m573607j297495K296206L184641R98391j299808
$$ 4731299 -481376 -6336310 -10909917 -12207412 -9911206 -6726565 -5728174 -7027982
8067g027982j420134J3847J370652J897462J686509J476567K136500L191709K937526
$$ -7027982 -8448116 -8434269 -7063617 -5166155 -3479646 -2003079 133421 3325130 6262656
8058F262656R85425j042803k276435l598322m749941l503264N17972M167563M772707
$$ 6262656 7248081 6205278 3928843 330521 -4419420 -7922684 -7404712 -3237149 1535558
8049A535558K991927M82289j737242j714053J836759N104775K332551m591753
$$ 1535558 4527485 5009774 3272532 1558479 3395238 8500013 10832564 6240811
8041F240811o755465j567799K652285K55445k555460N45592L983348J77002n936800
$$ 6240811 -514654 -2082453 569832 825277 -1730183 -1184591 2798757 2975759 -2961041
8032b961041m571411K008426L732665N07820J198879N959934M980155l288663
$$ -2961041 -7532452 -5524026 -1791361 -1283541 -84662 5875272 10855427 7566764
8024G566764p738420k923391K201498K55973k799532j52414L269327Q80385k588820
$$ 7566764 -171656 -3095047 -893549 -637576 -3437108 -3589522 -320195 560190 -2028630
8015b028630K51761N224242L239483l849220o231958k008284J565323J181379
$$ -2028630 -1776869 3447373 6686856 2837636 -3394322 -5402606 -3837283 -2655904
8007b655904O75536J337837k65318l645671l399848J103609L891008K438674R74690
$$ -2655904 -1980368 -642531 -907849 -4553520 -7953368 -6849759 -2958751 -520077 454613
7998D54613J330947m19017m660889m901288J041479N291965K107427k208092J33827
$$ 454613 1785560 1366543 -3294346 -8195634 -7154155 -1862190 245237 -1962855 -1829028
7989a829028M924445L134854l452085n115901k29836L121377J401172K59932K921430
$$ -1829028 3095417 6230271 2778186 -2337715 -2567551 553826 1954998 2214930 5136360
7980E136360M414843J380635j477148l1641J798772o84804m420750l876373j58581
$$ 5136360 9551203 10931838 9454690 9423049 11221821 10537017 6116267 2239894 2081313
7971B081313J650341O61286m18977j014091j914568j467909J607384L944213J931325
$$ 2081313 3731654 4392940 3973963 2959872 1045304 -422605 1184779 5128992 7060317
7962G060317j724331j859969O44242O66766k267783l647520j828550M29843J995681
$$ 7060317 5335986 3476017 4120259 4787025 2519242 -1128278 -2956828 -2526985 -531304
7953e31304M253318N940400L939227l01053j946496q97166j469441l373868j496490
$$ -531304 3722014 9662414 13601641 13300588 11354092 10456926 8987485 5613617 4117127
7944D117127L539555L968365k268841o585542l156036J579760O2410l769855k199596
$$ 4117127 7656682 11625047 9356206 2770664 -385372 1194388 1256798 -2513057 -4712653
7935d712653K307637J634647l349324l988489J493824N241253K635573j581551
$$ -4712653 -2405016 -770369 -4119693 -8108182 -6614358 -1373105 1262468 -319083
7927c19083k385617j391052j396273j036620J128855K813062K279883J737757
$$ -319083 -2704700 -4095752 -5492025 -6528645 -5399790 -2586728 -306845 1430912
7919A430912K693784K408001q48560l212151r59692K519240J335698l355584m804036
$$ 1430912 4124696 6532697 5684137 2471986 1512294 4031534 5367232 2011648 -2792388
7910b792388j226670J617859j10984k436126o02715K908854K533895j258609k911259
$$ -2792388 -4019058 -2401199 -2512183 -4948309 -5551024 -2642170 -108275 -1366884 -4278143
7901d278143o71436J518976J350002J241856K383927J801159j350550k416473
$$ -4278143 -4949579 -3430603 -2080601 -838745 1545182 3346341 1995791 -420682
7893d20682J061757L703276O06681l576383j923396K348823Q36605m803609m451691
$$ -420682 641075 4344351 4951032 1374649 -548747 1800076 2636681 -2166928 -6618619
7884f618619K914733N993164n03772o642665l408584L118124L225820l71356L14590
$$ -6618619 -3703886 2289278 1785506 -4857159 -8265743 -5147619 -1921799 -2293155 -1978565
7875a978565K865576k73519n506231k228521P792381J0390134Q72143q052485
$$ -1978565 887011 613492 -4892739 -7121260 671121 11061255 11933398 3880913
$$ [...]
##END NTUPLES=NMR SPECTRUM
##END=
