##TITLE=31Pdec_SR124_rek5T_1'''
 DMSO, 124 sc
 9.6.2022
##JCAMPDX= 6.0         $$ Bruker NMR JCAMP-DX V2.0
##DATA TYPE= NMR SPECTRUM
##DATA CLASS= NTUPLES
##ORIGIN= UXNMR, Bruker Analytische Messtechnik GmbH
##OWNER= root
$$ XWIN-NMR		Version 3.5
$$ Thu Jun  9 16:07:24 2022 Russian Standard Time (UT+4h)  she@DPX200
##.OBSERVE FREQUENCY= 81.013821
##.OBSERVE NUCLEUS= ^31P
##.ACQUISITION MODE= SIMULTANEOUS
##.ACQUISITION SCHEME= undefined
##.AVERAGES= 124
##.DIGITISER RES= 16
##SPECTROMETER/DATA SYSTEM= spect
##.PULSE SEQUENCE= zgpg30
##.SOLVENT NAME= DMSO
##.SHIFT REFERENCE= (INTERNAL, DMSO, 0, 248.564)
##AUDIT TRAIL= $$ (NUMBER, WHEN, WHO, WHERE, WHAT)
$$ ##TITLE= Audit trail, XWIN-NMR		Version 3.5
$$ ##JCAMPDX= 5.01
$$ ##ORIGIN= Bruker BioSpin GmbH
$$ ##OWNER= she
$$ F:/spectra/data/she/nmr/P31/1/pdata/1/auditp.txt
$$ ##AUDIT TRAIL=  $$ (NUMBER, WHEN, WHO, WHERE, WHAT)
(   1,<2022-06-09 16:05:42.53 +0400>,<she>,<DPX200>,
      <created by zg, POWCHK disabled, PULCHK disabled
       configuration hash MD5:
       00 E9 B6 7A A2 85 ED C7 34 08 36 98 17 FE 4E 26
       data hash MD5: 32K
       A8 07 F1 DC 78 9A BB 51 9E 05 39 7B A5 14 F4 DB>)
(   2,<2022-06-09 16:06:03.56 +0400>,<she>,<DPX200>,
      <Start of raw data processing
       efp BC_mod = 2 LB = 1 FT_mod = 6 PKNL = 1 PHC0 = -10258.48 PHC1 = 2.853455 SI = 64K 
       data hash MD5: 64K
       CF 76 5E AF 6C D7 91 BD 35 0F 2A C3 7D C4 63 40>)
(   3,<2022-06-09 16:06:28.06 +0400>,<she>,<DPX200>,
      <pk PHC0 = -135.9854 PHC1 = 385.3997 
       data hash MD5: 64K
       86 9A 42 1C 11 D1 CA 2B 6D 70 CA EE F5 73 B7 C6>)
(   4,<2022-06-09 16:06:34.82 +0400>,<she>,<DPX200>,
      <abs ABSG = 5 
       data hash MD5: 64K
       6A 63 CB B3 D5 2C C2 11 DF 65 D0 1E 75 3B A5 03>)
$$ ##END=
$$ 
$$ hash MD5
$$ A1 10 80 0F 9B 79 96 8B 39 58 10 BA 7D 14 D2 31
##$RELAX= 
##$RELAX= 
##$RELAX= 
##$RELAX= 
##$RELAX= 
##$RELAX= 
##$RELAX= 
##$RELAX= 
$$ Bruker specific parameters
$$ --------------------------
##$DU= <F:/spectra>
##$EXPNO= 1
##$NAME= <P31>
##$PROCNO= 1
##$TYPE= <nmr>
##$USER= <she>
##$AMP= (0..31)
100 100 100 100 100 100 100 100 100 100 100 100 100 100 100 100 100 100 
100 100 100 100 100 100 100 100 100 100 100 100 100 100 
##$AQSEQ= 0
##$AQ_mod= 1
##$AUNM= <au_zg>
##$AUTOPOS= <>
##$BF1= 81.014009
##$BF2= 200.13
##$BF3= 200.13
##$BF4= 200.13
##$BF5= 200.13
##$BF6= 200.13
##$BF7= 200.13
##$BF8= 200.13
##$BYTORDA= 1
##$CFDGTYP= 0
##$CFRGTYP= 5
##$CHEMSTR= <none>
##$CNST= (0..31)
1 1 145 1 1 1 1 1 1 1 1 1 1 1 1 1 1 1 1 1 1 1 1 1 1 1 1 1 1 1 1 1 
##$CPDPRG= <waltz16>
##$CPDPRG1= <>
##$CPDPRG2= <waltz16>
##$CPDPRG3= <>
##$CPDPRG4= <mlev>
##$CPDPRG5= <mlev>
##$CPDPRG6= <mlev>
##$CPDPRG7= <mlev>
##$CPDPRG8= <mlev>
##$CPDPRGB= <>
##$CPDPRGT= <>
##$D= (0..31)
0 1 0 0 0 0 0 0 0 0 0 0.03 2e-05 3e-06 0 0 0 0 0 0 0 0 0 0 0 0 0 0 0 0 
0 0 
##$DATE= 1654776205
##$DBL= (0..7)
120 120 120 11 120 120 24 19 
##$DBP= (0..7)
150 150 150 150 150 150 150 150 
##$DBP07= 0
##$DBPNAM0= <>
##$DBPNAM1= <>
$$ [...]
##$SUBNAM3= <"">
##$SUBNAM4= <"">
##$SUBNAM5= <"">
##$SUBNAM6= <"">
##$SUBNAM7= <"">
##$SUBNAM8= <"">
##$SUBNAM9= <"">
##$SW= 501.771253377433
##$SWIBOX= (0..15)
0 1 3 0 0 0 0 0 0 0 0 0 0 0 0 0 
##$SW_h= 40650.406504065
##$TD= 32768
##$TD0= 1
##$TE= 0
##$TE2= 300
##$TE3= 300
##$TEG= 300
##$TL= (0..7)
0 120 53 12 22 120 120 120 
##$TP= (0..7)
150 150 150 150 150 150 150 150 
##$TP07= 0
##$TPNAME0= <>
##$TPNAME1= <>
##$TPNAME2= <>
##$TPNAME3= <>
##$TPNAME4= <>
##$TPNAME5= <>
##$TPNAME6= <>
##$TPNAME7= <>
##$TPOAL= (0..7)
0.5 0.5 0.5 0.5 0.5 0.5 0.5 0.5 
##$TPOFFS= (0..7)
0 0 0 0 0 0 0 0 
##$TUNHIN= 0
##$TUNHOUT= 0
##$TUNXOUT= 0
##$USERA1= <user>
##$USERA2= <user>
##$USERA3= <user>
##$USERA4= <user>
##$USERA5= <user>
##$V9= 5
##$VALIST= <valist>
##$VCLIST= <CCCCCCCCCCCCCCC>
##$VD= 0
##$VDLIST= <DDDDDDDDDDDDDDD>
##$VPLIST= <PPPPPPPPPPPPPPP>
##$VTLIST= <TTTTTTTTTTTTTTT>
##$WBST= 1024
##$WBSW= 4
##$XGAIN= (0..3)
0 0 0 0 
##$XL= 0
##$YL= 0
##$YMAX_a= 7996
##$YMIN_a= -9537
##$ZGOPTNS= <>
##$ZL1= 120
##$ZL2= 120
##$ZL3= 120
##$ZL4= 120
##$ABSF1= 248.5645
##$ABSF2= -253.2056
##$ABSG= 5
##$ABSL= 3
##$ALPHA= 0
##$AQORDER= 0
##$ASSFAC= 0
##$ASSFACI= 0
##$ASSFACX= 0
##$ASSWID= 0
##$AUNMP= <proc_1d>
##$AZFE= 0.1
##$AZFW= 0.5
##$BCFW= 0
##$BC_mod= 2
##$BYTORDP= 0
##$COROFFS= 0
##$CY= -3
##$DATMOD= 1
##$DC= 0
##$DFILT= <>
##$DTYPP= 0
##$F1P= 0
##$F2P= 0
##$FCOR= 1
##$FTSIZE= 65536
##$FT_mod= 6
##$GAMMA= 0
##$GB= 0
##$INTBC= 1
##$INTSCL= 5.30512e-09
##$ISEN= 30
##$LB= 1
##$LEV0= 0
##$LPBIN= 0
##$MAXI= 10000
##$MC2= 0
##$MEAN= 0
##$ME_mod= 0
##$MI= 50
##$NCOEF= 0
##$NC_proc= -7
##$NLEV= 6
##$NOISF1= 182.463
##$NOISF2= 159.3651
##$NSP= 0
##$NTH_PI= 0
##$NZP= 0
##$OFFSET= 248.5645
##$PC= 4
##$PHC0= -10394.47
##$PHC1= 388.2531
##$PH_mod= 1
##$PKNL= yes
##$PPARMOD= 0
##$PSCAL= 0
##$PSIGN= 0
##$REVERSE= no
##$SF= 81.014009
##$SI= 65536
##$SIGF1= 159.3651
##$SIGF2= -187.1042
##$SINO= 113.3802
##$SIOLD= 16384
##$SREGLST= <1H.CDCl3>
##$SSB= 0
##$STSI= 65536
##$STSR= 0
##$SW_p= 40650.406504065
##$SYMM= 0
##$S_DEV= 0
##$TDeff= 32768
##$TDoff= 0
##$TI= <>
##$TILT= no
##$TM1= 0
##$TM2= 0
##$TOPLEV= 0
##$USERP1= <user>
##$USERP2= <user>
##$USERP3= <user>
##$USERP4= <user>
##$USERP5= <user>
##$WDW= 1
##$XDIM= 65536
##$YMAX_p= 286169086
##$YMIN_p= -35077759
$$ End of Bruker specific parameters
$$ ---------------------------------
##NTUPLES= NMR SPECTRUM
##VAR_NAME=  FREQUENCY,     SPECTRUM/REAL,   SPECTRUM/IMAG
##SYMBOL=    X,             R,               I
##VAR_TYPE=  INDEPENDENT,   DEPENDENT,       DEPENDENT
##VAR_FORM=  AFFN,          ASDF,            ASDF
##VAR_DIM=   65536,         65536,           65536
##UNITS=     HZ,            ARBITRARY UNITS, ARBITRARY UNITS
##FACTOR=    0.620285442955139, 1,           1
##FIRST=     20137.2065510759, 0,            0
##LAST=      -20513.1999529892, 0,           0
##MIN=       -20513.1999529892, -35077759,   0
##MAX=       20137.2065510759, 286169086,    0
$$ Real data points
##PAGE= N=1
##DATA TABLE= (X++(R..R)), XYDATA
$$ [...]
$$ plain form
13027 -332341 -731423 -1470820 -1302120 -3117413 -7373219 -9485609 -7187109 -4978516 -6580344
13018 -6580344 -8079588 -4728593 -147932 -1005262 -5481621 -5913719 -1742767 -216035
13010 -216035 -3300292 -3862492 1586867 5570572 1114402 -6686928 -8143671 -3198712
13002 -3198712 -82784 -2226070 -4519609 -2602483 983205 1754625 -403611 -2271460
12994 -2271460 -1699874 967448 4030953 5632107 5118390 4062995 4762732 7101104 8164100
12985 8164100 5975786 2728336 2769114 7172541 11743140 11762241 7829696 4544842 3379889
12976 3379889 608466 -5613319 -10159566 -7585867 -1159980 1077372 -1610512 -1914995
12968 -1914995 2794092 4864662 -1983950 -11758219 -13747934 -7374652 -2100143 -3549809
$$ packed form
13027c32341l99082p39397J68700j815293m255806k112390K298500K208593j601828
13018f580344j499244L350995M580661q57330m476359m32098M170952J526732
13010b16035l084257n62200N449359L983705m456170p801330j456743M944959
13002c198712L115928k143286k293539J917126L585688P71420k158236j867849
12994b271460N71586K667322L063505J601154n13717j055395O99737K338372J062996
12985H164100k188314l247450M0778M403427M570599J9101l932545l284854j164953
12976C379889k771423o221785m546247K573699O425887K237352k687884l04483
12968a914995M709087K070570o848612r774269j989715O373282N274509j449666
$$ plain form
12960 -3549809 -6804803 -5000283 1043262 5224862 5122964 4544082 7312193 11476951
12952 11476951 11702213 6661780 1339080 497426 2194204 998315 -3676180 -6873219
12944 -6873219 -5861310 -3798793 -4071924 -5428462 -5251959 -3823349 -2467179 -920517
12936 -920517 560226 22541 -2098547 -1546588 3230911 6889781 4202923 -2070489 -5472114
12927 -5472114 -4859075 -3354775 -1323155 2583287 5472773 3332208 -629134 739109
12919 739109 6275732 6604317 -935881 -6626362 -2834471 3865718 2633430 -5216112
12911 -5216112 -8781438 -4003859 1642427 1356682 -2153222 -2927028 -756376 388838
12903 388838 -811010 -2335426 -3043633 -3311076 -2210323 1724071 6449248 7203142 3173502
$$ packed form
12960c549809l254994J804520O043545M181600j01898n78882K768111M164758
12952A1476951K25262n040433n322700q41654J696778j195889m674495l197039
12944f873219J011909K062517k73131j356538J76503J428610J356170J546662
12936i20517J480743n37685k121088N51959M777499L658870k686858o273412l401625
12927e472114O13039J504300K031620L906442K889486k140565l961342J368243
12919G39109N536623L28585p540198n690481L791891O700189j232288p849542
12911e216112l565326M777579N646286k85745l509904p73806K170652J145214
12903C88838j199848j524416p08207k67443J100753L934394M725177P53894m029640
$$ plain form
12894 3173502 -153054 1672113 5283664 4435392 -92233 -1288226 3044996 6200166
12886 6200166 2331140 -4852321 -7642146 -4921373 -1809121 -859217 379672 3056881
12878 3056881 3798167 -244154 -6625262 -10148238 -8471497 -3861643 -426184 -243678
12870 -243678 -1678258 -1764515 -475616 -865699 -3900630 -5850460 -3421534 1009325 2875047
12861 2875047 2085547 1936324 2940048 2777693 1666539 2318345 4241668 3509001 -523448
12852 -523448 -3208369 -1186809 3250637 6243884 6921175 6153968 4676502 4303731 7152551
12843 7152551 11674970 13223885 10336926 6310213 2813153 -2772679 -10658004 -14904016
12835 -14904016 -11221419 -4166986 -1164248 -2745783 -4294387 -4418911 -5111384 -5435974
$$ packed form
12894C173502l326556J825167L611551q48272m527625j195993M333222L155170
12886F200166l869026p183461k789825K720773L112252R49904J238889K677209
12878C056881P41286m042321o381108l522976J676741M609854L435459J82506
12870b43678j434580q6257J288899l90083l034931j949830K428926M430859J865722
12861B875047p89500j49223J003724j62355j111154O51806J923323p32667m032449
12852e23448k684921K021560M437446K993247O77291p67207j477466l72771K848820
12843G152551M522419J548915k886959m026713l497060n585832p885325m246012
12835a4904016L682597P054433L002738j581535j548604j24524o92473l24590
$$ plain form
12827 -5435974 -2104078 3631010 5955434 2597292 -2148964 -3981456 -3684260 -3809057
12819 -3809057 -4215462 -3468745 -2014229 -1440394 -1918040 -2065001 -810965 1118755 1253392
12810 1253392 -2140733 -6520745 -5982345 1584987 10026683 11498945 6423003 2243055
12802 2243055 2789469 4640828 4925395 6142007 9955595 12098101 8670424 3244029
12794 3244029 1529632 1861596 -1898455 -9006493 -11168622 -4949349 2075156 1554971
12786 1554971 -4344031 -7079453 -3873494 292118 1672031 2575133 5850824 9482895
12778 9482895 9591477 5843111 977415 -2998300 -5289228 -4636660 -546163 4306647
12770 4306647 6023274 4129754 1811444 1265863 1365949 460723 -1191962 -2828965 -4431904
$$ packed form
12827e435974L331896N735088K324424l358142m746256j832492K97196j24797
12819c809057m06405P46717J454516N73835m77646j46961J254036J929720J34637
12810A253392l394125m380012N38400P567332Q441696J472262n075942m179948
12802B243055N46414J851359K84567J216612L813588K142506l427677n426395
12794C244029j714397L31964l760051p108038k162129O219273P024505n20185
12786A554971n899002k735422L205959M165612J379913R03102L275691L632071
12778I482895J08582l748366m865696l975715k290928O52568M090497M852810
12770D306647J716627j893520k318310n45581J00086r05226j652685j637003j602939
$$ plain form
12761 -4431904 -5140785 -3004984 1610104 4710388 3487343 607623 518411 2863819 3450933
12752 3450933 1282107 182718 2382373 4649296 3307465 -94327 -1511815 -794252
12744 -794252 -1477047 -4841701 -8014974 -8588027 -7721095 -7044980 -5287398 -582629 5505425
12735 5505425 9166533 9003941 6908000 4452672 1359959 -1710926 -1942191 1816062
12727 1816062 6040839 6307368 3198914 1373754 2670902 3405935 26490 -5171794
12719 -5171794 -6710018 -3135366 1446917 3219992 3112128 3803596 4572011 2311130 -2696553
12710 -2696553 -5552192 -2927892 2116678 4200403 2759572 1537901 1697579 71660
12702 71660 -4408744 -6999832 -3234773 4061049 7801271 5401782 963932 -560666
$$ packed form
12761d431904p08881K135801M615088L100284j223045k879720q9212K345408N87114
12752C450933k168826j099389K199655K266923j341831l401792j417488P17563
12744g94252o82795l364654l173273n73053Q66932O76115J757582M704769O088054
12735E505425L661108j62592k095941k455328l092713l070885k31265L758253
12727A816062M224777K66529l108454j825160J297148P35033l379445n198284
12719e171794j538224L574652M582283J773075j07864O91468P68415k260881n007683
12710b696553k855639K624300N044570K083725j440831j221671J59678j625919
12702G1660m480404k591088L765059P295822L740222k399489m437850j524598
$$ plain form
12694 -560666 2038052 7095556 11928047 13372329 9682844 2964869 -2475484 -4683687
12686 -4683687 -4869226 -3967326 -1588567 1286620 2252830 1378178 1728240 4307754 5858888
12677 5858888 3966552 1151447 952383 2679588 3457549 3190272 3558691 3701069 1392687
12668 1392687 -1891561 -1622956 3086079 7132900 5630367 -70258 -4576694 -4991214
12660 -4991214 -3148320 -2103931 -2421740 -2402290 -941452 855318 1131797 -252344 -1584463
12651 -1584463 -1578733 -760262 -361084 -1096657 -3521267 -7956926 -12854129 -14721552 -11557125
12642 -11557125 -5535514 -551731 2166275 4146610 6195835 7394959 7588398 8255301
12634 8255301 9967711 10992373 9665589 6677322 3766569 1467488 -419562 -1281674
$$ packed form
12694e60666K598718N057504M832491J444282l689485o717975n440353k208203
12686d683687j85539R01900K378759K875187R66210q74652L50062K579514J551134
12677E858888j892336k815105j99064J727205P77961k67277L68419J42378k308382
12668A392687l284248K68605M709035M046821j502533n700625m506436m14520
12660d991214J842894J044389l17809J9450J460838J796770K76479j384141j332119
12651a584463N730Q18471L99178p35573k424610m435659m897203j867423L164427
12642a1557125O021611M983783K718006J980335K049225J199124J93439O66903
12634H255301J712410J024662j326784k988267k910753k299081j887050q62112
$$ plain form
12626 -1281674 -545166 423246 -684699 -3956000 -6828677 -7462507 -6988687 -7429821 -8836868
12617 -8836868 -9928015 -10315905 -10200975 -8864784 -5897102 -3267706 -3188378 -4093011 -2374780
12608 -2374780 1383597 2338325 -737274 -2422192 1057490 5216941 4146853 -11737
12600 -11737 -1097681 443014 -886846 -4599831 -4003821 1694170 4375824 -270142 -5563483
12591 -5563483 -4822666 -2011435 -4258238 -9734566 -11427769 -9021486 -8092245 -9521527
12583 -9521527 -8637684 -4733985 -3081000 -5992728 -9061242 -8607568 -6771078 -6355752 -5837403
12574 -5837403 -2856894 1269011 3649665 3345801 392119 -5366649 -11712056 -13481349
12566 -13481349 -8101051 98818 4075401 1412762 -4606418 -9561736 -11000214 -8390841
$$ packed form
12626a281674P36508R68412j107945l271301k872677o33830M73820m41134j407047
12617h836868j091147l87890J14930J336191K967682K629396P9328r04633J718231
12608b374780L758377R54728l075599j684918L479682M159451j070088m158590
12600a1737j085944J540695j329860l712985N96010N697991K681654m645966n293341
12591e563483P40817K811231k246803n476328j693203K406283R29241j429282
12583i521527Q83843L903699J652985k911728l068514M53674J836490M15326N18349
12574e837403K980509M125905K380654l03864k953682n758768o345407j769293
12566a3481349N380298Q199869L976583k662639o019180m955318j438478K609373
$$ plain form
12558 -8390841 -3064386 1834093 3535982 2284055 773726 1048602 2716069 3821979
12550 3821979 2676345 -691480 -4011443 -4191080 -336186 4754072 7065636 5537172
12542 5537172 2984921 2398113 3047482 1617816 -2655293 -5860809 -4063660 1275750
12534 1275750 5152417 5580041 4846848 4163666 1612424 -2736281 -4284159 -155220 5523386
12525 5523386 6908800 4254342 1805307 476023 -1721427 -3670318 -2083920 1756840
12517 1756840 2558611 -813035 -3562315 -2663033 -571358 550697 2391499 5423403
12509 5423403 5806313 1216523 -4617557 -7030270 -6172855 -4010563 184087 6665564
12501 6665564 11142261 9411610 4023070 1235976 2630815 4286083 3230930 365886
$$ packed form
12558h390841N326455M898479J701889j251927j510329K74876J667467J105910
12550C821979j145634l367825l319963j79637L854894N090258K311564j528464
12542E537172k552251n86808O49369j429666m273109l205516J797149N339410
12534A275750L876667M27624p33193o83182k551242m348705j547878M128939N678606
12525E523386J385414k654458k449035j329284k197450j948891J586398L840760
12517A756840Q01771l371646k749280Q99282K091675J122055J840802L031904
12509E423403L82910m589790n834080k412713Q57415K162292M194650O481477
12501F665564M476697j730651n388540k787094J394839J655268j055153k865044
$$ plain form
12493 365886 -2295375 -3293017 -1393716 2503788 4067193 457544 -4112748 -2616922
12485 -2616922 4852178 10466722 9190154 5011858 4200591 6495790 6792423 3193127
12477 3193127 -780518 -1741343 -953738 -2021056 -5586494 -8185651 -6787609 -3159806
12469 -3159806 -1827340 -3758087 -4660893 -1014647 4604804 6904521 4997435 2785112
12461 2785112 2752498 2911228 651456 -3148927 -5249381 -3791319 -77771 2555373 1761672
12452 1761672 -984764 -1506659 1638194 4394973 2456447 -2320726 -4498975 -3033488
12444 -3033488 -1900882 -2751858 -2427680 585128 2580619 560364 -2760547 -3547318 -2498809
12435 -2498809 -1695069 502192 5989599 10926416 9343936 1892186 -4659571 -6482318
$$ packed form
12493C65886k661261r97642J899301L897504J563405l609649m570292J495826
12485b616922P469100N614544j276568m178296q11267K295199K96633l599296
12477C193127l973645r60825P87605j067318l565438k599157J398042L627803
12469c159806J332466j930747r02806L646246N619451K299717j907086k212323
12461B785112l2614J58730k259772l800383k100454J458062L713548K633144p93701
12452A761672k746436n21895L144853K756779j938526m777173k178249J465487
12444c033488J132606q50976L24178L012808J995491k020255l320911p86771J048509
12435b498809Q03740K197261N487407M936817j582480p451750o551757j822747
$$ plain form
12427 -6482318 -5797108 -4744937 -2177829 1785244 3701633 2342173 1713180 4950653
12419 4950653 8825242 8292330 3915404 847289 2091144 6055190 9292174 8796524
12411 8796524 3467308 -3474499 -5370646 844350 9811367 13598344 11098399 7692244
12403 7692244 6870834 6923812 5451892 2277802 -2271644 -7249260 -9132505 -5330341 -253963
12394 -253963 -1731482 -9512833 -13792569 -8474098 407120 4231281 3779855 5059763
12386 5059763 7874232 7054458 3076710 2591305 7491391 11052125 7630145 333195
12378 333195 -4451506 -5804717 -7580694 -11635390 -15594199 -16417299 -13376584 -7641860
12370 -7641860 -863525 5282559 8931565 8339722 3294668 -3607751 -8397636 -9347479
$$ packed form
12427f482318O85210J052171K567108L963073J916389j359460o28993L237473
12419D950653L874589n32912m376926l068115J243855L964046L236984m95650
12411H796524n329216o941807j896147O214996Q967017L786977k499945l406155
12403G692244q21410N2978j471920l174090m549446m977616j883245L802164N076378
12394b53963j477519p781351m279736N318471Q881218L824161m51426J279908
12386E059763K814469q19774l977748m85405M900086L560734l421980p296950
12378C33195m784701j353211j775977m054696l958809q23100L040715N734724
12370g641860O778335O146084L649006n91843n045054o902419m789885r49843
$$ plain form
12362 -9347479 -8075186 -6466422 -4557507 -2674054 -2793394 -5169717 -6200014 -3104039
12354 -3104039 1453757 3332807 3387840 5193698 7992273 7681401 4271163 2237882 2919312
12345 2919312 2619172 -259739 -1987902 331736 4492387 7448753 8972941 8655201
12337 8655201 4509522 -2198453 -5755207 -3596944 -696569 -2136074 -5403225 -4783124
12329 -4783124 174896 5589429 9542636 12146954 11810691 6995916 233742 -4554608
12321 -4554608 -7409021 -10406277 -12140830 -9491226 -3827965 105149 1190809 2450687
12313 2450687 4493142 4002170 -95002 -3824909 -3305506 933409 5881131 8839418
12305 8839418 7712923 2584159 -2032457 -788123 5113185 8232320 4442357 -1948811
$$ packed form
12362i347479J272293J608764J908915J883453j19340k376323j030297L095975
12354c104039M557796J879050N5033J805858K798575l10872l410238k033281O81430
12345B919312l00140k878911j728163K319638M160651K956366J524188l17740
12337H655201m145679o707975l556754K158263K900375j439505l267151O20101
12329d783124M958020N414533L953207K604318l36263m814775o762174m788350
12321d554608k854413k997256j734553K649604N663261L933114J085660J259878
12313B450687K042455m90972m097172l729907N19403M238915M947722K958287
12305H839418j126495n128764m616616J244334N901308L119135l789963o391168
$$ plain form
12297 -1948811 -4882960 -4076901 -2601555 -868468 2420258 5779370 6211305 3973519
12289 3973519 1932189 707987 -1516589 -4428884 -5053535 -2751150 -866976 -1603000
12281 -1603000 -2799578 -2496239 -3340622 -8089857 -12712026 -9764441 702503 9109783
12273 9109783 7915208 768730 -3709117 -3353345 -2151530 -1271541 2262517 7954588
12265 7954588 10299709 7179116 3498724 3151936 3168442 221871 -2510669 -876257 2191499
12256 2191499 1060522 -3050037 -4350681 -2652429 -3240015 -6591380 -6419925 -39406
12248 -39406 6557630 7333723 3932150 1017181 -625405 -1722879 -78573 5604796 10572078
12239 10572078 8990809 2827232 -132702 2766004 5454194 2002567 -5272056 -9233542
$$ packed form
12297a948811k934149Q06059J475346J733087L288726L359112M31935k237786
12289C973519k041330j224202k224576k912295o24651K302385J884174p36024
12281a603000j196578L03339q44383m749235m622169K947585J0466944Q407280
12273I109783j194575p146478m477847L55772J201815Q79989L534058N692071
12265G954588K345121l120593l680392l46788J6506k946571k732540J634412L067756
12256B191499j130977m110559j300644J698252n87586l351365J71455O380519
12248c9406O597036P76093l401573k914969j642586j097474J644306N683369M967282
12239A0572078j581269o163577k959934K898706K688190l451627p274623l961486
$$ plain form
12231 -9233542 -6774131 -1302101 2445754 3331621 3229574 3427953 3246279 2240251 2335504
12222 2335504 6030618 12228443 15613746 11906185 3253927 -3424658 -3935215 -1176891
12214 -1176891 -969106 -4699487 -8190940 -7876405 -5563166 -5278137 -7147088 -7474799 -4620838
12205 -4620838 -1382163 -417113 -500752 349914 650107 -2246487 -6992212 -9074969 -6663490
12196 -6663490 -2460540 576697 2385543 3877624 4626726 3955815 2445894 973461
12188 973461 -374556 -1374803 -1081107 629150 2069595 1573656 -388127 -1880720 -1734990
12179 -1734990 -395302 884803 1059633 30960 -1040000 -564458 1824143 4660055
12171 4660055 5906788 4599257 1249596 -2835046 -6300136 -8080316 -7567167 -5031278
$$ packed form
12231i233542K459411N472030L747855Q85867j02047J98379j81674j006028R5253
12222B335504L695114O197825L385303l707561q652258o678585n10557K758324
12214a176891K07785l730381l491453L14535K313239K85029j868951l27711K853961
12205d620838L238675R65050q3639Q50666L00193k896594m745725k082757K411479
12196f663490M202950L037237J808846J492081P49102o70911j509921j472433
12188I73461j348017j000247K93696J710257J440445m95939j961783j492593J45730
12179a734990J339688J280105J74830j028673j070960M75542K388601K835912
12171D660055J246733j307531l349661m084642l465090j780180N13149K535889
$$ plain form
12163 -5031278 -2002746 -438394 -747080 -1320980 -952754 -471311 -177835 2541616 9234069
12154 9234069 14905370 12084070 1690946 -5922172 -3957219 2278201 4397435 3116771
12146 3116771 4496569 7925513 6717428 -185785 -5665671 -4795128 -412567 3537844
12138 3537844 7204122 10455229 9868511 4362315 -1185768 -2398851 -1510882 -2766893
12130 -2766893 -5273953 -5106635 -2034266 392315 47045 -2113448 -4350812 -5035657 -2597726
12121 -2597726 2411836 6275726 5785341 2117416 -981956 -1738459 -1321915 -1709732 -4162908
12112 -4162908 -8147774 -10492046 -7999346 -2346647 735566 -807392 -2137296 927918
12104 927918 5073936 4803295 1541540 1682175 6821983 11589045 11391446 7591475 4084360
$$ packed form
12163e031278L028532J564352l08686n73900L68226M81443K93476K719451O692453
12154I234069N671301k821300j0393124p613118J964953O235420K119234j280664
12146C116771J379798L428944j208085o903213n479886Q70543M382561L950411
12138C537844L666278L251107n86718n506196n548083j213083Q87969j256011
12130b766893k507060J67318L072369K426581l45270k160493k237364o84845K437931
12121b597726N009562L863890m90385l667925l099372p56503M16544l87817k453176
12112d162908l984866k344272K492700N652699L082213j542958j329904L065214
12104I27918M146018k70641l261755J40635N139808M767062j97599l799971l507115
$$ plain form
12095 4084360 2512556 2036290 1104963 -1409647 -4872278 -6591112 -4756664 -1215979
12087 -1215979 705885 330667 -593256 -1001502 -860764 145367 1413854 713665 -1876928
12078 -1876928 -1586292 4728812 11771195 11389574 4209103 -1099026 -541355 657152 -1803540
12069 -1803540 -4443345 -3580248 -2809499 -6558883 -11150817 -9627553 -2714924 2279541
12061 2279541 2370204 1765363 3562873 5053602 3257151 99223 -622531 1957485 6167018
12052 6167018 10036044 11197434 7615984 1012152 -2952347 -982399 3011834 2519298
12044 2519298 -3121406 -8118343 -7852201 -3806312 -39321 2248574 4411864 6357041
12036 6357041 5857287 2293542 -1018825 14024 5130392 9338490 8506527 4308925
$$ packed form
12095D084360j571804m76266r31327k514610l462631j718834J834448L540685
12087a215979J921864l75218r23923m08246J40738J006131J268487p00189k590593
12078a876928K90636O315104P042383l81621p180471n308129N57671J198507k460692
12069a803540k639805Q63097P70749l749384m591934J523264O912629M994465
12061B279541R0663o04841J797510J490729j796451l157928p21754K580016M209533
12052F167018L869026J161390l581450o603832l964499J969948L994233m92536
12044B519298n640704m996937K66142M045889L766991K287895K163290J945177
12036F357041m99754l563745l312367J032849N116368M208098q31963m197602
$$ plain form
12028 4308925 1995954 3521292 5212317 3394835 60939 151754 4117618 6653352
12020 6653352 3685875 -2228218 -5252139 -3033289 1854966 5685343 6481338 4133898
12012 4133898 190131 -2490359 -1844166 1362228 4802312 7400333 9261157 9544822
12004 9544822 7004092 2900596 953360 3381259 8499142 12697061 13235103 9108140
11996 9108140 1681594 -4777875 -5914619 -2245397 865508 -72368 -2186346 -789171
11988 -789171 3561555 5759901 3065630 -1927044 -5420865 -6680073 -7144568 -7322257 -6162178
11979 -6162178 -2935583 1154950 3376888 1865139 -1864403 -3482023 -100489 6352905
11971 6352905 11206258 12151897 10842878 9615370 8607529 6831937 4485844 2907323
$$ packed form
12028D308925k312971J525338J691025j817482l333896R0815L965864K535734
12020F653352k967477n914093l023921K218850M888255L830377P95995k347440
12012D133898l943767k680490O46193L206394L440084K598021J860824K83665
12004I544822k540730m103496j947236K427899N117883M197919N38042m126963
11996I108140p426546o459469j136744L669222L110905r37876k113978J397175
11988g89171M350726K198346k694271m992674l493821j259208m64495j77689J160079
11979f162178L226595M090533K221938j511749l729542j617620L381534O453394
11971F352905M853353R45639j309019j227508j007841j775592k346093j578521
$$ plain form
11963 2907323 2961449 4368079 6070454 6647984 5136693 2274163 268936 437835 1702021
11954 1702021 2384302 2649469 3639180 4862540 4656104 3237862 2721015 3279845 2123797
11945 2123797 -1776483 -4547538 -2147757 3421605 6373590 4832585 2246314 1188732
11937 1188732 322590 -1293882 -1455154 1073552 3375751 2452437 -331491 -1853708 -1620980
11928 -1620980 -464110 2306733 6626627 9030032 6711586 2544630 1632702 4194840
11920 4194840 6343868 6669701 6999829 7210761 4672488 -505852 -4198425 -3178388 1977473
11911 1977473 8606079 12985550 10972034 2668851 -4587331 -4023554 289303 -1889416
11903 -1889416 -11585455 -18166897 -14658974 -7224743 -5050481 -8124484 -10686743 -10692207 -9405631
$$ packed form
11963B907323N4126J406630J702375N77530j511291k862530k005227J68899J264186
11954A702021O82281K65167R89711J223360k06436j418242n16847N58830j156048
11945B123797l900280k771055K399781N569362K951985j541005k586271j057582
11937A188732q66142j616472j61272K528706K302199r23314k783928j522217K32728
11928a620980J156870K770843M319894K403405k318446m166956r11928K562138
11920D194840K149028L25833L30128K10932k538273n178340l692573J020037N155861
11911A977473O628606M379471k013516q303183p256182N63777M312857k178719
11903a889416r696039o581442L507923P434231K174262l074003k562259n464J286576
$$ plain form
11894 -9405631 -6266858 -736358 4059894 5422515 5929746 8802600 11496039 9726684
11886 9726684 5245281 3415246 4850614 5529970 4128524 3421842 4775288 6407770
11878 6407770 7093705 7138241 5844573 2209056 -1877365 -2838959 75340 4232196 6837236
11869 6837236 6287978 2134203 -3202347 -4767365 -764391 4142169 4888386 2753864
11861 2753864 1639995 631499 -3682040 -9320071 -10119867 -4742912 1437876 3973395
11853 3973395 3755002 3239493 2967390 2627621 1643567 -1696271 -8077116 -14169400 -15362634
11844 -15362634 -11311724 -5712790 -1600893 -1446 -1235356 -3665384 -3544663 -513924
11836 -513924 -156656 -5694671 -10887533 -8401535 -1809626 -273905 -3656456 -3389724 2463780
$$ packed form
11894i405631L138773N530500M796252J362621N07231K872854K693439j769355
11886I726684m481403j830035J435368O79356j401446p06682J353446J632482
11878F407770O85935M4536j293668l635517m086421r61594K914299M156856K605040
11869F837236n49258m153775n336550j565018M002974M906560P46217k134522
11861B753864j113869j008496m313539n638031p99796N376955O180788K535519
11853C973395k18393n15509k72103l39769r84054l339838o380845o092284j193234
11844a5362634M050910N598934M111897J599447j233910k430028J20721L030739
11836e13924L57268n538015n192862K485998O591909J535721l382551K66732N853504
$$ plain form
11827 2463780 6249826 4116784 1240179 848382 -994471 -5307206 -5584886 546782
11819 546782 4622359 -155658 -7683514 -8505250 -4056787 -2511911 -5190378 -6140949 -2695191
11810 -2695191 1500494 2896089 1436443 -1427664 -3463387 -1955608 2770040 6262065
11802 6262065 5798427 4180074 4014837 2339969 -4002534 -11288898 -13161001 -9566477
11794 -9566477 -5876620 -4849477 -4584144 -3096211 -445876 2421190 3396386 -175787
11786 -175787 -7259256 -12391583 -12770825 -12332571 -14338508 -14339891 -6872265 4197058 9319763
11777 9319763 5662311 -804907 -4557925 -5486538 -5128880 -3998806 -2970634 -2588588 -1220592
11768 -1220592 2028924 3879020 894377 -4676515 -7947899 -8320135 -8032269 -6253797
$$ packed form
11827B463780L786046k133042k876605l91797j842853m312735k77680O131668
11819E46782M075577m778017p527856q21736M448463J544876k678467r50571L445758
11810b695191M195685J395595j459646k864107k035723J507779M725648L492025
11802F262065m63638j618353j65237j674868o342503p286364j872103L594524
11794i566477L689857J027143K65333J487933K650335K867066R75196l572173
11786a75787p083469n132327l79242M38254k005937j383P467626J1069323N122705
11777I319763l657452o467218l753018r28613L57658J130074J028172L82046J367996
11768a220592L249516J850096k984643n570892l271384l72236K87866J778472
$$ plain form
11760 -6253797 -1278906 3220066 1726550 -3864746 -5889164 -1866496 3261553 5895545
11752 5895545 7245932 7476183 4408427 -163112 -502496 4207569 7933960 7185544 5463361
11743 5463361 5682520 5292876 2358111 -410981 -1590831 -4270716 -8992779 -10221929
11735 -10221929 -5106737 553257 998713 -765999 408544 2072311 -914763 -5943328
11727 -5943328 -6027103 -1381293 1093273 -755075 -1642856 1659418 5591237 6543026 6108579
11718 6108579 6748312 6905616 3688752 -2337411 -7409787 -8096945 -3928689 1571304 2690149
11709 2690149 -2778176 -9644352 -10360896 -4173392 2316717 4223892 3711720 4464027 5137784
11700 5137784 2180221 -3156082 -5072444 -725748 5586030 7163732 2550922 -2963776
$$ packed form
11760f253797M974891M498972j493516n591296k024418M022668N128049K633992
11752E895545J350387K30251l067756m571539l39384M710065L726391p48416j722183
11743E463361K19159l89644k934765k769092j179850k679885m722063j229150
11735a0221929N115192N659994M45456j764712J174543J663767k987074n028565
11727e943328q3775M645810K474566j848348q87781L302274L931819R51789m34447
11718F108579O39733J57304l216864o026163n072376o87158M168256N499993J118845
11709B690149n468325o866176p16544O187504O490109J907175n12172P52307O73757
11700E137784k957563n336303j916362M346696O311778J577702m612810n514698
$$ plain form
11692 -2963776 -3406833 1409296 6309977 6995656 4097462 726742 -1715757 -3590970
11684 -3590970 -4705414 -4518739 -3838070 -3837525 -3859466 -2569606 -831029 -730148 -1942477
11675 -1942477 -2089032 -994801 -1356386 -4155370 -6473239 -5557888 -2548385 -246667 650687
11666 650687 927898 203123 -2592919 -6840690 -10286582 -11247643 -9784135 -7301958 -5593673
11657 -5593673 -5241445 -4594041 -1865551 1544447 2254086 35994 -1453861 -555208 -506604
11648 -506604 -3737314 -6834914 -5198847 23575 4084788 5394758 5223396 2890368
11640 2890368 -2520963 -6783549 -4067292 3425052 6432642 1399497 -4337276 -3416874
11632 -3416874 1534195 3271642 392760 -2853654 -3825281 -3379122 -2566606 -1675935 -1037447
$$ packed form
11692b963776m43057M816129M900681O85679k898194l370720k442499j875213
11684c590970j114444J86675O80669N45k1941J289860J738577J00881j212329
11675a942477j46555J094231l61585k798984k317869R15351L009503K301718Q97354
11666F50687K77211p24775k796042m247771l445892r61061J463508K482177J708285
11657e593673L52228O47404K728490L409998P09639k218092j489855Q98653M8604
11648e06604l230710l097600J636067N222422M061213J309970j71362k333028
11640B890368n411331m262586K716257P492344L007590n033145n736773R20402
11632c416874M951069J737447k878882l246414r71627M46159Q12516Q90671O38488
$$ plain form
11623 -1037447 129839 3273302 6404211 4301293 -3552187 -9534462 -7347046 -941615
11615 -941615 1866678 943155 1790718 4785347 4878072 1252708 -844940 1486148 5618515
11606 5618515 9157948 11982132 12133931 7298186 1461023 2000854 8065942 10162035
11598 10162035 4418558 -1356912 -525686 1990158 -1048613 -6722995 -7280642 -3277051
11590 -3277051 -2438857 -7401544 -12429341 -12000310 -6504840 537016 5798361 6715331 3288608
11581 3288608 -366822 222175 4551967 8262395 8794567 7120174 4891496 2935591
11573 2935591 1898910 1813245 1744688 1681009 3101715 5759308 6388692 3343668 43444
11564 43444 560396 3905604 5988894 5252419 3067675 528314 -1783413 -2652175 -1950932
$$ packed form
11623a037447J167286L143463L130909k102918p853480n982275K187416O405431
11615i41615K808293r23523Q47563K994629R2725l625364k097648K331088M132367
11606E618515L539433K824184J51799m835745n837163N39831O065088K096093
11598A0162035n743477n775470Q31226K515844l038771n674382n57647M003591
11590c277051Q38194m962687n027797M29031N495470P041856N261345R16970l426723
11581C288608l655430N88997M329792L710428N32172j674393k228678j955905
11573B935591j036681q5665o8557o3679J420706K657593O29384l045024l300224
11564D3444N16952L345208K083290p36475k184744k539361k311727q68762P01243
$$ plain form
11555 -1950932 -1600902 -2241327 -1757826 86219 -566421 -5300414 -8975330 -6829878 -2266622
11546 -2266622 -1416253 -3231017 -2156158 1611022 2387426 -1258240 -4601552 -4845139 -4143936
11537 -4143936 -3799961 -2007725 1249710 2866275 1670286 -141842 -1475207 -3252883
11529 -3252883 -4409071 -2425900 1407355 2764361 1099355 170504 1179425 1548665
11521 1548665 1389847 4181358 9025078 9465125 3505062 -1597479 1112991 9060112
11513 9060112 14665802 14630242 10665593 5241071 964361 664932 3748293 5146936 1562958
11504 1562958 -3757956 -5581756 -3172169 893865 5295626 9567763 11580585 9506360
11496 9506360 5173727 2394217 2693827 4656771 6331692 6721868 6122046 5913768 6633716
$$ packed form
11555a950932L50030o40425M83501J844045o52640m733993l674916K145452M563256
11546b266622Q50369j814764J074859L767180P76404l645666l343312k43587P01203
11537d143936L43975J792236L257435J616565j195989j812128j333365j777676
11529c252883j156188J983171L833255J357006j665006r28851J008921L69240
11521A548665j58818K791511M843720M40047n960063n102541K710470P947121
11513I060112N605690l5560l964649n424522m276710k99429L083361J398643l583978
11504A562958n320914j823800K409587M066034M401761M272137K012822k074225
11496I506360m332633k779510K99610J962944J674921L90176n99822k08278P19948
$$ plain form
11487 6633716 6391163 3722779 1412899 3380706 7777024 8362433 3864208 453756
11479 453756 2841039 8328071 12338344 14281969 14533760 11180507 4254582 -1599790
11471 -1599790 -3388801 -4285316 -7165549 -8371252 -3749367 3184595 5777796 4007044
11463 4007044 3007540 3992718 3530359 789861 -1126380 -961734 -493907 253477 3375090
11454 3375090 7883860 9241100 5492674 -115425 -3820928 -5175576 -5239356 -4246643 -2429623
11445 -2429623 -896177 -690532 -2206833 -5170055 -7823850 -7496810 -4019498 -840498
11437 -840498 -252629 240818 3523410 7441046 8273638 7236786 7683978 7433470 1244641
11428 1244641 -8591504 -11941915 -4215914 6368537 9388945 5109811 1463969 1891281
$$ packed form
11487F633716k42553k668384k309880J967807M396318N85409m498225l410452
11479D53756K387283N487032M010273J943625K51791l353253o925925n854372
11471a599790j789011q96515k880233j205703M621885O933962K593201j770752
11463D007044r99504R85178m62359k740498j916241J64646M67827P47384L121613
11454C375090M508770J357240l748426n608099l705503j354648o3780R92713J817020
11445b429623J533446K05645j516301k963222k653795L27040L477312L179000
11437h40498N87869M93447L282592L917636Q32592j036852M47192k50508o188829
11428A244641r836145l350411P726001J0584451L020408m279134l645842M27312
$$ plain form
11420 1891281 2680674 1066867 -595794 -3683 838540 -755379 -3516885 -4198168 -2066656
11411 -2066656 1615165 6856845 13664783 18147792 15012431 5617102 -1198024 250782
11403 250782 4904107 4556148 -372719 -2923426 -1349851 -937505 -3787922 -4953925 -1479875
11394 -1479875 2018670 1072397 -1519363 -1353455 85847 -690649 -2314549 -1856913 -1247249
11385 -1247249 -3557411 -5757408 -2663737 3449660 4842797 -232353 -5271608 -5553440
11377 -5553440 -3652656 -3139614 -3058821 -1669028 -587136 -1516483 -2393531 -404053 3392235
11368 3392235 5506224 4767430 3263989 3156085 4051018 3448767 -422933 -5834430 -8405076
11359 -8405076 -6019822 -1911521 -856544 -3126649 -4606669 -2336471 2642873 7570227
$$ packed form
11420A891281P89393j613807j662661N92111Q42223j593919k761506o81283K131512
11411b066656L681821N241680O807938M483009l135361r395329o815126J448806
11403B50782M653325l47959m928867k550707J573575M12346k850417j166003L474050
11394a479875L498545r46273k591760J65908J439302p76496j623900M57636O09664
11385a247249k310162k199997L093671O113397J393137n075150n039255k81832
11377e553440J900784N13042Q0793J389793J081892r29347q77048J989478L796288
11368C392235K113989p38794j503441j07904Q94933o02251l871700n411497k570646
11359h405076K385254M108301J054977k270105j480020K270198M979344M927354
$$ plain form
11351 7570227 10377929 10009365 7123210 4684110 5377501 8256885 10195527 10396386 10642261
11342 10642261 11052868 8996344 3521716 -1761886 -2306846 1888544 5895997 4997583
11334 4997583 -137667 -3794698 -1428673 4920280 9252677 9337610 8497052 8938930 7889829
11325 7889829 3310185 -777011 614170 5740896 8528818 6907804 3995122 2417639
11317 2417639 2278801 3605264 5923771 6386677 3301585 540386 3012375 8506858
11309 8506858 10039103 6148796 2466382 2487830 3590611 3850645 5824344 10208587 11830588
11300 11830588 6739492 -740593 -2805486 2165205 8340847 9406360 4283162 -2891751
11292 -2891751 -6767146 -5665564 -3031630 -2940819 -5087244 -6539117 -6754372 -6736376 -4645217
$$ packed form
11351G570227K807702l68564k886155k439100O93391K879384J938642K00859K45875
11342A0642261M10607k056524n474628n283602n44960M195390M007453q98414
11334D997583n135250l657031K366025O348953M332397Q4933q40558M41878j049101
11325G889829m579644m087196J391181N126726K787922j621014k912682j577483
11317B417639j38838J326463K318507M62906l085092k761199K471989N494483
11309H506858J532245l890307l682414K1448J102781K60034J973699M384243J622001
11300A1830588n091096p480085k064893M970691O175642J065513n123198p174913
11292b891751l875395J101582K633934R0811k146425j451873k15255J7996K091159
$$ plain form
11283 -4645217 1969429 9708295 11551526 6773885 2375539 2804142 4732466 4622584
11275 4622584 4525222 6247152 6323300 2430153 -506917 2916481 9352228 10536708 4064337
11266 4064337 -4988131 -11079916 -11982395 -7805052 -1347111 2277081 990830 -1009577
11258 -1009577 440277 2653612 846258 -3037973 -3072746 471399 1222398 -2562288 -4609854
11249 -4609854 -152043 7220721 11229666 10545868 7429898 2882568 -2758801 -7009442
11241 -7009442 -7149265 -4068729 -1353736 -1045570 -2379626 -4162346 -6317102 -8856584
11233 -8856584 -10609667 -9659456 -5255396 451753 3289534 1145064 -2965326 -3846385
11225 -3846385 -646414 1726863 -964231 -6480757 -9100675 -7244031 -5056159 -6159695
$$ packed form
11283d645217O614646P738866J843231m777641m398346M28603J928324j09882
11275D622584r7362J721930P6148l893147k937070L423398O435747J184480o472371
11266D064337r052468o091785r02479M177343O457941L624192j286251k000407
11258a009577J449854K213335j807354l884231l4773L544145P50999l784686k047566
11249d609854M457811P372764M008945o83798l115970m547330n641369m250641
11241g009442j39823L080536K714993L08166j334056j782720k154756k539482
11233h856584j753083R50211M404060N707149K837781k144470m110390q81059
11225c846385L199971K373277k691094n516526k619918J856644K187872j103536
$$ plain form
11217 -6159695 -8823052 -9038340 -6305370 -3732921 -3176062 -3074932 -1564696 634702 1624366
11208 1624366 949251 -476050 -1741115 -2027812 -728777 1093449 848055 -2113682 -4506834
11199 -4506834 -2910727 1384562 3848793 2419322 -918931 -3898288 -6264584 -7882567
11191 -7882567 -7513302 -4953799 -2551754 -2993310 -6123991 -8582044 -6569048 253846
11183 253846 7122747 8149503 3437931 82513 3489560 9917572 11492157 6899471
11175 6899471 2033978 598462 -116005 -2948678 -5934059 -6286002 -4930738 -3891159
11167 -3891159 -2522940 321308 2915234 2803224 768100 -235310 726596 1628112 340663
11158 340663 -2903140 -5681049 -5732763 -3651105 -2539015 -3832261 -5072805 -4148149 -3463796
$$ packed form
11217f159695k663357k15288K732970K572449N56859J01130J510236K199398R89664
11208A624366o75115j425301j265065k86697J299035J822226k45394k961737k393152
11199d506834J596107M295289K464231j429471l338253k979357k366296j617983
11191g882567L69265K559503K402045m41556l130681k458053K012996O822894
11183B53846O868901J026756m711572l355418L407047O428012J574585m592686
11175F899471m865493j435516p14467k832673k985381l51943J355264J039579
11167c891159J368219K844248K593926j12010k035124j003410R61906R01516j287449
11158C40663l243803k777909n1714K081658J112090j293246j240544R24656O84353
$$ plain form
11149 -3463796 -5689421 -7268241 -2324504 7195163 12223826 9003349 4097774 4173994
11141 4173994 7199573 7834971 5794430 3822949 2129886 278058 704847 4691309
11133 4691309 7877730 5425659 -658621 -4575963 -4886315 -4280531 -3254663 6363
11125 6363 4297061 5690299 3401540 679072 -475997 -1367585 -3073826 -4654919 -5451892
11116 -5451892 -6075740 -6725177 -7020628 -7254757 -7277583 -4861941 1762636 10119573 15197232
11107 15197232 14836226 10950793 6004413 1141859 -2520293 -3752875 -2800539 -1144587
11099 -1144587 378563 1854690 3352017 5024594 7015203 8067640 6205947 2424248
11091 2424248 1120147 4351774 8175850 7784058 4016168 1314467 1175395 1362781 184478
$$ packed form
11149c463796k225625j578820M943737R519667N028663l220477m905575P6220
11141D173994L025579O35398k040541j971481j693063j851828M26789L986462
11133D691309L186421k452071o084280l917342l10352O05784J025868L261026
11125F363M290698J393238k288759k722468j155069q91588j706241j581093p96973
11116e451892o23848o49437k95451k34129k2826K415642O624577Q356937N077659
11107A5197232l61006l885433m946380m862554l662152j232582R52336J655952
11099a144587J523150J476127J497327J672577J990609J052437j861693l781699
11091B424248j304101L231627L824076l91792l767890k701701j39072J87386j178303
$$ plain form
11082 184478 -1940493 -3952402 -4260198 -1143870 4069988 6671053 4732999 2680185
11074 2680185 4662431 7771830 7186663 4799552 5781830 8625223 6618806 -850004
11066 -850004 -6289146 -4876118 -350172 2126120 2790912 3873114 4544004 3054015 444237
11057 444237 -1159568 -1674847 -2205058 -2872546 -2916266 -1494501 1754702 5108503 4686393
11048 4686393 -995273 -7532587 -9559537 -7927618 -7140119 -6851580 -2423743 5767701
11040 5767701 10635911 8075595 2216813 -1501637 -2677480 -2583686 -531316 2527354
11032 2527354 2254280 -2580149 -6472350 -4823786 -968527 -431650 -2111441 -1207841 1977313
11023 1977313 2771324 300620 -1354448 -76971 1721992 2113388 2504014 4282134 6372887
$$ packed form
11082A84478k124971k011909l07796L116328N213858K601065j938054k052814
11074B680185J982246L109399n85167k387111R82278K843393k006417p468810
11066h50004n439142J413028M525946K476292O64792J082202O70890j489989k609778
11057D44237j603805n15279n30211o67488m3720J421765L249203L353801m22110
11048D686393n681666o537314k026950J631919P87499K88539M427837Q191444
11040E767701M868210k560316n858782l718450j175843R3794K052370L058670
11032B527354k73074m834429l892201J648564L855259N36877j679791R03600L185154
11023A977313P94011k470704j655068J277477J798963L91396L90626J778120K090753
$$ plain form
11014 6372887 7404312 7347930 6156048 3658179 1573779 2528370 5854943 7402693 5321219
11005 5321219 3247802 5148589 9147189 9954847 6631657 4192970 6689234 11841106
10997 11841106 14521795 13296589 10766786 8737934 6355410 2995845 -150393 -2234923
10989 -2234923 -3832423 -4822905 -3836471 -1157559 593144 511123 1286332 4576002 7312299
10980 7312299 5916047 1960598 -21597 1317289 3862710 6255102 8245690 8115707
10972 8115707 4387105 -311499 -1595947 368451 1164091 -989838 -2921060 -1847025
10964 -1847025 944582 2901273 3367070 3025033 3074682 5164366 8918659 9854850 4039449
10955 4039449 -4962301 -8623936 -4116418 2141815 3218067 -430658 -3880066 -4517892
$$ packed form
11014F372887J031425n6382j191882k497869k084400R54591L326573J547750k081474
11005E321219k073417J900787L998600Q07658l323190k438687K496264N151872
10997A1841106K680689j225206k529803k028852k382524l359565l146238k084530
10989b234923j597500r90482R86434K678912J750703q2021P75209L289670K736297
10980G312299j396252l955449j982195J338886K545421K392392J990588j29983
10972H115707l728602m698604j284448J964398P95640k153929j931222J074035
10964a847025K791607J956691M65797l42037M9649K089684L754293R36191n815401
10955D039449r001750l661635M507518O258233J076252l648725l449408o37826
$$ plain form
10947 -4517892 -3226061 -1793672 -1546022 -2510425 -2812738 -1108391 425031 -1163084 -4216922
10938 -4216922 -4290813 -1110329 1785457 4319247 9614568 15172655 12891229 1882655
10930 1882655 -6847874 -4563059 3248422 6134384 3714101 2791135 4161955 2564892
10922 2564892 -2064747 -3459589 117630 2639301 89112 -3802252 -4319176 -2008749
10914 -2008749 982723 5267070 10943620 14293419 12199711 7218761 4329851 4424046
10906 4424046 4433819 2523071 -241500 -2627718 -4374472 -4639318 -2343355 1207638 2626748
10897 2626748 720277 -1586865 -1366121 49593 -545544 -2804834 -3283866 -1247585 19385
10888 19385 -986311 -1067795 2043387 5127430 4742733 3609424 6063085 9571037 7873365
$$ packed form
10947d517892J291831J432389K47650r64403l02313J704347J533422j588115l053838
10938d216922p3891L180484K895786K533790N295321N558087k281426j1008574
10930A882655q730529K284815P811481K885962k420283r22966J370820j597063
10922B564892m629639j394842L577219K521671k550189l891364n16924K310427
10914b008749K991472M284347N676550L349799k093708m980950k888910R4195
10906D424046R773j910748k764571k386218j746754k64846K295963L550993J419110
10897B626748j906471k307142K20744J415714n95137k259290m79032K036281J266970
10888A9385j005696q1484L111182L084043l84697j133309K453661L507952j697672
$$ plain form
10879 7873365 1909601 -222105 4348242 8543425 6241847 1007707 -757183 450027
10871 450027 157825 -1822942 -2449060 -1943481 -3064038 -5490937 -6504408 -6183485 -6791437
10862 -6791437 -7816567 -6673113 -3847069 -2315912 -1951317 361687 4495455 6138992
10854 6138992 3570292 661972 841510 2119271 1147305 -989461 -757443 1885889 3349169
10845 3349169 1842742 -287829 -373324 885064 1028065 -311491 -1074063 110179 2305462
10836 2305462 4083271 5185869 5412670 3502983 -1085973 -6231437 -8828191 -7890993
10828 -7890993 -4497223 311038 5510504 9042259 9447134 7982975 6527951 4212664
10820 4212664 -719232 -6495889 -9130033 -7904430 -5561742 -3280825 -140130 2401312
$$ packed form
10879G873365n963764k131706M570347M195183k301578n234140j764890J207210
10871D50027k92202j980767o26118N05579j120557k426899j013471L20923o07952
10862f791437j025130J143454K826044J531157L64595K313004M133768J643537
10854F138992k568700k908320J79538J277761r71966k136766K32018K643332J463280
10845C349169j506427k130571q5495J258388J43001j339556p62572J184242K195283
10836B305462J777809J102598K26801j909687m588956n145464k596754R37198
10828g890993L393770M808261N199466L531755M04875j464159j455024k315287
10820D212664m931896n776657k634144J225603K342688K280917L140695K541442
$$ plain form
10812 2401312 1244639 -1931681 -1153838 4420207 7625730 3686039 -2067215 -1953545
10804 -1953545 3030854 5816872 3853768 1035880 600518 1746552 3111498 4973903
10796 4973903 7249770 8329313 6811521 3285529 618778 2382783 8876426 14747163
10788 14747163 14161052 8716383 5189758 4326530 -1087549 -13360366 -22672051 -19538552
10780 -19538552 -8744762 -2542879 -3865555 -5362413 -2950489 -604605 -1303749 -2092476
10772 -2092476 -515318 1030613 373564 -280904 1836230 5911447 9275607 10192475 7969817
10763 7969817 3626425 954092 3178349 8007537 9793295 6971023 3168981 616212
10755 616212 -2395372 -6066822 -6502890 -1627425 4512757 7092147 7198666 9207350 13199167
$$ packed form
10812B401312j156673l176320P77843N574045L205523l939691n753254J13670
10804a953545M984399K786018j963104k817888m35362J146034J364946J862405
10796D973903K275867J079543j517792l525992k666751J764005O493643N870737
10788A4747163n86111n444669l526625q63228n414079j2272817r311685L133499
10780a9538552J0793790O201883j322676j496858K411924K345884o99144p88727
10772b092476J577158J545931o57049o54468K117134M075217L364160R16868k222658
10763G969817m343392k672333K224257M829188J785758k822272l802042k552769
10755F16212l011584l671450m36068M875465O140182K579390J06519K008684L991817
$$ plain form
10746 13199167 14170242 8989469 1007750 -3801678 -3771534 -2518831 -2986654 -3044501 647798
10737 647798 6013001 6950192 1751908 -4252216 -6132689 -4996798 -3590895 -1110798
10729 -1110798 3337228 6376865 4987929 2290940 2794444 4582616 2892424 -562314
10721 -562314 527935 6401564 10188398 8403971 5137868 3970820 2921941 623058
10713 623058 946919 6608151 12670376 11683960 3087264 -6471281 -10781871 -9185726 -5398227
10704 -5398227 -3724453 -5618475 -8310100 -7558495 -2665282 2332142 3124618 -387045
10696 -387045 -4482984 -5239512 -1509541 4439853 9021092 10763877 11112953 11259599 10063051
10687 10063051 6671244 2864769 279781 -2271316 -5388242 -5554153 354144 8720941
$$ packed form
10746A3199167R71075n180773p981719m809428L0144J252703m67823n7847L692299
10737F47798N365203R37191n198284o004124j880473J135891J405903K480097
10729a110798M448026L039637j388936k696989N03504J788172j690192l454738
10721e62314J090249N873629L786834j784427l266103j167048j048879k298883
10713F23058L23861N661232O062225r86416q596696r558545m310590J596145L787499
10704e398227J673774j894022k691625P51605M893213M997424P92476l511663
10696c87045m095939p56528L729971N949394M581239J742785L49076J46646j196548
10687A0063051l391807l806475k584988k551097l116926j65911N908297Q366797
$$ plain form
10679 8720941 12567307 10562019 7591175 6826199 6771554 6385267 7099258 8209126 5857352
10670 5857352 -753819 -6632131 -7342028 -4467627 -2059730 -989392 83557 774119
10662 774119 -493954 -3154863 -4481455 -2913467 -108918 522557 -2521889 -6247985
10654 -6247985 -5410386 1062417 7240484 6524095 47849 -4554806 -2842092 1475578
10646 1475578 2385788 -670083 -3191836 -2241547 16233 46209 -1458731 -211017 4930387
10637 4930387 9137234 8609212 7322008 11049031 16450398 14301442 4367634 -2295961
10629 -2295961 458413 4697522 1596423 -4833872 -5727216 -2013295 -949549 -2925616
10621 -2925616 -2383348 1019485 2441131 1469058 2251940 5007770 6081839 5514280 6292715
$$ packed form
10679H720941L846366k005288k970844p64976n4645l86287P13991J109868k351774
10670E857352o611171n878312p09897K874401K407897J070338J072949O90562
10662G74119j268073k660909j326592J567988K804549O31475l044446l726096
10654f247985Q37599O472803O178067p16389o476246m602655J712714M317670
10646A475578R10210l055871k521753R50289K257780K9976j504940J247714N141404
10637D930387M206847n28022j287204L727023N401367k148956r933808o663595
10629b295961K754374M239109l101099o430295q93344L713921J063746j976067
10621b925616N42268L402833J421646r72073P82882K755830J074069n67559P78435
$$ plain form
10612 6292715 7311024 5326050 2332633 2332597 2562950 -2596273 -10433128 -12705237 -8814712
10603 -8814712 -5973458 -6723392 -6857031 -5668164 -7200657 -10514736 -9648617 -4548230 -1435957
10594 -1435957 -1223521 1428852 6335368 6777986 2085232 -702738 122049 -1284941 -4885898
10585 -4885898 -2688483 5624063 8786970 1914888 -4469437 -817713 7610326 11269437
10577 11269437 10146121 8645447 5943822 49514 -5802103 -7915413 -6951340 -3524286
10569 -3524286 3071057 8333883 4999035 -3847162 -5654370 2481456 8277075 4290011
10561 4290011 -248798 3500825 8638311 5723198 -402162 37487 4795573 4976385
10553 4976385 346228 -2616662 -2309452 -1311248 644795 4178864 6135897 5160810 4940064
$$ packed form
10612F292715J018309j984974k993417l6K30353n159223p836855k272109L890525
10603h814712K841254p49934j33639J188867j532493l314079Q66119N100387L112273
10594a435957K12436K652373M906516M42618m692754k787970Q24787j406990l600957
10585d885898K197415Q312546L162907o872082o384325L651724Q428039L659111
10577A1269437j123316j500674k701625n894308n851617k113310R64073L427054
10569c524286O595343N262826l334848q846197j807208Q135826N795619l987064
10561D290011m538809L749623N137486k915113o125360M39649M758086J80812
10553D976385m630157k962890L07210R98204J956043L534069J957033r75087k20746
$$ plain form
10544 4940064 5919937 2440884 -5588115 -8634306 -2739095 2403863 -927343 -6594487
10536 -6594487 -7682460 -8658284 -13428415 -14395921 -6431566 736414 -1715770 -5561053
10528 -5561053 -413534 6847696 4429197 -2879003 -2489789 4069368 5899695 2538403
10520 2538403 1839611 3884461 3105730 1075067 2467059 4178358 1989198 803999
10512 803999 5196045 8588961 4885176 293114 439401 -1202083 -7816646 -8034089 3411642
10503 3411642 11769634 7625035 5503373 15366275 19572600 5678964 -3835540 11313626
10495 11313626 29225170 23886777 15063400 29628304 42791674 25440411 26240899 116205957
10487 116205957 250625220 286169086 168935722 17209993 -35077759 -1153384 18396938
$$ packed form
10544D940064R79873l479053q028999l046191N895211N142958l331206n667144
10536f594487j087973r75824m770131r67506P964355P167980k452184l845283
10528e561053N147519P261230k418499p308200L89214O559157J830327l361292
10520B538403o98792K044850p78731k030663J391992J711299k189160j185199
10512H03999M392046L392916l703785m592062J46287j641484o614563k17443J1445731
10503C411642Q357992m144599k121662R862902M206325j3893636r514504J5149166
10495A1313626J7911544n338393q823377J4564904J3163370j7351263Q00488Q9965058
10487A16205957J34419263L5543866j17233364j51725729n2287752L3924375J9550322
$$ plain form
10480 18396938 -6823893 -25310638 -12480973 -1171391 -9890201 -15304097 -4573269
10473 -4573269 2556995 -4441145 -9127821 -3560309 -2850628 -13558150 -20654181 -15703257
10465 -15703257 -9386344 -8311887 -5615181 -596772 -2477700 -9322608 -7627041 2194127
10457 2194127 3869238 -6168230 -11885689 -5210393 2131145 976871 -2407787 -2942828
10449 -2942828 -6054681 -12645415 -13199649 -4799835 2393253 2405580 1535639 3446137 2123191
10440 2123191 -4066618 -6509907 -1068686 4990771 6272524 6330977 7056396 4409736 -989142
10431 -989142 -2257158 928873 963244 -3289662 -4476538 -1715007 -2756722 -8135229 -8652779
10422 -8652779 -2578423 391260 -3040946 -3941734 1305554 3486141 -2727275 -9620481
$$ packed form
10480A8396938k5220831j8486745J2829665J1309582q718810n413896J0730828
10473d573269P130264o998140m686676N567512P09681j0707522p096031M950924
10465a5703257O316913J074457K696706N018409j880928o844908J695567R821168
10457B194127J675111j0037468n717459O675296P341538j154274l384658n35041
10449b942828l111853o590734n54234Q399814P193088J2327q69941J910498j322946
10440B123191o189809k443289N441221O059457J281753N8453P25419k646660n398878
10431i89142j268016L186031L4371m252906j186876K761531j041715n378507n17550
10422h652779O074356K969683l432206r00788N247288K180587o213416o893206
$$ plain form
10414 -9620481 -11177172 -12503115 -16965188 -17833948 -10880359 -2687219 1045461 3318235
10406 3318235 5638228 3161366 -3441010 -4988807 319275 2067312 -4030714 -7849146
10398 -7849146 -3312162 305868 -4394121 -9542242 -7272555 -3856142 -6044070 -7312923
10390 -7312923 -1491223 3218564 -1232154 -6810090 -4240022 -1789008 -10671684 -21670918
10382 -21670918 -17181644 -566187 7576840 347613 -7831088 -5264252 2863287 7336366
10374 7336366 7085808 4354687 -516413 -5427905 -6745044 -5752863 -7098237 -10038062
10366 -10038062 -9448857 -5727658 -4759230 -7300490 -7346029 -2512355 2407661 4160144 5328048
10357 5328048 7459631 7247897 2891434 -1659875 -2373120 -739726 -657946 -2804675 -4603672
$$ packed form
10414i620481j556691j325943m462073q68760O953589Q193140L732680K272774
10406C318235K319993k476862o602376j547797N308082J748037o098026l818432
10398g849146M536984L618030m699989n148121K269687L416413k187928j268853
10390g312923N821700M709787m450718n577936K570068K451014q882676j0999234
10382b1670918M489274J6615457Q143027p229227q178701K566836Q127539M473079
10374G336366k50558k731121m871100m911492j317139R92181j345374k939825
10366a0038062N89205L721199R68428k541260m5539M833674M920016J752483J167904
10357E328048K131583k11734m356463m551309p13245J633394Q1780k146729j798997
$$ plain form
10348 -4603672 -3968152 -1589599 -316837 -2325269 -6513953 -9892692 -11494305 -12113598
10340 -12113598 -10408391 -4430611 1945129 1057613 -6822195 -11102720 -5379129 2748535
10332 2748535 3192360 -1878851 -3428694 -447903 459475 -2684325 -5269123 -5099564 -4432458
10323 -4432458 -3474573 -10160 4397369 5243018 2515599 798732 1836849 3071840
10315 3071840 3304206 3666373 3298461 320950 -3032244 -2450051 1267689 3043182 1490741
10306 1490741 -30 -136204 -1264144 -3411734 -3136533 129402 2052986 -396034
10298 -396034 -5027770 -8169683 -8723727 -7637724 -6443820 -6469474 -6792325 -4058626 2517216
10289 2517216 8003741 7762731 4396178 3701869 5822503 6169400 3423862 395882 -1790772
$$ packed form
10348d603672O35520K378553J272762k008432m188684l378739j601613o19293
10340a2113598J705207N977780O375740q87516p879808m280525N723591Q127664
10332B748535M43825n071211j549843K980791R07378l143800k584798J69559O67106
10323d432458R57885L464413M407529Q45649k727419j716867J038117J234991
10315C071840K32366L62167l67912k977511l353194N82193L717740J775493j552441
10306A490741j490771j36174j127940k147590K75201L265935J923584k449020
10298c96034m631736l141913n54044J086003J193904k5654l22851K733699O575842
10289B517216N486525k41010l366553o94309K120634L46897k745538l027980k186654
$$ plain form
10280 -1790772 -3916846 -4125585 28350 5562114 6954955 4640440 3483112 3198667
10272 3198667 -1405622 -9681608 -13242584 -7666381 1171508 5776652 5747032 4478075
10264 4478075 3034888 1200494 31402 -116867 -506419 -785729 1127285 4295830 4699751
10255 4699751 1870825 475983 2856336 5177706 3997100 1621790 1327749 1829959
10247 1829959 685775 -520025 1242907 5285974 8410105 9284219 8527069 6278424
10239 6278424 2453970 -1985625 -5932479 -8792352 -9209268 -5539552 1087526 6679081
10231 6679081 8723127 8355025 7421753 6286056 5420746 5867843 6819486 5928724 3321956
10222 3321956 2115388 3715556 5883595 6572028 6135508 4686676 1343760 -2440910
$$ packed form
10280a790772k126074k08739M153935N533764J392841k314515j157328k84445
10272C198667m604289q275986l560976N576203Q837889M605144k9620j268957
10264D478075j443187j834394j169092j48269l89552k79310J913014L168545M03921
10255D699751k828926j394842K380353K321370j180606k375310k94041N02210
10247A829959j144184j205800J762932M043067L124131Q74114p57150k248645
10239F278424l824454m439595l946854k859873m16916L669716O627078N591555
10231F679081K044046l68102r33272j135697q65310M47097R51643q90762k606768
10222C321956j206568J600168K168039O88433m36520j448832l342916l784670
$$ plain form
10214 -2440910 -3148479 -748651 279117 -2317593 -5153910 -5045649 -3675273 -3199703 -1747701
10205 -1747701 2404145 5864823 4257296 -1026442 -4679178 -4430606 -2194014 225492
10197 225492 2532480 3802942 2602782 -598800 -3488522 -4372087 -3185756 -763778
10189 -763778 1692717 3386574 5016753 7736226 10544070 10871397 8480218 6227541
10181 6227541 6004761 6683434 7046352 7455486 7323427 4759090 775605 -48453 4061908
10172 4061908 8514269 8322094 4595278 1822724 1534424 2103666 2335329 1842468 129079
10163 129079 -1604906 -340822 3920612 6338474 4098184 1680964 4161993 8171853
10155 8171853 6055546 -2228303 -8307430 -7138879 -3211124 -2824002 -5347932 -5477652
$$ packed form
10214b440910p07569K399828J027768k596710k836317J08261J370376M75570J452002
10205a747701M151846L460678j607527n283738l652736K48572K236592K419506
10197B25492K306988J270462j200160l201582k889722q83565J186331K421978
10189g63778K456495J693857J630179K719473K807844L27327k391179k252677
10181F227541k22780O78673L62918M09134j32059k564337l983485q24058M110361
10172D061908M452361j92175l726816k772554k88300N69242K31663m92861j713389
10163A29079j733985J264084M261434K417862k240290k417220K481029M009860
10155H171853k116307q283849o079127J168551L927755L87122k523930j29720
$$ plain form
10147 -5477652 -753936 6539368 12845636 15597508 13339707 6829192 117926 -2075990
10139 -2075990 664066 3631128 2783908 268891 1406499 6147009 7580420 1573666
10131 1573666 -5782634 -5340100 2464649 8262052 6808955 2695734 1476283 2004511
10123 2004511 1337159 1321721 4785049 8935821 8211329 1897889 -5329112 -8951127 -7491319
10114 -7491319 -1928019 4631510 8620319 9700027 10249512 9836702 5108146 -2255181
10106 -2255181 -4059335 2782134 9512464 7478900 1081102 7889 3394619 2499053
10098 2499053 -3656812 -7308775 -6336011 -7539658 -13330714 -16375080 -11709644 -4595225
10090 -4595225 -1392707 -1051030 -732243 -1760483 -4164556 -2951007 3544231 8489101
$$ packed form
10147e477652M723716P293304O306268K751872k257801o510515o711266k193916
10139b075990K740056K967062q47220k515017J137608M740510J433411o006754
10131A573666p356300M42534P804749N797403j453097m113221j219451N28228
10123B004511o67352j5438L463328M150772p24492o313440p227001l622015J459808
10114g491319N563300O559529L988809J079708N49485m12810m728556p363327
10106b255181j804154O841469O730330k033564o397798j073213L386730q95566
10098B499053o155865l651963R72764j203647n791056l044366M665436P114419
10090d595225L202518L41677L18787j028240k404073J213549O495238M944870
$$ plain form
10082 8489101 6843100 4164339 6941349 10338877 5801169 -3306375 -5163222 2490805
10074 2490805 8840118 5994983 -1080320 -3837957 -1444767 1506516 2624049 2335445
10066 2335445 835546 -1428345 -2785098 -2856917 -3746324 -6407983 -8392966 -7597680 -5779323
10057 -5779323 -5657763 -6566798 -5887661 -3521391 -2201228 -3769259 -7003226 -8928345 -7362060
10048 -7362060 -2914317 906132 865993 -2039214 -3534137 -1869998 -476839 -3116904
10040 -3116904 -8357864 -11127484 -8469503 -1715729 5747136 10631760 10872829 7230274
10032 7230274 3365260 2369613 3821867 5716719 7513549 8867091 7614414 3073483
10024 3073483 -145908 3196652 10562482 13311247 7976296 571768 -2500029 -2538473
$$ packed form
10082H489101j646001k678761K777010L397528m537708r107544j856847P654027
10074B490805O349313k845135p075303k757637K393190K951283J117533k88604
10066B335445j499899k263891j356753p1819q89407k661659j984983P95286J818357
10057e779323J21560r09035O79137K366270J320163j568031l233967j925119J566285
10048g362060M447743L820449m0139k905207j494923J664139J393159k640065
10040c116904n240960k769620K657981O753774P462865M884624K41069l642555
10032G230274l865014r95647J452254J894852J796830J353542j252677m540931
10024C073483l219391L342560P365830K748765n334951p404528l071797l8444
$$ plain form
10016 -2538473 -4072710 -7024879 -8072846 -6522730 -3948537 -409019 4223679 7226237
10008 7226237 6210748 3724558 3816464 5578595 5245133 3087365 2202575 1613618 -2405664
9999 -2405664 -8138838 -9010214 -3613806 2105113 4568488 6800742 10032807 9316738 2581893
9990 2581893 -3373454 -2570232 615404 -897217 -4770967 -3322213 3552677 8244117
9982 8244117 6714528 1975506 -2860962 -7295034 -9299089 -5962296 722879 5028287
9974 5028287 5304622 4918509 5234087 4067854 1698836 1727218 4794094 7857372 10580177
9965 10580177 15269380 19306470 16041841 5938561 -1711222 -2110972 -1357534 -4376389
9957 -4376389 -5621343 402104 7425673 6410425 579973 237076 5808599 7681838
$$ packed form
10016b538473j534237k952169j047967J550116K574193L539518M632698L002558
10008G226237j015489k486190R1906J762131l33462k157768q84790n88957m019282
9999b405664n733174q71376N396408N718919K463375K232254L232065p16069o734845
9990B581893n955347Q03222L185636j512621l873750J448754O874890M691440
9982H244117j529589m739022m836468m434072k004055L336793O685175M305408
9974E028287K76335l86113L15578j166233k369018K8382L066876L063278K722805
9965A0580177M689203M037090l264629j0103280p649783l99750P53438l018855
9957d376389j244954O023447P023569j015248n830452l42897N571523J873239
$$ plain form
9949 7681838 2172464 -3637093 -4448227 -3775013 -5202728 -5748601 -2671620 599034 935933
9940 935933 1905948 7371196 12990753 10997024 1652775 -6053796 -5150541 2155918 8499028
9931 8499028 9380709 6334967 3926681 4484444 5670598 3739492 -1206047 -5267151 -6268703
9922 -6268703 -6215685 -6915864 -6517067 -3190518 412801 103484 -3820523 -7016216 -6900739
9913 -6900739 -4874919 -3215319 -2829541 -3922988 -5892902 -6476122 -3839914 355468 2764791
9904 2764791 3068678 3427476 3185763 -1215163 -9326514 -14383576 -11526188 -5052270 -3124282
9895 -3124282 -7085079 -10410293 -7647616 -527025 4906609 4200679 -2340423 -9457131
9887 -9457131 -10185780 -2581692 6757090 9128337 3738278 -2173964 -3046326 -262912 2903037
$$ packed form
9949G681838n509374n809557q11134O73214j427715n45873L076981L270654L36899
9940I35933R70015N465248N619557j993729r344249p706571R03255P306459O343110
9931H499028Q81681l045742k408286N57763J186154j931106m945539m061104j001552
9922f268703N3018p00179L98797L326549L603319l09317l924007l195693J15477
9913f900739K025820J659600L85778j093447j969914n83220K636208M195382K409323
9904B764791L03887L58798k41713m400926q111351n057062K857388O473918J927988
9895c124282l960797l325214K762677P120591N433634p05930o541102p116708
9887i457131p28649P604088R338782K371247n390059n912242q72362K783414L165949
$$ plain form
9878 2903037 6053496 8836749 8492491 4303896 736406 1773855 4983747 5355052 2262439
9869 2262439 -1690653 -5724219 -9531053 -9644420 -3606087 3816438 5433905 2018045
9861 2018045 760062 3339173 3591953 -1161067 -4760484 -2123427 2744552 4057321
9853 4057321 3626664 6445806 11142740 11868613 7594613 3269494 2540006 4316379 5914357
9844 5914357 5300567 1003298 -6042068 -11150123 -10242365 -5061787 -683016 1154915 2514199
9835 2514199 4136647 4194232 2020052 -661273 -2281057 -2245228 25711 3681859 5316098
9826 5316098 2972162 -132829 -65741 1466848 489537 -1330670 912955 5650815 5607229
9817 5607229 -359004 -4349532 -1468271 2941076 2673096 237531 1000862 3551698 3097768
$$ packed form
9878B903037L150459K783253l44258m188595l567490J037449L209892L71305l092613
9869B262439l953092m033566l806834j13367O038333P422525J617467l415860
9861B018045j257983K579111K52780m753020l599417K637057M867979J312769
9853D057321m30657K819142M696934P25873m274000m325119p29488J776373J597978
9844E914357o13790m297269p045366n108055R07758N180578M378771J837931J359284
9835B514199J622448N7585k174180k681325j619784L5829K270939L656148J634239
9826E316098k343936l104991O7088J532589r77311j820207K243625M737860m3586
9817E607229n966233l990528K881261M409347k67980k435565P63331K550836m53930
$$ plain form
9808 3097768 434150 75554 1939556 2007277 -279403 -2095695 -3663872 -7620001 -12143897
9799 -12143897 -11859104 -6602877 -2489139 -2333405 -1710988 2407095 5677087 3944192 1348960
9790 1348960 4240044 10208736 10669936 3883043 -1676858 1064555 8392154 11610515
9782 11610515 8403827 3768270 1446244 -341531 -3847740 -6929623 -6183296 -2591723
9774 -2591723 -519420 -1653103 -3181059 -2482734 -653945 108098 184054 1274297 2963567
9765 2963567 3204506 1771997 837460 1889707 3952423 5199799 4736988 2508884 -743772
9756 -743772 -2819144 -1346233 2796077 4917160 1589964 -4306235 -6125724 -1606279
9748 -1606279 3829143 3649801 -1532952 -5034975 -2959860 1409621 3244824 2778491 3216662
$$ packed form
9808C097768k663618l58596J864002O7721k286680j816292j568177l956129m523896
9799a2143897K84793N256227M113738J55734O22417M118083L269992j732895k595232
9790A348960K891084N968692M61200o786893n559901K741413P327599L218361
9782A1610515l206688m635557k322026j787775l506209l081883P46327L591573
9774b591723K072303j133683j527956O98325J828789P62043P5956J090243J689270
9765B963567K40939j432509r34537J052247K062716J247376m62811k228104l252656
9756g43772k075372J472911M142310K121083l327196n896199j819489M519445
9748a606279N435422j79342n182753l502023K075115M369481J835203m66333M38171
$$ plain form
9739 3216662 4440049 3366878 250428 -113400 5009731 12179496 16388314 16729603 15100299
9730 15100299 12159569 7707739 2976803 -646370 -3524219 -5511433 -4051374 1583823
9722 1583823 6252286 4420904 -1105295 -1815277 4426298 9889530 7901539 1783899
9714 1783899 -1028733 528745 1694533 367742 -610811 599811 1449286 -1012482 -5712764
9705 -5712764 -8771381 -7695372 -3468890 498865 969501 -2739602 -8349811 -12546569
9697 -12546569 -13083170 -9415988 -2917372 2958921 4689487 2384107 -33631 95626
9689 95626 726579 -1075733 -3827197 -3496998 297548 3731989 4440348 4144578 4921603
9680 4921603 6192211 6707091 6627934 6080837 4153421 956501 -1580439 -2533213 -3312628
$$ packed form
9739C216662J223387j073171l116450l63828N123131P169765M208818L41289j629304
9730A5100299k940730m451830m730936l623173k877849j987214J460059N635197
9722A583823M668463j831382n526199p09982O241575N463232j987991o117640
9714A783899k812632J557478J165788j326791r78553J210622Q49475k461768m700282
9705e712764l058617J076009M226482L967755M70636l709103n610209m196758
9697a2546569n36601L667182O498616N876293J730566k305380k417738J29257
9689I5626O30953j802312k751464L30199L794546L434441P08359k95770P77025
9680D921603J270608N14880p9157n47097j927416l196920k536940r52774p79415
$$ plain form
9671 -3312628 -4566571 -4302168 -1224403 2433016 3846021 3175376 1715031 -1021050 -5196868
9662 -5196868 -8125835 -7789187 -6678077 -7465752 -6922724 -269671 9275648 12514433 6997928
9653 6997928 737637 659432 4215735 6432965 8461672 12882272 15881782 11974586 3591235
9644 3591235 -1749830 -2256043 -2381041 -3518685 -2300023 1301936 2394201 -203326 -1500501
9635 -1500501 277726 -538282 -7084650 -12704800 -10271956 -3445650 -1032215 -3735591
9627 -3735591 -4693523 -1382943 1424808 878070 487812 3286764 6740174 7323268 5507766
9618 5507766 3533653 2166556 2109486 4828933 9235772 10981655 8078372 4260626 3677611
9609 3677611 5056488 4681697 2685820 2048019 2767284 1711143 -1720599 -4006033 -2774380
$$ packed form
9671c312628j253943K64403L077765L657419J413005o70645j460345k736081m175818
9662e196868k928967L36648J111110p87675N43028O653053R545319L238785n516505
9653F997928o260291p8205L556303K217230K028707M420600K999510l907196q383351
9644C591235n341065n06213j24998j137644J218662L601959J092265k597527j297175
9635a500501J778227q16008o546368n620150K432844O826306K413435k703376
9627c735591r57932L310580K807751n46738l90258K798952L453410N83094j815502
9618E507766j974113j367097n7070K719447M406839J745883k903283l817746n83015
9609C677611J378877l74791j995877o37801P19265j056141l431742k285434J231653
$$ plain form
9600 -2774380 -497183 -1136678 -5073795 -9006437 -9725304 -6774987 -2279748 756830 567649
9591 567649 -1936199 -3985419 -3785605 -2311296 -1756504 -2502799 -2630923 -899382 748503
9582 748503 -793068 -5132549 -7662634 -5048718 -144943 972395 -3470522 -9075215
9574 -9075215 -11365484 -10836718 -10347844 -10016353 -7396811 -1557085 5520988 11208089 14054274
9565 14054274 13822958 11419527 8414092 5277496 915952 -4568054 -8148721 -7455105
9557 -7455105 -4897018 -4826159 -6979744 -6644576 -1975367 2832737 3409982 786961 -1215414
9548 -1215414 -1166220 91206 1935266 3098336 845535 -4962688 -8968772 -6237316 76010
9539 76010 2320113 -652275 -2238805 859992 3026744 -1032771 -7125932 -7461357 -2050383
$$ packed form
9600b774380K277197o39495l937117l932642p18867K950317M495239L036578j89181
9591E67649k503848k049220J99814J474309N54792p46295j28124J731541J647885
9582G48503j541571m339481k530085K613916M903775J117338m442917n604693
9574i075215k290269N28766M88874L31491K619542N839726P078073N687101K846185
9565A4054274k31316k403431l005435l136596m361544n484006l580667O93616
9557g455105K558087P0859k153585L35168M669209M808104N77245k623021k002375
9548a215414M9194J257426J844060J163070k252801n808223m006084K731456O313326
9539G6010K244103k972388j586530L098797K166752m059515o093161l35425N410974
$$ plain form
9530 -2050383 2280445 2355703 1374649 1544585 842933 -1456515 -2243760 -264629 1021710
9521 1021710 -173278 451968 6553179 13647621 14125981 7963398 2745553 3286171 6294218
9512 6294218 6148298 1719451 -3978738 -7687791 -7984996 -5900644 -4465847 -5519589 -6603607
9503 -6603607 -3615656 3207083 9120597 11128032 10543634 8291651 2492720 -6325560
9495 -6325560 -12039363 -9686890 -2787380 987574 -154524 -1422737 114537 1887425
9487 1887425 1222808 -754000 -2346428 -4013336 -5592572 -4788668 -1350939 764836 -1053202
9478 -1053202 -3434347 -2204169 356567 -1147979 -5828853 -6588684 -378722 7285698
9470 7285698 10140736 8463962 5650350 2327036 -1858130 -4514279 -3841103 -2899077 -4857246
$$ packed form
9530b050383M330828P5258r81054J69936p01652k299448p87245J979131J286339
9521A021710j194988O25246O101211P094442M78360o162583n217845N40618L008047
9512F294218j45920m428847n698189l709053k97205K084352J434797j053742j084018
9503f603607K987951O822739N913514K007435n84398k251983n798931q818280
9495f325560n713803K352473O899510L774954j142098j268213J537274J772888
9487A887425o64617j976808j592428j666908j579236Q03904L437729K115775j818038
9478a053202k381145J230178K560736j504546m680874p59831O209962P664420
9470G285698K855038j676774k813612l323314m185166k656149O73176R42026j958169
$$ plain form
9461 -4857246 -6154187 -1147010 7313306 9606922 2808886 -4994094 -6565684 -4676475
9453 -4676475 -5283296 -8034865 -9186721 -8655574 -7763953 -4441039 2123540 5803427 904864
9444 904864 -7135307 -7525846 207249 5784887 3977908 748809 951509 243163 -5036690
9435 -5036690 -8774893 -4033791 4771454 7301480 1696685 -4309483 -4969935 -2089652
9427 -2089652 438495 1363095 804092 -914266 -2402034 -2423348 -1771063 -1362210 -123517
9418 -123517 2096907 2149344 -1460015 -4023985 -935467 3667743 1812127 -5602492 -9082722
9409 -9082722 -4542293 978513 288903 -4558033 -7720299 -7902635 -6403034 -2497296 3432925
9400 3432925 6607385 4000892 571421 2759606 7834539 6631916 -3439106 -14465435
$$ packed form
9461d857246j296941N007177Q460316K293616o798036p802980j571590J889209
9453d676475o06821k751569j151856N31147Q91621L322914O564579L679887m898563
9444I04864q040171l90539P733095N577638j806979l229099K02700p08346n279853
9435e036690l738203M741102Q805245K530026n604795o006168o60452K880283
9427b089652K528147R24600n59003j718358j487768k1314O52285M08853J238693
9418a23517K220424N2437l609359k563970L088518M603210j855616p414619l480230
9409i082722M540429N520806o89610m846936l162266j82336J499601L905738N930221
9400C432925L174460k606493l429471K188185N074933j202623j0071022j1026329
$$ plain form
9392 -14465435 -18068461 -14153002 -8139897 -3977796 -2173965 -1610123 -966554 151740
9384 151740 700704 345448 1545962 6394756 11579483 10761359 3154543 -4461524 -6395559
9375 -6395559 -4755242 -4670429 -6648754 -7752421 -7435654 -7323512 -6893437 -4408547 -1350972
9366 -1350972 -875211 -1943375 -175482 4801170 8170580 7617618 6779931 8371957 9158925
9357 9158925 5844393 1497660 1086850 4016113 6517824 8605549 12385696 15361707
9349 15361707 12639314 5778809 2385311 5244747 8053031 4601536 -2919540 -7833056
9341 -7833056 -6976939 -1820743 4609930 8709120 7330369 1086901 -5487390 -9023258
9333 -9023258 -9923501 -8683001 -3917746 3386996 8075951 6920816 2844783 -515057
$$ packed form
9392a4465435l603026L915459O013105M162101J803831N63842O43569J118294
9384A51740N48964l55256J200514M848794N184727q18124p606816p616067j934035
9375f395559J640317Q4813j978325j103667L16767J12142M30075K484890L057575
9366a350972M75761j068164J767893M976652L369410n52962q37687J592026P86968
9357I158925l314532m346733m10810K929263K501711K087725L780147K976011
9349A5361707k722393o860505l393498K859436K808284l451495p521076m913516
9341g833056Q56117N156196O430673M099190j378751o243468o574291l535868
9333i023258r00243J240500M765255P304742M688955j155135m076033l359840
$$ plain form
9325 -515057 -4376413 -10422819 -14814396 -12573435 -5640907 -667536 -748 -206605 1250491
9316 1250491 2971780 3130425 1792132 -135623 -1017817 1328938 6225759 8732466 5524125
9307 5524125 42392 -2429298 -2083220 -1861430 -691407 3609169 7198956 4398884 -1959250
9298 -1959250 -3306967 1148232 2973131 -1516319 -5263898 -2435964 2151280 1336444
9290 1336444 -3297226 -5169751 -2993647 -990207 -1499923 -2683288 -2276834 -63657 2406693
9281 2406693 2778609 266994 -2397842 -2334840 -1675463 -4789795 -10279281 -11789973 -7841805
9272 -7841805 -3985603 -3242547 -1992486 1574912 3139239 984351 849837 5967525 10065115
9263 10065115 7713855 4338473 7071262 12072250 11260847 6680353 6657384 10590977 9610512
$$ packed form
9325e15057l861356o046406m391577K240961O932528M973371O66788k05857J457096
9316A250491J721289J58645j338293j927755q82194K346755M896821K506707l208341
9307E524125n481733k471690L46078K21790J170023M300576L589787k800072o358134
9298a959250j347717M455199J824899m489450l747579K827934M587244q14836
9290A336444m633670j872525K176104K003440n09716j183365M06454K213177K470350
9281B406693L71916k511615k664836O3002O59377l114332n489486j510692L948168
9272g841805L856202P43056J250061L567398J564327k154888j34514N117688M097590
9263A0065115k351260l375382K732789N000988q11403m580494k2969L933593r80465
$$ plain form
9254 9610512 1953371 -3704392 -1861662 2764895 4396409 3839329 3797841 3776620 3104044
9245 3104044 3221657 4004145 2835127 -280750 -1425034 1420351 5724716 8978780 11147679
9236 11147679 11292634 7055320 -410129 -5693478 -5484815 -1799926 2282050 5603033
9228 5603033 6631634 3433532 -2173955 -5156862 -3722686 -761255 2164511 6612356
9220 6612356 11499714 12101660 7828772 4775034 6556065 8420110 5273338 275957
9212 275957 -373673 2866517 4711456 3936209 4209039 7133041 9845179 9662851 7304974
9203 7304974 5242856 5229297 7005092 7848702 4866026 -749796 -4079858 -3026322 -1585013
9194 -1585013 -3915420 -8236305 -10243094 -9917913 -10464234 -12055419 -11322630 -6874524 -1514186
$$ packed form
9254I610512p657141n657763J842730M626557J631514n57080m1488k1221o72576
9245C104044J17613P82488j169018l115877j144284K845385M304365L254064K168899
9236A1147679J44955m237314p465449n283349K08663L684889M081976L320983
9228E603033J028601l198102n607487k982907J434176K961431K925766M447845
9220F612356M887358O01946m272888l053738J781031J864045l146772m997381
9212B75957o49630L240190J844939p75247K72830K924002K712138j82328k357877
9203G304974k062118j3559J775795Q43610k982676n615822l330062J053536J441309
9194a585013k330407m320885k006789L25181n46321j591185P32789M448106N360338
$$ plain form
9185 -1514186 1541296 2002601 1616131 1680023 1726036 73125 -3595711 -6243279 -4299096
9176 -4299096 1113915 4949757 5181456 4857923 5430009 3260927 -3308344 -8358925 -5691861
9167 -5691861 1689584 5823866 5128568 4443532 5010170 2359046 -4681405 -10150321 -9257822
9158 -9257822 -5163792 -3781165 -5561208 -6158036 -2972283 2213262 6054618 6876395 5529981
9149 5529981 4120556 3656178 3230189 2328799 2550012 4775478 6071405 3100779 -1815227
9140 -1815227 -2342879 3300615 9310875 9359555 3535613 -3134921 -5979882 -3185618 3455710
9131 3455710 8371081 6202588 -1551867 -6931099 -5102085 -376418 505988 -2174669
9123 -2174669 -2900522 -8786 2297973 816110 -2402306 -3597226 -1682282 2023515
$$ packed form
9185a514186L055482M61305l86470O3892M6013j652911l668836k647568J944183
9176d299096N413011L835842K31699l23533N72086k169082o569271n050581K667064
9167e691861P381445M134282o95298o85036N66638k651124p040451n468916Q92499
9158i257822M094030J382627j780043n96828L185753N185545L841356Q21777j346414
9149E529981j409425m64378m25989r01390K21213K225466J295927k970626m916006
9140a815227n27652N643494O010260M8680n823942o670534k844961K794264O641328
9131C455710M915371k168493p754455n379232J829014M725667Q82406k680657
9123b174669p25853K891736K306759j481863l218416j194920J914944L705797
$$ plain form
9115 2023515 5770431 7986914 7926850 6486401 4825974 2237172 -2467101 -7548373 -9148931
9106 -9148931 -6101936 -1374744 1855423 2807815 1338712 -2648432 -6525901 -5802277 -557846
9097 -557846 2691929 -537291 -5662330 -5504546 -1215648 -299625 -4697573 -8119644 -6431439
9088 -6431439 -3548508 -3823172 -4931235 -3153642 -662926 -1616141 -4506401 -4763326 -2753478
9079 -2753478 -2632164 -4321509 -3427715 551357 2515432 -140063 -3576459 -4058076 -3160079
9070 -3160079 -3281873 -2654455 1014915 5256227 5624303 1951742 -1855149 -3081782 -2293036
9061 -2293036 -1130960 -540119 -564629 -378822 437400 -4609 -4037649 -9533188 -10413643
9052 -10413643 -4564604 2193536 3403196 152945 -1901481 -694527 1793678 4696618
$$ packed form
9115B023515L746916K216483o0064j440449j660427k588802m704273n081272j600558
9106i148931L046995M727192L230167R52392j469103l987144l877469P23624N244431
9097e57846L249775l229220n125039J57784M288898R16023m397948l422071J688205
9088f431439K882931k74664j108063J777593K490716r53215k890260k56925K009848
9079b753478J21314j689345Q93794L979072J964075k655495l436396m81617Q97997
9070c160079j21794O27418L669370M241312L68076l672561l806891j226633P88746
9061b293036J162076N90841k4510J85807Q16222m42009m033040n495539q80455
9052a0413643N849039O758140J209660l250251k054426J206954K488205K902940
$$ plain form
9044 4696618 8291293 10425970 8770630 5872485 6043392 7562787 4518237 -2963224
9036 -2963224 -7311846 -4460175 444253 1542366 294016 597997 1460924 322548 -462199
9027 -462199 2963438 8428823 9994683 6662272 2968473 1309131 -496473 -3375168
9019 -3375168 -4348524 -1746508 1221584 654255 -3099075 -6634531 -7346987 -4690234 63140
9010 63140 3973754 4596904 3216540 3668185 6924353 9543049 8776046 6153779 4140876
9001 4140876 2471524 489539 93428 2776897 5946655 5974901 3340126 1113649 -30380
8992 -30380 -1258722 -1630282 395841 2393703 416014 -3919931 -4570333 -320809 2994789
8983 2994789 1546548 -1105306 -710714 1301215 2199599 3232028 5399730 5076559 288862
$$ packed form
9044D696618L594675K134677j655340k898145J70907J519395l044550p481461
9036b963224m348622K851671M904428J098113j248350L03981Q62927j138376p84747
9027d62199L425637N465385J565860l332411l693799j659342j805604k878695
9019c375168r73356K602016K968092n67329l753330l535456p12456K656753M753374
9010F3140L910614O23150j380364M51645L256168K618696p67003k622267k012903
9001D140876j669352j981985l96111K683469L169758K8246k634775k226477j144029
8992c0380j228342l71560K026123J997862j977689m335945o50402M249524L315598
8983B994789j448241k651854L94592K011929Q98384J032429K167702l23171m787697
$$ plain form
8974 288862 -3077722 694865 6017948 2160475 -10350619 -19060021 -16434842 -8104214
8966 -8104214 -1622345 3514443 9391517 11684751 6143518 -2266889 -5124399 -2665779
8958 -2665779 -2451424 -7406350 -12559424 -13571392 -11707561 -9248096 -5859453 -1450472
8950 -1450472 2100993 4063269 5698131 6380852 3170371 -3535190 -8191932 -7139678
8942 -7139678 -3850044 -3488373 -5410617 -5535090 -3653251 -2831884 -2669588 583851 6334459
8933 6334459 8217103 3228121 -2839850 -3322260 -16509 771188 -1332045 -943415 3230933
8924 3230933 5845575 3762185 994634 1593298 3065721 1353762 -1937619 -2570162 -892699
8915 -892699 -402416 -1016700 394080 3505056 4224816 1272451 -1811477 -2138779 -941861
$$ packed form
8974B88862l366584L772587N323083l857473j2511094q709402K625179Q330628
8966h104214O481869N136788N877074K293234n541233q410407k857510K458620
8958b665779K14355m954926n153074j011968J863831K459465L388643M408981
8950a450472L551465J962276J634862O82721l210481o705561m656742J052254
8942g139678L289634L61671j922244j24473J881839Q21367J62296L253439N750608
8933F334459J882644m988982o067971m82410L305751P87697k103233L88630M174348
8924C230933K614642k083390k767551N98664J472423j711959l291381o32543J677463
8915h92699M90283o14284J410780L110976P19760k952365l083928l27302J196918
$$ plain form
8906 -941861 -715529 -2261768 -4973740 -6971401 -5332870 332280 5451092 5728096 3438442
8897 3438442 3417492 4644410 2876466 468507 4397778 13515696 17708874 12980761 7483837
8888 7483837 7521405 7512033 1379289 -5152339 -3672856 2251638 2779925 -2059748 -3383086
8879 -3383086 1373474 5335381 4200936 1370930 -71077 -1554857 -3265342 -2107100
8871 -2107100 2111359 5168128 5324720 5541494 6823753 5699352 953535 -3034033 -2984943
8862 -2984943 -1876164 -3892848 -7808530 -8509152 -2994899 6573744 13907110 13025036 4633290
8853 4633290 -3063977 -3716272 -888695 -1466280 -3889457 -1219371 5550070 7608186 2859730
8844 2859730 -505369 1649959 2281756 -3972990 -10787988 -10657752 -6933393 -6471233 -7342583
$$ packed form
8906i41861K26332j546239k711972j997661J638531N665150N118812K77004k289654
8897C438442k0950J226918j767944k407959L929271R117918M193178m728113n496924
8888G483837L7568r372o132744o531628J479483N924494N28287m839673j323338
8879c383086M756560L961907j134445k830006j442007j483780j710485J158242
8871b107100M218459L056769J56592K16774J282259j124401m745817l987568M9090
8862b984943J108779k016684l915682p00622N514253R568643P333366q82074q391746
8853D633290p697267o52295K827577n77585k423177K670086O769441K058116m748456
8844B859730l365099K155328O31797o254746o814998J30236L724359M62160q71350
$$ plain form
8835 -7342583 -3914208 1143470 779750 -3652636 -4316039 -347738 949633 -3066335 -5843499
8826 -5843499 -2153444 4682397 8990155 9789739 8544474 5213488 138610 -3730591
8818 -3730591 -3593332 212050 5242024 8767751 8365883 3881868 -715706 -781584 3020781
8809 3020781 5372141 3459963 48120 -1320057 -558758 724598 1846418 2302085 1149287
8800 1149287 -1400268 -3889832 -5681846 -6660858 -5064911 543382 6662602 6916050 574639
8791 574639 -5492649 -6056751 -4229925 -5099684 -6886574 -4180447 2344345 5995727 3960971
8782 3960971 1303801 3254018 8142303 10889230 10167517 8542373 7445633 5833840
8774 5833840 3425612 1849044 1772251 1461041 -407003 -2252443 -1554104 1766191 5462549
$$ packed form
8835g342583L428375N057678l63720m432386o63403L968301J297371m015968k777164
8826e843499L690055O835841M307758P99584j245265l330986n074878l869201
8818c730591J37259L805382N029974L525727m01868m484015m597574o5878L802365
8809C020781K351360j912178l411843j368177P61299J283356J121820M55667j152798
8800A149287k549555k489564j792014r79012J595947N608293O119220K53448o341411
8791E74639o067288n64102J826826q69759j786890K706127O524792L651382k034756
8782C960971k657170J950217M888285K746927p21713j625144j096740j611793
8774E833840k408228j576568p6793l11210j868044j845440O98339L320295L696358
$$ plain form
8765 5462549 7689499 8008540 6301847 2709031 -1257367 -3445262 -3593782 -3723876 -5288717
8756 -5288717 -7161682 -7272719 -5258624 -2739497 -1772641 -3450405 -6873125 -8995279 -7009073
8747 -7009073 -1928852 1606227 552404 -2621138 -2895648 1212705 6348560 8594692
8739 8594692 6955762 2499761 -3571064 -9544511 -12431564 -9990476 -3836832 1219473
8731 1219473 2090437 566906 134926 850073 172654 -1392967 356707 6386336 10781746
8722 10781746 8021363 1171209 -2220789 -864634 -455798 -3788829 -6636330 -5329252
8714 -5329252 -2380895 -1170760 -170905 3082068 6269974 5639532 2416052 872190 1693401
8705 1693401 1991615 848301 319197 1322096 2479380 2872739 2534482 693026 -2884493
$$ packed form
8765E462549K226950L19041j706693l592816l966398k187895j48520j30094j564841
8756e288717j872965j11037K014095K519127R66856j677764l422720k122154J986206
8747g009073N080221L535079j053823l173542k74510M108353N135855K246132
8739H594692j638930m456001o070825n973447k887053K441088O153644N056305
8731A219473Q70964j523531m31980P15147o77419j565621J749674O029629M395410
8722A0781746k760383o850154l391998J356155M08836l333031k847501J307078
8714e329252K948357J210135R99855L252973L187906o30442l223480j543862Q21211
8705A693401K98214j143314n29104J002899J157284L93359l38257j841456l577519
$$ plain form
8696 -2884493 -5236033 -2818241 3000329 6635390 4941992 9985 -4877785 -8541776
8688 -8541776 -10513805 -9932153 -7317687 -4875053 -3857682 -3743319 -4369963 -6042647 -6981283
8679 -6981283 -4147281 1861158 5894054 4353947 -324561 -3517470 -4366622 -5138815 -6387750
8670 -6387750 -6017123 -2743718 2148194 6613718 9308071 9038371 4981676 -1345295 -5722492
8661 -5722492 -4577992 1319547 7533323 10413111 9959911 8147290 5957105 3326301
8653 3326301 836369 -591157 -1292275 -2118506 -2346560 -669780 1879655 2975689 3162244
8644 3162244 5189192 8203587 7246964 1161846 -3665048 -1811927 2758839 2459584 -2303078
8635 -2303078 -3883848 958251 6822809 8114750 5962458 4615923 5562160 7647321
$$ packed form
8696b884493k351540K417792N818570L635061j693398m932007m887770l663991
8688h541776j972029N81652K614466K442634J017371J14363o26644j672684r38636
8679f981283K834002O008439M032896j540107m678508l192909q49152p72193j248935
8670f387750L70627L273405M891912M465524K694353k69700m056695o326971m377197
8661e722492J144500N897539O213776K879788m53200j812621k190185k630804
8653C326301k489932j427526p01118q26231k28054J676780K549435J096034J86555
8644C162244K026948L014395r56623o085118m826894J853121M570766k99255m762662
8635b303078j580770M842099N864558J291941k152292j346535R46237K085161
$$ plain form
8627 7647321 9407096 9040293 5285347 428201 -681753 3033878 6315770 3968122
8619 3968122 -2288222 -5931826 -3201424 3447791 8177995 6497802 -1393711 -10345054
8611 -10345054 -14442676 -12708474 -9503729 -8508523 -8184009 -4746621 1858220 7020892
8603 7020892 6382972 758318 -4016048 -2512121 4449631 10251302 9815687 5051561 1209743
8594 1209743 -28925 -471578 -354814 1643187 3882341 2737564 -1258464 -3614090 -3287826
8585 -3287826 -4004682 -6249533 -4600119 3008612 9378756 6963350 -1731529 -8455970
8577 -8455970 -10337449 -10534343 -10652038 -9406857 -7564829 -7529996 -7950759 -4568135 2784317
8568 2784317 8882820 9758257 6747278 3520950 2785735 5875827 11587964 15423717 14050214
$$ packed form
8627G647321J759775l66803l754946m857146j109954L715631L281892k347648
8619C968122o256344l643604K730402O649215M730204j680193p891513q951343
8611a0345054m097622J734202L204745R95206L24514L437388O604841N162672
8603G020892o37920n624654m774366J503927O961752N801671m35615m764126l841818
8594A209743j238668m42653J16764J998001K239154j144777l996028k355626L26264
8585c287826p16856k244851J649414P608731O370144k415406q694879o724441
8577h455970j881479j96894j17695J245181J842028L4833m20763L382624P352452
8568B784317O098503Q75437l010979l226328p35215L090092N712137L835753j373503
$$ plain form
8559 14050214 10256125 9070748 9681004 6995210 1186408 -1468653 940591 2050764
8551 2050764 -2411261 -7069673 -5239650 532034 3028178 1892095 3158890 8577220
8543 8577220 12461131 10030721 3481347 -1925470 -4004949 -4160429 -4241403 -4315405 -2636434
8534 -2636434 1952478 6921479 7490831 3111889 -457838 925283 2947400 -749099
8526 -749099 -7830157 -10119190 -6373612 -4046551 -6998027 -9801515 -7739034 -4707528
8518 -4707528 -5819395 -8465526 -7081513 -1974229 2966368 7123621 11142878 12115323
8510 12115323 8168339 4400686 6080241 8857630 5035680 -2510061 -3532617 2618803
8502 2618803 5091491 -805613 -5748172 -1677279 5351208 5239984 -1119953 -5239534
$$ packed form
8559A4050214l794089j185377O10256k685794n808802k655061K409244J110173
8551B050764m462025m658412J830023N771684K496144j136083J266795N418330
8543H577220L883911k430410o549374n406817k079479j55480q0974p4002J678971
8534b636434M588912M969001N69352m378942l569727J383121K022117l696499
8526g49099p081058k289033L745578K327061k951476k803488K062481L031506
8518d707528j111867k646131J384013N107284M940597M157253M019257R72445
8510A2115323l946984l767653J679555K777389l821950p545741j022556O151420
8502B618803K472688n897104m942559M070893P028487j11224o359937m119581
$$ plain form
8494 -5239534 -3721649 396409 4431710 6681670 4299245 -2066133 -5171870 -196560
8486 -196560 6536926 5624393 -1732642 -6517570 -5951292 -5597503 -8456545 -11147963 -11432640
8477 -11432640 -11212187 -10917269 -8395247 -4602827 -3449755 -4898138 -4906877 -2880172 -2056824
8468 -2056824 -1993943 1253938 6214746 5945002 -577863 -5416780 -3412212 972696 2348419
8459 2348419 2190708 3535687 5192846 5914780 7348763 8332234 3896579 -4805976 -7870071
8450 -7870071 -849681 6302954 3082332 -5587894 -7145722 -77566 5927690 5654110
8442 5654110 3578104 3915053 4604441 2320789 -3079875 -9695699 -14339300 -13276702 -7007279
8433 -7007279 -2155817 -3446531 -6757671 -5935370 -2643992 -2140666 -3170069 -1124158 1649089
$$ packed form
8494e239534J517885M118058M035301K249960k382425o365378l105737M975310
8486a96560O733486r12533p357035m784928N66278L53789k859042k691418k84677
8477a1432640K20453K94918K522022L792420J153072j448383q739K026705Q23348
8468b056824O2881L247881M960808k69744o522865m838917K004568M384908J375723
8459B348419j57711J344979J657159P21934J433983R83471m435655q702555l064095
8450g870071P020390P152635l220622q670226j557828P068156O005256k73580
8442E654110k076006L36949O89388k283652n400664o615824m643601J062598O269423
8433g007279M851462j290714l311140Q22301L291378N03326j029403K045911K773247
$$ plain form
8424 1649089 -1083932 -7526177 -9583522 -6275265 -4720759 -7009928 -7156333 -3314852
8416 -3314852 -2032649 -6507554 -10692024 -9778321 -7305980 -6728731 -4867554 310399 3837516
8407 3837516 2446266 1475591 5700148 10190143 8431885 3564671 2702680 4790302 3381540
8398 3381540 -1624670 -4119327 -1999436 932695 2332592 3146674 2808687 -206545 -3344254
8389 -3344254 -2514587 173731 -1710626 -8270152 -11395420 -5963520 2834989 6701865
8381 6701865 4635259 2560812 4857502 9284536 10014318 4660719 -2051836 -3064073
8373 -3064073 1857141 4838115 493052 -5860743 -5731910 -394971 1013203 -4152690
8365 -4152690 -7787846 -3662563 2878766 2743441 -4163854 -9618753 -8114993 -2270940
$$ packed form
8424A649089k733021o442245k057345L308257J554506k289169j46405L841481
8416c314852J282203m474905m184470R13703K472341N77249J861177N177953L527117
8407C837516j391250r70675M224557M489995j758258m867214q61991K087622j408762
8398C381540n006210k494657K119891K932131J399897Q14082l37987l015232l137709
8389c344254Q29667K688318j884357o559526l125268N431900Q798509L866876
8381F701865k066606k074447K296690M427034P29782n353599o712555j012237
8373c064073M921214K980974m345063o353795J28833N336939J408174n165893
8365d152690l635156M125283O541329j35325o907295n454899J503760N844053
$$ plain form
8357 -2270940 1901863 1142997 -3600655 -8825652 -11021616 -9295934 -5762307 -2648138
8349 -2648138 61584 2979277 4783108 3639902 645757 -684492 1032340 2968283
8341 2968283 1769962 -2005665 -4836000 -5070492 -4798410 -6379514 -9031565 -10359305 -9775680
8332 -9775680 -8151834 -5161389 -237189 3910604 2736577 -3571976 -8533771 -7068450
8324 -7068450 -1898648 945878 484632 463235 2220885 2773803 258341 -2985926 -4194339
8315 -4194339 -3986586 -4588479 -6008210 -5660217 -1594418 4204555 6294547 1422575 -6011920
8306 -6011920 -7576835 -1794377 2772971 -708980 -7104141 -7302329 -2714278 -2609897 -8203513
8297 -8203513 -10121612 -3959127 2164389 863849 -2832062 -622296 5321266 6779849
$$ packed form
8357b270940M172803p58866m743652n224997k195964J725682L533627L114169
8349b648138K709722K917693J803831j143206k994145j330249J716832J935943
8341B968283j198321l775627k830335k34492K72082j581104k652051j327740N83625
8332i775680J623846K990445M924200M147793j174027o308553m961795J465321
8324g068450N169802K844526m61246k1397J757650N52918k515462l244267j208413
8315d194339K07753o01893j419731L47993M065799N798973K089992m871972p434495
8306f011920j564915N782458M567348l481951o395161j98188M588051J04381n593616
8297h203513j918099O162485O123516j300540l695911K209766N943562J458583
$$ plain form
8289 6779849 3061002 747263 2263888 3754107 3689606 5126448 8565441 10034717 8089977
8280 8089977 6497807 7859568 9790292 9331901 6438724 1559782 -5268550 -11130744
8272 -11130744 -11167922 -5322906 399661 1929974 1856005 3454200 4921810 3415421 564215
8263 564215 -551898 -478551 -790538 470010 5399412 10362525 9241639 2018159 -4816951
8254 -4816951 -6566490 -4939912 -4142106 -6063921 -9802288 -12794228 -12139302 -7655445 -3510098
8245 -3510098 -3756571 -6591229 -6716508 -3321882 -1232905 -3052471 -4781846 -1956872 3372388
8236 3372388 5430596 2728255 -190495 1126507 5565075 7900449 4845794 -1289912
8228 -1289912 -5623735 -6890027 -8314868 -11194156 -10930339 -3423561 6706266 9979455
$$ packed form
8289F779849l718847k313739J516625J490219o4501J436842L438993J469276j944740
8280H089977j592170J361761J930724m58391k893177m878942o828332n862194
8272a1130744l7178N845016N722567J530313p3969J598195J467610j506389k851206
8263E64215j116113P3347l11987J260548M929402M963113j120886p223480o835110
8254d816951j749539J626578P97806j921815l738367k991940O54926M483857M145347
8245c510098k46473k834658j25279L394626K088977j819566j729375K824974N329260
8236C372388K058208k702341k918750J317002M438568K335374l054655o135706
8228a289912m333823j266292j424841k879288K63817P506778J0129827L273189
$$ plain form
8220 9979455 4158872 -3257816 -5849712 -5512579 -6255674 -7049576 -5728116 -4918382 -7697737
8211 -7697737 -10685533 -8416336 -2800585 -1072428 -4676581 -7316046 -5084162 -1672544
8203 -1672544 -1071476 -1403613 147987 1577910 205910 -1310336 1155111 5478160 5306182
8194 5306182 -597225 -6307043 -6922943 -4328240 -2945244 -3396771 -3181076 -1291439 1089061
8185 1089061 3552316 6897382 10137303 9823571 4290591 -2731594 -5179742 -1574539
8177 -1574539 3089240 3396058 -149868 -2573543 -1083199 2226137 4160863 4151463 3256262
8168 3256262 1940267 694972 1086410 3853420 6860976 7155393 4653176 1823664 36791
8159 36791 -1613352 -3767128 -5294155 -5033725 -3366973 -1377406 83246 56753 -1877935
$$ packed form
8220I979455n820583p416688k591896L37133p43095p93902J321460Q09734k779355
8211g697737k987796K269197N615751J728157l604153k639465K231884L411618
8203a672544O01068l32137J551600J429923j372000j516246K465447M323049j71978
8194E306182n903407n709818o15900K594703J382996m51527K15695J889637K380500
8185A089061K463255L345066L239921l13732n532980p022185k448148L605203
8177a574539M663779L06818l545926k423675J490344L309336J934726r400q95201
8168C256262j315995j245295L91438K767010L007556K94417k502217k829512j786873
8159C6791j650143k153776j527027K60430J666752J989567J460652k6493j934688
$$ plain form
8150 -1877935 -3784005 -2357638 2630107 6722537 5732193 845220 -3664773 -6410915
8142 -6410915 -9117653 -11410276 -9830611 -3652110 2051119 2147944 -2048703 -5245080 -5511324
8133 -5511324 -5376787 -6116608 -5146543 -473108 5294207 7471490 4297245 -1938246 -7275221
8124 -7275221 -8515725 -5092069 -16148 2605250 2423492 3307949 7200231 10056894 7181653
8115 7181653 678392 -2828948 -1243763 1143655 1387083 2114368 5600575 8438091 6305213
8106 6305213 813443 -3120177 -4662962 -6780312 -9589696 -9443871 -5208353 -577331
8098 -577331 1346034 1579426 1663981 848359 -523015 1031673 6848955 11924331 10733070
8089 10733070 5449256 3432687 7121892 11238973 10546139 5981193 1654446 -538002
$$ packed form
8150a877935j906070J426367M987745M092430r90344m886973m509993k746142
8142f410915k706738k292623J579665O178501N703229R6825m196647l196377k66244
8133e511324J34537p39821R70065M673435N767315K177283l174245o235491n336975
8124g275221j240504L423656N075921K621398j81758Q84457L892282K856663k875241
8115G181653o503261l507340J585185K387418K43428P27285L486207K837516k132878
8106F305213n491770l933620j542785k117350k809384J45825M235518M631022
8098e77331J923365K33392Q4555q15622j371374J554688N817282N075376j191261
8089A0733070n283814k016569L689205M117081o92834m564946m326747k192448
$$ plain form
8081 -538002 -1190679 -1031562 -620837 -777918 -1563728 -1987398 -1648921 -1136281 -94631 2965892
8071 2965892 7723200 10977889 10150695 6301329 2413645 357558 596140 2644985 4290334
8062 4290334 2764151 -1260423 -3173151 -313438 3997346 5270075 4483796 6116528
8054 6116528 10941818 14898225 14700201 10799318 4875214 -1805916 -7057071 -8448035
8046 -8448035 -6551762 -4768012 -4841183 -4956579 -3193890 -496794 897465 70760 -2362894
8037 -2362894 -4920241 -5663754 -3855487 -1583537 -1787149 -4402781 -6533051 -6484162 -5140902
8028 -5140902 -3202023 -102811 3438875 4687304 2183178 -2203987 -5472245 -5910204
8020 -5910204 -3045297 2239515 6825734 7228131 3468258 -874804 -2866132 -2237549 504013
$$ packed form
8081e38002o52677J59117M10725j57081p85810m23670L38477N12640J041650L060523
8071B965892M757308L254689q27194l849366l887684k056087K38582K048845J645349
8062D290334j526183m024574j912728K859713M310784J272729p86279J632732
8054F116528M825290L956407j98024l900883n924104o681130n251155j390964
8046h448035J896273J783750p3171j15396J762689K697096J394259q26705k433654
8037b362894k557347p43513J808267K271950k03612k615632k130270M8889J343260
8028e140902J938879L099212L541686J248429k504126m387165l268258m37959
8020e910204K864907N284812M586219M02397l759873m343062j991328O28583K741562
$$ plain form
8011 504013 4573663 7216014 5413684 379567 -3233655 -3643426 -3657323 -5044397 -5650355
8002 -5650355 -3950634 -1985979 -1279073 -20770 2890252 4927891 3921630 1259064
7994 1259064 -1425680 -4615656 -7396735 -6489209 -2091979 478679 -1124332 -2148732
7986 -2148732 589273 2119081 -2113371 -6945528 -5082400 529688 1311814 -2914389
7978 -2914389 -4487227 -1219225 988934 -590733 -1176113 2475054 6853155 8284553
7970 8284553 7906023 7490794 6334674 4437518 3096983 790582 -5459185 -13167708 -15473285
7961 -15473285 -11037938 -6113639 -4708132 -4138787 -3117939 -5888401 -13423876 -18076798
7953 -18076798 -13464455 -4027355 1616551 2083814 1801841 2594400 3345589 4630679 7056194
$$ packed form
8011E04013M069650K642351j802330n034117l613222m09771j3897j387074o05958
8002e650355J699721J964655P06906J258303K911022K037639j006261k662566
7994A259064k684744l189976k781079R07526M397230K570658j603011j024400
7986b148732K738005J529808m232452m832157J863128N612088P82126m226203
7978b914389j572838L268002K208159j579667n85380L651167M378101J431398
7970H284553l78530m15229j156120j897156j340535k306401o249767p708523k305577
7961a5473285M435347M924299J405507N69345J020848k770462p535475m652922
7953a8076798M612343R437100N643906M67263k81973P92559P51189J285090K425515
$$ plain form
7944 7056194 7542822 3526727 -1262134 -1324177 2041398 2755199 -657861 -3678200 -3256335
7935 -3256335 -1057998 762131 1956805 2072765 480506 -1189219 -787732 187846 -1441140
7926 -1441140 -4410334 -3953929 133222 1693568 -2915562 -8590995 -8125804 -2357466 977030
7917 977030 -2067209 -6641305 -6587186 -3546253 -4478499 -10778455 -14970319 -10950648 -3359982
7908 -3359982 -1440614 -5757899 -7974894 -4089163 -179493 -1797013 -4739923 -2293391
7900 -2293391 3330014 4075056 -1729846 -7233291 -6896085 -2635108 681604 1338968 1065598
7891 1065598 2238370 5597479 8808963 7882111 2317270 -2490283 -1212661 4163368
$$ packed form
7944G056194M86628m016095m788861o2043L365575P13801l413060l020339M21865
7935c256335K198337J820129J194674J15960j592259j669725M01487R75578j628986
7926a441140k969194M56405M087151J560346m609130n675433M65191N768338L334496
7917I77030l044239m574096N4119L040933r32246o299956m191864M019671P590666
7908c359982J919368m317285k216995L885731L909670j617520k942910K446532
7900b293391N623405P45042n804902n503445L37206M260977L316712O57364k73370
7891A065598J172772L359109L211484r26852n564841m807553J277622N376029
$$ [...]
##END NTUPLES=NMR SPECTRUM
##END=
