##TITLE=31Pdec_SR124_rek5T_1''''
 DMSO, 124 sc
 10.6.2022
##JCAMPDX= 6.0         $$ Bruker NMR JCAMP-DX V2.0
##DATA TYPE= NMR SPECTRUM
##DATA CLASS= NTUPLES
##ORIGIN= UXNMR, Bruker Analytische Messtechnik GmbH
##OWNER= root
$$ XWIN-NMR		Version 3.5
$$ Fri Jun 10 13:53:10 2022 Russian Standard Time (UT+4h)  she@DPX200
##.OBSERVE FREQUENCY= 81.013821
##.OBSERVE NUCLEUS= ^31P
##.ACQUISITION MODE= SIMULTANEOUS
##.ACQUISITION SCHEME= undefined
##.AVERAGES= 124
##.DIGITISER RES= 16
##SPECTROMETER/DATA SYSTEM= spect
##.PULSE SEQUENCE= zgpg30
##.SOLVENT NAME= DMSO
##.SHIFT REFERENCE= (INTERNAL, DMSO, 0, 248.564)
##AUDIT TRAIL= $$ (NUMBER, WHEN, WHO, WHERE, WHAT)
$$ ##TITLE= Audit trail, XWIN-NMR		Version 3.5
$$ ##JCAMPDX= 5.01
$$ ##ORIGIN= Bruker BioSpin GmbH
$$ ##OWNER= she
$$ F:/spectra/data/she/nmr/P31/1/pdata/1/auditp.txt
$$ ##AUDIT TRAIL=  $$ (NUMBER, WHEN, WHO, WHERE, WHAT)
(   1,<2022-06-10 13:49:07.50 +0400>,<she>,<DPX200>,
      <continue with go, POWCHK disabled, PULCHK disabled
       configuration hash MD5:
       00 E9 B6 7A A2 85 ED C7 34 08 36 98 17 FE 4E 26
       data hash MD5: 32K
       8B 60 6A EA 69 D1 D7 80 F3 B8 54 AC 95 BE 3F 54>)
(   2,<2022-06-10 13:50:23.06 +0400>,<she>,<DPX200>,
      <Start of raw data processing
       efp BC_mod = 2 LB = 1 FT_mod = 6 PKNL = 1 PHC0 = -10394.47 PHC1 = 388.2531 SI = 64K 
       data hash MD5: 64K
       8A E6 E6 3B D7 A4 44 7C 15 83 38 5E 2C AB 98 93>)
(   3,<2022-06-10 13:50:49.60 +0400>,<she>,<DPX200>,
      <pk PHC0 = 246.3084 PHC1 = -668.6 
       data hash MD5: 64K
       33 7C 53 FB FF 0C 0C 02 1B D4 CD 91 4D C1 05 5D>)
(   4,<2022-06-10 13:51:37.75 +0400>,<she>,<DPX200>,
      <pk PHC0 = -313.3004 PHC1 = 782.8015 
       data hash MD5: 64K
       3A E8 B1 09 44 5C 4A 88 45 2E 70 7B D9 20 25 87>)
(   5,<2022-06-10 13:51:41.18 +0400>,<she>,<DPX200>,
      <abs ABSG = 5 
       data hash MD5: 64K
       9B A5 F7 23 B7 35 C6 DB 0A B6 82 BB CC E0 66 79>)
$$ ##END=
$$ 
$$ hash MD5
$$ A3 1A 01 14 08 5D DD C6 D3 CA 11 7F D9 2B 6A B4
##$RELAX= 
##$RELAX= 
##$RELAX= 
##$RELAX= 
##$RELAX= 
##$RELAX= 
##$RELAX= 
##$RELAX= 
$$ Bruker specific parameters
$$ --------------------------
##$DU= <F:/spectra>
##$EXPNO= 1
##$NAME= <P31>
##$PROCNO= 1
##$TYPE= <nmr>
##$USER= <she>
##$AMP= (0..31)
100 100 100 100 100 100 100 100 100 100 100 100 100 100 100 100 100 100 
100 100 100 100 100 100 100 100 100 100 100 100 100 100 
##$AQSEQ= 0
##$AQ_mod= 1
##$AUNM= <au_zg>
##$AUTOPOS= <>
##$BF1= 81.014009
##$BF2= 200.13
##$BF3= 200.13
##$BF4= 200.13
##$BF5= 200.13
##$BF6= 200.13
##$BF7= 200.13
##$BF8= 200.13
##$BYTORDA= 1
##$CFDGTYP= 0
##$CFRGTYP= 5
##$CHEMSTR= <none>
##$CNST= (0..31)
1 1 145 1 1 1 1 1 1 1 1 1 1 1 1 1 1 1 1 1 1 1 1 1 1 1 1 1 1 1 1 1 
##$CPDPRG= <waltz16>
##$CPDPRG1= <>
##$CPDPRG2= <waltz16>
##$CPDPRG3= <>
##$CPDPRG4= <mlev>
##$CPDPRG5= <mlev>
##$CPDPRG6= <mlev>
##$CPDPRG7= <mlev>
##$CPDPRG8= <mlev>
##$CPDPRGB= <>
##$CPDPRGT= <>
##$D= (0..31)
$$ [...]
##$SUBNAM3= <"">
##$SUBNAM4= <"">
##$SUBNAM5= <"">
##$SUBNAM6= <"">
##$SUBNAM7= <"">
##$SUBNAM8= <"">
##$SUBNAM9= <"">
##$SW= 501.771253377433
##$SWIBOX= (0..15)
0 1 3 0 0 0 0 0 0 0 0 0 0 0 0 0 
##$SW_h= 40650.406504065
##$TD= 32768
##$TD0= 1
##$TE= 0
##$TE2= 300
##$TE3= 300
##$TEG= 300
##$TL= (0..7)
0 120 53 12 22 120 120 120 
##$TP= (0..7)
150 150 150 150 150 150 150 150 
##$TP07= 0
##$TPNAME0= <>
##$TPNAME1= <>
##$TPNAME2= <>
##$TPNAME3= <>
##$TPNAME4= <>
##$TPNAME5= <>
##$TPNAME6= <>
##$TPNAME7= <>
##$TPOAL= (0..7)
0.5 0.5 0.5 0.5 0.5 0.5 0.5 0.5 
##$TPOFFS= (0..7)
0 0 0 0 0 0 0 0 
##$TUNHIN= 0
##$TUNHOUT= 0
##$TUNXOUT= 0
##$USERA1= <user>
##$USERA2= <user>
##$USERA3= <user>
##$USERA4= <user>
##$USERA5= <user>
##$V9= 5
##$VALIST= <valist>
##$VCLIST= <CCCCCCCCCCCCCCC>
##$VD= 0
##$VDLIST= <DDDDDDDDDDDDDDD>
##$VPLIST= <PPPPPPPPPPPPPPP>
##$VTLIST= <TTTTTTTTTTTTTTT>
##$WBST= 1024
##$WBSW= 4
##$XGAIN= (0..3)
0 0 0 0 
##$XL= 0
##$YL= 0
##$YMAX_a= 7385
##$YMIN_a= -8794
##$ZGOPTNS= <>
##$ZL1= 120
##$ZL2= 120
##$ZL3= 120
##$ZL4= 120
##$ABSF1= 248.5645
##$ABSF2= -253.2056
##$ABSG= 5
##$ABSL= 3
##$ALPHA= 0
##$AQORDER= 0
##$ASSFAC= 0
##$ASSFACI= 0
##$ASSFACX= 0
##$ASSWID= 0
##$AUNMP= <proc_1d>
##$AZFE= 0.1
##$AZFW= 0.5
##$BCFW= 0
##$BC_mod= 2
##$BYTORDP= 0
##$COROFFS= 0
##$CY= -3
##$DATMOD= 1
##$DC= 0
##$DFILT= <>
##$DTYPP= 0
##$F1P= 0
##$F2P= 0
##$FCOR= 1
##$FTSIZE= 65536
##$FT_mod= 6
##$GAMMA= 0
##$GB= 0
##$INTBC= 1
##$INTSCL= 5.30512e-09
##$ISEN= 30
##$LB= 1
##$LEV0= 0
##$LPBIN= 0
##$MAXI= 10000
##$MC2= 0
##$MEAN= 0
##$ME_mod= 0
##$MI= 50
##$NCOEF= 0
##$NC_proc= -8
##$NLEV= 6
##$NOISF1= 182.463
##$NOISF2= 159.3651
##$NSP= 0
##$NTH_PI= 0
##$NZP= 0
##$OFFSET= 248.5645
##$PC= 4
##$PHC0= -10461.46
##$PHC1= 502.4546
##$PH_mod= 1
##$PKNL= yes
##$PPARMOD= 0
##$PSCAL= 0
##$PSIGN= 0
##$REVERSE= no
##$SF= 81.014009
##$SI= 65536
##$SIGF1= 159.3651
##$SIGF2= -187.1042
##$SINO= 113.3802
##$SIOLD= 16384
##$SREGLST= <1H.CDCl3>
##$SSB= 0
##$STSI= 65536
##$STSR= 0
##$SW_p= 40650.406504065
##$SYMM= 0
##$S_DEV= 0
##$TDeff= 32768
##$TDoff= 0
##$TI= <>
##$TILT= no
##$TM1= 0
##$TM2= 0
##$TOPLEV= 0
##$USERP1= <user>
##$USERP2= <user>
##$USERP3= <user>
##$USERP4= <user>
##$USERP5= <user>
##$WDW= 1
##$XDIM= 65536
##$YMAX_p= 343269335
##$YMIN_p= -254565287
$$ End of Bruker specific parameters
$$ ---------------------------------
##NTUPLES= NMR SPECTRUM
##VAR_NAME=  FREQUENCY,     SPECTRUM/REAL,   SPECTRUM/IMAG
##SYMBOL=    X,             R,               I
##VAR_TYPE=  INDEPENDENT,   DEPENDENT,       DEPENDENT
##VAR_FORM=  AFFN,          ASDF,            ASDF
##VAR_DIM=   65536,         65536,           65536
##UNITS=     HZ,            ARBITRARY UNITS, ARBITRARY UNITS
##FACTOR=    0.620285442955139, 1,           1
##FIRST=     20137.2065510759, 0,            0
##LAST=      -20513.1999529892, 0,           0
##MIN=       -20513.1999529892, -254565287,  0
##MAX=       20137.2065510759, 343269335,    0
$$ Real data points
##PAGE= N=1
##DATA TABLE= (X++(R..R)), XYDATA
$$ [...]
41113a0942693L93358O964053R570045L231056l665804j438696N774682P217978
41105A7103979K515777L08688L016149M060707m37454o721289j0461315j1017788
41097a632546q472960l116976K189915M860340O660276R415570R320335K783883
41089B2007837m617583m091632K479999M311567j959690p495533n238141N22787
41081E919611K589666R25791o65193j381725j710856k86192K430622K177630k252294
41072G747060m778074k55921P192876J0120437Q167680N632381K156443n297904
41064C0684978j2666108j1097380q52719O382490L130089l921321n023224j165404
41056E471401O33850q6165J180036L231642P14548m408909l749050L512881Q028197
$$ plain form
41113 -10942693 -10549335 -3585282 5984763 9215819 5550015 4111319 9886001 17103979
41105 17103979 19619756 19928444 22944593 27005300 26567846 19846557 9385242 -1632546
41097 -1632546 -10105506 -13222482 -11032567 -6172227 488049 9903619 19223954 22007837
41089 22007837 17390254 13298622 15778621 20090188 18130498 10634965 5396824 5919611
41081 5919611 8509277 9435068 8769875 7388150 5677294 5391102 7821724 9999354 7747060
41072 7747060 2968986 2713065 9905941 20026378 28194058 33826439 35982882 30684978
41064 30684978 18018870 6921490 6068771 12451261 15581350 11660029 6636805 5471401
41056 5471401 6105251 6019086 7199122 10430764 11145312 6736403 2987353 6500234 14528431
41047A4528431N241842K511792N459432P386176J150124o934125o407530M8668
41039B2984810J358858l194625l606037K607016N332132j723093j1132049j3323690
41031f96678q801293l513380Q0256J954677J349618j95451J412435N660704O171424
41022C422312Q68445l091783O20873Q501795J2768126J0043494J015174j1080013
41014B3068423j7794257j0688122N053104J2243446M315736m423978o64069P431624
41006A8541907N041891m413210o426063l15508K272372q0311J858686O281275
40998B2761039J70324j4840932j8047189p57792J6915815J3716451l237182j2051521
40990D629013p731237k719913k635045j15473P606110J1165878L599145q313400
$$ plain form
41047 14528431 19770273 22282065 27741497 35127673 36277797 29343672 22936142 22984810
41039 22984810 24343668 21149043 17543006 20150022 25482154 23759061 12627012 -696678
41031 -696678 -9497971 -13011351 -12931095 -10976418 -9626800 -9822251 -8409816 -2749112 3422312
41022 3422312 4290757 1198974 1819847 10321642 23089768 33133262 34148436 23068423
41014 23068423 5274166 -5413956 -360852 11882594 16198330 11774352 11110283 18541907
41006 18541907 23583798 19170588 12744525 12429017 14701389 14621078 16479764 22761039
40998 22761039 22931363 8090431 -9956758 -10714550 6201265 19917716 16680534 4629013
40990 4629013 -3102224 -5822137 -8457182 -8572655 -966545 10199333 13798478 5485078
40982E485078j2605693n870103N125431J1077666P140283l691095j2107073j0522285
40974a5967791j151307O448485O569668K889171J608508K787375J922694j780867
40966C325936l452036k2833M380086M167905Q74630M22641K508349L09997o766131
40957E748544q635048N07506J0083598O248575p157747j2821293m187941O859835
40949c353971Q521299L400614k76052j275566k510047l514913k706376j446580
40941c161592m34869K332899N570693L552066l899001p788677k760145L917485
40933b671141L692188l53147r63009K9818k832990n530070l04207Q218024P065520
40924F350986m003973r412119l65686J1262635R240085n034914j5499433j1926951
$$ plain form
40982 5485078 -7120615 -12990718 -7865287 3212379 10352662 6661567 -5445506 -15967791
40974 -15967791 -17119098 -10670613 -4100945 -1211774 396734 3184109 5106803 3325936
40966 3325936 -126100 -148933 4231153 8399058 9273688 9696329 12204678 12514675 5748544
40957 5748544 -2886504 -2378998 7704600 13953175 6795428 -6025865 -10213806 -3353971
40949 -3353971 5167328 8567942 8291890 7016324 4506277 991364 -1715012 -3161592
40941 -3161592 -3596461 -1263562 4307131 7859197 3960196 -3828481 -6588626 -2671141
40933 -2671141 1021047 667900 -295109 -265291 -3098281 -8628351 -8932558 -714534 6350986
40924 6350986 2347013 -7065106 -7430792 3831843 13071928 8037014 -7462419 -19389370
40916a9389370N43281J0595424J2369683P211092o26739o912561q629787n808423
40908a0647400k209785j552988k317525O69387P559895J0450701L800551n536451
40900B16385o255837R58769M498814J46207k889507J586582O041323L076915o73838
40891F705813L561434Q940520K242691j2574594j6208328j548703J4435429J2359554
40883A7913816n579011k0137532j7645985j984921J2510762J4926205N798900
40876E802234n280826r394908n635841J069569O512086Q882405O815292N77104
40868I347115n617263o605564j704880N029131Q706118O272835j560575q877543
40860D989374r167248l952540j470458l799697k937641N101727J1235804O766290
$$ plain form
40916 -19389370 -18846089 -8250665 4119018 11330110 10703371 3790810 -4838977 -10647400
40908 -10647400 -12857185 -14410173 -16727698 -16058311 -8498416 1952285 5752836 216385
40900 216385 -6039452 -5080683 -581869 -435662 -3325169 -1738587 4302736 7379651 6705813
40891 6705813 10267247 19207767 21450458 8875864 -7332464 -8881167 5554262 17913816
40883 17913816 12334805 -7802727 -25448712 -27433633 -14922871 3334 5802234
40876 5802234 521408 -8873500 -14509341 -13439772 -6927686 1954719 8770011 9347115
40868 9347115 3729852 -2875712 -4580592 448539 9154657 15427492 13866917 4989374
40860 4989374 -4177874 -8130414 -9600872 -13400569 -16338210 -11236483 -679 6765611
40852F765611k464167n941149m776534n476966m572317M720762J4966541J1333617
40844A4555398m755048j5693763j2565718l816221K597275Q575491J3575023J0267361
40836A2739798p56668p282420l989137o47214m433267q268199n115519J48135
40828a7604491K422173O042700J2529461J2664676K619794n545682k641446J782317
40820A2269502k759081p433845L7647J0807817P775659m698604p127007K601803
40812A1473891O601369k345569j0207061o780262r03400k312545n680295l355187
40804a3509059j36318l392083q458025n849564L319064R687538R476904P066005
40796a795538O165929N966188N083787L483596P07499l405672o125330l502231
$$ plain form
40852 6765611 4301444 -1639705 -6416239 -11893205 -16465522 -11744760 3221781 14555398
40844 14555398 9800350 -5893413 -18459131 -22275352 -19678077 -11102586 2472437 12739798
40836 12739798 11983130 4700710 711573 64359 -4368908 -12637107 -17752626 -17604491
40828 -17604491 -15182318 -9139618 3389843 16054519 18674313 13128631 10487185 12269502
40820 12269502 9510421 2076576 2114223 12922040 20697699 15999095 8872088 11473891
40812 11473891 18075260 15729691 5522630 -1257632 -2161032 -4473577 -10153872 -13509059
40804 -13509059 -13645377 -17037460 -25495485 -31345049 -28025985 -18338447 -8861543 -1795538
40796 -1795538 4370391 10336579 15420366 18903962 19611461 16205789 10080459 6578228
40788F578228M149253J0232763P311501m496416j5542245j5677226n632967L853337
40780i223772N006905L82301m252289p364759p756320j398613R810007J3494333
40772a302207K397028j0681561p469228Q522737J5171850L839476q377446n169800
40764c069151N544826O408719k555403o968697k137004J711255j884452n763537
40756h713444k485931L187335K587029k751374l907240J195396M813713J313173
40748d761343n060386p180598m148871N16213M715697O620753K697143n663316
40740a2264708p704184M294541K0057786K0897845N300230q162388p320252j727422
40732A3371448l766421q247536l492538P424026J1372158N285155k153573m992895
$$ plain form
40788 6578228 10727481 20960244 28271745 23775329 8233084 -7444142 -13077109 -9223772
40780 -9223772 -4216867 -3834566 -8086855 -15451614 -23207934 -24606547 -14796540 -1302207
40772 -1302207 1094821 -9586740 -17055968 -8533231 6638619 10478095 2100649 -3069151
40764 -3069151 2475675 8884394 6328991 -639706 -2776710 -1065455 -2949907 -8713444
40756 -8713444 -11199375 -8012040 -5425011 -8176385 -12083625 -10888229 -6074516 -4761343
40748 -4761343 -9821729 -17002327 -21151198 -20634985 -15919288 -9298535 -6601392 -12264708
40740 -12264708 -19968892 -15674351 4383435 25281280 30581510 22419122 15098870 13371448
40732 13371448 9605027 1357491 -2135047 5288979 16661137 21946292 19792719 14799824
40724A4799824l830912P70212O316928M322185q297549j8217181j1317961M489001
40716a0965453R325659J670252j301341O120063R956945L352974j019618M641470
40708B1780951P215273m626391j8744802j7499656m562514L565355L122293K739312
40700g010179M444301K347597l188380n294823k696329M49513M094849R714216
40692B860765J1793120M867709m204198m787694l25322k360510q776066n837611
40684f769807O840949J2422362L493973n503308j762291O167688M557193l143563
40676A6303196m938238q94453J003988J787490O694258Q759865k854009j9245512
40668F616585j8005198K434350J5861176N863349r192186m833208J1903604J5302991
$$ plain form
40724 14799824 10968912 11739124 18056052 22378237 14080688 -4136493 -15454454 -10965453
40716 -10965453 -1639794 30458 -1270883 4849180 14806125 18159099 17139481 21780951
40708 21780951 28996224 24369833 5625031 -11874625 -16437139 -12871784 -9749491 -7010179
40700 -7010179 -2565878 -218281 -3406661 -8701484 -11397813 -10948300 -6853451 2860765
40692 2860765 14653885 19521594 15317396 10529702 10204380 7843870 -932196 -6769807
40684 -6769807 71142 12493504 15987477 10484169 8721878 14889566 19446759 16303196
40676 16303196 11364958 10470505 11474493 13261983 19956241 28716106 25862097 6616585
40668 6616585 -11388613 -8954263 6906913 12770262 3578076 -1255132 10648472 25951463
40660B5951463J623562q200617m216685k47039o173336j1085952m955440K813623
40652d490421J080921k965189J639723Q005153L326916o953849p150300K428802
40644e078244P615687N235204M778987O393002l95444j3270584j5047635j875859
40636a1644886P780420K520144l709133L415774J3308441Q306225o541564j1914619
40628A520802m654981N22651l096154n499375R54878Q987750Q247170j4786n452531
40619A515424j234025Q380719J1580685J924052j1240697j1467900K517031J2597124
40611A4572413O332938m428770k077276Q929691R667579k702326j1337576p439276
40603A1517397k567060p116503j2799991o991697O792377J4398280J0610933K937718
$$ plain form
40660 25951463 27575025 19374408 15157723 14910684 8737348 -2348604 -7304044 -4490421
40652 -4490421 -3409500 -6374689 -4734966 3270187 6597103 -356746 -7507046 -5078244
40644 -5078244 2537443 7772647 12551634 18944636 18549192 5278608 -9769027 -11644886
40636 -11644886 -3864466 -1344322 -5053455 -1637681 11670760 19976985 13435421 1520802
40628 1520802 -3134179 -2611528 -5707682 -11207057 -10252179 -1264429 6982741 6967955 1515424
40619 1515424 281399 8662118 20242803 22166855 10926158 -541742 1975289 14572413
40611 14572413 20905351 16476581 14399305 23328996 32996575 30294249 18956673 11517397
40603 11517397 8950337 1833834 -10966157 -17957854 -11165477 3232803 13843736 16781454
40595A6781454r61096j265893k295472o222731j0322201q594810J305735J1715874
40587A40860J0944568j329699j0876616o654206L954856N784898k019390n403608
40579e458337K422455R522095K385262j3238392j8530300o136735J1225386J7861954
40571E3388J2078640K477479m620690p492596m818482K366778P760407O799260
40563A4604184L927506M792229M787422l544990j3951555j1629023L352797J2935565
40555A5274135O963084k414067j162142N304354L734935m705547q665563o142390
40547H186799m551757n135761k075383M084354N630362Q13855l844601n063735
40539a955867n717340n511191l4801Q586455J0692105K738588o471663p385919
$$ plain form
40595 16781454 15820358 14554465 12258993 6036262 -4285939 -12880749 -11575014 140860
40587 140860 11085428 9755729 -1120887 -7775093 -3820237 1964661 -54729 -5458337
40579 -5458337 -3035882 6486213 8871475 -4366917 -22897217 -29033952 -17808566 53388
40571 53388 12132028 14609507 9988817 2496221 -2322261 44517 7804924 14604184
40563 14604184 18531690 23323919 28111341 24566351 10614796 -1014227 2338570 15274135
40555 15274135 22237219 19823152 18661010 23965364 27700299 22994752 14329189 8186799
40547 8186799 3635042 -1500719 -3576102 508252 6138614 6952469 3107868 -1955867
40539 -1955867 -7673207 -13184398 -13219199 -4632744 6059361 8797949 2326286 -5059633
40531e059633j070059M418885L884502j132610m276037L61445J0949056J7367656
40523B5443205J2950906L795698m98778j390970o715762j4410914j3831549l789018
40515A552818L844317J892648k620642j523815K772948M706678N195990O583891
40507B2404833N600297p86928p752301q060128k005192L518867L701302r4504
40499A6526246l089251j958815J488972J954314j634757l133284J097163M052258
40491A5302846j707178r862020q255221J362145N695942J775236L60978N015413
40483I688141N312046k780517p108280K02448Q210752N339710j840474j961761
40475A5062065J347706j251859n967220l384419K889908K648937j416024J502378
$$ plain form
40531 -5059633 -6129692 -1710807 2173695 1041085 -3234952 -2873507 8075549 25443205
40523 25443205 38394111 42189809 41691031 40300061 33584299 19173385 5341836 1552818
40515 1552818 5397135 7289783 4669141 3145326 5918274 10624952 15820942 22404833
40507 22404833 28005130 27218202 19465901 11405773 9400581 12919448 16620750 16526246
40499 16526246 13436995 11478180 12967152 14921466 13286709 10153425 11250588 15302846
40491 15302846 13595668 3733648 -4521573 -3159428 2536514 4311750 4672728 9688141
40483 9688141 15000187 12219670 5111390 5313838 13524590 18864300 17023826 15062065
40475 15062065 16409771 15157912 9190692 5806273 8696181 11345118 9929094 11431472
40467A1431472R487689R892706J218451m403989j638983J704864J311773L158823
40459C2162806Q779210Q682168j947911j2813480j2053647j578428Q188238J1423532
40451D0842488Q359569N19062q597364j2893603r711404l391108P79960K601298
40443A8508898M414670O701002Q449918P964894K523002p477152j3911337q124943
40435A9048952N593566J2239591N204142n198592o814692p38108M779572P125850
40427D1240281P605262L808281n819240j3729978j0491537Q02128P270290M016180
40419C4701667l11722J679095M783497N52286q242748j0628264l143071N180261
40411B4571001N466297O03033n39224L173910M282728m54993m202555r18772M466256
$$ plain form
40467 11431472 20919161 30811867 32030318 27626329 25987346 27692210 29003983 32162806
40459 32162806 40942016 49624184 47676273 34862793 22809146 21230718 29418956 40842488
40451 40842488 49202057 49721119 41123755 28230152 18518748 15127640 15907600 18508898
40443 18508898 22923568 29624570 38074488 46039382 48562384 41085232 27173895 19048952
40435 19048952 24642518 36882109 42086251 36887659 30072967 29334859 34114431 41240281
40427 41240281 48845543 52653824 46834584 33104606 22613069 23415197 30685487 34701667
40419 34701667 34389945 36069040 40852537 41404823 33162075 22533811 19390740 24571001
40411 24571001 30037298 30640331 30101107 33275017 37557745 37102752 32900197 31981425 36447681
40402C6447681L581905k095730m044500o29083J279852j279151l157437j478390
40394B8625147m37988j651719O66335Q540238J3001678O601230l660859n736778
40386D5947284m3438K939501l16457k847984l37515K644659J501096j747777l253667
40377D4485702k033163J874133P216607Q302353J57988j0524148q957074P400573
40369D7922971K0363005J2018431j0514612k1759261q945012J2955254K0478117
40362G2518893R007746n206742p233349P125L832251N68759j197609M261258R959715
40353H6518047O813036j691420l982025K357333P066277K517808n683430p651132
40345H6264494k798814R72042j431038o512860o871510O19750J0762853J4370123
$$ plain form
40402 36447681 40029586 37933856 33889356 33260273 34540125 33260974 30103537 28625147
40394 28625147 28187159 26535440 27201775 35742013 48743691 55344921 51684062 45947284
40386 45947284 45903846 48843347 48526890 45678906 45341391 47986050 49487146 47739369 44485702
40377 44485702 42452539 44326672 51543279 59845632 60003620 49479472 40522398 47922971
40369 47922971 68285976 80304407 69789795 48030534 39085522 52040776 72518893
40362 72518893 81526639 76319897 69086548 69093673 72925924 73494683 72297074 76558332 86518047
40353 86518047 93331083 91639663 87657638 90014971 97081248 99599056 93915626 86264494
40345 86264494 83465680 84437722 83006684 76493824 69622314 70242064 81004917 95375040
40337I5375040Q587181J221657R54251N983415R135208J1411761J9473885K9484967
40329A81627365K7139753Q931216r420853j4042886j1088975j3735312k1434072
40322A47976236k4643873k1743915j7379531j0836185r55693L172621o696143
40315F8893517j9610031j6178435K845743J6600562J4031840N540598J409624
40308G3533418k176141q349337r054114l65171O648893K806888l682947j377718
40300E7983771N332611N035795j141189l011809J102072L702203J825082l41179
40292G0487357o52916r33477j232616l38873m8976j961739l064518j243746j142994
40283E9867502p104233j4306455j4760604q612304k159221J559222L068988J797121
$$ plain form
40337 95375040 103962221 105183878 106138129 112121544 121256752 132668513 152142398 181627365
40329 181627365 208767118 217698334 208277481 194234595 183145620 169410308 147976236
40322 147976236 123332363 101588448 84208917 73372732 72417039 75589660 68893517
40315 68893517 49283486 33105051 35950794 52551356 66583196 72123794 73533418
40308 73533418 71357277 63007940 53953826 53588655 60237548 63044436 59361489 57983771
40300 57983771 63316382 68352177 67210988 64199179 65301251 69003454 70828536 70487357
40292 70487357 69834441 68900964 67668348 67329475 67280499 65318760 62254242 61010496 59867502
40283 59867502 52763269 38456814 23696210 15083906 12924685 14483907 17552895 19350016
40275A9350016j455668j956846J744278L443758l23947k437189K849630P503791
40267B8717823J327308j0095419j2734883n246721J431330K857242M496843P058956
40259A7812479L726082n480747r940627l523885O593601J0257591N872965r10116
40251B4407343l722525K18620O868471P606184P5279o866502n386555N0007K080267
40242B5330589L446170Q800198J1235041K309851j0162470j1228164j826891M419380
40234C2323704L786951L322293K559067m612430j1426020m510255J0526490J3638993
40226D5608793L163484j077252P598539J1971158L378244l002380J372478J35546
40218F9148610j7074317l0047417j7813366O078690J3032338L31674j1433013
$$ plain form
40275 19350016 17894348 15937502 17681780 21125538 20801591 18364402 21214032 28717823
40267 28717823 30045131 19949712 7214829 1968108 3399438 6256680 10753523 17812479
40259 17812479 21538561 16057814 6117187 2593302 9186903 19444494 25317459 24407343
40251 24407343 20684818 20903438 27771909 35378093 35453372 28586870 23200315 23250322 25330589
40242 25330589 28776759 37576957 48811998 51121849 40959379 29731215 27904324 32323704
40234 32323704 36110655 39432948 41992015 37379585 25953565 21443310 31969800 45608793
40226 45608793 48772277 47695025 55293564 67264722 70642966 67640586 69013064 69148610
40218 69148610 52074293 22026876 4213510 10292200 23324538 23656212 12223199
40211A2223199j1478498o307929j209287M493319P731074M455744j487716m977924
40203C441982q083705j0588389l749607J2388648J9392518O258163q924369m739169
40195E396072Q880528P291655p495914j1245838J287625R461900K131367p717680
40187G989715q289496m323030j135115M228968R187996M090042p978268r919730
40179f148918K332983J0739452L065002q218807o850410L188937P863256M741992
40171A0713487J106357k59581j226730j029091J270190K493062R13942L05898
40163A4287534K500667K586200k678049q380676r045721o296743l772213q03515
40155a1602516L651539O588720N317735J484058k451621n705922o255824j568911
$$ plain form
40211 12223199 744701 -5563228 -6772515 -2279196 5451878 9907622 8419906 3441982
40203 3441982 -4641723 -15230112 -18979719 -6591071 12801447 19059610 10135241 5396072
40195 5396072 14276600 21568255 14072341 2826503 4114128 13576028 15707395 7989715
40187 7989715 -299781 -4622811 -5757926 -1528958 7659038 11749080 3770812 -6148918
40179 -6148918 -3815935 6923517 9988519 1769712 -5080698 -1891761 5971495 10713487
40171 10713487 11819844 11560263 10333533 9304442 10574632 13067694 13981636 14287534
40163 14287534 16788201 19374401 16696352 8315676 -730045 -7026788 -10799001 -11602516
40155 -11602516 -7950977 -1362257 3955478 5439536 2987915 -2718007 -8973831 -10542742
40147a0542742N889258J0036676R211068O589398L103260k051838m880069p46320
40139A6608691N115729K657465o713508j1127774o879430k728831l129086j638733
40131g835477M445203P510792M091810J986806N345931N985236j654807r309432
40123A0566062q184038k178744J566329M232382P726309O703576j170766p472787
40115A1788323o280721m536889p945179q207921J979301J2304469R507511l34067
40107H274827j992133L297630J737864p272561r460809k99379P454433M858820
40099F598692n44392P61531N910769O829407K409652k815515n475187m280887
40091I394070L63086M699241M512259J080162q78778j074895k966792n641455
$$ plain form
40147 -10542742 -4653484 5383192 14594260 21183658 24286918 22235080 17355011 16608691
40139 16608691 21724420 24381885 17668377 6540603 -338827 -3067658 -6196744 -7835477
40131 -7835477 -3390274 4120518 8212328 10199134 15545065 21530301 19875494 10566062
40123 10566062 2382024 203280 1769609 6001991 13728300 20431876 19261110 11788323
40115 11788323 5507602 970713 -6974466 -15182387 -13203086 -898617 8608894 8274827
40107 8274827 6282694 9580324 11318188 4045627 -5415182 -5714561 1739872 6598692
40099 6598692 6054300 6815831 12726600 19556007 21965659 19150144 13674957 9394070
40091 9394070 9757156 14456397 18968656 20048818 19170040 18095145 15128353 9486898
40083I486898m437056k20513P80430j852689j014237N147456Q112732K303277
40075A8306298m607361k357878O636114J1200624P416580K065063O46176J78723
40067C9484339l614347q199690p859447k235708L302119M596055J926303l171719
40059B4227905r497371j3447329r918166L95835Q560845P167193r1447l748703
40051C648762j104076K592108L461635K116346j578869q294860j3048085q259594
40043b0466633M286469J2879821J0885294M442002J206701j61836l584812o506644
40035B980362m719724m84280J497728J784132L304376M861725L691486P40158
40027A3655963k064166n574722r211648q096506n52733O484010O263143J915546
$$ plain form
40083 9486898 5049842 4829329 5609759 3757070 2742833 7890289 16003021 18306298
40075 18306298 13698937 11341059 17977173 29177797 36594377 38659440 39305616 39484339
40067 39484339 35869992 27670302 19810855 17575147 20877266 25473321 27399624 24227905
40059 24227905 14730534 1283205 -8634961 -8239126 321719 7488912 7397465 3648762
40051 3648762 2544686 5136794 8598429 10714775 9135906 841046 -12207039 -20466633
40043 -20466633 -16180164 -3300343 7584951 12026953 13233654 13071818 9487006 2980362
40035 2980362 -1739362 -2223642 -725914 1058218 4362594 9224319 12915805 13655963
40027 13655963 11591797 6017075 -3194573 -11291079 -11843812 -5359802 903341 2818887
40019B818887N92103K382535K279646o98391l432182m433830l693837q36741J421660
40010c600150k073048r103250q871645J864351J0744209P909346J979606M536281
40002C385700Q947675K872268o135750m91414J4690735J4163298p925352k5345562
39994D161598j6829497M780030J4059572O959736k428937n972959n271185l27450
39986h69092Q414206J1948610K591632j0632118j1060053K007809J2322644R957843
39978B4681481K555565L74361J945811N01702l917615n928739l812057j170474
39970A5230035j400362l815134m227329J255485J0554095J4288910N271377r722128
39962B7434949j4379558l048717R815770P534306n892489j1003479o30910R556623
$$ plain form
40019 2818887 3410990 5793525 8073171 7374780 3942598 -491232 -4185069 -5021810 -3600150
40010 -3600150 -5673198 -14776448 -23648093 -21783742 -11039533 -3130187 -1150581 3385700
40002 3385700 12333375 15205643 9069893 8578479 23269214 37432512 29507160 4161598
39994 4161598 -12667899 -7887869 6171703 13131439 10702502 4729543 -541642 -869092
39986 -869092 7545114 19493724 22085356 11453238 393185 2400994 14723638 24681481
39978 24681481 27237046 27611407 29557218 30058920 26141305 20212566 16400509 15230035
39970 15230035 13829673 10014539 5787210 7042695 17596790 31885700 37157077 27434949
39962 27434949 13055391 10006674 19822444 27356750 21464261 10460782 9829872 19386495
39954A9386495L947335r991415j2988603k558262M573280p29139o370255K65079
39946d465485J0900900Q792330m929768j2704272o425454L118662N076811L061459
39938B425183M648989P489652M831599k212874o773194o228551k790548J972850
39930C363106O307790O057820P05929k381413J885083O055761O37354q429477
39922A4201953o718384M241578O073454p243225j6213721m288835J4562295J5107740
39914A9722855q34951p742325L201123J1090825J09879j4617540j1372564M056559
39906C613861Q707619k117459j1160136q216134j951884j32167K771005J0928277
39898B442982J5955965J0439931P25585m140503o185097j0325715j1580475l590768
$$ plain form
39954 19386495 23333830 13342415 353812 -2204450 2368830 1639691 -4730564 -4465485
39946 -4465485 6435415 15227745 10297977 -2406295 -8831749 -5713087 -636276 2425183
39938 2425183 7074172 14563824 19395423 17182549 10409355 4180804 1390256 3363106
39930 3363106 9670896 15728716 16434645 14053232 15938315 21994076 22631430 14201953
39922 14201953 7483569 11725147 17798601 10555376 -5658345 -9947180 4615115 19722855
39914 19722855 18887904 11145579 14346702 25437527 25547406 10929866 -442698 3613861
39906 3613861 12321480 10204021 -956115 -9172249 -11124133 -11256300 -8485295 2442982
39898 2442982 18398947 28838878 29564463 25423960 19238863 8913148 -2667327 -6258095
39890f258095O416696N526718m718392r750985l451832M520890M919259Q08748
39882a986993r45420l34951m48493k59956K343963M895095L540862p26647l501754
39873B575706k751740J11784L012691M156500K107270k146044m661411k784380
39865c79624J222614L181349K407106J439173J306392L07946k341257m725431
39857B418268n079826l803633j388708K616316O329426M833964k731021q331198
39849e136412m237162M154357L892045n574773r074705J746357J3734425J0833296
39841A0337428j696920o322654p07085J507074l916814m792284M927493J3362417
39833A2698655R789469O51224l491869m160237o922904q388172l699448J874669
$$ plain form
39890 -6258095 158601 5685319 966927 -8784058 -12235890 -7715000 -2795741 -1986993
39882 -1986993 -2932413 -3267364 -3715857 -3975813 -1631850 3263245 6804107 6077460 2575706
39873 2575706 -176034 -64250 2948441 7104941 9212211 7066167 2404756 -379624
39865 -379624 842990 4024339 6431445 7870618 9177010 9484956 7143699 2418268
39857 2418268 -2661558 -6465191 -7853899 -5237583 1091843 5925807 3194786 -5136412
39849 -5136412 -9373574 -5219217 -1327172 -6901945 -15976650 -14230293 -495868 10337428
39841 10337428 8640508 2317854 1610769 3117843 -798971 -5591255 -663762 12698655
39833 12698655 22488124 23139348 19647479 15487242 8564338 176166 -3523282 -1648613
39825a648613J350385j240347J531295O834189P357039M374599L170549J802195
39817B3531291l195550o414591k316524J989651k507910r160741n503648M099074
39809E21052M357856m743268p612833L66919O034417K093546j604747K852001
39801B264943Q112708N778394l48369l589699m460259m029969M47893O252474
39793A0428116M403357m350929o345667L303039R960742K005005r178709o332291
39785C892663O871720J2381960M733082m275767m912844J44848M006448L443068
39777B6285178q89887m366032j064591O651344O605381o270962j7798480j1504462
39769b352511O667838J4800547N042267p263809o888746K075422O106204J342852
$$ plain form
39825 -1648613 -298228 -1538575 -7280 6826909 14183948 18558547 21729096 23531291
39817 23531291 20335741 13921150 11604626 13594277 11086367 1925626 -3578022 521052
39809 521052 4878908 135640 -7477193 -7110274 -1075857 1017689 -587058 2264943
39801 2264943 10377651 16156045 15807676 12217977 7757718 3727749 4175642 10428116
39793 10428116 14831473 10480544 4134877 7437916 17398658 19403663 10224954 3892663
39785 3892663 10764383 23146343 27879425 23603658 18690814 18835662 22842110 26285178
39777 26285178 25395291 21029259 19964668 26616012 33221393 26950431 9151951 -2352511
39769 -2352511 4315327 19115874 24158141 16894332 10005586 12081008 18187212 19530064
39761A9530064m870531o008322l065289r47160k071714l635983j113202M845048
39753B662911P690167M261773J026803M976926J1266036Q552017l728903j2834402
39745B3873328r856898p82179L856253K686764P67398n73026l233553n376053
39737A1362034l339869Q25995J618392l84158M94325L527108Q30287p730403r236911
39728b033200L766388J7817164J4585833k175588j1056251l730361N635942N322700
39720B8132627K218382L858843J960790j0646198k0753177j2401058N223947R364321
39712F958477j373338o446020K607965J0883800P364633J431156L268456O769621
39704C1464750L340873k759855m612355m952097p053899n640016J798548O417892
$$ plain form
39761 19530064 14659533 8651211 5585922 4638762 2567048 -1068935 -2182137 2662911
39753 2662911 10353078 14614851 15641654 20618580 31884616 40436633 36707730 23873328
39745 23873328 14016430 13234251 17090504 19777268 20544666 19971640 16738087 11362034
39737 11362034 8022165 8848160 10466552 10082394 10576719 14103827 14934114 7203711 -2033200
39728 -2033200 1733188 19550352 34136185 31960597 20904346 17173985 22809927 28132627
39720 28132627 30351009 34209852 36170642 25524444 4771267 -7629791 -2405844 6958477
39712 6958477 5585139 -860881 1747084 12630884 19995517 21426673 24695129 31464750
39704 31464750 34805623 32045768 27433413 22481316 15427417 9787401 11585949 18003841
39696A8003841K343239j996351J131831M345179p87330p032169m343204J384935
39688A3049971k33738l523384K689405J1522873P209688n970943p339581O636395
39680B4040686J5166905N078311j0323637j3357710o003136l79227J629535N803692
39672B1655419J0538215P638187l746388j3449089j1999462j652504N904461K367593
39664A7256432p282321j0097092j336412R380499J1284600N612943k69815m955704
39656A9593130j0065679j1168130l477146O609318P912407J085044k755602Q23082
39648H556424N285314N557052L241743m52431n619853p824691k931836L136794
39640H948516J795133k945321j051434L904233l57550j0651234j0051651L046494
$$ plain form
39696 18003841 20347080 18350729 19482560 23827739 23040409 16008240 11665036 13049971
39688 13049971 12816233 9292849 11982254 23505127 30714815 24743872 17404291 24040686
39680 24040686 39207591 44285902 33962265 20604555 14601419 14222192 15851727 21655419
39672 21655419 32193634 39831821 36085433 22636344 10636882 8984378 14888839 17256432
39664 17256432 9974111 -122981 -1459393 7921106 19205706 24818649 24548834 19593130
39656 19593130 9527451 -1640679 -5117825 1491493 9403900 10488944 7733342 8556424
39648 8556424 13841738 19398790 22640533 22188102 16568249 8743558 5811722 8948516
39640 8948516 10743649 7798328 6746894 10651127 10293577 -357657 -10409308 -7362814
39632g362814J0110899L572697o35981P318284J2595879K934407p268435j229233
39624B0035703R914985N714943q100334r543228K417408P845068j1358o650511
39616B1622676l591753J52897j871937l200463j62942O44517k611476j346043
39608I635476O711678J0623725M073265m058804n205675l832952n800335o721676
39600E424702j941343L073598K656346J327318M132593O168991K310272j839236
39592B1313241o3662K136830k291098p547389m459122K533360K827964j428727
39584A3021397j91195M538086J623664p261792p669142K847797Q846867K405805
39576A8161487l488591K573050J0284467M441423r545733j3664780m674753L044015
$$ plain form
39632 -7362814 2748085 6320782 5684801 13003085 25598964 28533371 21264936 20035703
39624 20035703 29950688 35665631 27565297 18022069 20439477 28284545 28273187 21622676
39616 21622676 18030923 18183820 16311883 13111420 12948478 13592995 10981519 9635476
39608 9635476 16347154 26970879 31044144 26985340 21779665 17946713 12146378 5424702
39600 5424702 3483359 6556957 9213303 10540621 14673214 20842205 23152477 21313241
39592 21313241 21249579 23386409 21095311 13547922 9088800 11622160 14450124 13021397
39584 13021397 12830202 17368288 18991952 11730160 4061018 6908815 15755682 18161487
39576 18161487 14672896 17245946 27530413 31971836 22426103 8761323 4086570 7130585
39568G130585N19316m666676k539124N375361J0459937P758312j122050j0403357
39560A2512304j3139643o489225M162239R819858P089420l62059p925765j2483005
39552f815876j0412553n85470J0038695J1111752J587655q047992q494885j367244
39544a2985918N628500P628098M464803q34449k845992J634799P610383O574804
39536A6875028o32107l351576K775092Q002476L314742n259606o428013j210924
39528A4085112N10444k879812l300468K117899O391674M628624M11523k505375
39520A9459621n589037q963551q095101j855395L558486L947279L358878N235313
39512A1056493M528543l265672j0963038p902454L155721Q071582J174138o788863
$$ plain form
39568 7130585 7649901 2983225 444101 5819462 16279399 24037711 22915661 12512304
39560 12512304 -627339 -7116564 -2954325 6865533 13954953 13592894 5667129 -6815876
39552 -6815876 -17228429 -17813899 -7775204 3336548 4924203 -3123789 -11618674 -12985918
39544 -12985918 -7357418 270680 4735483 3901034 1055042 2689841 10300224 16875028
39536 16875028 16242921 12891345 15666437 23668913 26983655 21724049 15296036 14085112
39528 14085112 14595556 11715744 8415276 10533175 16924849 21553473 21964996 19459621
39520 19459621 13870584 4907033 -3188068 -5043463 -1484977 2462302 5821180 11056493
39512 11056493 15585036 12319364 1356326 -6546128 -3390407 4681175 5855313 -933550
39504i33550m530768L887538N827416j637805q154153m890670L746373O925377
39496B39758K337221j448065J896415O774859L975711m658374p650354p14625
39488G52546O226197L591781l535775l711145L105716O430736K247317k075002
39480A3032371j219506P94762N32535J483570M445718K278168o901006j1265287
39472C181325k066777R265188N819952q164792j2506543j433053R378687Q457917
39464A1931904L181095K731386L322207m43995m125232l675336l932273o472668
39456B517088k859529Q089061J1423177l22336j0052130k108745R417369L147711
39448A9251666j1168988p581879R529067R677568j1232728k0181341l06193K0300027
$$ plain form
39504 -933550 -5464318 -1576780 4250636 2612831 -5541322 -10431992 -6685619 239758
39496 239758 2576979 1128914 3025329 9800188 13775899 9117525 1467171 752546
39488 752546 6978743 10570524 7034749 3323604 6429320 12860056 15107373 13032371
39480 13032371 11812865 12607627 13140162 14623732 19069450 21347618 14446612 3181325
39472 3181325 1114548 10379736 16199688 8034896 -4471647 -5904700 3473987 11931904
39464 11931904 15112999 17844385 21166592 20722597 16597365 12922029 8989756 2517088
39456 2517088 -342441 7746620 19169797 18847461 8795331 6686586 16103955 19251666
39448 19251666 8082678 500799 10029866 19707434 8474706 -11706635 -12012828 8287199
39440H287199J3172259p029574r979145K382220N788013l517842p581989j459241
39432F1900P79171n584820p848149m95407M228071j885756p738979M67098J7863796
39423a53075K5520466J2626740j0522088k1435345q935289J1975298J5862108
39416B4938815l05774j2430406m368585Q295837M352144q411306p289642O378988
39408A1160071R339555m727754j5383212q400052N425166J1545981J0548278P211222
39400B6719255K13978p309327n004080N882897Q009391n332943j5483196n398576
39392B297399J3171621J7007930M648618o592088r020429r928727j1655307o077663
39384f148646P977193J7409806J1453130l911342j3924809j1636431k311744M805142
$$ plain form
39440 8287199 21459458 14429884 4450739 6832959 12620972 9103130 1521141 61900
39432 61900 841071 -4743749 -12591898 -13087305 -8859234 -10744990 -18483969 -18016871 -153075
39423 -153075 25367391 37994131 27472043 6036698 -2898591 9076707 24938815
39416 24938815 24633041 12202635 7834050 16129887 20482031 12070725 4781083 11160071
39408 11160071 20499626 15771872 388660 -8011392 -2586226 8959755 19508033 26719255
39400 26719255 26933233 19623906 14619826 20502723 28512114 23179171 7695975 2297399
39392 2297399 15469020 32476950 37125568 30533480 21513051 11584324 -70983 -6148646
39384 -6148646 1828547 19238353 30691483 26780141 12855332 1218901 -1092843 3712299
39376C712299N450318K316273P9241l66723j193650k188514l56131M013368N659165
39367A7125646J251056n737403r256563o707425l1479N366476L391244n342199
39359E9353j0115247k453256Q893468O900305q003946j5148870k839566J3535998
39351i171761J3522144M16695o124800P02260Q314902N304613m878317j1969994
39343c884258j0635104k356425P084781J0720299O529533O91550J35996L122870
39335A1409242K433313l508728q498522p117044n99289N669671O963669K440590
39327I192902l512650m765812n50826L596546L805850K333517J622900j13201
39319A1609226l353226l778644J78872K708212J64131j242813M439761J1028152
$$ plain form
39376 3712299 9162617 11478890 11558131 11191408 9997758 7809244 7453113 11466481 17125646
39367 17125646 18376702 12639299 3382736 -3324689 -3356168 2010308 5401552 59353
39359 59353 -10055894 -12509150 -3615682 3284623 -4719323 -19868193 -22707759 -9171761
39351 -9171761 4350383 4767078 -1357722 -655462 7659440 12964053 8085736 -3884258
39343 -3884258 -14519362 -16875787 -9791006 929293 7458826 8150376 8286372 11409242
39335 11409242 13842555 10333827 1835305 -5281739 -5881028 -211357 6752312 9192902
39327 9192902 5680252 914440 363614 3960160 7766010 10099527 11722427 11609226
39319 11609226 8256000 4477356 4656228 7364440 7528571 6285758 10725519 21753671
39311B1753671Q533392p96614n718132l057723l95615j937099k674444R67267
39303A6674703L875726Q8309p862825j1653279o673942L277034R947892R534556
39295A7208174P417300J0563845J5362014J0759530l404637j1370416k636562
39288D3899248J1349104J3324312N245873K283895O699362N413463o218145j5800555
39280F6196557j3907504p767314p592615j1184282j0576985m893501J512660O345755
39272A8132771P607745J795974q529615j2228135l423018P599987O967545l123327
39264A4799927p861648j618107M769075R97196p973235j0278057m150246J509381
39256i805714J691036J810036O743160J0347051L498625r879315j4168808k235524
$$ plain form
39311 21753671 30287063 29490449 23772317 20714594 20318979 18381880 15707436 16674703
39303 16674703 20550429 20638738 12775913 1122634 -5551308 -2274274 7673618 17208174
39295 17208174 24625474 35189319 50551333 61310863 57906226 46535810 43899248
39288 43899248 55248352 68572664 73818537 76102432 82801794 88215257 81997112 66196557
39280 66196557 52289053 44521739 36929124 25744842 15167857 10274356 11787016 18132771
39272 18132771 25740516 27536490 19006875 6778740 3355722 10955709 17923254 14799927
39264 14799927 6938279 5320172 10089247 11086443 3113208 -7164849 -11315095 -9805714
39256 -9805714 -8114678 -6304642 438518 10785569 14284194 4404879 -9763929 -11999453
39248a1999453J3358803J5213915K235275j0952403j2788009n578230J617925
39241h892177L814702K426746J637974M051066P505010O863573J397724k414111
39233A6390507K76554M447966K129520n240030r256068p564921n287065l935206
39225h038743N23389O694825O038645k913195q735596k967074O424950O600457
39217C627658j200036m871420m05210L720633J525999j715167L00483M143753
39209E126693K609056l387137o218767l340668o34720k692317n743151l894914
39201a8175925J797012N499257N435924M881330N192437L969248P67352j588479
39193G778156l018283o744650j0897984p343398N228286J4303290Q808229l357856
$$ plain form
39248 -11999453 1359350 16573265 18808540 7856137 -4931872 -10510102 -8892177
39241 -8892177 -5077475 -2650729 -1012755 3038311 10543321 17406894 18804618 16390507
39233 16390507 16667061 21115027 23244547 18004517 8748449 1183528 -4103537 -8038743
39225 -8038743 -7515354 -820529 5218116 2304921 -6430675 -9397749 -2972799 3627658
39217 3627658 2427622 -2443798 -2849008 871625 2397624 682457 982940 5126693
39209 5126693 7735749 4348612 -1870155 -5210823 -5845543 -8537860 -14281011 -18175925
39201 -18175925 -16378913 -10879656 -5443732 -562402 4630035 8599283 9366635 7778156
39193 7778156 4759873 -1984777 -12882761 -20226159 -14997873 -694583 8113646 4755790
39185D755790m324879Q352004J7189678Q748362q284129j5623130q865093J67009
39177B115612J355503k499132l564223o07814K012533K780515L978579N132238
39169A0703811K443679l288124n103053o99637K006314k666518o762793n70356
39161c936677R161716P514235l833998p500506J320025O323239k419243j1070435
39153d441644n179203N950343N150704m631974p302759q2020O252980P691937
39145C408364Q443900O350374l631319j3772611j1003325P45028M962071o58272
39137e155790k064026N005535Q101817J692422l464401j539489j897445r012190
39129h333567j1416080k069239P575412O333099N40612j69604N08116l189177
$$ plain form
39185 4755790 430911 8782915 25972593 34720955 26436826 10813696 1948603 2115612
39177 2115612 3471115 971983 -2592240 -3200054 -1187521 1592994 5571573 10703811
39169 10703811 13147490 9859366 4756313 4056676 6062990 3396472 -3366321 -3936677
39161 -3936677 5225039 12739274 8905276 1404770 2724795 9048034 6628791 -4441644
39153 -4441644 -9620847 -3670504 1480200 -3151774 -10454533 -10536553 -4283573 3408364
39145 3408364 11852264 18202638 14571319 798708 -10204617 -9459589 -4497518 -5155790
39137 -5155790 -7219816 -2214281 5887536 7579958 4115557 2576068 678623 -8333567
39129 -8333567 -19749647 -21818886 -14243474 -7910375 -7369763 -7539367 -7031251 -10220428
39121a0220428n082729J029788P742560O904528M242912O303458N275262o034037
39113A0161314j5720688r036242N871835R354795R28794k953592K365872N509881
39105F481969K397084J555001M099632r5905j1124802j3935635k452679Q714085
39097d361250O469985j865201k928570J987471K876046j749998n858815p650300
39089a3080632q950158p405909O7460Q624166R768285L389312k228095k020852
39081a1836423J010296K705193L234497M283325N490679N627669M283464J101394
39073A5900094l959209q370712p888405k002997L418410K329651k993925l565470
39065g132563M421561J2948372J1587319J570610n278818k131554M270169L495375
$$ plain form
39121 -10220428 -15303157 -14273369 -6530809 373719 4616631 10920089 16195351 10161314
39113 10161314 -5559374 -14595616 -8723781 631014 1559808 -1393784 972088 6481969
39105 6481969 8879053 10434054 14533686 14437781 3312979 -10622656 -13075335 -4361250
39097 -4361250 2108735 243534 -2685036 -697565 2178481 428483 -5430332 -13080632
39089 -13080632 -22030790 -29436699 -29369239 -20745073 -10976788 -7587476 -9815571 -11836423
39081 -11836423 -10826127 -8120934 -4886437 -603112 4887567 10515236 14798700 15900094
39073 15900094 11940885 3570173 -4318232 -6321229 -2902819 -573168 -3567093 -7132563
39065 -7132563 -2711002 10237370 21824689 23395299 18116481 15984927 20255096 23750471
39057B3750471m889244j1893600j0496757k102973O743814J0124256O124072j828351
39049A5531688o823924m351288K914653P380739M063673m180814q892379m453995
39041A188353M977129R152681M123803k614208l163009p71462l168665q238015
39033A486607o899759Q23302M756171J391740o58652L769615P642964M894280
39025A7206268P24269P36283O93628l438273n521592l72098M360229p9424p584323
39016F724967o294866K273307O815328M508335K238393K725962K313801L37587
39008B1642814j016239l438337p803556p006480L691830J3685139R277694m513015
39000B4519850j0554998n607960k120429m805922m565276J951366N645873K584097
$$ plain form
39057 23750471 18861227 6967627 -3529130 -5632103 1111711 11235967 17360039 15531688
39049 15531688 8707764 4356476 7271129 14651868 18715541 14534727 5642348 1188353
39041 1188353 6165482 15318163 19441966 16827758 13664749 12893287 9724622 1486607
39033 1486607 -5413152 -4589850 166321 1558061 899409 4669024 12311988 17206268
39025 17206268 17930537 18666820 19360448 15922175 10400583 10028485 14388714 14309290 6724967
39016 6724967 430101 2703408 9518736 14027071 16265464 18991426 21305227 21642814
39008 21642814 20626575 17188238 9384682 2378202 6070032 19755171 29032865 24519850
39000 24519850 13964852 8356892 6236463 1430541 -3134735 -1183369 4462504 7046601
38992G046601O58666K838414R51676o710798q415889J512593J1539152J0670942
38984B0091357L152618l489348r953952j4684534q054835R847845K0508574J1235867
38976B8653592m851935q935506l948944l882365p216295k555947O874623P372032
38968A1509255K18290N59581J0395825J4022220M174164o726427p776070m802561
38960B1574277n878143o305586J206070J1778885J4457563O809576m591814j3289751
38952B5761077j6280081j2764221n059872K337638P521991J1243260J1492063
38945B4251855M765544n457982r662790n313111q24701j960768k944917K173506
38937E026636P679603N213177j498744k056044L694751N843217J283668j208283
$$ plain form
38992 7046601 7705267 10543681 11495357 4784559 -3631330 -2118737 9420415 20091357
38984 20091357 23243975 19754627 9800675 -4883859 -12938694 -3090849 17417725 28653592
38976 28653592 23801657 14866151 10917207 7034842 -181453 -2737400 4137223 11509255
38968 11509255 11727545 12287126 22682951 36705171 40879335 34152908 26376838 21574277
38960 21574277 15696134 9390548 10596618 22375503 36833066 43642642 39050828 25761077
38952 25761077 9480996 -3283225 -8343097 -6005459 1516532 12759792 24251855
38945 24251855 29017399 23559417 13896627 8583516 7758815 5798047 2853130 5026636
38937 5026636 12706239 17919416 16420672 14364628 18059379 23902596 25186264 23977981
38929B3977981L942132Q967394M157696p323407j3744796j0396300l139063K402555
38921H844192P122592J1995497J2659502N827286l146568n774730k117431k90330
38913C5120010l765771o145676j818563M391709M225509j130598k629597K683350
38905C0930373O580358J324447q621957j1436905l015139P446481Q713009J484412
38897C3405079l251616j09691K459841m813767j5365838j3482904K006737J2888307
38889A3736148O403686o146615o226968N088901J1364444P015270K396514K725642
38881C6357022j72146r459165j3110891k782425R806047Q549659l660456j1073741
38873A4453904q550601m194534j881312L045294R994027J0272764K442223k554074
$$ plain form
38929 23977981 27920113 36887507 41045203 33721796 19977000 9580700 6441637 8844192
38921 8844192 15966784 27962281 40621783 46449069 43302501 37527771 35410340 35120010
38913 35120010 31354239 25208563 23390000 27781709 32007218 30876620 28247023 30930373
38905 30930373 37510731 38835178 30213221 18776316 15761177 23207658 31920667 33405079
38897 33405079 30153463 30043772 32503613 27689846 12324008 -1158896 847841 13736148
38889 13736148 20139834 13993219 7766251 12855152 24219596 31234866 33631380 36357022
38881 36357022 36184876 26725711 13614820 10832395 20638442 29188101 25527645 14453904
38873 14453904 5903303 1708769 -172543 2872751 12866778 23139542 25581765 23027691
38865B3027691J608517N561009r10076j1498136j1747656j28289J0153114R375641
38857B5441815J998176k295654r29727J462619Q74080j842465l377517k441201
38849A8890126j110255j512206k390370j437933k04291j964767m184217J82674
38841F268761J0670165J6011931R186693j009151k466146J683788r59961j0290124
38833B9095956j2248662j027437J1242105J2684404P451657N203310N191286J414678
38825E9007297l817068l410907J287653K046858k805900o271035m039612L87500
38817D2384786K643900K489309J043711q74659j057329J994983N112763L728394
38809E7465858j261072m999937n920162n745792l908199R13294M805792K445715
$$ plain form
38865 23027691 24636208 30197217 29287141 17789005 6041349 5913060 16066174 25441815
38857 25441815 27439991 25144337 24214610 25677229 26551309 24708844 21331327 18890126
38849 18890126 17779871 16267665 13877295 12439362 12235071 10270304 6086087 6268761
38841 6268761 16938926 32950857 42137550 41128399 38662253 40346041 39386080 29095956
38833 29095956 16847294 15819857 27061962 39746366 47198023 52401333 57592619 59007297
38825 59007297 55190229 51779322 53066975 55113833 52307933 46036898 41997286 42384786
38817 42384786 45028686 47517995 48561706 47687047 46629718 48624701 53737464 57465858
38809 57465858 56204786 51204849 45284687 39538895 35630696 36543990 41349782 43795497
38801D3795497l053993k864495L799054P678831L818380j086662O39L877636L699437
38792E9664324m3242j695431J15145J023116k408313q001723r729534m128432
38784C4795910L918206M943743j783899m213617N124151J3933409O147471j0716016
38776E2149358j3028848K839400J3401283M375058p936344n244577L345083L95110
38768E0295523q220692n472626M261671K323474r581167j0173940M843025J4211067
38760D2486335N656506n544933l408546M395039L212435l990334m579878K255724
38752D0482348O751953M375534j243546n641381n168769K233340J0650004Q668172
38744F1107655m153214j2506701n885692N765356P496406R25120k346142o83686
$$ plain form
38801 43795497 40741504 37877009 41676063 49354894 53173274 52086612 52087251 55964887 59664324
38792 59664324 59621082 57925651 58040796 59063912 56655599 48653876 38924342 34795910
38784 34795910 38714116 43657859 41873960 37660343 42784494 56717903 62865374 52149358
38776 52149358 39120510 41959910 55361193 59736251 51799907 46555330 49900413 50295523
38768 50295523 42074831 36602205 40863876 43187350 33606183 23432243 28275268 42486335
38760 42486335 48142841 42597908 39189362 43584401 46796836 42806502 38226624 40482348
38752 40482348 47234301 51609835 50366289 44724908 39556139 41789479 52439483 61107655
38744 61107655 56954441 44447740 38562048 44327404 51823810 52748930 50402788 49719102
38736D9719102j132769l681226j858433L669778N822854L901041L385504M615141
38728F4440992L505634J552092K983417M306185j92413n064304r57791O477242
38720G7051054K740744r474799j0218403O271882J9807929J4111297P48263q15713
38712A00222254P370911R462636L279349J478100R018205J6167796J4780588Q836806
38704A70616645O232621Q736178J2237890J1580240N203580j052012K242575J5553224
38696B31350941K6150787K3075508J1645003N129710O722809R353266R349809
38689C22777833R037431Q005416L448655j605223j838846r40543p062719j6553711
38681C15268293j6089428m173550L534262l543862j6079832k0239673j6446192
$$ plain form
38736 49719102 48586333 44905107 43046674 46716452 52539306 56440347 59825851 64440992
38728 64440992 67946626 69498718 72482135 76788320 76595907 71531603 70573812 77051054
38720 77051054 79791798 70316999 60098596 66370478 86178407 100289704 101037967 100222254
38712 100222254 107593165 117055801 120335150 121813250 130831455 146999251 161779839 170616645
38704 170616645 176849266 185585444 197823334 209403574 214607154 213555142 215797717 231350941
38696 231350941 257501728 280577236 292222239 297351949 304074758 313428024 322777833
38689 322777833 331815264 339820680 343269335 341664112 339825266 338884723 331822004 315268293
38681 315268293 299178865 295005315 298539577 294995715 278915883 258676210 242230018
38674B42230018j2991499j0901450o964548m517123q463644j3910155j2066361
38667A72415238n119428l423106q652693j1396291o760943j400875j643398m202512
38659A29815992l801112k295398l876803o711580o208726l305639k812850n024614
38651I5779270n370478k558598j007189l165078m733298j503647K978787K261400
38643H2681169k473192l558829J160897N058925M172195L781731P552869P894444
38635A06270209k668544j5511160j4441594L74657J0635771N323031n002181n920223
38627G9059966L42355K152734k076811l730067M45571L885398J334940m012729
38619G7401357o173554l956120j296830k254547n836473o088510j25554N377744
$$ plain form
38674 242230018 229238519 218337069 211372521 206855398 198391754 184481599 172415238
38667 172415238 167295810 163872704 155220011 143823720 137062777 135661902 134018504 129815992
38659 129815992 126014880 123719482 119842679 113131099 106922373 103616734 100803884 95779270
38651 95779270 90408792 87850194 86843005 83677927 78944629 77440982 80419769 82681169
38643 82681169 80207977 76649148 77810045 82868970 87041165 90822896 98375765 106270209
38635 106270209 103601665 88090505 73648911 74023568 84659339 89982370 84980189 79059966
38627 79059966 79402321 81555055 79478244 75748177 76193748 80079146 81414086 77401357
38619 77401357 71227803 67271683 65974853 63720306 57883833 51795323 51669769 57047513
38611E7047513K394628m519091l150776N684301O413743n930332j4143733m614245
38603C9182008R849522R763539n39157k978086K562566J064138p255631o336723
38595D5312176M269595M759229j0326274j8682369m670854J5145265J7774850
38588E3581618O734392J07354M26839k343106p822771o855667r20219j60362m342743
38579C8405335l428396L742479P699151N552762M539814O839862N493947j345016
38571F7499938n325244j653412L103085J890614l099694n791980l738101K572319
38563E5457525J0392691J2933362N427366n176712o134364K919278Q299417K876965
38555H6995528l141430Q67198Q996479R188824K693311Q01166O046375R132832
$$ plain form
38611 57047513 59442141 54923050 51772274 57456575 63870318 57939986 43796253 39182008
38603 39182008 49031530 58795069 58255912 55277826 57840392 58904530 51648899 45312176
38595 45312176 49581771 54341000 44014726 25332357 20661503 35806768 53581618
38588 53581618 60316010 60423364 60850203 58507097 50684326 43828659 42908440 42748078 38405335
38579 38405335 34976939 38719418 46418569 51971331 56511145 63351007 68844954 67499938
38571 67499938 62174694 60521282 63624367 65514981 62415287 56623307 52885206 55457525
38563 55457525 65850216 78783578 84210944 79034232 72899868 75819146 84118563 86995528
38555 86995528 83854098 84721296 93717775 102906599 105599910 106401076 112447451 121580283
38547A21580283M763695k01807K245128R500133J2185934O032541l754521q702816
38539A43648570n824997m13675J08444m545186o723529j556029M466813Q48465
38531A30008876j1632563j9346853j2283527K616383R298668J656896j0146631
38524I0171249j2536450l639382O072762N697612n422563j7489758j9241141q264588
38516C5347741O432977J2933235P928555j496215p120167p251229m501406q78612
38508D1394879J651406K31514m288429n461598J02742N359700J334573r274735
38500C1050052j5294960j2513459o604468j241640N488973J1232943Q454072j741044
38492A8830469o745776o05282N961064K661428l709101j342584O438423O979857
$$ plain form
38547 121580283 126343978 126142171 128387299 137887432 150073366 156105907 152351386 143648570
38539 143648570 137823573 137409898 137518342 132973156 126249627 124693598 129160411 130008876
38531 130008876 118376313 99029460 86745933 89362316 98660984 100317880 90171249
38524 90171249 77634799 73995417 80068179 85765791 80343228 62853470 43612329 35347741
38516 35347741 41780718 54713953 62642508 61146293 54026126 46774897 42273491 41394879
38508 41394879 43046285 43277799 38989370 33527772 33630514 38990214 40324787 31050052
38500 31050052 15755092 3241633 -3362835 -4604475 884498 12117441 20571513 18830469
38492 18830469 12084693 11479411 17440475 20101903 16392802 15050218 21488641 28468498
38484B8468498j040134o784467m526557J159814N915871Q862002O384913m387543
38476C4052397j5446840j4115715j490109P262181L730518m193075o771067m474368
38468a446078r85723M009261Q586638N988624l752232q884303j507342R623194
38460A1632039J1157031L628215j967051j223154M99998m64206j474971o42319
38452B1145582m52923k566304m304186k195062L569188Q487165O559600l813941
38444B6429119j5093770j5942123m655523P196040R003253M043604J924381L179960
38436A6084941R95721m144534l372185M785559Q747590N65022j0257909r250824
38428D153381J583959O452466m16226n993980J218880J2602642J1414790k889995
$$ plain form
38484 28468498 27428364 20643897 16117340 17277154 23193025 32055027 38439940 34052397
38476 34052397 18605557 4489842 2999733 10261914 13992432 9799357 3028290 -1446078
38468 -1446078 -2431801 1577460 10164098 16152722 12400490 3516187 2008845 11632039
38460 11632039 22789070 26417285 24450234 23227080 23727078 23262872 21787901 21145582
38452 21145582 20692659 18126355 13822169 11627107 15196295 23683460 30243060 26429119
38444 26429119 11335349 -4606774 -9262297 -2066257 6936996 10980600 12904981 16084941
38436 16084941 17080662 12936128 9563943 14349502 23097092 23662114 13404205 4153381
38428 4153381 5737340 12189806 11773580 5779600 6998480 19601122 31015912 28125917
38420B8125917j4987310j6027111j1611530o196267M527099J8769384K1682582
38413B4282764O146084j1347346j1540848l66262K251895m879681m836963N549318
38405E258961R067950j126647p894831J085196J1615445O401260o434054p823836
38397A0149444R93548K929391n749058j1599912p521046j107634J550015L558042
38389f797210N884424L507299k839481m542500K14662K011866l742086q163025
38381a4466051l771620K885405L095708J403260P233247J6784041J6666926M726047
38373C4556963n245628k924028M424159L767839m466490q047978j807530M673099
38365B4930406J313432p824914j0574999l428505N327918Q208052O562351M682174
$$ plain form
38420 28125917 13138607 -2888504 -14500034 -20696301 -16169202 2600182 24282764
38413 24282764 30428848 19081502 7540654 7174392 9426287 4546606 -290357 5258961
38405 5258961 14326911 13200264 5305433 6390629 18006074 24407334 17973280 10149444
38397 10149444 11142992 14072383 8323325 -3276587 -10797633 -11905267 -10355252 -6797210
38389 -6797210 -912786 2594513 -244968 -4787468 -4572806 -2560940 -6303026 -14466051
38381 -14466051 -18237671 -15352266 -12256558 -10853298 -3620051 13163990 29830916 34556963
38373 34556963 29311335 26387307 30811466 34579305 30112815 22064837 20257307 24930406
38365 24930406 26243838 18418924 7843925 4415420 9743338 17951390 24513741 29195915
38357B9195915K916057j11749l730812o890854r219200q349131j762098O364988
38349H413116P112355n53049o516608m138256k72428l263933q387730n353485
38341a2960018M626138J0190684O079038j590302n175178k559193M138032R494980
38333A2244181O877449k878437q424899k040401P733695P983811R34408j705625
38325B0724182L34964k605224q973668n730544P171078J1477130j625345j5546352
38317E226221j2051296K756544R962820M949538j600056k884630j914442j673936
38309B770763j406044j249562j688919n16100K544502K251690l494424o541071
38301g329165O88135J1697766J3509280M597398m925739q449669p760756m798510
$$ plain form
38357 29195915 32111972 32000223 28269411 21378557 12159357 3810226 2048128 8413116
38349 8413116 15525471 14972422 8455814 4317558 4045130 781197 -7606533 -12960018
38341 -12960018 -8333880 1856804 7935842 6345540 1170362 -1388831 2749201 12244181
38333 12244181 19121630 16243193 7818294 5777893 13511588 21495399 22429807 20724182
38325 20724182 21059146 18453922 9480254 3749710 10920788 22397918 20772573 5226221
38317 5226221 -6825075 -4068531 5894289 10843827 9243771 6359141 4444699 2770763
38309 2770763 1364719 115157 -1573762 -2089862 454640 2706330 -788094 -7329165
38301 -7329165 -6641030 5056736 18566016 23163414 18237675 9788006 2027250 -2771260
38293b771260M93130M628354L276985n22811n86068P79493l520772j0296589p986449
38284a6505987L704516R719037J348212r903885q689838L286454J2311915J1664730
38276F935154N642610o48024n453474o457959j775811M974555P219747L607449
38268A4044247r84088k264824l44445K345729L145409N07220l216665k592092
38260A0640491L164035O395667Q11837p738865q088552r5133M963673J456504
38252A1509657k807006l523N211273L598969m500371j0934809j1610496q366831
38244a7903137j967858P318841J3152632P868305l783476n998637P159726K0791644
38236B6638040J7510415N30123j1985112j2171346r706213j2870252j5045960
$$ plain form
38293 -2771260 -2278130 2350224 5627209 5104398 4518330 5297823 1777051 -8519538 -16505987
38284 -16505987 -12801471 -3082434 -1734222 -11638107 -20327945 -17041491 -4729576 6935154
38276 6935154 12577764 11929740 6476266 18307 -1757504 3217051 10436798 14044247
38268 14044247 13060159 10795335 10450890 12796619 15942028 16449248 13232583 10640491
38260 10640491 13804526 20200193 21012030 13273165 5184613 5089480 10053153 11509657
38252 11509657 8702651 8699128 13910401 17509370 13008999 2074190 -9536306 -17903137
38244 -17903137 -19870995 -12552154 600478 8468783 4685307 -1313330 5846396 26638040
38236 26638040 44148455 44678578 32693466 20522120 10815907 -2054345 -17100305
38229a7100305o895267O815137J2307443N171847n153030q699102n391947j010931
38221a9956155J101525J450346J453734K145528L823829N067908L674316j20742
38213a359711k907717j757375K581473O652800P056956K400741m968493q908578
38205a209904m671257M264227Q057538K030625o650265p629136n25871N320765
38197a013278L530845k082711m114940r16792L334168N026676M428798L654506
38189A1847272L607559K980840j93636n292570p909527m402057K164958M248577
38181G051416l14565m584014k009510L804282L971886k890907q830537p678283
38173a1480232k047125K628203N408030P415227O519291J66859q025487j0142623
$$ plain form
38229 -17100305 -23995572 -17180435 -4872992 298855 -4854175 -13553277 -18945224 -19956155
38221 -19956155 -18854630 -17404284 -15950550 -13805022 -9981193 -4913285 -1238969 -1359711
38213 -1359711 -4267428 -6024803 -3443330 3209470 10266426 12667167 7698674 -1209904
38205 -1209904 -5881161 -1616934 6440604 8471229 1820964 -5808172 -6334043 -1013278
38197 -1013278 2517567 434856 -3680084 -4596876 -1262708 3763968 8192766 11847272
38189 11847272 15454831 18435671 18242035 12949465 5039938 637881 2802839 7051416
38181 7051416 6736851 2152837 143327 3947609 7919495 5028588 -3801949 -11480232
38173 -11480232 -13527357 -10899154 -5491124 1924103 8443394 8610253 584766 -9557857
38165i557857l534162N312912Q379291N098160J458329J680340L751875L428276
38157A6017164p3745m123391o541848o656500l484260L201547R308233Q349156
38149A5996356k42498q209379p760262j199465L053178J839742n81701l97106
38141B498865J568610L263932L459066N01791n147726p458383j069867Q566571
38133F182859R809713J554814m219959o87941L356551j515210r505611r239614
38125d264398k256340N39901l027851m818190j663448P76726R84665N621948J5597406
38116G490419J9150660P396894j0070690j4905446l347461Q624340N333516r254533
38108A0417699j7125225r328388L091743N009754j448521q99353J0757727J8156964
$$ plain form
38165 -9557857 -13092019 -7779107 600184 5698344 7156673 8837013 12588888 16017164
38157 16017164 15943419 11820028 5278180 -1378320 -4862580 -1661033 7647200 15996356
38149 15996356 15753858 7544479 -215783 -1415248 1637930 3477672 2895971 2498865
38141 2498865 4067475 7331407 10790473 11292264 6144538 -1313845 -2383712 6182859
38133 6182859 15992572 17547386 13327427 12639486 15996037 14480827 4975216 -4264398
38125 -4264398 -6520738 -5980837 -9008688 -13826878 -15490326 -14713600 -13728935 -8106987 7490419
38116 7490419 26641079 34037973 23967283 9061837 5714376 14338716 19672232 10417699
38108 10417699 -6707526 -16035914 -12944171 -7934417 -9382938 -10282291 475436 18632400
38100A8632400Q604018q547035j4983963q198442q73416m96987k952641m123104
38092a2939170m444555k216147M706091J0052401N148421m973705n572158M971264
38084e267558J1387842N579036j297279R52926M483869j306943r939934q175979
38076c584020K106591P521332M008786l7440N80361J805364J87510j575550o23529
38067A0389405J793550L243918K562901k12680k958631k873255j571679l968226
38059F405303q604823o400961M846649J2731692O185409p380565j1660493l540539
38051g418328N572136P298487L904390J05041k070941q30322L671311N902500
38043A6134274J447239n012310o416122m582644n110986n290651P52544Q176192
$$ plain form
38100 18632400 27236418 18689383 3705420 -4493022 -5366438 -5863425 -8816066 -12939170
38092 -12939170 -17383725 -19599872 -14893781 -4841380 307041 -4666664 -10238822 -5267558
38084 -5267558 6120284 11699320 10402041 11354967 15838836 14531893 4591959 -3584020
38076 -3584020 -1477429 6043903 10052689 10015249 10595610 12400974 12588484 11012934 10389405
38067 10389405 12182955 15426873 17989774 17777094 14818463 11945208 10373529 6405303
38059 6405303 -2199520 -8600481 -3753832 8977860 15163269 7782704 -3877789 -7418328
38051 -7418328 -1846192 5452295 9356685 9461726 7390785 6560463 10231774 16134274
38043 16134274 17581513 12569203 6153081 1570437 -3540549 -8831200 -8078656 97536
38035I7536O862950o63917j926777M442001O314702m24785m367237J425460P157829
38026A8917762K947474m852199m406291L868398J0555110J1541818J0069138R284076
38018E7925286R815058J0833441Q930174Q57765r383262j2821843q076393l786902
38010E4293324n015514o437199l749957j821596m918263q175232o184556j664826
38002A6326181J257259L438698L820938k946839j3717469j3996849P39979J3022013
37994G943911P162549n956277n580217O189821R214458j691796j0785335q677975
37986b180861m114159m140921k216584O069852J2091837Q726297K466114J257182
37978A7958757J732803j514966m278749j207310K455873j101593q486032r857172
$$ plain form
38035 97536 6960486 6296569 4369792 8811793 15126495 14701710 10334473 11759933 18917762
38026 18917762 21865236 17013037 12606746 16475144 27030254 38572072 48641210 57925286
38018 57925286 67740344 78573785 87503959 88361724 78978462 66156619 58080226 54293324
38010 54293324 49277810 42840611 39090654 37269058 32350795 24175563 17991007 16326181
38002 16326181 17583440 21022138 24843076 21896237 8178768 -5818081 -5078102 7943911
37994 7943911 15106460 9150183 3569966 9759787 18974245 17282449 6497114 -2180861
37986 -2180861 -6295020 -10435941 -12652525 -6582673 5509164 14235461 16701575 17958757
37978 17958757 19691560 18176594 13897845 12690535 15146408 14044815 5558783 -4298389
37970d298389l111425N682293J1605815J2144669M346244r274353j6436112q192004
37962g533262O129898Q975411j240041q449678k842144O467968P394496J709276
37954A0611924j904532k297483l495665m269210r07530K963146K66311o648910
37946e681949p618546n16264M750853J779647k437733M06307N950867M296650
37938I29832l668489o995447l83231R518855J3806576R972032M43056j0067857
37930A3555327j4578071q845139J269249M657476j10841k661420K421747N898016
37922A606344j317251j1359264q923988N531697J4258604N780870r738307j3774511
37914a7935806k241564J0936054J1173137o34370j0588924q404844J292758N947732
$$ plain form
37970 -4298389 -7409814 -1727521 9878294 22022963 26369207 17094854 658742 -7533262
37962 -7533262 -1403364 7572047 6332006 -2117672 -4959816 1508152 8902648 10611924
37954 10611924 8707392 6409909 2914244 -1354966 -2262496 700650 966961 -5681949
37946 -5681949 -13300495 -13816759 -9065906 -7286259 -9723992 -9317685 -3366818 929832
37938 929832 -2738657 -9734104 -10117335 -598480 13208096 23180128 23623184 13555327
37930 13555327 -1022744 -9867883 -8598634 -3941158 -4051999 -6713419 -4291672 1606344
37922 1606344 289093 -11070171 -19994159 -14462462 -203858 5577012 -4161295 -17935806
37914 -17935806 -20177370 -9241316 1931821 1297451 -9291473 -17696317 -16403559 -10455827
37906a0455827J264225m339914k218308N100270Q619465M747002k338556p287508
37898f909151p565778l008322L446806N957938J765643l780929k966044L850647
37890i209190Q161202M170955m071041p576366k455447N599684O870800r35837
37882E54760q037160m293154N029372M272110q887040j6399430n201540J1472293
37874b1489789J2343544j02587m391715N937776J3549454O455104l526905j492267
37866G282615O936090O665297k462393p591820m130504n48852k562746n043190
37858a455503k604877J093359j66085m761694n238762N45062N357228K169142
37850e062130n020448n346072L336660J0023201O374437k11125J629872P974895
$$ plain form
37906 -10455827 -9191602 -13531516 -15749824 -10649554 -2030089 2716913 378357 -6909151
37898 -6909151 -14474929 -17483251 -14036445 -8078507 -6312864 -10093793 -13059837 -9209190
37890 -9209190 -1047988 3122967 -948074 -8524440 -10979887 -5380203 1490597 554760
37882 554760 -7482400 -11775554 -6746182 -2474072 -11361112 -27760542 -32962082 -21489789
37874 -21489789 -9146245 -9248832 -13640547 -7702771 5846683 12301787 8774882 7282615
37866 7282615 14218705 20884002 18421609 10829789 6699285 6150433 3587687 -1455503
37858 -1455503 -4060380 -2967021 -3133106 -7894800 -13133562 -12588500 -7231272 -5062130
37850 -5062130 -10082578 -15428650 -12091990 -2068789 4305648 4094523 5724395 13699290
37842A3699290N300324o423687j1799322m087691M156854J570683m799423k983115
37834e366087M678814P972017N699514L215278j90943p838718j4081755r983403
37826a5895283J409937Q083390O425187L684879L500238J328899m228440p333329
37818c024522n456803l895527n658873n638912K85573P400760Q537791L497748
37810c952765j858560k571711J493740N666785M167339k612075o036835J37026
37802e567056R228145R446444Q22588n170296k986600O41185k75111k650679l098862
37793C89758m356601p091694n236805L011314Q340705L323662m983636n182912
37785a1786209J308238L665776j166963m997736j150533P675704J4157933J2634249
$$ plain form
37842 13699290 18999614 12575927 776605 -3311086 845768 2416451 -2382972 -5366087
37834 -5366087 -687273 7284744 12984258 16199536 16008593 8169875 -5911880 -15895283
37826 -15895283 -14485346 -6401956 23231 3708110 7208348 8537247 4308807 -3024522
37818 -3024522 -8481325 -12376852 -18035725 -23674637 -23389064 -15988304 -7450513 -3952765
37810 -3952765 -5811325 -8383036 -6889296 -1222511 2944828 332753 -5704082 -5567056
37802 -5567056 3661089 13107533 13930121 8759825 5773225 6414410 6139299 3488620 389758
37793 389758 -3966843 -11058537 -16295342 -13284028 -4943323 -1619661 -6603297 -11786209
37785 -11786209 -10477971 -6812195 -7979158 -12976894 -14127427 -6451723 7706210 20340459
37777B0340459K051396j1031546j4626510m082010Q956859Q760649l832813j1968329
37769e431845n102508Q275601J3600113Q025183M3298l113329j655170N61271
37761A5202614Q92430r35059m008029p854687j2158308j3966035q057045N609177
37753b5274942J6937682J4942956K187210p045034m604117K756270N189386K316826
37745G406237j014363l832987o472989n077151K246768P994319L938312n133447
37737E4699o758779Q52068O670554M105350p95920j547614m94228n26830J778722
37728C338022P057598O919053l095566j2237415q202788L574226P442241R93874
37720E789245l128393J688512P430626O276901R19038l900466q157292j0149423
$$ plain form
37777 20340459 22391855 11360309 -3266201 -7348211 1608648 10369297 6536484 -5431845
37769 -5431845 -10534353 -2258752 11341361 19366544 19409842 16296513 14641343 15202614
37761 15202614 16095044 15159985 11151956 3297269 -8861039 -22827074 -30884119 -25274942
37753 -25274942 -8337260 6605696 8792906 1747872 -2856245 -99975 5089411 7406237
37745 7406237 6391874 2558887 -3914102 -8991253 -6744485 1249834 5188146 54699
37737 54699 -6704080 -5852012 818542 4923892 4127972 2580358 2086130 1559300 3338022
37728 3338022 10395620 17314673 14219107 1981692 -6221096 -2646870 4795371 5789245
37720 5789245 2660852 4349364 11779990 18056891 18975929 15075463 6918171 -3231252
37712c231252n166613L696198N285293k044112m922456L954780J1948575N979263
37704A5499676n790781p570433k023964l898204j2710619j2259901K413485J6488624
37696i852117J7382122R150180N25780o305890r734507o121806M51765l31504
37688d835977p092803m945392R858081J8946955P842117j0978501j6463845r021705
37680a6691070m279690n298550j574640P565293R590230J136179m654972P77967
37672a3429253P993343N375303l214225o007560p32327M752698M869117J739726
37664A346822L3295J484644L803149K835395k523853p019298m136790M599295
37656D22659R783380N366177m282732j0480224r539839l938952J951108M585682
$$ plain form
37712 -3231252 -8397865 -4701667 583626 -1460486 -6382942 -2428162 9520413 15499676
37704 15499676 9708895 2138462 114498 -3783706 -16494325 -28754226 -26340741 -9852117
37696 -9852117 7530005 16680185 17205965 10900075 1165568 -4956238 -4504473 -4835977
37688 -4835977 -11928780 -16874172 -7016091 11930864 19772981 8794480 -7669365 -16691070
37680 -16691070 -20970760 -26269310 -27843950 -20278657 -10688427 -9552248 -14207220 -13429253
37672 -13429253 -5435910 -60607 -3274832 -9282392 -10014719 -5262021 -392904 1346822
37664 1346822 1380117 2864761 6667910 9503305 6979452 -39846 -4176636 422659
37656 422659 10206039 15572216 11289484 809260 -8730579 -12669531 -10718423 -6132741
37648f132741K642567j546126l571077j487169K495214N017682M434004J270396
37640C122750j729697j219708K066890K330238l313344q564367n970443J104149
37632a2173532K962238r68537j433619M522523P955625K960250l431976l138902
37624b745930N81912J230380J312519N815237R592800L754664q004322j1810788
37616b73528k891854Q123985J0263888M547017j677683m791723n137026l142020
37608E021056K76259K896703L605844L022955J108502j953724k688085J951959
37600A3241469P142770L900845p132138j3471235p284572L109195N165320n16803
37592D154851l660311j153453J76747k857482l920355J905505R180985R138761
$$ plain form
37648 -6132741 -3490174 -5036300 -8607377 -10094546 -7599332 -2581650 1852354 3122750
37640 3122750 1393053 173345 2240235 4570473 1257129 -7307238 -13277681 -12173532
37632 -12173532 -9211294 -10179831 -11613450 -7090927 864698 3824948 392972 -2745930
37624 -2745930 -2164018 -933638 378881 6194118 15786918 19541582 11537260 -273528
37616 -273528 -3165382 4958603 15222491 19769508 18091825 13300102 8163076 5021056
37608 5021056 5297315 8194018 11799862 14822817 15931319 13977595 11289510 13241469
37600 13241469 20384239 24285084 17152946 3681711 -3602861 -493666 4671654 4154851
37592 4154851 494540 -658913 -482166 -3339648 -7260003 -5354498 3826487 12965248
37584A2965248J107170p357448r092599l390685M140682O058906J521p930958
37576c498163r676663m983230k28067J861480M164286O280683L408330k373872
37568e045216p06153R982668J5037619M271059r777288r119305J793129L910452
37560A0346965m928305q090053o68850J592000q569826j4205700j080054J8054068
37552g549755K2610627J2837862J807974p743603j8153371j9740489l346120J6098193
37544c178682J4043776o528427j7059860n160202R712741Q861492k62930k197097
37536a769189K480037M787202M071351L761167K173485j031711m57556K985274
37528A7000060j447247j4753513j9482561m964503J2505590J2326481N86153k181364
$$ plain form
37584 12965248 14072418 6714970 -2377629 -5768314 -1627632 4431274 4432795 -3498163
37576 -3498163 -13174826 -18158056 -18386123 -16524643 -12360357 -6079674 -2671344 -5045216
37568 -5045216 -5751369 4231299 19268918 23539977 13762689 4643384 6436513 10346965
37560 10346965 5418660 -2671393 -3340243 -1748243 -10318069 -24523769 -25603823 -7549755
37552 -7549755 15060872 27898734 29706708 21963105 3809734 -15930755 -19276875 -3178682
37544 -3178682 10865094 4336667 -12723193 -17883395 -8170654 690838 427908 -1769189
37536 -1769189 710848 5498050 9569401 13330568 15504053 14472342 14014786 17000060
37528 17000060 15552813 799300 -18683261 -23647764 -11142174 1184307 1770460 -410904
37520d10904M834182M582283n691832r130762J199054R936334M098700p883152
37512A533903j1245171n040453K449498P305229R241962N894622k571943q832226
37504a264579o463282J172192N994686N456970K799480O08577j252041l625043
37496C426960o929936r878446q579302j047642O894800O314983k208038p202212
37488a9208833j295370Q280116R294811K82714r057906j0767413o255892j313100
37480c0040873J835892N332185J0207697J2891593R168316Q82167m806996m171067
37472A298914j187675o72962j459689l67032J332953Q42819l05331O87380J993648
37463B163025M63788k151370k468001j491913r23050J852726P168033P155068
$$ plain form
37520 -410904 4423278 9005561 3313729 -5817033 -4617979 5318355 9417055 1533903
37512 1533903 -9711268 -14751721 -12302223 -4996994 4244968 10139590 7567647 -1264579
37504 -1264579 -7727861 -6555669 -560983 4895987 7695467 8304044 7052003 3426960
37496 3426960 -3502976 -13381422 -21960724 -23008366 -16113566 -9798583 -12006621 -19208833
37488 -19208833 -20504203 -12224087 -2929276 -2646562 -11704468 -22471881 -28727773 -30040873
37480 -30040873 -28204981 -22872796 -12665099 226494 9394810 10276977 5469981 1298914
37472 1298914 111239 -561723 -2021412 -2388444 -1055491 -212672 -518003 169377 2163025
37463 2163025 2626813 475443 -1992558 -3484471 -4407521 -2554795 4613238 11768306
37455A1768306k990804j2984903r759273J791815N148163k526665p538347k656962
37447a9748670L689697M062261J676254o87822n451273r017656k417263J0506808
37439a7387664J2802331N01221q600921k566791O308101M046725j756931J701925
37431d952004Q319149N404089j940692l33119O600501M543866n135579p101542
37423E404669J770373Q039659L909538l857248q103874q500412m266872M926058
37415f78109J0766261M579668o213159o107696L752771O419477l363280j0963400
37407a807467n986102K927741M609406J261778l85365o11880j125192P21086M627640
37398D231645M400403j525959o510261p274550p914448q357076k286483P875954
$$ plain form
37455 11768306 8777502 -4207401 -13966674 -12174859 -7026696 -9553361 -17091708 -19748670
37447 -19748670 -16058973 -11996712 -10320458 -11008280 -16459553 -25477209 -27894472 -17387664
37439 -17387664 -4585333 -4084112 -12685033 -15251824 -8943723 -4896998 -6653929 -4952004
37431 -4952004 3367145 8771234 6830542 6497423 13097924 17641790 12506211 5404669
37423 5404669 7175042 15214701 19124239 15266991 7163117 -1337295 -5604167 -678109
37415 -678109 10088152 14667820 8454661 2346965 6099736 12519213 9155933 -1807467
37407 -1807467 -7793569 -4865828 -256422 1005356 619991 8111 -1117081 -395995 4231645
37398 4231645 8632048 7106089 595828 -6678722 -14593170 -22950246 -25236729 -17360775
37390a7360775Q785267k800513j1187019m217523Q584670J1816442O028512J295120
37382I44181K579n58495J770281P408823P263637l872411j4021990r544258K792422
37373g815231N734436j624764m661981J559435O030927K005299k981374j357958
37365c111211L455534N080818L020335m36033l740108m116791J42552M387117
37357D682213K584262k539307l308030k92454q93234m752891l056899N467049
37349b109291J0530238O379577J8508j829867k442756n379155o165044j783185
37341b780975J290516k420092p193106n676441j013618M05309R87393N453701
37333a0947313Q631781K938338n858953m728824N561014R823627J297637q194896
$$ plain form
37390 -17360775 -8575508 -11376021 -22563040 -26780563 -18195893 -6379451 -350939 944181
37382 944181 946760 388265 2158546 9567369 16831006 12958595 -1063395 -10607653 -7815231
37373 -7815231 -2080795 -3705559 -8367540 -6808105 -777178 1228121 -1753253 -3111211
37365 -3111211 344323 5425141 8445476 8009443 4269335 152544 295096 4682213
37357 4682213 7266475 4727168 1419138 1126684 233450 -4519441 -7576340 -2109291
37349 -2109291 8420947 14800524 14819032 12989165 10546409 5167254 -997790 -2780975
37341 -2780975 -1490459 -3910551 -11103657 -16780098 -17793716 -17388407 -16401014 -10947313
37333 -10947313 -2315532 622806 -5236147 -9964971 -4403957 5419670 6717307 -1477589
37325a477589o229998L328059Q710904O703397K269206j838622n871497p200214
37317a606354k729494L794386M614406j230566n976415l387851L616109P122485
37309D216706K903761n816256j0851077n870119O153586J3485925P979271m064854
37301H136943q911361k945229L756879K671910k393870l730745j335832L45690
37293d405615J376596M111217N899496K433158l563531n057857j398138J177396
37285E72722n45992l566522n265699n637306k785746N230784J2734533J0025435
37277A0762209j862859r123101l456514N729767M929246m059142p751155r00316
37269e731865O905925N426358k977722p793502m151111K065977K815529j537221
$$ plain form
37325 -1477589 -7707587 -4379528 4331376 11034773 13303979 11465357 5593860 -1606354
37317 -1606354 -4335848 -541462 4072944 2842378 -3134037 -6521888 -2905779 4216706
37309 4216706 7120467 1304211 -9546866 -15416985 -9263399 4222526 12201797 8136943
37301 8136943 -774418 -3719647 37232 2709142 315272 -3415473 -4751305 -4405615
37293 -4405615 -3029019 1082198 6981694 9414852 5851321 793464 -604674 572722
37285 572722 26730 -3539792 -8805491 -14442797 -17228543 -11997759 736774 10762209
37277 10762209 8899350 -223751 -3680265 2049502 6978748 2919606 -4831549 -5731865
37269 -5731865 1174060 6600418 3622696 -4170806 -8321917 -6255940 -3440411 -4977632
37261d977632l505277N5152L020037j48743m983191m150181J41445K11950k880383
37252a7216823n28039P706738J1674753O725300L41743j496678k549769n385104
37244g27879m817301J87509P40935o148067q434292K177174J3850732J1510706
37236H339517K43034m462594j772130k681863p577481n966061L029834Q113775
37228b733969M563109l10952j366053p12711J441934O279957P504883q85340r074018
37219D706840k360715J2297431J2176451n624937j7599867r850174K726233M081572
37211E52834P49539K864769L065089o127451j2059286j733963J2050475Q499617
37203G861623o967170j0954508J204177J1271433Q562648J487791k258270n485150
$$ plain form
37261 -4977632 -8482909 -8427757 -5407720 -5556463 -10539654 -14689835 -14548390 -14336440 -17216823
37252 -17216823 -17744862 -10038124 1636629 8361929 8703672 7206994 4657225 -727879
37244 -727879 -5545180 -5357671 -4616736 -10764803 -19199095 -17021921 -3171189 8339517
37236 8339517 8582551 4119957 2347827 -334036 -7911517 -13877578 -10847744 -2733969
37228 -2733969 1829140 1518188 152135 -560576 881358 7161315 14666198 13780858 4706840
37219 4706840 2346125 14643556 26820007 21195070 3595203 -6254971 -3528738 552834
37211 552834 1302373 4167142 7232231 1104780 -10954506 -12688469 -637994 7861623
37203 7861623 894453 -10060055 -8855878 2415555 10978203 12465994 10207724 4722574
37195D722574q081088l458737O191318Q413289M79960m667010R17392Q136707
37187A2654405O956495J100083j816512k782485m836296m644179l33006J524251
37179G822756l258501p000596k251204L996681N93453q271071p718306M528306
37171a1558482J2812824N201580r703847j4275829m473650O574043O454773j648509
37163a0617097n074782R65164Q080978P454752J653618j052241M76416O30585
37155B517393j903753k530293p14722j995923o752074o347337L240555J1917545
37147b568609Q467761k286534n764180J052308N680081o06653r644265q450603
37139a4120694K169404R212391N486080j986734l274110J186510L359709M2175
$$ plain form
37195 4722574 -3358514 -6817251 -625933 7787356 8267316 3600306 4517698 12654405
37187 12654405 19610900 20710983 18894471 16111986 11275690 6631511 6298505 7822756
37179 7822756 4564255 -2436341 -4687545 -690864 -97411 -8368482 -16086788 -11558482
37171 -11558482 1254342 6455922 -3247925 -17523754 -21997404 -15423361 -8968588 -10617097
37163 -10617097 -15691879 -14726715 -6645737 809015 2462633 1410392 1886808 2517393
37155 2517393 613640 -1916653 -2631375 -4627298 -11379372 -17726709 -14486154 -2568609
37147 -2568609 5899152 3612618 -2151562 -1099254 4580827 3974174 -5670091 -14120694
37139 -14120694 -11951290 -2738899 2747181 760447 -2513663 -1327153 2032556 2074731
37131B074731l749224l362598l82910J875260L315391M099919J475379n393463
37123d7515j0602971p368532K510477J0065944R543670L404856k068030k431367
37115C006532K147283O146402L149379n143219q538813k401210L679719p7631
37107A968442o833578l158401P836689R673427q75575q186701l451428K082080
37099i45045j567662n707184p9088P285751L780673n346792o162809N34561L443395
37090d764200K093924M263500O535427p34761j0415755m497392J3684589J7930829
37082B4096161r33654j7350854q487445J0949724J2089569m649176j3875295n495611
37074c656581M649325M385694J811457N496053P541465j470638j3640695j3961796
$$ plain form
37131 2074731 -1674493 -5037091 -5420001 -3544741 -229350 3870569 5345948 -47515
37123 -47515 -10650486 -18019018 -15508541 -5442597 4101073 7505929 5437899 3006532
37115 3006532 5153815 11300217 14449596 9306377 767564 -1633646 2046073 1968442
37107 1968442 -4865136 -8023537 -186848 9486579 8611004 424303 -3027125 -945045
37099 -945045 -2512707 -8219891 -8298979 -1013228 2767445 -2579347 -8742156 -8207595 -4764200
37090 -4764200 -2670276 1593224 8128651 7393890 -3021865 -7519257 6165332 24096161
37082 24096161 23162507 5811653 -2675792 8273932 20363501 15714325 1839030 -3656581
37074 -3656581 992744 5378438 7189895 12685948 20227413 18756775 5116080 -8845716
37066h845716k757751N289047K423024l669586m108572j219241j221553j971830
37058a6082178L105997J1550525J2405506K501346o843640n329580J564207K245557
37050E117740k221511j199519O009740Q088173J103310m598498k510353q05944
37042H983138o127602r980691l901717L484390N13757n591736J4814J2175143
37034d30504J1306145l576036j0374756J453216J3255710O181308r754013j1985168
37026c924098J094160J1130920Q335296J218154j479719k758330p228730j0779638
37018d391985p136887J740883Q018963P692161L239378j924486p056400j1015107
37010a0833480r423309L30483J1667059J2829069J971806p767853m899318M209794
$$ plain form
37066 -8845716 -11603467 -6314420 -3891396 -7560982 -11669554 -12888795 -14110348 -16082178
37058 -16082178 -12976181 -1425656 10979850 13481196 6637556 1307976 2872183 5117740
37050 5117740 2896229 1696710 7706450 15794623 16897933 12299435 9789082 8983138
37042 8983138 2855536 -7125155 -11026872 -7542482 -7028725 -12620461 -12605647 -430504
37034 -430504 10875641 7299605 -3075151 -1621935 11633775 17815083 8061070 -3924098
37026 -3924098 -2829938 8300982 16636278 17854432 16374713 13616383 6387653 -4391985
37018 -4391985 -11528872 -9787989 -1769026 5923135 9162513 7238027 181627 -10833480
37010 -10833480 -20256789 -19926306 -8259247 4569822 6541628 -1226225 -6125543 -1915749
37002a915749N534417n59870j231715N733751P177299k664524j0773563n657597
36994d357551M816635P306654L012601Q92220Q58805j898511l939363k27963K702031
36985I165558l634699j1889188q014514M739826R192411J316024m401001Q17998
36977b707585Q098322Q213736M699115K945667N66074l681051m166950L33200
36969A4300528J340971n100925j0117558o818193k530709n737720j0317446n015663
36961b9996715P798094J4811838R815420n88936o944247n162533K524079Q752857
36953A009857O428209k133808o023281l85507N899411L074822n444297r058925
36945f633519m421542L282621Q330244P191299r04572r566256q255449K953957
$$ plain form
37002 -1915749 3618668 3058798 1827083 7560834 14738133 12073609 1300046 -4357551
36994 -4357551 459084 7765738 10778339 11670559 12529364 10630853 6691490 6463527 9165558
36985 9165558 5530859 -6358329 -14372843 -9633017 -440606 875418 -3525583 -2707585
36977 -2707585 5390737 13604473 18303588 21249255 21815329 18134278 13967328 14300528
36969 14300528 15641499 10540574 423016 -6395177 -8925886 -14663606 -24981052 -29996715
36961 -29996715 -22198621 -7386783 2428637 1839701 -5104546 -10267079 -7743000 1009857
36953 1009857 7438066 5304258 -719023 -1104530 4794881 7869703 2425406 -6633519
36945 -6633519 -11055061 -7772440 557804 7749103 6844531 -2721725 -10977174 -8023217
36937h023217R471203K014479q020988m610259Q692663J4348027O027082n784620
36929A4114370j0774092q041305j44284Q887751J0628180M75208j1635017j1811179
36921h300368l006053q36979q103622r934651J495378J3619685J2871171L992863
36913A797424r6465K313253L038667j853627q497995j1878308r554166k372677
36905b7103894M318791M748603R17331N99263M776331N526602J63510k635312
36897h688775K762309Q428281N741363l7683Q39293N453041L284958n281328q744028
36888C757431k519240M598633M186908j174046m389267l564469j425924k94564
36880h24538r77522l002075l750023n90552M628267O513609L063245j347404j559781
$$ plain form
36937 -8023217 1447986 3462465 -4558523 -9168782 -476119 13871908 19898990 14114370
36929 14114370 3340278 -4701027 -4845311 4042440 14670620 15145828 3510811 -8300368
36921 -8300368 -11306421 -12143400 -20247022 -30181673 -28686295 -15066610 -2195439 1797424
36913 1797424 1700959 4014212 7052879 5199252 -3298743 -15177051 -24731217 -27103894
36905 -27103894 -22785103 -18036500 -17119169 -16519906 -11743575 -6216973 -6053463 -8688775
36897 -8688775 -5926466 2501815 8243178 8205495 9044788 14497829 17782787 12501459 3757431
36888 3757431 1238191 5836824 10023732 8849686 4460419 895950 -529974 -824538
36880 -824538 -1802060 -4804135 -8554158 -9144710 -4516443 1997166 5060411 3713007 2153226
36871B153226K181356N156361L555709k123074p668456q472473l506490L336657
36863e387184O430091L272297l330882o926239k309316Q117065J3349486M577098
36855A7792416j1400043j6510296m085458R857609O767247q364734j3609138j402282
36847b0954679J1582240J0140382J653991J344138P657267P168346j572160n672487
36839A1347038J17314M426240k293211j2523496j3082061l329674O577313R670269
36831I09732O339387m92490o200462m614741M326367J0546610N714412m398256
36823A2130559q196997m750541j477434L96677M640038O998676m53744j1720478
36815b433244j1307720N38606N821156j676174n147517N846811J5176340O377870
$$ plain form
36871 2153226 4334582 9490943 13046652 10923578 3255122 -5217351 -8723841 -5387184
36863 -5387184 1042907 4315204 984322 -5941917 -8251233 -134168 13215318 17792416
36855 17792416 6392373 -10117923 -14203381 -4345772 2421475 -5943259 -19552397 -20954679
36847 -20954679 -9372439 767943 2421934 3766072 11423339 18591685 17019525 11347038
36839 11347038 11464352 15890592 13597381 1073885 -12008176 -15337850 -8760537 909732
36831 909732 7249119 6756629 556167 -4058574 267793 10814403 16528815 12130559
36823 12130559 3933562 -816979 -2294413 -1897736 2742302 9740978 9287234 -2433244
36815 -2433244 -13740964 -13202358 -7381202 -9057376 -14204893 -8358082 6818258 13196128
36807A3196128q590490q594102K136013L473846n528643p776136k71956K384626
36799i570714k598132o63930J0628797J2772963k581307j6846142j2675822O68024
36791b0866263N836180M482830P921870J3619903J0344096p89383p864551o573075
36783F111607k839620o63358K93262j287623n378409n740817R17925N908134P46197
36774a932702o735001k690071R631430J2895288J869405q897020p044041J371889
36766a530823L408208l281212j0835195j1847472m545184O945261J3846886R820433
36758A980902l20824m888075q35728K120599l147909r396677n678248N544801
36750a4621159J1015923N026505l452090m052799J379794L373080q18390m088967
$$ plain form
36807 13196128 4605638 -3988464 -1852451 1621395 -3907248 -11683384 -11955340 -9570714
36799 -9570714 -12168846 -12832776 -2203979 10568984 7987677 -8858465 -21534287 -20866263
36791 -20866263 -15030083 -10547253 -2625383 10994520 21338616 20549233 12684682 6111607
36783 6111607 3271987 2608629 2901891 1614268 -3764141 -9504958 -8587033 -2678899 -1932702
36774 -1932702 -8667703 -11357774 -1726344 11168944 13038349 4141329 -2902712 -1530823
36766 -1530823 1877385 -1403827 -12239022 -24086494 -28631678 -21686417 -7839531 1980902
36758 1980902 1660078 -3227997 -4063725 -1943126 -5091035 -14487712 -20165960 -14621159
36750 -14621159 -3605236 1421269 -2030821 -6083620 -4703826 -1330746 -2149136 -6238103
36742f238103q64016M677438N341506J441474j069774o67798j510168m460875
36734c350316m142736K093064Q097554O290031k493167j0443458j1526459n833729
36726b1309216K170192P061804O513522L834832L805625N331914K903948l486732
36718F825889o348483j745797M216068M640265J445432J0506k5941j685028l263955
36709D068956j874148n37891l263619n846990j136290P325710P104058n129752
36701G10034j6039556j1581635M492817J4429934P660619p102122j3047585n248256
36693b5725750N471934Q659780P224354Q969876J1143241M036639j1127017j9739741
36685a1086684j2704682J927055J0874763J0523670N012014j483910m263610J204595
$$ plain form
36742 -6238103 -7102119 -2424681 2916825 4358299 3288525 2620727 1110559 -3350316
36734 -3350316 -7493052 -5399988 2697566 8987597 6494430 -3949028 -15475487 -21309216
36726 -21309216 -19139024 -12077220 -5563698 -1728866 2076759 7408673 10312621 6825889
36718 6825889 477406 -1268391 2947677 7587942 9033374 9043880 9017939 7332911 4068956
36709 4068956 2194808 1656917 -1606702 -7453692 -8589982 -1264272 5839786 710034
36701 710034 -15329522 -26911157 -22418340 -7988406 -327787 -7429909 -20477494 -25725750
36693 -25725750 -20253816 -11594036 -4369682 4600194 15743435 19780074 8653057 -11086684
36685 -11086684 -23791366 -21864311 -10989548 -465878 4546136 3062226 -1201384 3211
36677C211J0466428J0371577k994791j4709090r879598M763609J0370574K268838
36669A0660758o583542o602616k618559j966661k855793J14555N558836O422529
36661B129507N1027o556535m114468N961819J0713964L023386n606992m75069
36653E126639J2074674J2134448k062392j0140896k553853M666548r67247p194562
36645A1083359j552564M463209k283009r377408o00857J1217075L839438j3700525
36637C088718j3955766K245194P845640l238473p834939L293786J0204439J572195
36629C220794o044637o34758M452657j279049m909012L273997Q771084j90435
36621F660641q487688m35013J0767889N723189o713516n361372O356905Q000188
$$ plain form
36677 3211 10469639 20841216 17846425 3137335 -6742263 -1978654 8391920 10660758
36669 10660758 4077216 -2525400 -5143959 -7110620 -9966413 -9851858 -4293022 2129507
36661 2129507 2180534 -4376001 -8490469 -2528650 8185314 11208700 5601708 5126639
36653 5126639 17201313 29335761 27273369 17132473 14578620 19245168 18277921 11083359
36645 11083359 9530795 13994004 11710995 2333587 1732730 12949805 16789243 3088718
36637 3088718 -10867048 -8621854 -776214 -4014687 -11849626 -8555840 1648599 3220794
36629 3220794 -2823843 -3458601 994056 -284993 -5194005 -1920008 6851076 6660641
36621 6660641 -1827047 -2262060 8505829 14229018 7515502 2154130 8511035 16511223
36613A6511223k065596o438422j90980L294192k403834q189749p636917m613455
36605a1733538j245494M686272R154662M799245m154239n094858L108868P881326
36597G402244K762367m330445n647741l615543k439592j009867J358290J362724
36589d157563j958483m562304l694428n76572L837802Q754799R448735J865038
36581H957024q028675q654644J188349R278556O285923k458917o064376k785941
36573b282701K95121j078685l323985j992393R79314O02302k208859o51058O676818
36564b984126J0658521M252699m949443m596524L311482N810820N03746j404080
36556A0603095L921941N269303l790610j2865657j1808892n831320k988489k1740
$$ plain form
36613 16511223 14445627 8007205 7816225 11110417 8706583 516834 -7120083 -11733538
36605 -11733538 -12979032 -8292760 861902 5661147 1506908 -3587950 -479082 7402244
36597 7402244 10164611 5834166 186425 -3429118 -5868710 -6878577 -5520287 -4157563
36589 -4157563 -6116046 -10678350 -14372778 -14949350 -11111548 -2356749 7091986 8957024
36581 8957024 928349 -7726295 -6537946 2740610 9026533 6567616 503240 -2282701
36573 -2282701 -1987580 -3066265 -6390250 -8382643 -7403329 -6801027 -9009886 -9660944 -2984126
36564 -2984126 7674395 11927094 6977651 2381127 5692609 11503429 12007175 10603095
36556 10603095 14525036 19794339 16003729 3138072 -8670820 -14502140 -17490629 -17512369
36548a7512369O998153J0486596L949428l944217k431785L738335M212204J074328
36540F570673J830008L579785L17078k743746R76293M026947k303215q550850
36532C702973j168042J1355763R688594l794620q464282P6933M451207l315442
36524A2533084r942651o184291j315141l757784o806859l424894J225638J612183
36516a6060715K040015O145184Q417486M102452k754456o789385p147524l005418
36508a5052361N616972J1201708N877417l941932m882246R99585r79825j0995112
36500a2155794j1160315M780926J8701358J4652496L06343q477070q255403k995913
36492d603372N727107J2853234R053091l701363j0177521m992464j870398r548023
$$ plain form
36548 -17512369 -10514216 -27620 3921808 -22409 -2454194 1284141 5496345 6570673
36540 6570673 8400681 11980466 12297544 9553798 10530091 14557038 12253823 3702973
36532 3702973 2534931 13890694 23579288 19784668 11320386 11397319 15848526 12533084
36524 12533084 2590433 -3593858 -4908999 -8666783 -15473642 -18898536 -17672898 -16060715
36516 -16060715 -14020700 -7875516 541970 4644422 1889966 -4899419 -12046943 -15052361
36508 -15052361 -9435389 1766319 7643736 3701804 -1180442 -180857 -1160682 -12155794
36500 -12155794 -23316109 -18535183 166175 14818671 15125014 6647944 -1607459 -4603372
36492 -4603372 1123735 13976969 23030060 19328697 9151176 4158712 2288314 -7259709
36484g259709j5670962p693764O389697J2572162J1268506Q820311L215658o507199
36476E134700j0677716m494221M93663m158943p606007K42794Q363491M108291
36468h593948k323668M066688J4014630Q777033o210754r614144M69952O305884
36460F891673J523383l849446o631599j2467123j5796945m800245J2576805J4561613
36452g991884P99201n427417M259925J0352887N21188r376396l645296P494654
36444c013138P848953J499350M12686J503617m223371j1084583o943824M781848
36436i218462Q945896J165965p884116q956379l556917K170541M126629J822558
36428a1384285p90763J503597P047622P312105l67513o551701k386946P569145
$$ plain form
36484 -7259709 -22930671 -30624435 -24234738 -11662576 -394070 8426241 11641899 5134700
36476 5134700 -5543016 -10037237 -9543574 -13702517 -21308524 -21065730 -12702239 -8593948
36468 -8593948 -10917616 -6850928 7163702 15940735 9729981 115837 585789 6891673
36460 6891673 8415056 4565610 -2065989 -14533112 -30330057 -35130302 -22553497 -7991884
36452 -7991884 -7192683 -12620100 -8360175 1992712 2513900 -6862496 -10507792 -3013138
36444 -3013138 4835815 6335165 6747851 8251468 4028097 -7056486 -14000310 -9218462
36436 -9218462 -272566 893399 -6990717 -15947096 -19504013 -17333472 -13206843 -11384285
36428 -11384285 -12175048 -10671451 -3623829 3688276 3320763 -3230938 -5617884 1951261
36420A951261J2152969Q065400Q36199m034315m637672j666869P43402k120136
36412A1290239p305950n189673N860485J3349714O854667o476141j1918692p306569
36404h41920k784250l721130m757839q27688M878321N898558J6356r065426j4089034
36395b5294052r554447J682754R391468P466617J335346o30350J099812O08252
36387a3894600j843021k90304N595347Q284854L439454l555437n171103j041992
36379h476802L589798N290735M618585K641420q03553m673292n481357j303432
36371d597898M050409M781036J454240L92108K575644N32981p753386j0274498
36363h839364K029758J6042202J1023656r057806j7490293l560018J1226245O362759
$$ plain form
36420 1951261 14104230 22169630 23005829 18971514 14333842 12666973 13410375 11290239
36412 11290239 3984289 -1205384 4655101 18004815 24859482 18383341 6464649 -841920
36404 -841920 -3626170 -7347300 -12105139 -12932827 -8054506 -2155948 -2139592 -11205018 -25294052
36395 -25294052 -34848499 -33165745 -23774277 -16307660 -14972314 -15602664 -14502852 -13894600
36387 -13894600 -15737621 -16027925 -10432578 -2147724 1291730 -2263707 -7434810 -8476802
36379 -8476802 -4887004 403731 5022316 7663736 6860183 2186891 -3294466 -4597898
36371 -4597898 -547489 4233547 5687787 6079895 8655539 9188520 1435134 -8839364
36363 -8839364 -6809606 9232596 20256252 11198446 -6291847 -9851865 1374380 7737139
36355G737139p542715q815538P40078L292387k767827k555710O298163Q596126
36347D982103j250523q518381k247287P697863P702000O12408k464899m29674
36339F083610n93970m879531p685640m816970J938202P004174M738970m977196
36331c188351j3095954r603901K542455R488811N357051k51183J775786O786474
36323a88812O360069K160672M43310N46873p24049J14684O430474J0628860L115273
36314B8887354j0395660j3705697k615171R251504R086570r40741j0802599j4390398
36306e624838j0557577q16963R279898J2650266Q594969L414068J030679r77728
36298A6992774l882748l810044N87961L243171q71943p440092q787431m435781
$$ plain form
36355 7737139 194424 -8621114 -7881036 -4588649 -7356476 -9912186 -3614023 4982103
36347 4982103 3731580 -4786801 -7034088 663775 8365775 8978183 6513284 6083610
36339 6083610 5489640 610109 -7075531 -11892501 -9954299 -2950125 1788845 -3188351
36331 -3188351 -16284305 -25888206 -23345751 -13856940 -8499889 -8751072 -6975286 -188812
36323 -188812 6171257 8331929 8775239 9322112 8598063 8712747 15143221 25772081 28887354
36314 28887354 18491694 4785997 2170826 11422330 20508900 19568159 8765560 -5624838
36306 -5624838 -16182415 -16999378 -7719480 4930786 13525755 16939823 17970502 16992774
36298 16992774 13110026 9299982 9887943 13131114 12259171 4819079 -3968352 -8404133
36290h404133j6996J614519K602634M666752O090668M347376m10848m308741k556352
36281C624879M041229O534935k310049j5357381j6674537k908221J0211251R070192
36273c767702O80993M7640O664697P400773o32432n536830o46910N012378J829558
36264A1052165o055880q862519n145436J04845M658972Q150097P060293o94214
36256A0268323r031729r508571k372399M723586P088694N353856k3606p993331
36248a495177j1881583n370552N253257N789328m893126r946838J373311J5207699
$$ plain form
36290 -8404133 -8421129 -6806610 -4203976 462776 6553444 10900820 10489972 6181231 3624879
36281 3624879 7666108 14201043 11890994 -3466387 -20140924 -23049145 -12837894 -3767702
36273 -3767702 -3086709 -3039069 3625628 11026401 10393969 4857139 4210229 9222607 11052165
36264 11052165 4996285 -3866234 -9011670 -8906825 -4247853 3902244 10962537 10268323
36256 10268323 1236594 -8271977 -10644376 -5920790 1167904 6521760 6498154 -1495177
36248 -1495177 -13376760 -18747312 -13494055 -7704727 -12597853 -22544691 -21171380 -5963681
$$ [...]
##END NTUPLES=NMR SPECTRUM
##END=
