##TITLE=31Pdec_SR124T6
 CDCl3, 24 sc
 2.6.2022
##JCAMPDX= 6.0         $$ Bruker NMR JCAMP-DX V2.0
##DATA TYPE= NMR SPECTRUM
##DATA CLASS= NTUPLES
##ORIGIN= UXNMR, Bruker Analytische Messtechnik GmbH
##OWNER= root
$$ XWIN-NMR		Version 3.5
$$ Thu Jun  2 15:25:20 2022 Russian Standard Time (UT+4h)  she@DPX200
##.OBSERVE FREQUENCY= 81.013821
##.OBSERVE NUCLEUS= ^31P
##.ACQUISITION MODE= SIMULTANEOUS
##.ACQUISITION SCHEME= undefined
##.AVERAGES= 24
##.DIGITISER RES= 16
##SPECTROMETER/DATA SYSTEM= spect
##.PULSE SEQUENCE= zgpg30
##.SOLVENT NAME= DMSO
##.SHIFT REFERENCE= (INTERNAL, DMSO, 0, 248.564)
##AUDIT TRAIL= $$ (NUMBER, WHEN, WHO, WHERE, WHAT)
$$ ##TITLE= Audit trail, XWIN-NMR		Version 3.5
$$ ##JCAMPDX= 5.01
$$ ##ORIGIN= Bruker BioSpin GmbH
$$ ##OWNER= she
$$ F:/spectra/data/she/nmr/P31/1/pdata/1/auditp.txt
$$ ##AUDIT TRAIL=  $$ (NUMBER, WHEN, WHO, WHERE, WHAT)
(   1,<2022-06-02 15:24:28.29 +0400>,<she>,<DPX200>,
      <created by zg, POWCHK disabled, PULCHK disabled
       configuration hash MD5:
       00 E9 B6 7A A2 85 ED C7 34 08 36 98 17 FE 4E 26
       data hash MD5: 32K
       47 F3 A3 BF 39 35 EC BF 5E 55 8D 61 CB F9 2A 11>)
(   2,<2022-06-02 15:24:35.12 +0400>,<she>,<DPX200>,
      <Start of raw data processing
       efp BC_mod = 2 LB = 1 FT_mod = 6 PKNL = 1 PHC0 = -10159.03 PHC1 = -172.7461 SI = 64K 
       data hash MD5: 64K
       25 DA EB 81 CD 4C 40 A7 3E A0 3C 88 DF 45 88 39>)
$$ ##END=
$$ 
$$ hash MD5
$$ BD DA AB C0 AE 51 C3 1B CF 7E 7F A3 A4 B8 51 6E
##$RELAX= 
##$RELAX= 
##$RELAX= 
##$RELAX= 
##$RELAX= 
##$RELAX= 
##$RELAX= 
##$RELAX= 
$$ Bruker specific parameters
$$ --------------------------
##$DU= <F:/spectra>
##$EXPNO= 1
##$NAME= <P31>
##$PROCNO= 1
##$TYPE= <nmr>
##$USER= <she>
##$AMP= (0..31)
100 100 100 100 100 100 100 100 100 100 100 100 100 100 100 100 100 100 
100 100 100 100 100 100 100 100 100 100 100 100 100 100 
##$AQSEQ= 0
##$AQ_mod= 1
##$AUNM= <au_zg>
##$AUTOPOS= <>
##$BF1= 81.014009
##$BF2= 200.13
##$BF3= 200.13
##$BF4= 200.13
##$BF5= 200.13
##$BF6= 200.13
##$BF7= 200.13
##$BF8= 200.13
##$BYTORDA= 1
##$CFDGTYP= 0
##$CFRGTYP= 5
##$CHEMSTR= <none>
##$CNST= (0..31)
1 1 145 1 1 1 1 1 1 1 1 1 1 1 1 1 1 1 1 1 1 1 1 1 1 1 1 1 1 1 1 1 
##$CPDPRG= <waltz16>
##$CPDPRG1= <>
##$CPDPRG2= <waltz16>
##$CPDPRG3= <>
##$CPDPRG4= <mlev>
##$CPDPRG5= <mlev>
##$CPDPRG6= <mlev>
##$CPDPRG7= <mlev>
##$CPDPRG8= <mlev>
##$CPDPRGB= <>
##$CPDPRGT= <>
##$D= (0..31)
0 1 0 0 0 0 0 0 0 0 0 0.03 2e-05 3e-06 0 0 0 0 0 0 0 0 0 0 0 0 0 0 0 0 
0 0 
##$DATE= 1654169067
##$DBL= (0..7)
120 120 120 11 120 120 24 19 
##$DBP= (0..7)
150 150 150 150 150 150 150 150 
##$DBP07= 0
##$DBPNAM0= <>
##$DBPNAM1= <>
##$DBPNAM2= <>
##$DBPNAM3= <>
##$DBPNAM4= <>
##$DBPNAM5= <>
##$DBPNAM6= <>
##$DBPNAM7= <>
##$DBPOAL= (0..7)
0.5 0.5 0.5 0.5 0.5 0.5 0.5 0.5 
##$DBPOFFS= (0..7)
0 0 0 0 0 0 0 0 
##$DE= 6
##$DECBNUC= <off>
##$DECIM= 3
##$DECNUC= <off>
##$DECSTAT= 4
##$DIGMOD= 1
##$DIGTYP= 9
##$DL= (0..7)
0 0 52 120 120 21 21 25 
##$DP= (0..7)
$$ [...]
##$SUBNAM2= <"">
##$SUBNAM3= <"">
##$SUBNAM4= <"">
##$SUBNAM5= <"">
##$SUBNAM6= <"">
##$SUBNAM7= <"">
##$SUBNAM8= <"">
##$SUBNAM9= <"">
##$SW= 501.771253377433
##$SWIBOX= (0..15)
0 1 3 0 0 0 0 0 0 0 0 0 0 0 0 0 
##$SW_h= 40650.406504065
##$TD= 32768
##$TD0= 1
##$TE= 0
##$TE2= 300
##$TE3= 300
##$TEG= 300
##$TL= (0..7)
0 120 53 12 22 120 120 120 
##$TP= (0..7)
150 150 150 150 150 150 150 150 
##$TP07= 0
##$TPNAME0= <>
##$TPNAME1= <>
##$TPNAME2= <>
##$TPNAME3= <>
##$TPNAME4= <>
##$TPNAME5= <>
##$TPNAME6= <>
##$TPNAME7= <>
##$TPOAL= (0..7)
0.5 0.5 0.5 0.5 0.5 0.5 0.5 0.5 
##$TPOFFS= (0..7)
0 0 0 0 0 0 0 0 
##$TUNHIN= 0
##$TUNHOUT= 0
##$TUNXOUT= 0
##$USERA1= <user>
##$USERA2= <user>
##$USERA3= <user>
##$USERA4= <user>
##$USERA5= <user>
##$V9= 5
##$VALIST= <valist>
##$VCLIST= <CCCCCCCCCCCCCCC>
##$VD= 0
##$VDLIST= <DDDDDDDDDDDDDDD>
##$VPLIST= <PPPPPPPPPPPPPPP>
##$VTLIST= <TTTTTTTTTTTTTTT>
##$WBST= 1024
##$WBSW= 4
##$XGAIN= (0..3)
0 0 0 0 
##$XL= 0
##$YL= 0
##$YMAX_a= 3336
##$YMIN_a= -3540
##$ZGOPTNS= <>
##$ZL1= 120
##$ZL2= 120
##$ZL3= 120
##$ZL4= 120
##$ABSF1= 0
##$ABSF2= 0
##$ABSG= 0
##$ABSL= 0
##$ALPHA= 0
##$AQORDER= 0
##$ASSFAC= 0
##$ASSFACI= 0
##$ASSFACX= 0
##$ASSWID= 0
##$AUNMP= <proc_1d>
##$AZFE= 0.1
##$AZFW= 0.5
##$BCFW= 0
##$BC_mod= 2
##$BYTORDP= 0
##$COROFFS= 0
##$CY= -3
##$DATMOD= 1
##$DC= 0
##$DFILT= <>
##$DTYPP= 0
##$F1P= 0
##$F2P= 0
##$FCOR= 1
##$FTSIZE= 65536
##$FT_mod= 6
##$GAMMA= 0
##$GB= 0
##$INTBC= 1
##$INTSCL= 5.30512e-09
##$ISEN= 30
##$LB= 1
##$LEV0= 0
##$LPBIN= 0
##$MAXI= 10000
##$MC2= 0
##$MEAN= 0
##$ME_mod= 0
##$MI= 50
##$NCOEF= 0
##$NC_proc= -9
##$NLEV= 6
##$NOISF1= 182.463
##$NOISF2= 159.3651
##$NSP= 0
##$NTH_PI= 0
##$NZP= 0
##$OFFSET= 248.5645
##$PC= 4
##$PHC0= -10159.03
##$PHC1= -172.7461
##$PH_mod= 1
##$PKNL= yes
##$PPARMOD= 0
##$PSCAL= 0
##$PSIGN= 0
##$REVERSE= no
##$SF= 81.014009
##$SI= 65536
##$SIGF1= 159.3651
##$SIGF2= -187.1042
##$SINO= 113.3802
##$SIOLD= 16384
##$SREGLST= <1H.CDCl3>
##$SSB= 0
##$STSI= 65536
##$STSR= 0
##$SW_p= 40650.406504065
##$SYMM= 0
##$S_DEV= 0
##$TDeff= 32768
##$TDoff= 0
##$TI= <>
##$TILT= no
##$TM1= 0
##$TM2= 0
##$TOPLEV= 0
##$USERP1= <user>
##$USERP2= <user>
##$USERP3= <user>
##$USERP4= <user>
##$USERP5= <user>
##$WDW= 1
##$XDIM= 65536
##$YMAX_p= 351759291
##$YMIN_p= -470900727
$$ End of Bruker specific parameters
$$ ---------------------------------
##NTUPLES= NMR SPECTRUM
##VAR_NAME=  FREQUENCY,     SPECTRUM/REAL,   SPECTRUM/IMAG
##SYMBOL=    X,             R,               I
##VAR_TYPE=  INDEPENDENT,   DEPENDENT,       DEPENDENT
##VAR_FORM=  AFFN,          ASDF,            ASDF
##VAR_DIM=   65536,         65536,           65536
##UNITS=     HZ,            ARBITRARY UNITS, ARBITRARY UNITS
##FACTOR=    0.620285442955139, 1,           1
##FIRST=     20137.2065510759, 0,            0
##LAST=      -20513.1999529892, 0,           0
##MIN=       -20513.1999529892, -470900727,  0
##MAX=       20137.2065510759, 351759291,    0
$$ Real data points
##PAGE= N=1
##DATA TABLE= (X++(R..R)), XYDATA
$$ [...]
12947a792413l432566q593234j316866O950610N278113m11743k8762L768808L084527
12938C506474l47578n02683J72087l615758p389220l101170O161269J0192493
12930E075914P077224K881203m30519m784705p245052l767184J470007K317825
12922B594713J928609N197641N905118l025900j2123926o982516O444362Q998746
12914H936847p91893n636494k28883J534710n155623o049488M327369R374590
12906F311135j151936j1329090m723380Q763582J0518406K193485k669800l075595
12898D836807n882913o751603K537165J3891999J1113607m190404j3683122q800249
12890f928713N01675M071986L291151K268611O06722j460758q08524K483591M117790
$$ y = [-1792413, -5224979, -13818213, -15135079, -8184469, -2906356, -3318099, -3346861, 421947, 3506474, 3158896, 2656213, 2828300, -787458, -8176678, -11277848, -5116579, 5075914, 12153138, 15034341, 14603822, 9819117, 2574065, -1193119, 276888, 2594713, 4523322, 9720963, 15626081, 12600181, 476255, -6506261, -61899, 8936847, 8144954, 2508460, 2279577, 3814287, -1341336, -7390824, -3063455, 6311135, 5159199, -6169891, -10893271, -2129689, 8388717, 10582202, 7912402, 4836807, -1046106, -7797709, -5260544, 8631455, 19745062, 15554658, 1871536, -6928713, -6427038, -2355052, 936099, 3204710, 3811432, 2350674, 1542150, 4025741, 8143531]
12881H143531K165041j256385m413430o332777m696307M12331L271122m01514
12873c108388o086709o725715k662531J449411M960806Q509381Q080616J276288
12865E693159m814491k278593M607207N584691M70334k298424o75792k34490j398935
12856D654666J469526O857932M775129p111028j6725069j3104929j012361O423856
12848a3772278M630328O37019J168027L683040J679992l812187l755442M960744
12840d580757J1166243L795669r076730r056973M425732J1495779K725761n752809
12832E141915M86245R586484L819673r683650j0714658O22623O127544P93443
12824F179619k169302K366824L311294m346817r720249n161293K059160M144120
$$ y = [8143531, 10308572, 9052187, 4638757, -1694020, -6390327, -5977996, -2706874, -3108388, -9195097, -15920812, -18583343, -17133932, -12173126, -3663745, 4416871, 5693159, 878668, -1399925, 3207282, 8791973, 9262307, 6963883, 6288091, 6053601, 4654666, 6124192, 12982124, 17757253, 10646225, -6078844, -19183773, -20196134, -13772278, -9141950, -8504931, -7336904, -3653864, -1973872, -5786059, -9541501, -4580757, 6585486, 10381155, 1304425, -7752548, -3326816, 8168963, 10894724, 5141915, 5628160, 15214644, 19034317, 9350667, -1363991, -741368, 5386176, 6179619, 4010317, 6377141, 9688435, 5341618, -4378631, -9539924, -7480764, -3336644]
12816c336644L712000L845865J370982l476133l986326K64072N97933m929031
12808e937282o318314J110218P645049N102962o94901j491014J103694K902201
12800C422613N170387P261572L039796o600049r623548j071036O447589J603956
12792I651280p550735p015593J487723O079439M081062J772463Q25704j378969
12784G952374k468033J067039M562905J795850k936866j534616K763670J14325
12776A1316648q223089j0430102k476892O397325Q006207M264879l0298l884011
12768D940667o970982p525791n585744k629387K012057Q471352J1902973Q354155
12760A2969300L007673L365092O045259J656848p609541q747494P70502O459601
$$ y = [-3336644, 375356, 4221221, 5592203, 2116070, -1870256, -1606184, -1008251, -5937282, -12255596, -11145378, -3500329, 1602633, 907732, -583282, 520412, 3422613, 8593000, 15854572, 18894368, 12294319, 2670771, 1599735, 8047324, 9651280, 2100545, -4915048, -3427325, 2652114, 6733176, 8505639, 9331343, 7952374, 5484341, 6551380, 11114285, 12910135, 9973269, 8438653, 11202323, 11316648, 3093559, -7336543, -9813435, -3416110, 4590097, 8854976, 8824678, 4940667, -2030315, -9556106, -15141850, -17771237, -15759180, -7287828, 4615145, 12969300, 15976973, 19342065, 25387324, 27044172, 19434631, 10687137, 11457639, 17917240]
12752A7917240j345212j1595494r195084J890483N686076q48635m900361K54186
12744b136801N043296O89894n606310k483681O333561P250324j440774o694099
12736I55410j951486K251334l458478j0115061m286526Q416768R960747j943127
12728a70419r434652j750710R093818P908493j579045n364715m81218M553921
12720B775473M773337K656300L40197j984785k158229R22970K831715J187k732588
12711G425577O10362O001919N130579q02881l625956k383217l478982p371260
12703A506141p175728j720048J643381k04632j530286P95995J888355p59129j752856
12694g308807J770437L757732n9435l677617o84246M687985M629024L013k865640
$$ y = [17917240, 16572028, 4976534, -4218550, -2328067, 3358009, 2509374, -2390987, -2136801, 2906495, 3596389, -2009921, -4493602, 1839959, 9090283, 7649509, 955410, -996076, 1255258, -2203220, -12318281, -16604807, -8188039, 1772708, -170419, -9605071, -11355781, -2261963, 5646530, 4067485, -1297230, -1778448, 2775473, 7548810, 10205110, 10545307, 8560522, 6402293, 7325263, 10156978, 10158165, 7425577, 8035939, 14037858, 19168437, 18365556, 14739600, 12356383, 8877401, 1506141, -5669587, -7389635, -5746254, -5950886, -7481172, -6685177, -4796822, -5555951, -7308807, -5538370, -1780638, -1840073, -5517690, -6201936, -1513951, 3115073, 3118086, 252446]
12685B52446k972883l779109n120327m219039k252571k113356j621842L272866
12677a8553815R901899J1353024P106351L500202L149891J598514l694677q196637
12669F164752p395426l367435m80238R83931K846179M138160K777634M02679J228415
12660G298651N954226R645244O743106k596698j1606184j2809802n742375J709872
12652a403960J503202n084450q615876k947394O983310J0742940M344420n400320
12644A21872q184119q76809Q983014J0529976J294798r284884j0406521l137687
12636a0960360J261634k844346p155446j470986J0401463J4242406M304970q745615
12628i66280j1284375k621500O518532P725877K296828l450958n249120k595751
$$ y = [252446, -2720437, -6499546, -11619873, -15838912, -18091483, -20204839, -21826681, -18553815, -8651916, 2701108, 9807459, 13307661, 16457552, 18056066, 14361389, 6164752, -1230674, -4598109, -5078347, -4094416, -1248237, 2889923, 5667557, 6070236, 7298651, 13252877, 22898121, 29641227, 27044529, 15438345, 2628543, -3113832, -1403960, 99242, -4985208, -13601084, -16548478, -9565168, 1177772, 5522192, 121872, -8062247, -8939056, 43958, 10573934, 11868732, 2583848, -7822673, -10960360, -9698726, -12543072, -19698518, -21169504, -10768041, 3474365, 7779335, -966280, -12250655, -14872155, -8353623, -627746, 1669082, -1781876, -7030996, -9626747]
12620i626747K588575O539762N047316k344454r514380q478625R47774Q659447
12612f181332N282269n307786r590818j461957R999709J2836641O661127k23630
12604A2014223l059905k996499j031271K086758K245956k937382p174967l374146
12596d227233L158501J382676n940377m299516P986493J4040286M935821m864615
12588A2172036j018139P035086K957265p986506q061672K467090O308872j510353
12580A2363679p181787l074287J315581j257965l875604o46258K163700p89187
12572i82128l390558j8222L853485K252671p91791j44202J363071J106737K993772
12563F242835O879017L833560p343320j1678896O7986J2901136Q158742o764754
$$ y = [-9626747, -7038172, -498410, 4548906, 2204452, -7309928, -15788553, -14840779, -6181332, -899063, -6206849, -15797667, -17259624, -7259915, 5576726, 12237853, 12014223, 8954318, 5957819, 4926548, 7013306, 9259262, 6321880, -853087, -4227233, -1068732, 313944, -5626433, -9925949, -1939456, 12100830, 17036651, 12172036, 11153897, 18188983, 21146248, 13159742, 5098070, 7565160, 13874032, 12363679, 5181892, 2107605, 3423186, 2165221, -1710383, -2356641, -192941, -982128, -4372686, -4390908, -537423, 1715248, 923457, 779255, 2142326, 3249063, 6242835, 13121852, 16955412, 9612092, -2066804, -1998818, 10902318, 19061060, 12296306]
12555A2296306r315059K973745R895396J193110r429151q239164j272519r19398
12547b816734o134706p000228q61276O048445Q786126P879016N469638K575060
12539A3945341m50885l177266m453368k916482K81283J389363l38238m01491K985955
12530F864212L446165l585779j0161714n911251M017746M538152n493556r769327
12522a6055352N92466J2905305J2111944K188953k896345p73333j29882l663785
12514D279971n157857k592862j814015m859723m883081K624849J1005603J0839502
12506I442387K887546l397330k637441O76707p8800m392825o043117k016857L542428
12497b017302M909538J537342k536540m076342l009400o11064J902653L290744
$$ y = [12296306, 2981247, 5954992, 15850388, 17043498, 7614347, -624817, -1897336, -2816734, -8951440, -15951668, -16812944, -10764499, -1978373, 5900643, 11370281, 13945341, 13494456, 10317190, 5863822, 2947340, 3228623, 4617986, 4279748, 3878257, 6864212, 10310377, 6724598, -3437116, -9348367, -5330621, -792469, -6286025, -16055352, -15462886, -2557581, 9554363, 11743316, 8846971, 8073638, 7943756, 4279971, -877886, -3470748, -5284763, -10144486, -15027567, -12402718, -1397115, 9442387, 12329933, 8932603, 6295162, 6971869, 6893069, 2500244, -3542873, -5559730, -2017302, 2892236, 4429578, 1893038, -2183304, -5192704, -5803768, -3901115, -610371]
12489f10371L151153K746495L034742K444184j067234o124872q517904n660778
12481a0604585J119000P810075R611903L964559n130977q386411j661263O786267
12473C508568N666070l572014p871926p32727Q783315R259459K290899j747741
12465A5583903R39290L742852K49941p308355j1448489p870245P79214P924161
12457B592272R152898N740309J907044p07861l502534n994396m692568Q30740
12449E325904M703720J816727m363131o075679k269011M24889j409705k154578
12441d000864L686415J0758024Q169075m475473j3352675p101324P259091J2172764
12433A3115033K349821q564877p261091J156369J983814o889967j2062155m192365
$$ y = [-610371, 2540782, 5287277, 8322019, 10766203, 9698969, 3574097, -4943807, -10604585, -9485585, -1675510, 7936393, 11900952, 6769975, -1616436, -3277699, 3508568, 9174638, 5602624, -2269302, -3002029, 5781286, 15040745, 17331644, 15583903, 16523193, 20266045, 20515986, 13207631, 1759142, -6111103, -5331889, 2592272, 11745170, 17485479, 19392523, 18684662, 15182128, 9187732, 4495164, 5325904, 10029624, 11846351, 7483220, 1407541, -861470, -436581, -1846286, -4000864, -314449, 10443575, 18612650, 14137177, 784502, -6316822, 942269, 13115033, 15464854, 6899977, -361114, 795255, 2779069, -4110898, -16173053, -20365418]
12425b0365418R310400J5153130J0166235R80969o228345q814263m983623L627385
12417a153530Q802402L779916n705043p068992J074610N994174L5774p030904
12409a271593l036143P023332Q208802j479428q860777o362586j252590j34800
12401g165783K086592R354043J2589020L322229r158546r324638M05692L302429
12393E411038m539179p978401J913480J2511123Q818990m305144j0766625n889075
12385d823793J567787N000620N666223M812522J071845l460060l255884K159595
12377H738855N858614K302781n313536q687650l563734N630956R727561M112952
12369A8806799n704649r792578m999032K763127P066943O626984K135247n425486
$$ y = [-20365418, -11055018, 4098112, 14264347, 15245316, 9016971, 202708, -4780915, -1153530, 7648872, 11428788, 5723745, -1345247, -270637, 5723537, 5759311, -1271593, -4307736, 2715596, 10924398, 9444970, 584193, -5778393, -7030983, -7165783, -5079191, 4274852, 16863872, 20186101, 11027555, 1702917, 2108609, 5411038, 871859, -7106542, -5193062, 7318061, 16137051, 11831907, 1065282, -4823793, -3256006, 1744614, 7410837, 12223359, 13295204, 9835144, 6579260, 8738855, 14597469, 16900250, 11586714, 2899064, -664670, 4966286, 14693847, 18806799, 13102150, 3309572, -1689460, 1073667, 8140610, 14767594, 16902841, 11477355]
12361A1477355j1125619q506863L98275M942583M68740m737875k759144K077647
12353g764901K151540o49516l48630J701869R56603l69337K159080N479688M092228
12344G408624K94128p46698j016573l888201m175799L189910R959079N023450
12336A6047920n766638o654876L077777Q489510L400945k296651k059512j696773
12328A2541702m338267l388707K770920M542104k410038q232161m844250J723852
12320a634845L290954J799670J159370j335525o324229o528145O87290N716636
12312c168824J746327l292450o13228M215799K292391k159065k80820M494323
12304C234453K978272k186329q96577N851217O864738n66102o431148l485291
$$ y = [11477355, 351736, -8155127, -7756852, -2814269, -2345529, -7083404, -9842548, -7764901, -5613361, -6262877, -6611507, -4909638, -3953035, -4322372, -2163292, 3316396, 7408624, 7702752, 6956054, 5939481, 2051280, -2124519, 1065391, 11024470, 16047920, 10281282, 3626406, 6704183, 15193693, 18594638, 16297987, 14238475, 12541702, 8203435, 4814728, 7585648, 12127752, 9717714, 1485553, -3358697, -1634845, 1656109, 3455779, 4615149, 3279624, -3044605, -9572750, -8885460, -3168824, -1422497, -4714947, -5328175, -1112376, 1180015, -979050, -1259870, 3234453, 6212725, 4026396, 3129819, 8981036, 15845774, 15279672, 8848524, 5363233]
12296E363233M182894R329325Q834988K056933r066528j7077659j4273836k594161
12288a3244811P924059J0852035P778272K300168l082474m662642r0384N859001
12280A3633224N304302j446424n345495j561334L417514J543305m634292n099985
12272E810815L402832J1315809P357224o232047j4548805q246009M150143P792719
12264A0802681J468841k818645J145853N979320M099703j422840m197234m054489
12256A1003190l704607l024338j905006k453125m201216l656248j347310j144446
12248a0433106p23228N926366J3622799Q472441q394346j6073260l672952J1264466
12240a0820Q793715l796808o727819K99444K577546j563742o79290N459157M565077
$$ y = [5363233, 9546127, 18875452, 27710440, 29767373, 20700845, 3623186, -10650650, -13244811, -5320752, 5531283, 13309555, 15609723, 12527249, 7864607, 7774223, 13633224, 18937526, 17491102, 12145607, 10584273, 14001787, 15545092, 10910800, 5810815, 9213647, 20529456, 27886680, 21654633, 7105828, -1140181, 3009962, 10802681, 12271522, 9452877, 10598730, 16578050, 20677753, 19254913, 15057679, 11003190, 7298583, 4274245, 2369239, -83886, -4285102, -7941350, -9288660, -10433106, -11156334, -5229968, 8392831, 16865272, 8470926, -7602334, -11275286, -10820, 8782895, 4986087, -1741732, -1442288, 1135258, -428484, -1107774, 4351383, 8916460]
12231H916460m670471q967729l280636J889612K91102p14038L607020N863026
12223B934346O71531n156944m209730N70062L044303K653756Q84374k222980m050104
12214d881386p70466M197500K734190m035835m946013L932140J1667311P744076
12206A5641517l779872j1213179r563543l065282J542786J250685j28242M120962
12198e194168J2214438J1579139l145043j6407884j0326126P836197J4769893
12191A1326446N536952k165971M69110J240195o778099j0639515j959352N195625
12183B225391k202427j2032301o002315J0022229J5272219N494018m717189o486827
12175A572798n199509n764571n181459j004610M431803Q927559J0984670P313843
$$ y = [8916460, 4245989, -4721740, -8002376, -6112764, -5821662, -6535700, -2928680, 2934346, 3605877, -1551067, -5760797, -5190735, -2146432, 507324, 1391698, -831282, -4881386, -5651852, -1454352, 1279838, -2755997, -7702010, -3769870, 7897441, 15641517, 11861645, 648466, -8915077, -11980359, -10437573, -9186888, -9315130, -5194168, 7020270, 18599409, 15454366, -953518, -11279644, -3443447, 11326446, 16863398, 14697427, 15166537, 16406732, 9628633, -1010882, -2970234, 2225391, 22964, -12009337, -18011652, -7989423, 7282796, 12776814, 8059625, 1572798, -3626711, -9391282, -14572741, -15577351, -11145548, -2217989, 8766681, 16080524]
12167A6080524j869294q379772n921864n41693j491214n977020m422352K474513
12159a0048172M813757M52495k044330J448017M462208J950569j818249j599505
12151b383210Q15612J517374R67156R82263J74292k945911n531754l554758J843765
12142h115171M887266K676054n22386Q68797M710661L045781m887577q096700
12134e433275R62642J2286610J0372111k647869r701560m749722j21822l739473
12126b772358o041675J115800Q139106L693710n334888n280267K078960M683652
12118B82040P50360j981507k524362n683843p967233j228416J0258633J2391556
12110D297228K343746p265675p471161k925864j59109J230151J943157n59752
$$ y = [16080524, 14211230, 5831458, -90406, -632099, -2123313, -8100333, -12522685, -10048172, -5234415, -4781920, -6826250, -5378233, -916025, 1034544, -783705, -2383210, -1567598, -50224, 916932, 1899195, 2073487, -872424, -6404178, -9958936, -8115171, -3227905, -551851, -1074237, -205440, 4505221, 7551002, 2663425, -5433275, -4470633, 7815977, 18188088, 15540219, 5838659, 1088937, 967115, -2772358, -8814033, -7698233, 440873, 4134583, -1200305, -6480572, -4401612, 282040, 1032400, -949107, -3473469, -9157312, -17124545, -18352961, -8094328, 4297228, 6640974, -624701, -8095862, -11021726, -11180835, -9950684, -8007527, -8567279]
12102h567279m497464l242738L167306N922515J447580k223465J367552O544529
12094h1464N022884j048723l090564J143208N440819L967713k231575p081927
12086B040371n965895o16527L072867K762358J956874K508696N09666n276225
12078I92185p473958r94617N958316K735014o272184p746501l54239M667763L135984
12069e352237K879278P214716Q714995L705076j289586k901524o653361j2708991
12061f391634j0297508M086652J5699448J0625167l778931r520611j948642P957086
12053F431027R605160J367439j1524384j8993005j2067711M588129J3079007M612243
12045b902095o584318l293531R013184J1857568L083733k144447J731162K665427
$$ y = [-8567279, -13064743, -16307481, -13140175, -7217660, -5770080, -7993545, -6625993, -81464, 4941420, 3892697, 802133, 1945341, 7386160, 11353873, 9122298, 2040371, -3925524, -4542051, -1469184, 1293174, 3250048, 5758744, 6268410, 992185, -6481773, -7476390, -1518074, 1216940, -5055244, -12801745, -13155984, -8488221, -5352237, -2472959, 4741757, 13456752, 17161828, 15872242, 12970718, 6317357, -6391634, -16689142, -12602490, 3096958, 13722125, 9943194, 422583, -1526059, 6431027, 16036187, 17403626, 5879242, -13113763, -25181474, -20593345, -7514338, -2902095, -9486413, -12779944, -3766760, 8090808, 11174541, 9030094, 10761256, 13426683]
12037A3426683n730771j1393842l834440P559257P891422n07352l635914J506161
12029E281204M083916j785237q459200p856764k619818J025860L423943P353651
12021D47555R304530L671088o320515j0512784n481665J206590K593865R75378
12013d115958J197860K331134J869516K209297N348313N892527j486200j0680500
12005B565989j0569667j789846L743870Q40513k825181j445557q3360k905704
11997a2468943l359861M541799J3156561J0522771j609671r745531o955346L04133
11989e614088L593590K054918j047696m055297o005928m926634m17556M713216
11981a1705475P555894P897215O711490M166927Q51538r13942L83070J966161
$$ y = [13426683, 7695912, -3697930, -7532370, 26887, 7918309, 7410957, 3775043, 5281204, 9365120, 7579883, -879317, -8736081, -11355899, -10330039, -6906096, 447555, 9752085, 13423173, 7102658, -3410126, -8891791, -7685201, -5091336, -4115958, -2918098, -586964, 1282552, 3491849, 8840162, 14732689, 13246489, 2565989, -8003678, -9793524, -6049654, -5209141, -8034322, -9479879, -9563239, -12468943, -15828804, -11287005, 1869556, 12392327, 10782656, 1037125, -5918221, -5614088, -2020498, 34420, -1013276, -5068573, -11074501, -16001135, -16418691, -11705475, -4149581, 3747634, 10459124, 14626051, 15477589, 14563647, 14946717, 16912878]
11973A6912878j244912r370697j4475791q863930L459003Q981157J374064r075466
11965a2303694q330679K839284J0683987P229397j055273m051201J02437N997092
11957A111350P745310K747029o169946j1195241p131486J407893N905643N512992
11949f6456N186770M653453J29419m123054K46751Q840122P206036n513350j2417013
11940D142678n392067J986402j223662m602574K463862Q397418p90347j3353584
11932h371874q503208Q022726J2385895K018361k378900N361804P093408m933900
11924A0694312j2622139m155506M452592k241721j1279051l793531J1769721J3655786
11916F480463K557979k461690K362290K178182o735393r493290j56395O236405
$$ y = [16912878, 15667966, 6297269, -8178522, -17042452, -13583449, -4602292, -3228228, -12303694, -20634373, -17795089, -7111102, 118295, -936978, -4988179, -4885742, 1111350, 8856660, 11603689, 5433743, -5761498, -12892984, -11485091, -5579448, -66456, 5120314, 9773767, 9903186, 5780132, 6026883, 14867005, 22073041, 16559691, 4142678, -1249389, 737013, -486649, -5089223, -2625361, 5772057, 4981710, -8371874, -16875082, -8852356, 3533539, 5551900, 3173000, 8534804, 15628212, 10694312, -1927827, -6083333, -1630741, -3872462, -15151513, -18945044, -7175323, 6480463, 9038442, 6576752, 8939042, 11117224, 4381831, -5111459, -5267854, 968551]
11908I68551o60615q123465j650052J0222918R234839l811381j1276162n725714
11900a0821081K044540K461874k78777Q74999M383541N474744L973795J008470
11892I122105m260496q854073n077790P157109J4772634P720018n565908r725210
11884E288389m179849n60685k305409k012889J750784J655384j962890Q80326
11876a446839R606641Q460250p973404k1059157j3737506L982485J1365418P129657
11868c672455M631914N923310J918826o142286p159255j378032m57405n004225
11860a1339608k706560P497666J0578363J790270k907112O109588J3806873M556080
11852B7385560j0974243j1506074K355181J0414229K906864r070678j2231431
$$ y = [968551, 307936, -7815529, -9465581, 757337, 9992176, 6180795, -5095367, -10821081, -8776541, -6314667, -6593444, -5718445, -1334904, 4139840, 8113635, 9122105, 4861609, -3992464, -9070254, -1913145, 12859489, 20579507, 15013599, 5288389, 1108540, 547855, -1757554, -3770443, -2019659, -364275, -2327165, -1446839, 8159802, 16620052, 8646648, -12412509, -26150015, -22167530, -10802112, -3672455, 959459, 6882769, 8801595, 2659309, -4499946, -5877978, -6335383, -11339608, -14046168, -6548502, 4029861, 5820131, 2913019, 9022607, 22829480, 27385560, 16411317, 4905243, 7260424, 17674653, 20581517, 11510839, -720592]
11845g20592n970024K424857O450987L240393l739508n142924L225746J1674543
11837A1443478Q138608l436836p663232r35462K922873n240879j4357714r043473
11829a8172637O957698J5175468P810798k887892l035647M817558Q457317M371572
11821B3494235J8570j93421r12272n424909q469932n167395N6462Q20090n73762
11812C647666J676765N533600M651655J88162j331703o9185j778864n623438m936164
11803A958494l61212L40545l071177k349748K932448K790088m625910p268784
11795i655256L89989O397338J271286n328130j247146P051696N665397l634111
11787I11063p880000m201073n71760L93819K820790N438074K879418k334230k763133
$$ y = [-720592, -6690616, -4265759, 2185228, 5425621, 1686113, -3456811, -231065, 11443478, 19582086, 16145250, 8482018, 7546556, 10469429, 5228550, -9129164, -18172637, -11214939, 3960529, 11771327, 8883435, 5847788, 10665346, 19122663, 23494235, 23512805, 23319384, 22407112, 16982203, 8512271, 3344876, 3401338, 4221428, 3647666, 5324431, 10858031, 15509686, 15697848, 14366145, 14296960, 12518096, 6894658, 1958494, 1597282, 1937827, -1133350, -3483098, -550650, 2239438, -2386472, -9655256, -9265267, -2867929, -1596643, -6924773, -8171919, -1120223, 4545174, 911063, -6968937, -11170010, -11741770, -11347951, -8527161, -3089087, -209669, -2543899, -5307032]
11778e307032L84216j9924k462185N57454O160133L292689p039886r815526J038321
11769a3211740J2269016J0793914J324665l623023j545556R41651j68085l628129
11761C152713p608391j0452340r575000m178336K910893Q368759J0891452R965845
11753C475595N754734O07654k955070n234686o596140m185528K859184P889299
11745A615042M485042k237759j430411O939524J1295026N204817m668944r413794
11737A1788543p818561l023706K622704O514123O309633L466600P91647k747741
11729A7903242q070728r747056l437326L311724R1009q460131q383265M17828
11721a6374703L625964k725590n381950K522757R291382N123324k051948k249219
$$ y = [-5307032, -4922816, -4942740, -7404925, -6847471, -687338, 2605351, -4434535, -14250061, -13211740, -942724, 9851190, 11175855, 7552832, 6007276, 6948927, 6780842, 3152713, -4455678, -14908018, -24483018, -28661354, -25750461, -17381702, -6490250, 3475595, 9230329, 9837983, 6882913, 1648227, -4947913, -9133441, -6274257, 1615042, 6100084, 3862325, 2431914, 9371438, 20666464, 25871281, 21202337, 11788543, 3969982, 946276, 3568980, 10083103, 16392736, 19859336, 20650983, 17903242, 9832514, 85458, -3351868, -40144, 50865, -8409266, -16792531, -16374703, -12748739, -15474329, -20856279, -18333522, -9042140, -3918816, -5970764, -8219983]
11713h219983L16930j044232j676173K909733M691954k786534r574208m361426
11705a9743939N884137P852643M019679M873726P167293N0726j2055098j3567761
11697a5518594l346922L620092J158097l91917N055449Q455471K073234p410594
11689f305684r800613m833665J654070O275727P532267M314995o11879k078586
11681c853368k48495l63151l165670l197314J347671M899151L395672q4943j283009
11672b553456k08209J528936L276599L811915K302832R33132J488341R91377k791569
11663H779898m414881J613049Q695877N119053p198201j3365813o937487J570090
11655f138415J601257l281211m008319L70383M103603L439058q07330m412740
$$ y = [-8219983, -7903053, -8947285, -10623458, -7713725, -3021771, -5808305, -15382513, -19743939, -13859802, -6007159, -1987480, 2886246, 10053539, 10104265, -1950833, -15518594, -18865516, -15245424, -14087327, -14479244, -9423795, -968324, 1104910, -6305684, -16106297, -20939962, -19285892, -13010165, -5477898, -1162903, -1774782, -3853368, -4101863, -4465014, -7630684, -10827998, -9480327, -4581176, -1185504, -1270447, -2553456, -2761665, -1232729, 2043870, 5855785, 8158617, 9091749, 10580090, 11571467, 8779898, 4365017, 5978066, 14673943, 19792996, 12594795, -771018, -7708505, -6138415, -4537158, -7818369, -11826688, -11456305, -7352702, -3913644, -4720974, -9133714]
11647i133714j664401P730916J3650143O200265q397268j3392741m457179N128451
11639d335528N213787J346193J191917J825113j254070m073063k449243m58941
11631b993835j709659j628302K516204L710918k415244o747073j17841J0282703
11623H97871J0641141Q10981p386856p566058l058039K024678N117595K670237
11615D151550m286626o603478M74835O945450K251258o272331m059914O104771
11607a294485P600678k963017j0262333m736067M183935N200577J138109P2973
11599a059630K019618K780183K253901J338478k070704p147787p070993J007403
11591g949531Q642052O154676l748478r179322l984445N885929J0456475O721712
$$ y = [-9133714, -10798115, -3067199, 10582944, 16783209, 8385941, -5006800, -9463979, -4335528, 878259, 2224452, 3416369, 5241482, 3987412, -85651, -2534894, -2993835, -4703494, -6331796, -3815592, -104674, -2519918, -9266991, -9384832, 897871, 11539012, 12349993, 4963137, -2602921, -5660960, -3636282, 1481313, 4151550, -135076, -6738554, -6263719, 681731, 2932989, -3339342, -7399256, -1294485, 6306193, 3343176, -6919157, -11655224, -7471289, -2270712, -1132603, -1059630, 959988, 3740171, 5994072, 7332550, 5261846, -1885941, -8956934, -7949531, 692521, 6847197, 3098719, -6080603, -10065048, -4179119, 6277356, 12999068]
11583A2999068Q14812k70175J916238k95397p605833j0003614k095825N396726
11575H56000N19322r367669p251325N575333R575402k078474j1662604m499054
11567a8333069Q705931R845673J68877n840486l370777J353158N303755Q763432
11559F596494O684325m120438j2771038o017600R031632J1159118l986406j6301822
11551i725735j0379774L526435P407001J619060q8114N900667Q968000K328681
11543I556221p060923r701610o157705l249387k616132K42390O228679Q529972
11535d228495K081495o768242o611659L365651J1296691Q717794J560266k15853
11527I197648K446874J265086m906557q627503n776926o9971M604985Q082251
$$ y = [12999068, 13813880, 13543705, 15459943, 15164546, 7558713, -2444901, -4540726, 856000, 1375322, -7992347, -15243672, -9668339, -92937, -2171411, -13834015, -18333069, -9627138, 218535, 387412, -5453074, -8823851, -7470693, -2166938, 6596494, 13280819, 9160381, -3610657, -9628257, -596625, 10562493, 6576087, -9725735, -20105509, -16579074, -9172073, -7553013, -7641127, -1740460, 7227540, 9556221, 2495298, -7206312, -13364017, -16613404, -19229536, -18987146, -12758467, -4228495, -2147000, -8915242, -15526901, -12161250, -864559, 7853235, 9413501, 9197648, 11644522, 12909608, 8003051, -624452, -6401378, -6471349, -1866364, 6215887]
11519F215887R099054M810167k596567o306623m757393m095242p559761r517560
11511a4708038m555579L634085P664761O019591K353634o94183k373353j969096
11503d628178k22437L84092k16873R75911L814749L200410k739439p948260o606783
11494a3986808j057234L328211N831061P228075M839774j662484m688063J677577
11486A510109J0010413P823086l940283j1255721o568577K066305M107057m4351
11478C708038l203996k381498l57356j9850j279860k014902l07303L013223M481088
11469A637584K634694N29372M66263l26362l603278m051937K539521Q711091L868760
11460A2405708q110743j2384915n091005J813371Q85506k22535M878974Q822271
$$ y = [6215887, 15314941, 20125108, 17528541, 11221918, 6464525, 2369283, -5190478, -14708038, -19263617, -15629532, -7964771, -1945180, 408454, -285729, -2659082, -4628178, -4850615, -4466523, -4683396, -3707485, 107264, 3307674, 568235, -7380025, -13986808, -15044042, -11715831, -5884770, 1343305, 6183079, 4520595, -167468, 1510109, 11520522, 19343608, 15403325, 4147604, -2420973, -354668, 3752389, 3708038, 504042, -1877456, -2234812, -2254662, -3534522, -5549424, -5856727, -2843504, 1637584, 4272278, 4801650, 5267913, 4941551, 1338273, -2713664, -174143, 8536948, 12405708, 4294965, -8089950, -13180955, -11367584, -10482078, -10704613, -5825639, 2996632]
11452B996632M631073l43245K392000O032235M99801p536640m453136N537904
11444I756624N045298p446227j3191818k629637R181875O094293n040432o725223
11436d955247K846378J0161035P982394K594858L4466k529720p925027j0466140
11428b257003l252859R474310J4154370L801979j1728275j5595861l718318J0122838
11420A001181J1212664J067416p341804p318958l435759o93459J506982L124431
11412h77306Q73837l999292l800275L997760J0406477O978950j822363n727237
11404F030551k857186J297248M261007O345235L804529o321758j5908108j2767684
11396a6116166M60343O996508j05764p119272r33060R932124Q375441l993734
$$ y = [2996632, 7627705, 7284460, 9676460, 15708695, 16208496, 8671856, 4218720, 9756624, 14801922, 7355695, -5836123, -8465760, 716115, 6810408, 1769976, -4955247, -2108869, 8052166, 16034560, 18629418, 18663884, 16134164, 8209137, -2257003, -5509862, 3964448, 18118818, 21920797, 10192522, -5403339, -9121657, 1001181, 12213845, 13281261, 5939457, -1379501, -4815260, -5508719, -4001737, -877306, -3469, -4002761, -7803036, -3805276, 6601201, 13580151, 11757788, 6030551, 3173365, 4470613, 8731620, 15076855, 18881384, 12559626, -3348482, -16116166, -15655823, -8659315, -8765079, -15884351, -16817411, -6885287, 1490154, -2503580]
11388b503580q325322L025703J4667393J0489360l858924j0403076l781514M556570
11380C866610N009972J472846J591420M325776L503408j314739m819095n008400
11372H627798n242484o638776n054920J148419N664992K079037n653581p161750
11364a2231265j42045N776831K702738l579107j504660Q941946J4599546O663298
11356B1227282o860904j1479550m948050J472512l20238n256436m832931k29956
11348a1228271Q17158l033636m695904J9874O013453O901685M124446L256344
11340B175149M494996K773206l135427p253877m263124K926118O567787L416567
11332G701395k206440m331465j863528J551036K493100R63856j100137k693371
$$ y = [-2503580, -10828902, -7803199, 6864194, 17353554, 13494630, 3091554, -689960, 3866610, 8876582, 10349428, 11940848, 16266624, 19770032, 18455293, 13636198, 8627798, 3385314, -3253462, -8308382, -7159963, -1494971, 584066, -5069515, -12231265, -12373310, -6596479, -3893741, -7472848, -8977508, -35562, 14563984, 21227282, 14366378, 2886828, -2061222, -588710, -908948, -6165384, -10998315, -11228271, -10411113, -13444749, -18140653, -18120779, -12107326, -5205641, -1081195, 2175149, 6670145, 9443351, 6307924, -945953, -5209077, -2282959, 4284828, 7701395, 5494955, 1163490, -700038, 850998, 3344098, 4307954, 3207817, 514446]
11324E14446l674964k649331K232686Q830875J0055163J438112j0838171j4542592
11316h633776n992313M662909O496491J625774k20253K506612K173009l143778
11308e25325m526286L128658J0568801O718716m480519r725425n351199r5427
11300d288006q658j524975r81871n73134j208292J134737O771934Q342373J862084
11291I526192n274825m494728J669701N123953M730316M542993L788136j179767
11283A8431971o891065n514104J571916L017334o262317j6260052j4480240j947338
11275b8333895Q861887R134256J900833l880713l464327N28927L234016L479352
11267h539664L293320L046481Q59672k598066l274062m1094K548800J054901j764460
$$ y = [514446, -3160518, -5809849, -3577163, 5253712, 15308875, 16746987, 5908816, -8633776, -14626089, -9963180, -3466689, -1840915, -2061168, 445444, 2618453, -525325, -5051611, -1922953, 8645848, 15364564, 10884045, 1158620, -4192579, -4288006, -4296664, -5821639, -6803510, -7376644, -8584936, -7450199, -678265, 7664108, 9526192, 4251367, -243361, 1426340, 6550293, 11280609, 15823602, 19611738, 18431971, 11540906, 6026802, 7598718, 10616052, 4353735, -11906317, -26386557, -28333895, -19472008, -10337752, -8436919, -12317632, -15781959, -15253032, -12019016, -8539664, -5246344, -2199863, -1340191, -3938257, -7212319, -7253413, -4704613, -3649712, -5414172]
11258e414172k429711k120575j718116K346777J0160719J2542146L189964q260970
11250H296062p532572K745332O579993n80141n669771N0251P636953O040115j445174
11241A6121048n326534m694949m204230l919529j790952l59225k038381k781097
11233h993849J121290M870143K442539k608990k862402N03978R42600p40587K158354
11224c166924Q872166J0130723K274465o729878q459346m079584R7771J351790
11216B91183J156117R05105L28278j560075n046792p719797m864633M720616J3970464
11207B180466J3268802K102651q771116q998818l09196N825975J896620o241720
11199I53664o061918M975117J3616551O734739r747368j6482612n805601Q808555
$$ y = [-5414172, -7843883, -9964458, -11682574, -9335797, 824922, 13367068, 16557032, 8296062, 763490, 3508822, 10088815, 9508674, 3838903, 3889154, 11526107, 17566222, 16121048, 10794514, 6099565, 1895335, -2024194, -3815146, -4174371, -6212752, -8993849, -7872559, -3002416, -559877, -3168867, -6031269, -5527291, -4584691, -5325278, -3166924, 5705242, 15835965, 18110430, 11380552, 2921206, -1158378, -1060607, 291183, 1447300, 2352405, 2680683, 1120608, -3926184, -11645981, -16510614, -11789998, 2180466, 15449268, 17551919, 8780803, -218015, -527211, 5298764, 7195384, 953664, -5108254, -133137, 13483414, 20218153, 10470785, -6011827, -11817428, -3008873]
11191c008873J2174125N817315j69038l684208q066172j0328808n228836K495126
11183i999369K967056l028586n311561j030500K270308J260094J633874N147522
11175f091162M339010l997156j0591148o259164N079936J2768679J2588072P692104
11167A5529171K148904r02139J63727K034810q39467o235411m312677O773253
11159A4360171J3942683O377125p615317j1666576m257995J649604l55196k658099
11151I776400J030506M886999J153482p383621j1936777r525359l850558K130624
11143a3718304P937552J1296042Q593832Q93588n183030n146852k192404j989974
11135D90450m139017l273685J680568M813684K192877j515275k76475L210881
$$ y = [-3008873, 9165252, 14982567, 14813529, 11129321, 3063149, -7265659, -12494495, -9999369, -7032313, -10060899, -15372460, -16402960, -14132652, -12872558, -11238684, -6091162, -1752152, -5749308, -16340456, -22599620, -17519684, -4751005, 7837067, 15529171, 17678075, 16775936, 16939663, 18974473, 18135006, 11899595, 7586918, 14360171, 28302854, 34679979, 27064662, 15398086, 11140091, 12789695, 12434499, 9776400, 10806906, 15693905, 16847387, 9463766, -2473011, -11998370, -15848928, -13718304, -5780752, 5515290, 14109122, 15002710, 9819680, 4672828, 2480424, 490450, -3648567, -6922252, -5241684, -428000, 1764877, 249602, -26873, 3184008]
11127C184008J637011m380499o296575j223025L216745J365540j403054J443547
11119b456302N541877K474351n418226p349743m99537N717148L775834k016074
11111b30672l514595K7812L490468L677861O84131m658190r662573r177360j464613
11102b0827731P227233R135750M734932R83007J047482J671847N26282m26390
11094D072412k09845r21271k075481M19791N756562N763883k751917r620672m243197
11085c809735P524298J0344307J398618o659910n574740j372123l91002J286280
11077B745993O442002O962510k481634j0438914l532946J0347498J0892839l788857
11069A7148491j3100244m491493Q867286R417957m0284n049342k505604o35199
$$ y = [3184008, 4821019, 440520, -5856055, -7079080, -3862335, -2496795, -3899849, -2456302, 3085575, 5559926, 141700, -7208043, -7707580, -1990432, 1785402, -230672, -3745267, -3717455, -226987, 3450874, 4135005, -523185, -10185758, -19363118, -20827731, -13600498, -4464748, 270184, 1253191, 2300673, 3972520, 4498802, 4072412, 3862567, 2941296, 865815, 1285606, 7042168, 12806051, 10054134, 433462, -3809735, 3714563, 14058870, 15457488, 8797578, 3222838, 1850715, 1459713, 2745993, 9187995, 16150505, 13668871, 3229957, -302989, 10044509, 20937348, 17148491, 4048247, -443246, 8424040, 17841997, 17801713, 12752371, 10246767, 9611568]
11061I611568j930105r65519K409923J505588m010012n405228P12256N444040
11053G372511P54180q268876j0884474m848334L383602Q366964R096054N854693
11045A0826320L18452k927866j122925J561615n13248n084905m797602R75661
11037g64498M638320J886369k815239m603590m448780l682187m23426L700174
11029f512857K024832m934465n062975P056898J6210088O004648j3453373j6275816
11021a4943020J362765J4810297P680352n639188n732491K039172R99698o944071
11013f366486o157995M567524J0174377M735911o80885J808634N751379L951785
11005A7784244j374392p044755j3740716j7017574p927565R828225J7693838P435824
$$ y = [9611568, 7681463, 6715944, 9125867, 10631455, 6621443, 1216215, 1928471, 7372511, 8126691, -142185, -11026659, -15874993, -12491391, -4124427, 4971627, 10826320, 11144772, 8216906, 7093981, 8655596, 8142348, 3057443, -1740159, -764498, 3873822, 5760191, 2944952, -1658638, -6107418, -9789605, -10213031, -6512857, -4488025, -9422490, -14485465, -7428567, 8781521, 14786169, 1332796, -14943020, -13580255, 1230042, 8910394, 3271206, -2461285, -422113, 577585, -6366486, -12524481, -7956957, 2217420, 6953331, 6272446, 8081080, 13832459, 17784244, 16409852, 9365097, -4375619, -21393193, -29320758, -19492533, -1798695, 5637129]
10997E637129m812560k398444O503603M033740o690694o908798N710540J2500509
10989A3575025L922606o238570m523261J988965P69742m851564m071570J252064
10981A823437Q07674m944133n579597P31652M433126J552902o23760J770785K446320
10972B418406j335144j432156O000123R842021N16889j2137427j1921625r41649
10964h990562M897389J917781K170469R403125J0187108l157816j6381118j2357658
10956a2311282L943871J2966680P338329j781122l187871J055311K525358j350821
10948I198453n437495l954588K407828O263923K038656n620112o634466M98630
10940a239171O322020M667036J045244J642763K535867j958491p338599n388216
$$ y = [5637129, 824569, -1573875, 4929728, 8963468, 2272774, -4636024, 1074516, 13575025, 17497631, 11259061, 6735800, 8724765, 9494507, 4642943, 571373, 1823437, 2631111, -2313022, -7892619, -7160967, -2727841, -1174939, -1798699, -27914, 2418406, 1083262, -348894, 5651229, 15493250, 16010139, 3872712, -8048913, -8990562, -4093173, -2175392, -4923, 9398202, 19585310, 16427494, 46376, -12311282, -8367411, 4599269, 11937598, 10156476, 6968605, 8023916, 10549274, 9198453, 3760958, -193630, 2214198, 8478121, 10516777, 4896665, -1737801, -1239171, 5082849, 9749885, 10795129, 12437892, 14973759, 13015268, 5676669, 288453]
10932B88453K242019P049835O752455N364217L147543k924755j0080648j1346237
10924D92882o148615o23757K083600L499042L193328l48614l394441j194913K331842
10915a09646n64169p480495q046447q05811L944379O64439l492979j234122M543878
10906a2580973P626799P075514M728629J740945O30033L009475L572006m194641
10898A1607787j4556727j3495106J98207J0391572O242753l117902m762077p92006
10890h283499p7581j512923J065109M393033O87648o517311n532412M675562J1396301
10881B93927O484965k423428l584543L139030P887680M514701k698991n960298
10873G653043l968658k251114m004054m678957Q71431Q712315R355262P92778
$$ y = [288453, 2530472, 9580307, 16332762, 21696979, 24844522, 21919767, 11839119, 492882, -5655733, -6279490, -4195890, -696848, 2496480, 2147866, -1246575, -2441488, -109646, -673815, -8154310, -16200757, -17006568, -13062189, -12397750, -15890729, -17124851, -12580973, -4954174, 2121340, 6849969, 8590914, 9220947, 12230422, 15802428, 11607787, -2948940, -16444046, -16245839, -5854267, 388486, -2729416, -7491493, -8283499, -8361080, -9874003, -8808894, -4415861, -3728213, -10245524, -15777936, -11102374, 293927, 6778892, 4355464, 770921, 3909951, 11797631, 16312332, 13613341, 7653043, 3684385, 1433271, -2570783, -7249740, -6378309, 2334006, 11689268, 12482046]
10865A2482046q224538r518261m543607K17520J958317K531473M201704P014166
10857F118820Q371881M836972k999993q629596o875810j546110l08910l476315
10849d509061m669887j514846K026747L441387L797639K650178p87928k393986
10841a959757J485513M936228J79728p060821m138662O329970P637973m143467
10833C266705j2317458n867986L741762K836476l085142j958179L569331K893638
10825f920853l364051n794346j949939L060990O752216R018306O950869K57836
10817H011028l534754O68154N656119K267139o053598r235469n724721j467758
10809i413860J112562L025394K429268j675448l930466Q930N172226M755749N42438
$$ y = [12482046, 4257508, -5260753, -9804360, -9586840, -7628523, -5097050, -895346, 6118820, 14490701, 19327673, 16327680, 7698084, 822274, -723836, -1032746, -4509061, -9178948, -10693794, -8667047, -5225660, -1428021, 1222157, 434229, -1959757, -474244, 4461984, 4641712, -2419109, -6557771, -227801, 7410172, 3266705, -9050753, -14918739, -11176977, -8340501, -11425643, -13383822, -9814491, -6920853, -10284904, -16079250, -18029189, -14968199, -8215983, 802323, 7753192, 8011028, 4476274, 5144428, 10800547, 13067686, 7014088, -2221381, -7946102, -9413860, -8301298, -5275904, -2846636, -4522084, -8452550, -8443620, -3271394, 1484355, 2026793]
10800B026793k154176l353904l952614l50130P101295R040319J260469n187997
10792D430055l61327P291220M215618o027820r668751n071945j635715j626905
10784h455570K26750L076224K194854J199728N797651R262597J628138r908785
10776E021587q879342L396752Q450523k46903q293474m636794K965178L353718
10768A131245j743498m141037j186577M295455Q079343O208689k16640l199329
10760I227651R15517K968062m788280j2386276o072137O978811P775169l489645
10752A128872p930784J4218M827487j416807o332174j409193L282419l20634l132641
10743a1289237K517177P157067J702579m894155j327014N794347L790751m280379
$$ y = [2026793, -127383, -3481287, -7433901, -7784031, -682736, 8357583, 9618052, 4430055, 4068728, 11359948, 15575566, 9547746, -121005, -5192950, -6828665, -8455570, -8228820, -5152596, -2957742, -1758014, 4039637, 13302234, 14930372, 5021587, -3857755, -461003, 7989520, 7742617, -550857, -5187651, -2222473, 1131245, -612253, -4753290, -5939867, -1644412, 6434931, 12643620, 12426980, 9227651, 10143168, 13111230, 8322950, -4063326, -10135463, -3156652, 4618517, 1128872, -6801912, -6787694, -1960207, -3377014, -9709188, -11118381, -7835962, -8156596, -11289237, -8772060, -1614993, 87586, -4806569, -6133583, -339236, 3451515, -828864]
10735h28864o022094k58519M328409N501778P641916R200306L933287o171220
10727A7324999j0847332n533043K886807N555322J225046m452442n700967k196247
10719a737857J188782R06362o70591l67505n58105l791771m599692L126171J2363585
10710E859379R267088n627877j5657213j0904721j38922M864203M323715L264589
10702d749759J169701k767364l642692J176908N501392L479520j058908j237352
10694b128554K533620M821320L046043j319709n102835m636275M56207M232765
10686A902582J468113l400075k665050J442389R01888k916159j903898K346089
10678b824121J042911k837441K912369J5458188J6088431K88416j2299594q004879
$$ y = [-828864, -6850958, -7109477, -2781068, 2720710, 10362626, 19562932, 23496219, 17324999, 6477667, 944624, 3831431, 9386753, 10611799, 6159357, 458390, -1737857, -549075, 357287, -313304, -680809, -1238914, -5030685, -9630377, -6504206, 5859379, 15126467, 9498590, -6158623, -17063344, -17202266, -12338063, -8014348, -4749759, -3580058, -6347422, -9990114, -8813206, -3311814, 167706, -891202, -2128554, 405066, 5226386, 8272429, 6952720, 1849885, -2786390, -2330183, 1902582, 3370695, -29380, -2694430, -1252041, -350153, -3266312, -5170210, -2824121, -1781210, -4618651, -1706282, 13751906, 29840337, 30128753, 17829159, 9824280]
10670I824280R47326l88738n618746k533750L433900J60180q355168q845304r56682
10661a2332702L898832Q70111m383922n705049o73098R210925J5281359P874434
10653A4040890p158455j0730767J792521J0508881R99658j1983199p998742O659266
10645c869947J1067061L201865j499009J616305K364697k815732o064503m339655
10637c38918k485049l56182O337369J2620386Q407999l113929p390130q06651
10629A2874895M149124n96130p095462n480106J757161N617447K871473k497623
10621A1600779n142775k811666J937199M219036K978504J747577J182821k944916
10613A2766559j0349247j2918987p047638o17416M8726O98001O968467J1837943
$$ y = [9824280, 10771606, 10382868, 4764122, 2230372, 5664272, 5824452, -2530716, -11376020, -12332702, -8433870, -7563759, -11947681, -17652730, -18325828, -9114903, 6166456, 14040890, 6882435, -3848332, -2055811, 8453070, 9452728, -2530471, -10529213, -3869947, 7197114, 10398979, 8899970, 10516275, 12880972, 10065240, 4000737, -338918, -2823967, -3180149, 3157220, 15777606, 24185605, 21071676, 13681546, 12874895, 17024019, 16427889, 9332427, 3852321, 5609482, 11226929, 14098402, 11600779, 6458004, 3646338, 5583537, 9802573, 12781077, 14528654, 15711475, 12766559, 2417312, -10501675, -17549313, -18166729, -18118003, -17420002, -10451535, 1386408]
10605A386408P652688J318152K761057O253328J15521j0719986j0345707K209538
10597F30999J0853356O913856q58975l318248k794361l612935l735825j401313
10589B676554M1142q50592P4901M546816O868787J596788q117283j3486098r386013
10580a6034998O08164P457943N655193o25222l077751o90764N2812k996425l783597
10571a3434645J086142O207226O496918M265093K586128J1236l471205l969365
10563b22472j637867j795161m302355k579894L159485M312200m38528k153717
10555e658309J160736Q45726l414001J17952J2066783J5605101L830783p477930
10547A7076841o829957m768690j0016949j0922374J007625J1127793N970112k888724
$$ y = [1386408, 9039096, 10357248, 13118305, 19371633, 19487154, 8767168, -1578539, 630999, 11484355, 18398211, 17539236, 14220988, 11426627, 7813692, 4077867, 2676554, 2717696, 1867104, 1942005, 6488821, 13357608, 14954396, 6837113, -6648985, -16034998, -15426834, -7968891, -2313698, -2938920, -6016671, -6707435, -6654623, -9651048, -13434645, -12348503, -6141277, 355641, 4620734, 7206862, 7218098, 3746893, -222472, -1860339, -3655500, -7957855, -10537749, -7378264, -3066064, -3504592, -5658309, -4497573, -3651847, -7065848, -6947896, 5118887, 20723988, 24554771, 17076841, 10246884, 5478194, -4538755, -15461129, -14453504, -3325711, 2644401, -244323]
10539b44323q35243L841255j440997q600687n942101r19256k556728j580171Q005829
10530a0272422J0341298l095669j0687790L223074J5852252L737471j3879359
10523d781145q587976O353762K853119q628482j476618J2610461M575655j4137310
10515a1218534j0393990Q167285P314480q667845o379495J0807814R021878r372969
10507a0721376r821530O565793N562338j1082052q357469J0110803O324549j4230647
10499b5649591q126269J8612504J5138136j4951014j5109248J1562648J373070
10492a7149764l7599230k2665869L1907066p210552j57261288k17423515m3497575
10485d70900727J99920405K41494370P7771327n0797520k1229380M3073886K1171556
$$ y = [-244323, -1079566, 2761689, 1320692, -7279995, -13222096, -14141352, -16698080, -18278251, -10272422, 68876, -3026793, -13714583, -10491509, 5360743, 9098214, -4781145, -13369121, -7015359, -4162240, -12790722, -14267340, -1656879, 2918776, -11218534, -21612524, -13445239, -6130759, -14798604, -21178099, -10370285, -1348407, -10721376, -20542906, -13977113, -8414775, -19496827, -27854296, -17743493, -11418944, -25649591, -33775860, -15163356, -25220, -14976234, -30085482, -18522834, -17149764, -54748994, -77414863, -45507797, -52718349, -209979637, -427403152, -470900727, -270980322, -29485952, 48285375, -2512145, -23741525, 19332361, 40503917]
10478D0503917k8464646j3865085K7798890J8677767j9156601j8881848R186655
10471A5799049R436425j4907966j7503994L366548R402077n055003j0018672J950715
10463g530821Q685283L021669K51422N013432O265609J848106q0735L22912l124621
10454A4672256p941476q308263o515538n057565P13924R749844J0450179Q29304
10446H592665m182823J894362M616953m281805r306807J550866J3016196O669834
10438A8569441q879703j3095502m244561M544577P216865N297764j416788r303854
10430a311761q456239J082286M971159j611869l679538O406637J2053954N44330
10422I998959j2224719o936181O778385P335936l519326p430076r97293L684811
$$ y = [40503917, 12039271, -1825814, 25973076, 44650843, 25494242, 6612394, 15799049, 25235474, 10327508, -7176486, -3809938, 5592139, 537136, -9481536, -7530821, 1154462, 4176131, 4427553, 9440985, 15706594, 17554700, 17473965, 17796877, 14672256, 6730780, -1577483, -8093021, -13150586, -12436662, -2686818, 7763361, 8592665, 4409842, 6304204, 10921157, 6639352, -2667455, -1116589, 11899607, 18569441, 9689738, -3405764, -7650325, -3105748, 4111117, 9408881, 7992093, -1311761, -9768000, -8685714, -3714555, -5326424, -9005962, -2599325, 9454629, 9998959, -2225760, -9161941, -2383556, 4952380, 1433054, -5997022, -6994315, -3309504]
10414c309504K790447K619738L035109p40954m349311o42042M858724K095860
10406F358067m837668m189987K707770M098601j877452n322745j377065M515728
10398G5249O666100L953493k443947p699880n205246K730018M554188k404337
10390B25638n409372K252629P975276J582539n303779K96120P770361Q86258j1402787
10381a127117q178162P126895J1493026O24243n655140J318658N422303m614240
10373F410466j5244667j0131988N009074J2934340Q893412K168746N52984K954466
10365A3546833M168735J014318m770626p729831m582686J681752N928533O481886
10357A5738914L858093j331996n467409l442095K104625J490133n976821p561979
$$ y = [-3309504, -519057, 2100681, 5135790, 4394836, 45525, -596517, 4262207, 6358067, 1520399, -2669588, 38182, 4136783, 2259331, -3063414, -4440479, 75249, 6741349, 10694842, 8250895, 551015, -4654231, -1924213, 2629975, 225638, -5183734, -2931105, 5044171, 6626710, 1322931, 1619051, 9389412, 10275670, -1127117, -9305279, -2178384, 9314642, 9938885, 4283745, 5602403, 11024706, 6410466, -8834201, -18966189, -13957115, -1022775, 7870637, 10039383, 10592367, 13546833, 17715568, 18729886, 13959260, 6229429, 1646743, 3328495, 9257028, 15738914, 19597007, 18265011, 12797602, 9355507, 11460132, 12950265, 6973444, -588535]
10349e88535K247448R266824J228370j0295828p236280N675404R647515K787156
10341A2732074n20657K583969N38378p508395p941082J878893P304145K216245
10333A1283570m54214O831959J1425237K207742j0934414j2887915n090122J489139
10325C870982L799971M596332K516317l498624p367754m053410J907811M488521
10317F260146N267876O582499M509456k218700n286122P49402P124964L253463
10309B6242984o406719r431190l780395K334820M274389L565660O93907l936948
10301A3556508n384699p85071L164211l89271n969484m098832K396919L582073
10293F072354J81338J051361M989460K121159n874277n272147N684957J0749585
$$ y = [-588535, 1658913, 10925737, 12154107, 1858279, -5378001, 297403, 9944918, 12732074, 12211417, 14795386, 15333764, 7825369, -115713, 1763180, 9067325, 11283570, 10829356, 17661315, 29086552, 31294294, 20359880, 7471965, 2381843, 3870982, 7670953, 12267285, 14783602, 11284978, 3917224, -136186, 1771625, 6260146, 11528022, 18110521, 22619977, 20401277, 15115155, 15864557, 22989521, 26242984, 19836265, 10405075, 6624680, 8959500, 13233889, 16799549, 17493456, 13556508, 8171809, 7386738, 10550949, 10161678, 4192194, 93362, 2490281, 6072354, 6253692, 7305053, 12294513, 14415672, 8541395, 3269248, 8954205, 19703790]
10285A9703790J666100p542292m046186K486444j958073j0131470o328078M507959
10277a641806L808188p925194j0046717L649858J3276576N135045n812461r06415
10269d62926J1789782J1581864j352647q196307k558310K179149k360225p025305
10261C595075l138656L228198L526433O46058Q85258J726947k099458p306021
10253A063834o890910j803111J192243K13734r17076n9220J829715M292634O330184
10244E252027M528237j738591o323820l984682J121044J716602r04568J94151
10236a39600M968267N902937K38794n755954o077130j550851L977755P442137
10228I006355N806045j443283p842202n287492M102590Q567031J977862q213379
$$ y = [19703790, 21369890, 13827598, 9781412, 12267856, 10309783, 178313, -6149765, -1641806, 2166382, -5758812, -15805529, -12155671, 1120905, 6255950, 443489, -462926, 11326856, 22908720, 21556073, 13359766, 10801456, 12980605, 10620380, 3595075, 456419, 3684617, 7211050, 7857108, 8742366, 10469313, 8369855, 1063834, -5827076, -7630187, -6437944, -6224210, -7141286, -7200506, -5370791, -1078157, 5252027, 9780264, 8041673, 1717853, -2266829, -1145785, 570817, -333751, -139600, 4828667, 10731604, 10970398, 5214444, -862686, -2413537, 1564218, 9006355, 14812400, 13369117, 5526915, 239423, 4342013, 12909044, 14886906, 6673527]
10220F673527j1844975q440718m080749j277925K190930P183131J0897960R990970
10212A1292151L912641l571235o152506j624220L461764J009149o323928p105922
10204e102106K196382J0427271O844458l801898q525735l672093K837145M205391
10196E408815J650842r38418k215829k154397q10057L04109p73342l191720l766680
10187f486677j032774L203650N852379M535540o20794n395720m639899M34256
10179d150039K209981k248278n231667J01794P227168M715879n577644j0087789
10171a3040595l534170M324665M924568K473149L463152M843620J303558l143908
10163A614039r14467N946079P802265J156877p186157r082001k766749O885450
$$ y = [6673527, -5171448, -13612166, -17692915, -18970840, -16779910, -9596779, 1301181, 11292151, 15204792, 11633557, 5481051, 3856831, 7318595, 8327744, 2003816, -5102106, -2905724, 7521547, 14366005, 10564107, 2038372, -1633721, 1203424, 5408815, 7059657, 6121239, 3905410, 1751013, 940956, 1245065, 471723, -2719997, -6486677, -7519451, -4315801, 1536578, 6072118, 5451324, 55604, -4584295, -4150039, -1940058, -4188336, -9420003, -9318209, -2091041, 2624838, -2952806, -13040595, -16574765, -12250100, -7325532, -4852383, -1389231, 3454389, 4757947, 1614039, 699572, 6645651, 14447916, 15604793, 8418636, -663365, -3430114, 3455336]
10155C455336J1284037M289603r332255j5414087o716258O267774Q494879K47463
10147B576492n843868m442809k203513l284307k870494J913320N721297M214471
10139d219411O38491j146845k119694k745140l98337L933447M680395J317687
10131e9407J68808K668757J910440m081037o811084j979790J784394k199666o245169
10122a4843754j623795O151224P801338O187764P581683O288823n232779j7978755
10114e668251j6562351l490236N126328N031005N638931Q203792L591281o517145
10106d646646p988129J180928N524991j307565n068495L826162J2909979Q826595
10098A3257820j003215l068945J01304j239478m858054l080145N52878k247658
$$ y = [3455336, 14739373, 19028976, 9696721, -5717366, -12433624, -6165850, 2329029, 2576492, -3267376, -7710185, -9913698, -13198005, -16068499, -14155179, -8433882, -4219411, -3580920, -4727765, -6847459, -9592599, -9990936, -6057489, -1377094, -59407, 109401, 2778158, 4688598, 607561, -6203523, -8183313, -6398919, -8598585, -14843754, -16467549, -10316325, -2514987, 3672777, 11254460, 17543283, 12310504, -5668251, -22230602, -25720838, -20594510, -15563505, -9924574, -1720782, 1870499, -4646646, -12634775, -11453847, -5928856, -7236421, -12304916, -8478754, 4431225, 13257820, 12254605, 9185660, 9286964, 8047486, 3189432, 109287, 662165, -1585493]
10090a585493q346665q914140n100234l290072j263422N450513R920964L794156
10082i334393m295131O65393J3910117J5633693K157445q228518m317302L029571
10074I220875K138851j506605Q45318M462898J029470n714421o982254l662991
10066a68859k170766j796228K162234O952218N399860j540550n121062j298749
10058B418098M933133P494282M954280j117504p373409q818849l708993K102091
10050H83129J587839l139705l470945K487473O670368L269842k680667l167009
10042B440325J578079M885340L280934r09172m465686n788133l824496O01734
10034b201075L140564N88448l132733j239455N281380P773723K595842l229439
$$ y = [-1585493, -9932158, -18846298, -23946532, -27236604, -28500026, -23049513, -13128549, -9334393, -13629524, -12964131, 945986, 16579679, 18737124, 10508606, 6191304, 9220875, 11359726, 9853121, 10698439, 15161337, 16190807, 10476386, 3494132, -168859, -2339625, -4135853, -1973619, 4978599, 10378459, 8837909, 3716847, 2418098, 7351231, 14845513, 19799793, 18682289, 11308880, 2490031, -1218962, 883129, 2470968, -668737, -4139682, -1652209, 5018159, 8288001, 5607334, 2440325, 4018404, 8903744, 12184678, 11275506, 6809820, 1021687, -2802809, -2201075, 939489, 1527937, -1604796, -2844251, 2437129, 10210852, 12806694, 9577255]
10026I577255l022888l47695j653054m721109k824549L116057N760773L200324
10018I085114K90386j503186n637153j0434392p859901L545578J3505013J3260163
10010A4251622O555404J703042l30181l313266p181555r187698r144857p353650
10002a4001139k014488N303033P300430J295901l904399j61884O629028N881870
9994F328352M7501q5604M965815L679360n609361j0023253l461566K265898l322933
9985e215791j1529384q182828L723917R348268N032791J135861K874254L176728
9977C63816k181579n715205j341199M301153K698887k395363k241266J304346
9969e206410o9172m315369n86866J0957303J5170007L772714j0938845j3152389
$$ y = [9577255, 6554367, 6206672, 4553618, -167491, -2992040, 124017, 5884790, 9085114, 9375500, 7872314, 2235161, -8199231, -16059132, -12513554, 991459, 14251622, 20807026, 22510068, 22179887, 18866621, 11685066, 2497368, -6647489, -14001139, -16015627, -10712594, -3412164, -2116263, -6020662, -6182546, 446482, 6328352, 6375853, 6290249, 11256064, 14935424, 9326063, -697190, -4158756, -1892858, -5215791, -16745175, -24928003, -21204086, -11855818, -6823027, -5687166, -2812912, 363816, -1817763, -7532968, -8874167, -4573014, -1874127, -4269490, -6510756, -5206410, -5275582, -9590951, -10177817, 779486, 15949493, 19722207, 8783362, -4369027]
9961d369027m586285K075225K818722K894195L358184Q43024j944929O92732M761776
9952F543617Q49161q523868j0439663k631017K488206o36534j404539O655049
9944g099588J2194536M811250n923937n340277K445087K329480o396622r884552
9936a2864623k606057N900683P738465N624415K980512j751585p144825o863219
9928h986234p29580K322266j977069n457550k43520Q315505R438468K199650n438467
9919e56531r184625j0711179q911427M50695J3602964J7316408N891653p521454
9911C76504o738915M459094P808758j675091q731226l169144M114243R98591m829611
9902g386797n21298Q080309O680839j843347l787928o52927m813675j2828891
$$ y = [-4369027, -8955312, -6880087, -4061365, -1167170, 2191014, 3034038, 1089109, 1781841, 6543617, 7392778, -1131090, -11570753, -14201770, -11713564, -12350098, -13754637, -7099588, 5094948, 9906198, 3982261, -1358016, 1087071, 3416551, -2980071, -12864623, -15470680, -9569997, -1831532, 3792883, 6773395, 5021810, -2123015, -8986234, -9715814, -7393548, -9370617, -14828167, -15071687, -6756182, 2682286, 4881936, -556531, -9741156, -20452335, -29363762, -28913067, -15310103, 2006305, 7897958, 376504, -6362411, -1903317, 5905441, 4230350, -4500876, -7670020, -3555777, -2557186, -7386797, -7908095, 172214, 6853053, 5009706, 1221778, 568851, -4244824, -17073715]
9894a7073715r813239O95616R92848n721344M97201J2032301l614831m0871960
9886f2877123m3081413J5051876P4191189O5648047Q395305k3130498p243990
9879B6953393R636502j318662j3917189n375334N035741j542038q475986J361845
9871A2358272J2079664N082660o651412l402635O397112M287297n226279p046260
9863A7878419l961646o423097q560633m91360Q069019K687564p827266m883220
9855c512220O722414O520274n558375q772628K799263J0877792M093142m891679
9847H277983k062625O801023Q394816J876052m094661n349336l878349j135811
9839H829092K467769M147661P93980n747992q821367l983516M519751O779416
$$ y = [-17073715, -26886954, -26191338, -25198490, -30919834, -30422633, -18390332, -22005163, -62877123, -105958536, -90906660, -16715471, 48932576, 57327881, 34197383, 26953393, 36589895, 35271233, 21354044, 15978710, 21014451, 19472413, 10996427, 12358272, 24437936, 29520596, 22869184, 19466549, 25863661, 30150958, 24924679, 17878419, 13916773, 7493676, -1066957, -1558317, 6510702, 9198266, 1371000, -3512220, 3210194, 9730468, 4172093, -4600535, -1801272, 9076520, 13169662, 8277983, 6215358, 13016381, 21411197, 23287249, 19192588, 13843252, 9964903, 8829092, 11296861, 15444522, 16238502, 10490510, 1669143, -2314373, 2205378, 8984794]
9831H984794p93318r230434p986502M74538N207113L824441L478174N018596R53121
9822I930523p378119o982936M916931J2381940M906481n383592m321720J219657
9814I289165k036860q671847m502107P045721J0117088L257754k02206L234683
9806A7531391K998204m118870p888599l676843n3925k186395l084679K308433
9798A828717P580633O094857Q70799k602736l846057l030653J317416N895272
9790A4108248L468994n221645r600077m127292L742509N416493K380077J94568
9782A0361875m77332q33705O21456L245365J604474n659197j0400414n803257
9774g340735K282903K929248m005824p863458k445802O031796Q020055K522361
$$ y = [8984794, 8191476, -1038958, -9025460, -8550922, -3343809, 480632, 3958806, 8977402, 9930523, 2552404, -4430532, 486399, 12868339, 17774820, 12391228, 8069508, 9289165, 7252305, -1419542, -5921649, 1124072, 11241160, 14498914, 14296708, 17531391, 20529595, 16410725, 8522126, 4845283, 4791358, 2604963, -479716, 1828717, 9409350, 15504207, 16375006, 13772270, 9926213, 6895560, 8212976, 14108248, 17577242, 12355597, 2755520, -1371772, 2370737, 7787230, 10167307, 10361875, 9884543, 9050838, 9672294, 12917659, 14522133, 8862936, -1537478, -7340735, -5057832, -2128584, -6134408, -13997866, -16443668, -10411872, -2391817, 130544]
9766A30544l206266l325500N82798L182846K372668M66965m04063p25449r43658
9757a869115l0267J548878J006148j998390l251553j32589L274645J465169m299374
9748d286448p332566l804984L567747Q943809Q401258L499560Q10059M379680
9740A4178115Q321910L256725q346707j2210273k224984R215774Q540095l65111
9732B0365544n118154m505214o055526r229992o061017K517373N311529j800815
9724d576272q863352n950923M527950J3057239J3582566O379313l593571r309034
9716E253916p502001k492171k19591l34172O51110J696996n968j726380Q11664
9707c866597M558017L407046p14827q14536K670677K726222j647692m212966k698647
$$ y = [130544, -3075722, -6401222, -5818424, -2635578, -262910, 204055, -200008, -925457, -1869115, -1899382, -350504, 655644, -1342746, -4594299, -4726888, -1452243, 12926, -4286448, -11619014, -15423998, -11856251, -2912442, 5488816, 8988376, 9798435, 14178115, 22500025, 25756750, 17410043, 5199770, 2974786, 12190560, 20730655, 20365544, 15247390, 10742176, 4686650, -4543342, -10604359, -8086986, -2775457, -4576272, -13439624, -19390547, -14862597, -1805358, 11777208, 18156521, 14562950, 5253916, -2248085, -4740256, -4959847, -5294019, -4642909, -2945913, -2951881, -4678261, -3866597, 691420, 4098466, 3383639, 2569103, 5239780, 7966002, 6318310, 2105344, -593303]
9698e93303q38176O87771M562941P894842M278954m183744q101791n293615k885641
9689d471762l761277k889599J054029K910117K327455M897165Q932087M954439
9681A3952654o964955j3320957o905327K799157N826628N023357N263323L073841
9673H747721k973713m404129K898788Q158869K278860n786021l735699K533152
9665G717828q47180j0429155r276452N480029J6886535J2756100Q81310n672310
9657A7496705o170913p562612j0735783j0124586l522500M560364Q955112R090016
9649A985803P383952M891046Q76019l492701m328806n67772K492689q1604m661189
9640D497437l985573J007968K590389l79302m92796M304222N741110m97382o086583
$$ y = [-593303, -1431479, -743708, 3819233, 11714075, 15993029, 11809285, 3707494, -1586121, -4471762, -8233039, -11122638, -10068609, -7158492, -4831037, 66128, 8998215, 13952654, 6987699, -6333258, -13238585, -10439428, -4612800, 410557, 5673880, 8747721, 5774008, 1369879, 4268667, 12427536, 14706396, 8920375, 5184676, 7717828, 6870648, -3558507, -12834959, -7354930, 9531605, 22287705, 23169015, 17496705, 11325792, 3763180, -6972603, -17097189, -20619689, -16059325, -7104213, 1985803, 9369755, 14260801, 15136820, 11644119, 7315313, 6747541, 9240230, 9158626, 4497437, 511864, 1519832, 4110221, 3730919, 3238123, 7542345, 13283455, 12786073, 6699490]
9631F699490l688722R2921m087508j1167351q102969N657667J5959975J2572515
9623A3936018Q28582p160019o335704j454129K03169k898091n043231j170551
9615i093956M741480M336647k021495m994178j405303O33896k968422l447948
9607a4219279M940980J1370459M486202o703927n142709O023347P061996o266109
9599A550960j4352355l759078J1961331J2567059o05277j0029345p674223j432162
9591a1773090Q92245J155652L225617N482456M690576J621486p71311j584592
9583B939039j737463j608031j034801m38553k75033M897J299139L496118N409189
9574H054501N599615K970655k226127p050171p247182k246845K463954J331272
$$ y = [6699490, 3010768, 3103689, -983819, -12151170, -20254139, -14596472, 1363503, 13936018, 14764600, 7604581, 1268877, -185252, 17917, -2880174, -7923405, -9093956, -4352476, -15829, -2037324, -7031502, -8436805, -7802909, -10771331, -14219279, -9278299, 2092160, 6578362, -125565, -5268274, 755073, 7817069, 1550960, -12801395, -16560473, -4599142, 7967917, 7362640, -2666705, -10340928, -11773090, -10880845, -9725193, -6499576, -1017120, 3673456, 5294942, 4523631, 2939039, 1201576, -406455, -1441256, -1879809, -2154842, -2149945, -850806, 2645312, 8054501, 13654116, 16624771, 14398644, 7348473, 101291, -2145554, 318400, 1649672]
9566A649672l422415m329968M90726M545740L077313k55431q79247j038113l675738
9557c837461m655303J25726M683262R34368o249203m700909M793850P908803o64800
9548a661667q041616l004754P217518R170389K634116k523917k320759r93939
9540D75371j221048j367645q13772r24574j726592k316121k703706k095409J171430
9531a1522066N256164N479118K389748K638865P781887R800475L406387m915265
9523B0315313p102135n213339m859590m315055J24359M211415K018946k524445
9515B655469j427907L391659L008754l612827q181080n793264J57505N163318
9507d638373P401575N484926M61993j474311L546658Q767643M772580n776331
$$ y = [1649672, -1772743, -6102711, -5611985, -1066245, 2011068, 1755637, 876390, -161723, -3837461, -8492764, -8367038, -3683776, -2749408, -8998611, -13699520, -8905670, -996867, -1661667, -9703283, -12708037, -5490519, 3679870, 6313986, 3790069, 1469310, 475371, -745677, -2113322, -2927094, -3851668, -5578260, -7894381, -10598087, -12693496, -11522066, -6265902, -786784, 1602964, 4241829, 12023716, 21824191, 25230578, 20315313, 13213178, 7999839, 3140249, -1174806, -1050447, 3160968, 5179914, 2655469, 1227562, 4619221, 7627975, 4015148, -4165932, -9959196, -9801691, -4638373, 2763202, 8248128, 8710121, 7235810, 10782468, 19550111, 24322691, 18546360]
9499A8546360j0739776n388182K263391L408844j973190p775870p645900O60820
9491h643503J0825724J1008029j476887j2981388j0272886M57042L297389k694877
9483a0481357l524281N692929J2693572P710224k592864o578919k384966M285909
9475D820247Q378007O916924n0544o485621n614634j84988N74539m532070o786257
9466b964397k075597L115993L302956J349495N01823j083911l864185m354524
9458f072347k633910k860012l477600J948728J0751894J0915892L15509p055816
9450A832338j764871O831429O336887o03506m756057n945376q027925p585705
9442a3682786r11802N147782K824152k046496J294316R974542J1565740L930366
$$ y = [18546360, 7806584, 2418402, 4681793, 8090637, 6117447, -1658423, -9304323, -8643503, 2182221, 13190250, 11713363, -1268025, -11540911, -11083869, -7786480, -10481357, -14005638, -8312709, 4380863, 12091087, 9498223, 2919304, 534338, 4820247, 13198254, 20115178, 20064634, 13579013, 7964379, 7779391, 8353930, 3821860, -2964397, -5039994, -1924001, 1378955, 2728450, 3230273, 2146362, -1717823, -6072347, -8706257, -11566269, -15043869, -13095141, -2343247, 8572645, 8888154, 1832338, 67467, 6898896, 13235783, 12632277, 7876220, 1930844, -6097081, -13682786, -14594588, -9446806, -6622654, -8669150, -7374834, 2599708, 14165448, 18095814]
9434A8095814k711227k764815j496801l200421m322831j189548L537982M774641
9426A0722794N67852o267040q629749q46960J1413958J3079218j109731j6304873
9418B625469j6541257o793049k719849m814720m42097J0851433J4179144M583368
9410I28442l608396p666O067068L188311l200529j947916M729835O866952L591213
9401A6607314J107852m27392m972114r380838o925653j05668K039493j390894
9393c447900k714099O1878M06612l493293m465558O56147M606535K151745n80829
9384f818762L056913P785020M120641o177882j1684856o299562M907997J3363496
9376B253005J3842652N487636o734291j2648148o531201L962631N954201j529702
$$ y = [18095814, 15384587, 12619772, 11122971, 7922550, 3599719, 2410171, 5948153, 10722794, 11290646, 5023606, -3606143, -4453103, 6960855, 20040073, 18930342, 2625469, -13915788, -20708837, -23428686, -28243406, -28685503, -17834070, -3654926, 928442, -2679954, -2687620, 3379448, 6567759, 3367230, 1419314, 6149149, 13016101, 16607314, 17715166, 17287774, 12315660, 2934822, -3990831, -4096499, -2057006, -3447900, -6161999, -6100121, -5693509, -9186802, -13652360, -12996213, -8389678, -6237933, -6818762, -3761849, 4023171, 8143812, 1965930, -9718926, -16018488, -11110491, 2253005, 16095657, 21583293, 14849002, 2200854, -4330347, -367716, 5586485, 4056783]
9368D056783o878904l341254K456984K915026P67567J589001L005384l6092m586278
9359e1783l598518K132563M667285Q98733l656470l489817O32072M882559O790791
9350I207415N403711R50206m653056r099072j0907344q186359K08377R427191
9342g648931R884651m72091j0155180q180634L47943K660674j178579O90622J0285082
9333c766443J3790652K733764j1146315j1395264P09591R150527M726985n151077
9325c47580p594292P36413J0604492J0188905j415525j1312115p170836O087278
9317b23260J0804851l23088j3677576j2585091P69299R160495K962094q996906
9309a2109182j1728358j632578J0825184J3929855P537367J394920J384783K248369
$$ y = [4056783, -2822121, -6163375, -3706391, -791365, -23798, 1565203, 4570587, 4534495, -51783, -3650301, -1517738, 3149547, 4048280, 391810, -3098007, -2465935, 2416624, 9207415, 14611126, 15561332, 10908276, 1809204, -9098140, -17284499, -17076122, -7648931, 2235720, 1763629, -8391551, -16572185, -16224242, -13563568, -14742147, -14051525, -3766443, 10024209, 12757973, 1611658, -9783606, -9074015, 76512, 4803497, -347580, -7941872, -7205459, 3399033, 13587938, 12172413, 860298, -6310538, -223260, 10581591, 10258503, -3419073, -16004164, -15234865, -6074370, -3112276, -12109182, -23837540, -25470118, -14644934, -715079, 6822288, 8217208, 9601991, 11850360]
9301A1850360k447095q309426o158278K507570O337545J064064m815233m190076
9293d160569j056908j290798l002801k340205q56326l67056K170167P475955Q779935
9284E351394K101229m490383j191546Q367479J1611714M034666o669318j1791432
9276G323803r604183l436485J864939K371061j248646l806128k413616J89309
9268h759946J902505M905294Q653636O706314k400314q286050k070249R016049
9260I667239J0716913J519477p148362p802987l655201m9179J133004o32506l644889
9251A03509k431890M725241R354535L356891o765794p496780J395482O526600
9243H767794J343142n674555n939407k145832j37950N87623K440467L440211J230698
$$ y = [11850360, 9403265, 1093839, -5064439, -2556869, 3780676, 4844740, 29507, -4160569, -5217477, -6508275, -9511076, -11851281, -12707607, -13074663, -10904496, -3428541, 5351394, 7452623, 2962240, 1770694, 10138173, 21749887, 25784553, 19115235, 7323803, -2280380, -5716865, -3851926, -1480865, -2729511, -6535639, -8949255, -8759946, -6857441, -1952147, 6701489, 13407803, 11007489, 2721439, 651190, 9667239, 20384152, 21903629, 14755267, 6952280, 3297079, 3247900, 4380904, 3748398, 103509, -2328381, 2396860, 11751395, 15108286, 8342492, 845712, 2241194, 8767794, 10110936, 4436381, -1503026, -3648858, -3786808, -3199185, -758718, 2681493, 3912191]
9234C912191j792216j957359O35946L165963L141523k44582m464560m408300R46368
9225a065026M964268K009330l603295m443391j856802j823977k725527J266122
9217g278298P153352O523811Q94373l58329K552498j37946q304443r141031J208974
9208f887039R421202N831118j496418k511481q16791k828037m191310N09440N166481
9199B197165K304294k874791j433804L689568L628473j152312l719242l114252
9191d74901k203065J049080P831292R783279k40238j3117402j3705821l367373
9183a4445149K716563l97739j826126M830845J0950876Q215935J861270P12962
9175A2619437K809997k75054r135870j4120771p190841P335842J5563572Q699130
$$ y = [3912191, 2119975, 162616, 798562, 3964525, 7106048, 6861466, 2396906, -2011394, -1065026, 3899242, 5908572, 2305277, -2138114, -3994916, -5818893, -8544420, -7278298, -124946, 6398865, 7293238, 6934909, 9487407, 9349461, 1045018, -8096013, -6887039, 2534163, 8365281, 6868863, 4357382, 3540591, 712554, -3478756, -2969316, 2197165, 4501459, 1626668, 192864, 3882432, 7510905, 6358593, 2639351, -474901, -2677966, -1628886, 6202406, 15985685, 15745447, 2628045, -11077776, -14445149, -11728586, -12126325, -13952451, -9121606, 1829270, 10045205, 11906475, 12619437, 15429434, 15154380, 6018510, -8102261, -15293102, -7957260, 7606312, 16305442]
9167A6305442n608081j1074239l466963L575588j585583j1059672r477421K410722
9159a9980207R031925L080879n507848n321854K560177R570584J0365633N477934
9151I277223n52086k166272Q55926J079845n995714j1952022n947912O933825
9143h467187J0678065K226100l948378Q77658O331879J014789q461301q010987
9135g759362K339031R525272O409411q37894l555196q76375J798683J61914m045516
9126C159968m386221K417149J0329324J0130593J935294m629344m023875j116320
9118A3816568j292668k544981j914702j764393l749955l962327o32794N96216
9110a449036l473988n840329m36199N772491K818816n295641o148771J269182
$$ y = [16305442, 10697361, -376878, -3843841, -268253, -1853836, -12913508, -22390929, -19980207, -10948282, -7867403, -13375251, -18697105, -16136928, -6566344, 3799289, 9277223, 8725137, 6558865, 7414791, 8494636, 2498922, -9453100, -15401012, -8467187, 2210878, 4436978, 488600, 1366258, 7698137, 8712926, 251625, -7759362, -5420331, 4104941, 10514352, 9676458, 6121262, 5244887, 7043570, 7205484, 3159968, -1226253, 1190896, 11520220, 21650813, 23586107, 18956763, 14932888, 13816568, 12523900, 9978919, 8064217, 6299824, 2549869, -1412458, -2045252, -1449036, -4923024, -10763353, -11199552, -5427061, -2608245, -7903886, -14052657, -12783475]
9102a2783475N320374M99767m915746k760515L918686P716604O489545K016456
9094E501696l850230p613730m995086K402175O630279L633599r23851j81196M113050
9085D716706N190378J430929k181597j571809J401521J690324k786509p851423
9077C8520o586366K154684J0169129Q628648m45014o586848m841218q79816m97419
9068A154300j263961J031917L960850K733363j460510l948902m148558l879975
9060e821476j106489O283858J1824031N641447r540987j7234276p739003P613348
9052a0079547J0854807J126077o017964j728062M951826K845768m092294l919168
9044f058557M060990P865898P40170r137165j0691714m391608J230243K452404
$$ y = [-12783475, -7463101, -6963334, -11879080, -14639595, -10720909, -3004305, 3485240, 5501696, 1651466, -5962264, -10957350, -8555175, -1924896, 1708703, 784852, 603656, 4716706, 9907084, 11338013, 9156416, 7584607, 8986128, 10676452, 7889943, 38520, -6547846, -4393162, 5775967, 14404615, 13959601, 7372753, 2531535, 1651719, 1154300, -109661, 922256, 4883106, 7616469, 6155959, 2207057, -1941501, -5821476, -6927965, -644107, 11179924, 16821371, 7280384, -9953892, -17692895, -10079547, 775260, 1901337, -4116627, -5844689, -892863, 1952905, -2139389, -6058557, -1997567, 5868331, 6608501, -2528664, -13220378, -17611986, -16381743, -13929339]
9036a3929339K565728L675099L835182K510029K406454M265904M945168K559147
9028A2833372q19634l211076m908483m893784n69900N871955O706753o56436p579782
9019B772985n686367m2216j550022q440567p221429N574323J4698165O976035
9011G080907q313440j1246549J145165J1967780R219024N71799j397278K310270
9003A1337678K366639k477971n343932m439726n055078q019501o672725J458869
8995a6845747Q798373Q393106L360887J60446j331712m390857p107048n168809
8987a4131361j20096K321025N81015k004739k696088k16353O447606J3618044
8979C799053J1969055p49345j0459429k919034J3094287J4405286l053953j6563342
$$ y = [-13929339, -11363611, -7688512, -3853330, -1343301, 1063153, 5329057, 10274225, 12833372, 12013738, 8802662, 3894179, -999605, -1569505, 4302450, 11009203, 10352767, 2772985, -2913382, -2955598, -4505620, -12946187, -20167616, -14593293, 104872, 7080907, -1232533, -12479082, -11333917, 633863, 9852887, 10424686, 9027408, 11337678, 13704317, 11226346, 5882414, 1442688, -3612390, -11631891, -18304616, -16845747, -8047374, 345732, 3706619, 3867065, 2535353, -1855504, -8962552, -14131361, -14251457, -11930432, -11349417, -13354156, -16050244, -16266597, -9818991, 3799053, 15768108, 15018763, 4559334, 1640300, 14734587, 29139873, 26085920, 9522578]
8971I522578r245984O161293Q043468l165070j0317317o613642l16139K736057
8963c194756M612300M723678p37252p823824p140496P27879M691949O67954k758537
8954f231105K59906M062885L255547J657135K909930K631550k373790o205812
8946c3754l452940J131789Q20644k359703l408962l771267n832567m844672L030166
8937a8721266J0251006P283803j419217l168819L364738O953478K050652m196603
8929B397772m982557k401561J10467L223385N494231J817982o423978q799168
8921i563427j32013J0367299J1627562N494962O34793k227485q279753j5009544
8913g087606j2660692R4954J1087801J0059487K030871j000775K838249M330299
$$ y = [9522578, 276594, 6437887, 14481355, 11316285, 998968, -5614674, -5930813, -3194756, 1417544, 6141222, 5403970, -2419854, -9560350, -8832471, -4140522, -3472568, -6231105, -5971199, -1908314, 1347233, 3004368, 5914298, 8545848, 6172058, -33754, -3486694, -2354905, -1534261, -3893964, -7302926, -11074193, -16906760, -21751432, -18721266, -8470260, -1186457, -2605674, -5774493, -2409755, 4543723, 6594375, 2397772, -2584785, -4986346, -4875879, -1652494, 3841737, 5659719, -764259, -9563427, -9695440, 671859, 12299421, 17794383, 18429176, 16201691, 7921938, -7087606, -19748298, -19653344, -8565543, 1493944, 3524815, 2524040, 5362289, 9692588]
8905I692588j505512p198299l824700N217641Q306110J948429m571574l013035
8897E051648K328699K179878l735742p546963n578895k007903l92141Q67276K954519
8888e879624L190849M6781l541281m634048l705472j539952K392171O176609N495181
8879a998786N92091k048394J293139N942689O218177L179308L81063k452432n596864
8870E509991m808204J627508N886619r5584j0978440j3495173m815462M340201
8862a6828544N717046K912201K104009K585650J344938k12240J29334L30626j784202
8853c701182l394593j076693K737309L008952j77756k125013q32724O61331m97488
8844e397857k794245k640049O08669L272834J728651k080744k059058L281406
$$ y = [9692588, 8187076, 988777, -2835923, 2381718, 10687828, 12636257, 8064683, 5051648, 7380347, 9560225, 5824483, -1722480, -7301375, -9309278, -9701419, -8834143, -5879624, -2688775, -2641994, -6183275, -10817323, -14522795, -16062747, -13670576, -7493967, -1998786, -1406695, -3455089, -2161950, 3780739, 9998916, 13178224, 13559287, 11106855, 5509991, 701787, 2329295, 8215914, 8120330, -2858110, -16353283, -21168745, -16828544, -11111498, -8199297, -6095288, -3509638, -2164700, -2376940, -2247606, -1916980, -3701182, -7095775, -8172468, -5435159, -2426207, -2603963, -4728976, -5561700, -4900369, -5397857, -8192102, -10832151, -10223482, -6950648, -5221997, -7302741, -9361799, -6080393]
8836f080393P039355L529184j795103K46498P187642P531607l66944m590800M01768
8827A3102814L542362l582813r788001j476214J2266222J0759394n466118j3517156
8819E840490k539608J0462885P577959m206804p102645k4404L621128j201626
8811A2427375o126589n305524k839094k944016l196320m77729L587866N642720
8803G68689M199378l87441n174005m969875J157121N575298J352440n800908l996895
8794g276198O240061J0478496J011984j0987024j0600222R63165R676441P333281
8786F839984j113819o664691n590247q816N253664N743465R75760m614030o307989
8777e486719l699773R67394O279927J0395771R444392K181031n430174n813374
$$ y = [-6080393, 958962, 4488146, 2693043, 2939541, 10127183, 17658790, 17291846, 12701046, 13102814, 16645176, 13062363, 3274362, 1798148, 14064370, 24823764, 19357646, 5840490, 3300882, 13763767, 21341726, 17134922, 10032277, 10007873, 13629001, 12427375, 6300786, 995262, -1843832, -4787848, -7984168, -8461897, -4874031, 768689, 4968067, 4580626, -593379, -5563254, -4406133, 1169165, 2521605, -3279303, -7276198, -1036137, 9442359, 10454343, -532681, -11132903, -10169738, -493297, 6839984, 5726165, -938526, -6528773, -6537589, -1283925, 4459540, 5435300, 821270, -5486719, -9186492, -8219098, -1939171, 8456600, 17900992, 20082023, 14651849, 8838475]
8769H838475J61930L859242M40780n113094n653364j520944Q97605j666333n220709
8760d976412l969794K101050O728865M640336j945375n784734l368917J239822
8752e335159K378825R0167q99222J981675N986078O462931J776313m925426q093446
8743e77264n012254P33259K878857K50444j969044o4221L020122L112260J297517
8734C669676N02680p10894m838868q425005n758790J002580L211688j341360m377223
8725a7065516N82826Q270900R135064K524438l079432j048259O495864J1745598
8717A7561483Q324388l109186j3903848j4289770m124544N664051N750168m25496
8709A447246k976350j42763R26250k504011l621077K237310Q602683P112665K10817
$$ y = [8838475, 9000405, 12859647, 13300427, 8187333, 2533969, 1013025, 1910630, 244297, -4976412, -8946206, -6845156, -116291, 4524045, 2578670, -3206064, -6574981, -5335159, -2956334, -2866167, -3765389, -1783714, 4202364, 10665295, 12441608, 7516182, -577264, -5589518, -4856259, -1977402, -1726958, -3696002, -3760223, -740101, 2372159, 3669676, 4172356, 3461462, -1377406, -9802411, -15561201, -14558621, -11346933, -12688293, -17065516, -16482690, -8211790, 923274, 3447712, 368280, -679979, 5815885, 17561483, 25885871, 22776685, 8872837, -5416933, -9541477, -3877426, 1872742, 1447246, -1529104, -1671867, -745617, -3249628, -6870705, -4633395, 3969288, 11081953, 11292770]
8700A1292770l472630k918470m260522p523658m823833N305782J2185227P763773
8692A3548439j308306m217787j471217m28173j392455L08200K375934j239605
8684F175030o896357n056932K152256K391299n092750n725014N679912J3278393
8676F905837M634602q041108o293684O315371J1692455N249189j664124k945716
8668A5852822l338947m426728k179207J146659j317375o384486l712150M779115
8660D19703N081555n406787j1418697l390513Q233099J0733402O775835M311529
8652A5339126J832640m405535q841541m809849L096184N945080L591770J311391
8644A3059266k48053k394591k166609J766715L345311j286240n132507j449015
$$ y = [11292770, 7820140, 4901670, 641148, -6882510, -11706343, -6400561, 5784666, 13548439, 12240133, 8022346, 6551129, 6122956, 4730501, 5038701, 7414635, 6175030, -721327, -5778259, -3626003, -1234704, -6327454, -12052468, -6372556, 6905837, 11540439, 3499331, -2794353, 3521018, 15213473, 20462662, 18798538, 15852822, 12513875, 8087147, 5907940, 7054599, 5737224, -647262, -4359412, 419703, 5501258, 94471, -11324226, -14714739, -6481640, 4251762, 11027597, 15339126, 17171766, 12766231, 3924690, -885159, 2211025, 8156105, 11747875, 13059266, 12811213, 10416622, 8250013, 10016728, 13362039, 12075799, 6943292, 5494277]
8636E494277L419749k0712p657700p964804p66981L536036J183816j366461j07913
8627d250693K273465M574791Q177965R798760M094065n580906r180930l995268
8619E911249K397915L818357J280118k816393o891865o829858m02736N353219
8611A820006K225774m208762r81283R949359J1501540j625291j2110064n556517
8603A014762P419869Q094067k021090n953155J127890O114041J42597q360888
8595G578093p942660o76453K971593m59618m875102m809994j213468K940394O804247
8586C17032R146288O499364j739886r093401q343471j272736L540829K684404
8578A738423J131305K252391K428733n93719j818666K234335N572260J575908
$$ y = [5494277, 8914026, 8893314, 1235614, -6729190, -7496171, -3960135, -2776319, -4142780, -4250693, -1977228, 2597563, 10775528, 20574288, 24668353, 19087447, 9906517, 5911249, 8309164, 12127521, 13407639, 10591246, 3699381, -3130477, -3533213, 1820006, 4045780, -162982, -1144265, 8805094, 20306634, 18681343, 6571279, 1014762, 8434631, 16528698, 14507608, 8554453, 9682343, 15796384, 15938981, 7578093, -364567, -1041020, 1930573, 1470955, -3404147, -8214141, -9427609, -6487215, 317032, 9463320, 15962684, 14222798, 5129397, -3214074, -4486810, -945981, 1738423, 2869728, 5122119, 7550852, 6957133, 5138467, 7372802, 12945062, 14520970]
8570A4520970n234087n227492J719745O444853L560096l519958r082727r647324
8562f465924m049996M243153P674921M036052J034186M034757N759559j295422
8554A4971286r256196o142631K706817K145024o431604o264623N774461J2140195
8546I642729K493594j0597966j2647618o719241j616553L370534R817771J0641366
8538D384616K747321l055904J457721O818410J624032p335403o865887j23089
8530c48183K85172m639819l078150N028318P090809j85859n418685k086265J904595
8521a448067p09391m700288k289662M341016P273775L829240j821806m512642
8513c7825k619582Q84308J297048j788184l092278O22270M738676L424542j491605
$$ y = [14520970, 9286883, 4059391, 5779136, 12223989, 15784085, 12264127, 3181400, -6465924, -10515920, -6272767, 1402154, 5438206, 6472392, 10507149, 16266708, 14971286, 5715090, -427541, 2279276, 4424300, -2007304, -8271927, -2497466, 9642729, 12136323, 1538357, -11109261, -17828502, -19445055, -16074521, -6256750, 4384616, 7131937, 4076033, 5533754, 12352164, 13976196, 6640793, -225094, -348183, -63011, -4702830, -7780980, -2752662, 4338147, 4152288, -1266397, -3352662, -1448067, -2157458, -6857746, -9147408, -4806392, 2467383, 6296623, 4474817, -37825, -2657407, -1773099, -476051, -2264235, -5356513, -4734243, 4433, 3428975, 1937370]
8504A937370m090823l279425j636354J006261N382344P490328L601114k158766
8496H252049l494724k434246n117283r588632p991522m2142N769507M854471J370040
8487h422482k09740j1659J278204L554169M169734R54044k431020j581826L54354
8478b346222j650206l466761K086070R982531P585810m682302j1591792n566332
8470i649204K807179K526719k058847j226234M296603O436534K278796l899033
8462A512513o718129l292847M596831R396938M874444m045262o085879M11244
8454F49853N653716M266716J728928J689270n39402o231868p681064j879997K380004
8445C6156l09519k010385L168497O405375j40587o828637j707058P466133M742600
$$ y = [1937370, -2153453, -5432878, -7069232, -6062971, -680627, 6809701, 10410815, 8252049, 4757325, 2323079, -2794204, -12382836, -20374358, -20416500, -14646993, -9792522, -8422482, -8632222, -8643881, -7365677, -3811508, 358226, 1312270, -1118750, -2700576, -2346222, -3996428, -7463189, -5377119, 4605412, 12191222, 7508920, -4082872, -9649204, -6842025, -4315306, -6374153, -7600387, -3303784, 3132750, 5411546, 1512513, -5205616, -8498463, -3901632, 5495306, 10369750, 6324488, 238609, 649853, 6303569, 10570285, 12299213, 13988483, 13449081, 7217213, -463851, -2343848, 36156, -273363, -2283748, 884749, 7290124, 7149537, 320900, -1386158, 6079975, 10822575]
8436A0822575o958036j0079265r59026N767505K183337k398437K720L930211L244926
8427E556510J410479J725844j8179n263551o469461K41482O216029L130224l961775
8418B567602n707882k696360q04696M69353M104398N926780Q06373n762531m695040
8409e792003R61135O25605m843302l676377N542822Q842893q18823j0644723p224393
8400a7027166L256569O425128K075881O32574L467075K797327j371429o51480
8392c95521M789864M860465j815295m036530J641319L255883m882063r203967
8384e785845R76452J2648352P930443o887028j1089305j737468N128144K760262
8376C944007J213583N050706M957832k746203p456279l085214J541701n542k41738
$$ y = [10822575, 3864539, -6214726, -7173752, -1406247, 777090, -1621347, -1618627, 2311584, 5556510, 6966989, 8692833, 8674654, 3411103, -3058358, -2816876, 3399153, 6529377, 2567602, -3140280, -5836640, -6641336, -6171983, -2067585, 3859195, 4665568, -1096963, -5792003, -4830868, -4205263, -9048565, -12724942, -7182120, 1660773, 841950, -9802773, -17027166, -13770597, -7345469, -5269588, -4637014, -1169939, 1627388, 255959, -395521, 4394343, 9254808, 7439513, 3402983, 5044302, 8300185, 3418122, -5785845, -4809393, 7838959, 15769402, 8882374, -2206931, -3944399, 1183745, 3944007, 5157590, 10208296, 15166128, 12419925, 4963646, 1878432, 3420133, 3414591, 3172853]
8367C172853O135264J0039608M018673l511055l237354r92963m406121o449119
8359D769786O98378O959422o22075j3013963j1193665K409263P361375j724986
8351d356465q706090m135413K662179M580695P831892J3845021J0773100m968262
8343A7526657j6466132r932595L924695P308213J607395m88382J060226l202652
8335A337425j0790656q796294L556156J1510350O918323j112580k556214n54901
8327d88391k204902n434537l780773J931776M951500K689165r17234j728666M36518
8318d545544L077378L368259L54263l033480k075440L216422O051804Q39300q393153
8309a140191j1694490n035160N431006J1474181J1266566Q069376M120581n99572
$$ y = [3172853, 9308117, 19347725, 23366398, 19855343, 16617989, 15625026, 11218905, 4769786, 5468164, 12427586, 11805511, -1208452, -12402117, -9992854, -2631479, -4356465, -13062555, -17197968, -14535789, -9955094, -2123202, 11721819, 22494919, 17526657, 1060525, -8872070, -4947375, 2360838, 3968233, 3479851, 4540077, 1337425, -9453231, -18249525, -14693369, -3183019, 3735304, 2622724, 66510, -488391, -2693293, -8127830, -11908603, -9976827, -5025327, -2336162, -3253396, -4982062, -4545544, -1468166, 1900093, 2254356, -779124, -2854564, 361858, 6413662, 7252962, -1140191, -12834681, -17869841, -12438835, -964654, 10301912, 18371288, 22491869, 21892297]
8301B1892297n181754p182089n478271j413554K960703N840032N427606J482681
8293A8347651l086119n246891o240181q892906j0496967m517756P960263J5076974
8285B904068Q353229m636732r067514j653491P187005Q647485M414201m06632
8277A5741619m391299o758524m979664n8568J987006j128879l346645N5847L669096
8268G89989J45726o975271p487141J52898O814042O489420L212920J730104J937
8259D874624l759731m092585L472683J1648313Q717072m043456j2033213p069425
8251b285718J575060J800239l185053j030904R135378J3992940N537675p183210
8243A8356407j1107317n836446j21476K225178L974174N343106K752306l426745
$$ y = [21892297, 16710543, 9528454, 4050183, 2636629, 5597332, 11437364, 16864970, 18347651, 15261532, 10014641, 3774460, -5118446, -15615413, -20133169, -12172906, 2904068, 11257297, 6620565, -2446949, -4100440, 3086565, 11734050, 16148251, 15741619, 11350320, 4591796, -387868, -446436, 1540570, 411691, -2934954, -2879107, 789989, 935715, -6039556, -13526697, -13373799, -6559757, -70337, 3142583, 4872687, 4874624, 1114893, -2977692, 494991, 12143304, 20860376, 16816920, 4783707, -2285718, -710658, 1089581, -2095472, -3126376, 6009002, 20001942, 25539617, 18356407, 7249090, 1412644, 1291168, 3516346, 7490520, 12833626, 15585932, 12159187]
8235A2159187p868078p988549o004312k824187K837804Q175166P281691J272059
8227G040781o14145N488460J0897828O746755k854003p416398n089036k857131
8219A1343111m477431o358224m743090k41207M636495P040493L957863l500841
8211G657169p578048k390484O228856P175521r7828n103121k538258J065676O9195
8202D488678j390995P06347J232445m375298r291368n199913K604738K557180
8194h668186l887744m196761M122333R148856M945346J536709O534808J0178934
8186A9714295J247793j1891315j1814060J204271R340556L682815n337020p049244
8178i01909m892662m839791k993977M811168J1219448P519840j065775k935338
$$ y = [12159187, 4291109, -3697440, -9701752, -12525939, -9688135, -1512969, 5768722, 7040781, 6426636, 11915096, 22812924, 29559679, 26705676, 19289278, 14200242, 11343111, 6865680, 507456, -4235634, -4476841, 159654, 7200147, 11158010, 7657169, 79121, -2311363, 3917493, 11093014, 10995186, 5892065, 3353807, 4419483, 4488678, 3097683, 3804030, 5036475, 661177, -8630191, -13830104, -11225366, -8668186, -12555930, -16752691, -12630358, -3481502, 1463844, 3000553, 9535361, 19714295, 20962088, 9070773, -2743287, -1539016, 7801540, 11484355, 6147335, -901909, -5794571, -10634362, -13628339, -8817171, 2402277, 9922117, 8856342, 5921004]
8170E921004J327058J099785n371871p858939j487345N324124M473967p16861
8162B710922l505155m056187n220736m893155J56592P154840J0189050P296399
8154I832570N98629o828069j0564781o347961L326737Q950756N489545p32080
8146C725346j932377J96751L90706M32368M224183O939556Q71986r748011j2084689
8137f984181l627750M040398L133695j64881J516275M204322N33522p190441j0273116
8128a4812157n724431J845155P382062Q829192O112042J485607j427294k251517
8120A438659m105089o622738m395645L354476Q098502L614399l582302l677893
8112e877631J449859K510798j237794j581680L669492O583848K234318l799179
$$ y = [5921004, 7248062, 8347847, 2975976, -4882963, -6370308, -1046184, 3427783, 2710922, -794233, -4850420, -10071156, -14964311, -14807719, -7652879, 2536171, 9832570, 10431199, 3603130, -6961651, -13309612, -9982875, -1032119, 4457426, 3725346, 1792969, 1989720, 2380426, 2812794, 7036977, 13976533, 14848519, 5100508, -6984181, -10611931, -6571533, -3437838, -3602719, -2086444, 2117878, 2651400, -4539041, -14812157, -20536588, -18691433, -11309371, -2480179, 3631863, 5117470, 3690176, 1438659, -2666430, -9289168, -13684813, -10330337, -2231835, 1382564, -2199738, -5877631, -4427772, -1916974, -3154768, -4736448, -1066956, 5516892, 7751210, 3952031]
8104C952031m848804k258912p95054j112447r36372Q30014M062906P307281O411346
8095A2611989j242151r919550r720802J65314R309824R758322M390152j446737
8087A3906361p543191j2684068j0257309J444408J1701024R948335R33417k531636
8079D917341J807813M730111J378641k541535j255313L016062M647280J447099
8071A8147499m406637q187626n833685J034486N470138M269755K365145L263734
8063A6122809J783092n494275r834811k674543P362855N202421n844601p676118
8055a053171L509459J0659787L405706o301541n180508J156577J072152l499901
8047C768560m049631j586849j750308k138068J692799M560412j62089o623445
$$ y = [3952031, -896773, -3155685, -3950739, -5063186, -5999558, -5169544, -1106638, 6200643, 12611989, 11369838, 1450288, -8270514, -8105200, 1204624, 10962946, 15353098, 13906361, 6363170, -6320898, -16578207, -15133799, -3432775, 6515560, 7448977, 4917341, 6725154, 11455265, 12833906, 10292371, 9037058, 12053120, 16700400, 18147499, 13740862, 5553236, -280449, 754037, 6224175, 10493930, 12859075, 16122809, 17905901, 12411626, 2576815, -97728, 7265127, 12467548, 6622947, -1053171, 2456288, 13116075, 16521781, 10220240, 5039732, 6196309, 7268461, 3768560, -281071, -1867920, -3618228, -5756296, -4063497, 496915, 334826, -6288619]
8039f288619m855699J865017K593499k221716k613102K304035L674019N17336
8031e025230J549227P320736O947808k377844q001503j645072O758168M953794
8023A0480084k830234m621188l86752j1351n318327o995757m33087O003924L320476
8014g92212m156925m139370O144243J4931137J1314177K35443m765813j304524
8006A7466156o22846q321519j3996813p592012L565396N479172j198807l797847
7998i019120J684145O221414L672072j737450m859627m888706l37903R119266
7990a45909J4800344O581096r268020j4354438m412157M242127R06009l668704
7982e319652J638953P592141J075534r743643o338236R796452J7254033N470127
$$ y = [-6288619, -11144318, -9279301, -6685802, -8907518, -11520620, -9216585, -5542566, -5025230, -3476003, 3844733, 10792541, 8414697, 413194, -1231878, 5526290, 10480084, 7649850, 3028662, 2641910, 2630559, -2687768, -9683525, -10116612, -4112688, -792212, -4949137, -9088507, -2944264, 11986873, 23301050, 23536493, 18770680, 17466156, 16843310, 8521791, -5475022, -13067034, -9501638, -4022466, -5221273, -9019120, -7334975, -1113561, 2558511, 821061, -4038566, -8927272, -9265175, -145909, 14654435, 21235531, 11967511, -2386927, -6799084, -2556957, -1650948, -5319652, -3680699, 3911442, 4986976, -4756667, -11094903, -1298451, 15955582, 21425709]
$$ [...]
##END NTUPLES=NMR SPECTRUM
##END=
