##TITLE=31Pdec_SR124T6'
 CDCl3, 24 sc
 2.6.2022
##JCAMPDX= 6.0         $$ Bruker NMR JCAMP-DX V2.0
##DATA TYPE= NMR SPECTRUM
##DATA CLASS= NTUPLES
##ORIGIN= UXNMR, Bruker Analytische Messtechnik GmbH
##OWNER= root
$$ XWIN-NMR		Version 3.5
$$ Fri Jun  3 14:41:51 2022 Russian Standard Time (UT+4h)  she@DPX200
##.OBSERVE FREQUENCY= 81.013821
##.OBSERVE NUCLEUS= ^31P
##.ACQUISITION MODE= SIMULTANEOUS
##.ACQUISITION SCHEME= undefined
##.AVERAGES= 24
##.DIGITISER RES= 16
##SPECTROMETER/DATA SYSTEM= spect
##.PULSE SEQUENCE= zgpg30
##.SOLVENT NAME= DMSO
##.SHIFT REFERENCE= (INTERNAL, DMSO, 0, 248.564)
##AUDIT TRAIL= $$ (NUMBER, WHEN, WHO, WHERE, WHAT)
$$ ##TITLE= Audit trail, XWIN-NMR		Version 3.5
$$ ##JCAMPDX= 5.01
$$ ##ORIGIN= Bruker BioSpin GmbH
$$ ##OWNER= she
$$ F:/spectra/data/she/nmr/P31/1/pdata/1/auditp.txt
$$ ##AUDIT TRAIL=  $$ (NUMBER, WHEN, WHO, WHERE, WHAT)
(   1,<2022-06-03 14:38:34.06 +0400>,<she>,<DPX200>,
      <created by zg, POWCHK disabled, PULCHK disabled
       configuration hash MD5:
       00 E9 B6 7A A2 85 ED C7 34 08 36 98 17 FE 4E 26
       data hash MD5: 32K
       04 37 CD AD DF C2 16 02 64 B0 E8 72 B4 2B 65 B8>)
(   2,<2022-06-03 14:38:56.68 +0400>,<she>,<DPX200>,
      <Start of raw data processing
       efp BC_mod = 2 LB = 1 FT_mod = 6 PKNL = 1 PHC0 = -10159.03 PHC1 = -172.7461 SI = 64K 
       data hash MD5: 64K
       0A 07 E4 18 05 67 CB 71 71 69 BD 2D 93 70 C1 3F>)
(   3,<2022-06-03 14:39:19.09 +0400>,<she>,<DPX200>,
      <pk PHC0 = 1.203709 PHC1 = 0 
       data hash MD5: 64K
       B2 04 E7 A7 47 9B AF DB 8F 93 94 1A FE DB 72 DC>)
(   4,<2022-06-03 14:41:20.03 +0400>,<she>,<DPX200>,
      <pk PHC0 = -2.8 PHC1 = 0 
       data hash MD5: 64K
       5C 44 1D B4 F9 BD 4D 74 01 0A 4E 9E 4F EF BD 7E>)
$$ ##END=
$$ 
$$ hash MD5
$$ D5 C2 7F F2 BF 84 75 38 FB B9 4A 42 6F 3E E9 E3
##$RELAX= 
##$RELAX= 
##$RELAX= 
##$RELAX= 
##$RELAX= 
##$RELAX= 
##$RELAX= 
##$RELAX= 
$$ Bruker specific parameters
$$ --------------------------
##$DU= <F:/spectra>
##$EXPNO= 1
##$NAME= <P31>
##$PROCNO= 1
##$TYPE= <nmr>
##$USER= <she>
##$AMP= (0..31)
100 100 100 100 100 100 100 100 100 100 100 100 100 100 100 100 100 100 
100 100 100 100 100 100 100 100 100 100 100 100 100 100 
##$AQSEQ= 0
##$AQ_mod= 1
##$AUNM= <au_zg>
##$AUTOPOS= <>
##$BF1= 81.014009
##$BF2= 200.13
##$BF3= 200.13
##$BF4= 200.13
##$BF5= 200.13
##$BF6= 200.13
##$BF7= 200.13
##$BF8= 200.13
##$BYTORDA= 1
##$CFDGTYP= 0
##$CFRGTYP= 5
##$CHEMSTR= <none>
##$CNST= (0..31)
1 1 145 1 1 1 1 1 1 1 1 1 1 1 1 1 1 1 1 1 1 1 1 1 1 1 1 1 1 1 1 1 
##$CPDPRG= <waltz16>
##$CPDPRG1= <>
##$CPDPRG2= <waltz16>
##$CPDPRG3= <>
##$CPDPRG4= <mlev>
##$CPDPRG5= <mlev>
##$CPDPRG6= <mlev>
##$CPDPRG7= <mlev>
##$CPDPRG8= <mlev>
##$CPDPRGB= <>
##$CPDPRGT= <>
##$D= (0..31)
0 1 0 0 0 0 0 0 0 0 0 0.03 2e-05 3e-06 0 0 0 0 0 0 0 0 0 0 0 0 0 0 0 0 
0 0 
##$DATE= 1654252713
##$DBL= (0..7)
120 120 120 11 120 120 24 19 
##$DBP= (0..7)
150 150 150 150 150 150 150 150 
##$DBP07= 0
##$DBPNAM0= <>
##$DBPNAM1= <>
$$ [...]
##$SUBNAM2= <"">
##$SUBNAM3= <"">
##$SUBNAM4= <"">
##$SUBNAM5= <"">
##$SUBNAM6= <"">
##$SUBNAM7= <"">
##$SUBNAM8= <"">
##$SUBNAM9= <"">
##$SW= 501.771253377433
##$SWIBOX= (0..15)
0 1 3 0 0 0 0 0 0 0 0 0 0 0 0 0 
##$SW_h= 40650.406504065
##$TD= 32768
##$TD0= 1
##$TE= 0
##$TE2= 300
##$TE3= 300
##$TEG= 300
##$TL= (0..7)
0 120 53 12 22 120 120 120 
##$TP= (0..7)
150 150 150 150 150 150 150 150 
##$TP07= 0
##$TPNAME0= <>
##$TPNAME1= <>
##$TPNAME2= <>
##$TPNAME3= <>
##$TPNAME4= <>
##$TPNAME5= <>
##$TPNAME6= <>
##$TPNAME7= <>
##$TPOAL= (0..7)
0.5 0.5 0.5 0.5 0.5 0.5 0.5 0.5 
##$TPOFFS= (0..7)
0 0 0 0 0 0 0 0 
##$TUNHIN= 0
##$TUNHOUT= 0
##$TUNXOUT= 0
##$USERA1= <user>
##$USERA2= <user>
##$USERA3= <user>
##$USERA4= <user>
##$USERA5= <user>
##$V9= 5
##$VALIST= <valist>
##$VCLIST= <CCCCCCCCCCCCCCC>
##$VD= 0
##$VDLIST= <DDDDDDDDDDDDDDD>
##$VPLIST= <PPPPPPPPPPPPPPP>
##$VTLIST= <TTTTTTTTTTTTTTT>
##$WBST= 1024
##$WBSW= 4
##$XGAIN= (0..3)
0 0 0 0 
##$XL= 0
##$YL= 0
##$YMAX_a= 3006
##$YMIN_a= -3791
##$ZGOPTNS= <>
##$ZL1= 120
##$ZL2= 120
##$ZL3= 120
##$ZL4= 120
##$ABSF1= 0
##$ABSF2= 0
##$ABSG= 0
##$ABSL= 0
##$ALPHA= 0
##$AQORDER= 0
##$ASSFAC= 0
##$ASSFACI= 0
##$ASSFACX= 0
##$ASSWID= 0
##$AUNMP= <proc_1d>
##$AZFE= 0.1
##$AZFW= 0.5
##$BCFW= 0
##$BC_mod= 2
##$BYTORDP= 0
##$COROFFS= 0
##$CY= -3
##$DATMOD= 1
##$DC= 0
##$DFILT= <>
##$DTYPP= 0
##$F1P= 0
##$F2P= 0
##$FCOR= 1
##$FTSIZE= 65536
##$FT_mod= 6
##$GAMMA= 0
##$GB= 0
##$INTBC= 1
##$INTSCL= 5.30512e-09
##$ISEN= 30
##$LB= 1
##$LEV0= 0
##$LPBIN= 0
##$MAXI= 10000
##$MC2= 0
##$MEAN= 0
##$ME_mod= 0
##$MI= 50
##$NCOEF= 0
##$NC_proc= -8
##$NLEV= 6
##$NOISF1= 182.463
##$NOISF2= 159.3651
##$NSP= 0
##$NTH_PI= 0
##$NZP= 0
##$OFFSET= 248.5645
##$PC= 4
##$PHC0= -10160.63
##$PHC1= -172.7461
##$PH_mod= 1
##$PKNL= yes
##$PPARMOD= 0
##$PSCAL= 0
##$PSIGN= 0
##$REVERSE= no
##$SF= 81.014009
##$SI= 65536
##$SIGF1= 159.3651
##$SIGF2= -187.1042
##$SINO= 113.3802
##$SIOLD= 16384
##$SREGLST= <1H.CDCl3>
##$SSB= 0
##$STSI= 65536
##$STSR= 0
##$SW_p= 40650.406504065
##$SYMM= 0
##$S_DEV= 0
##$TDeff= 32768
##$TDoff= 0
##$TI= <>
##$TILT= no
##$TM1= 0
##$TM2= 0
##$TOPLEV= 0
##$USERP1= <user>
##$USERP2= <user>
##$USERP3= <user>
##$USERP4= <user>
##$USERP5= <user>
##$WDW= 1
##$XDIM= 65536
##$YMAX_p= 335718158
##$YMIN_p= -47776775
$$ End of Bruker specific parameters
$$ ---------------------------------
##NTUPLES= NMR SPECTRUM
##VAR_NAME=  FREQUENCY,     SPECTRUM/REAL,   SPECTRUM/IMAG
##SYMBOL=    X,             R,               I
##VAR_TYPE=  INDEPENDENT,   DEPENDENT,       DEPENDENT
##VAR_FORM=  AFFN,          ASDF,            ASDF
##VAR_DIM=   65536,         65536,           65536
##UNITS=     HZ,            ARBITRARY UNITS, ARBITRARY UNITS
##FACTOR=    0.620285442955139, 1,           1
##FIRST=     20137.2065510759, 0,            0
##LAST=      -20513.1999529892, 0,           0
##MIN=       -20513.1999529892, -47776775,   0
##MAX=       20137.2065510759, 335718158,    0
$$ Real data points
##PAGE= N=1
##DATA TABLE= (X++(R..R)), XYDATA
$$ [...]
$$ plain form
42978 -9623111 -8091082 -938613 5483665 7264057 5948881 4193350 2153719 -1037507
42970 -1037507 -5037160 -8732751 -11132217 -11167943 -8354025 -4173134 -1108011 194653
42962 194653 1158679 2433530 2859313 1852935 661037 144453 -799013 -3220547 -6021971
42953 -6021971 -7354054 -7085195 -6568978 -6706613 -7306939 -7679065 -6868698 -3919204 981851
42944 981851 5724664 7530864 5532846 2123235 1111118 3571123 5849974 3542754
42936 3542754 -2356442 -6122692 -5344422 -4471020 -7134034 -8954171 -3849435 5023464
42928 5023464 8356650 4640296 2699981 7812735 13245744 10611555 2284685 -2939940
42920 -2939940 -2152261 511824 2047109 2888044 2431788 -976107 -5390243 -6243987 -2897979
$$ packed form
42978i623111J532029P152469O422278J780392j315176j755531k039631l191226
42970a037507l999653l695591k399466l5726K813918M180891L065123J302664
42962A94653R64026J274851M25783j006378j191898n16584r43466k421534k801424
42953f021971j332083K68859N16217j37635o00326l72126Q10367K949494M901055
42944I81851M742813J806200j998018l409611j012117K460005K278851k307220
42936C542754n899196l766250P78270Q73402k663014j820137N104736Q872899
42928E023464L333186l716354j940315N112754N433009k634189q326870n224625
42920b939940P87679K664085J535285Q40935m56256l407895m414136q53744L346008
$$ plain form
42911 -2897979 159439 -569269 -3891143 -6698077 -7123335 -4953882 -2071781 -1892746 -4959815
42902 -4959815 -6436588 -2457036 2611264 1442784 -4330946 -5218841 1534992 6585907
42894 6585907 1934606 -7354587 -11149662 -8702016 -7488412 -10500575 -12789190 -10554829
42886 -10554829 -6498566 -4186815 -2646291 301625 3045923 2178313 -2148694 -5861362
42878 -5861362 -5734689 -2705830 -232181 -312173 -1515077 -856065 2458394 5611531 5099714
42869 5099714 808805 -3711159 -5100392 -3442678 -1362778 -727134 -1060721 -996057 -377791
42860 -377791 -318868 -1331279 -2126975 -892087 2365676 5441899 6312755 5470357 5145094
42851 5145094 6150733 6503620 4167358 538155 -761550 939084 1762554 -1156078
$$ packed form
42911b897979L057418p28708l321874k806934m25258K169453K882101J79035l067069
42902d959815j476773L979552N068300j168480n773730q87895O753833N050915
42894F585907m651301r289193l795075K447646J213604l012163k288615K234361
42886a0554829M056263K311751J540524K947916K744298q67610m327007l712668
42878e861362J26673L028859K473649p9992j202904O59012L314459L153137n11817
42869E099714m290909m519964j389233J657714K079900O35644l33587O4664O18266
42860c77791N8923j012411p95696J234888L257763L076223Q70856q42398l25263
42851E145094J005639L52887k336262l629203j299705J700634Q23470k918632
$$ plain form
42843 -1156078 -4640118 -3606761 779017 1966852 -2059302 -5039454 -1866673 2766761
42835 2766761 549290 -7908513 -12757166 -7380842 3691620 10727109 9072558 1907575
42827 1907575 -4548133 -6682322 -5692419 -5306848 -7009018 -8246815 -6443363 -3029569
42819 -3029569 -1041459 -421329 791476 1894497 481818 -2584808 -3868738 -3113452
42811 -3113452 -3376074 -4827874 -3815852 374426 3314395 2469447 1159238 2168944
42803 2168944 2428486 -1538277 -6986879 -8749155 -6619920 -4131386 -2557452 -1095930
42795 -1095930 -821114 -3101936 -5453656 -4296145 -1156361 -896854 -3867085 -5049714
42787 -5049714 -1792634 2514828 4092229 3766693 3885718 3592325 370078 -5285210 -9581430
$$ packed form
42843a156078l484040J033357M385778J187835m026154k980152L172781M633434
42835B766761k217471q457803m848653N376324J1072462P035489j654551p164983
42827A907575o455708k134189R89903L85571j702170j237797J803452L413794
42819c029569J988110O20130J212805J103021j412679l066626j283930P55286
42811c113452k62622j451800J012022M190278K939969q44948j310209J009706
42803B168944K59542l966763n448602j762276K129235K488534J573934J461522
42795a095930K74816k280822k351720J157511L139784K59507k970231j182629
42787e049714L257080M307462J577401l25536J19025k93393l222247n655288m296220
$$ plain form
42778 -9581430 -9839254 -7682400 -7130754 -9608065 -11682093 -9198695 -3404056 -184362
42770 -184362 -2114826 -4621254 -2737354 1545310 2860403 904029 -155004 501644
42762 501644 -593000 -3688906 -3758430 1402822 6315235 5056372 -358182 -3270345 -1622072
42753 -1622072 811787 1399155 2074790 4914494 7999799 7947133 4716728 1588626 863920
42744 863920 1598722 1957972 1906937 2067085 1290499 -1958167 -5959081 -6578803 -2828869
42735 -2828869 1385118 2880564 3445314 5625059 7386834 5357674 1219502 -458590
42727 -458590 228029 -999527 -4460035 -5264170 -1937255 68185 -3091350 -7197063 -6739974
42718 -6739974 -3513049 -2723943 -4066618 -3363069 -1051089 -1630674 -4797136 -4645883 363709
$$ packed form
42778i581430k57824K156854N51646k477311k074028K483398N794639L219694
42770a84362j930464k506428J883900M282664J315093j956374j059033O56648
42762E01644j094644l095906o9524N161252M912413j258863n414554k912163J648273
42753a622072K433859N87368O75635K839704L085305n2666l230405l128102p24706
42744H63920P34802L59250n1035J60148p76586l248666m000914o19722L749934
42735b828869M213987J495446N64750K179745J761775k029160m138172j678092
42727d58590O86619j227556l460508q04135L326915K005440l159535m105713M57089
42718f739974L226925P89106j342675P03549K311980n79585l166462J51253N009592
$$ plain form
42709 363709 3608647 337081 -4221447 -2309339 4617298 8066950 4798252 327958
42701 327958 -300758 868023 -252748 -2995457 -3980055 -2925625 -2391010 -3304440 -4432561
42692 -4432561 -5471773 -7219489 -8903121 -8518190 -6063034 -3709519 -2506281 -1480873
42684 -1480873 -121970 1038790 2433771 4860397 6577557 4748448 675577 -529005
42676 -529005 2793295 6083240 5438700 2992964 2203724 2057502 426072 -500733 2309822
42667 2309822 6362379 6704526 3907920 2959758 4833440 5290677 2397334 -675455 -1437387
42658 -1437387 -1153849 -601651 1895085 5965713 7670937 5302936 2440068 2201482 2369608
42649 2369608 -332995 -4438809 -5978878 -4170588 -1479184 86798 -230192 -2921190
$$ packed form
42709C63709L244938l271566m558528J912108O926637L449652l268698m470294
42701C27958o28716J168781j120771k742709r84598J054430N34615r13430j128121
42692d432561j039212j747716j683632L84931K455156K353515J203238J025408
42684a480873J358903J160760J394981K426626J717160j829109m072871j204582
42676e29005L322300L289945o44540k445736p89240j46222j631430r26805K810555
42667B309822M052557L42147k796606r48162J873682M57237k893343l072789p61932
42658a437387K83538N52198K496736M070628J705224k368001k862868k38586J68126
42649B369608k702603m105814j540069J808290K691404J565982l16990k690998
$$ plain form
42641 -2921190 -6942547 -9060071 -7417585 -4532445 -4134798 -6263937 -8001685 -7803553
42633 -7803553 -6479883 -4937010 -3608352 -3417873 -4829498 -6403492 -6474851 -5795958 -6370955
42624 -6370955 -7959568 -7895434 -4688805 -280470 1880387 448199 -2337452 -2925359 -614982
42615 -614982 1237538 -498024 -4130501 -5328804 -3397923 -1865411 -2421386 -2434248 -141520
42606 -141520 1814693 792429 -1445222 -2031445 -1701250 -2563065 -3714241 -2987012 -1050033
42597 -1050033 115757 976776 2580368 2657142 -1643318 -7942059 -10373306 -7229362 -2565664
42588 -2565664 182157 1902926 4096305 5451102 4234668 1533902 69328 1010159
42580 1010159 3029704 3749090 2037878 -257401 428364 5068523 10008791 10921013 7604292
$$ packed form
42641b921190m021357k117524J642486K885140L97647k129139j737748J98132
42633g803553J323670J542873J328658J90479j411625j573994p1359O78893n74997
42624f370955j588613O4134L206629M408335K160857j432188k785651n87907K310377
42615f14982J852520j735562l632477j198303J930881J532512n55975j2862K292728
42606a41520J956213j022264k237651n86223L30195q61815j151176P27229J936979
42597a050033J165790Q61019J603592P6774m300460o298741k431247L143944M663698
42588b565664K747821J720769K193379J354797j216434k700766j464574R40831
42580A010159K019545P19386j711212k295279O85765M640159M940268R12222l316721
$$ plain form
42571 7604292 3020334 -755806 -3164193 -3627509 -2600838 -2556934 -4425917 -4711348 -246500
42562 -246500 5771533 7410975 4533096 2126433 1738609 67621 -3320852 -3996001 -853508
42553 -853508 317568 -4405584 -9939403 -8668647 -493522 8122271 12395254 12276358
42545 12276358 9537492 6128595 4272654 4730283 5634811 5160461 3789297 2101215
42537 2101215 -1070792 -5681180 -8526710 -7673887 -6235219 -7720129 -9862656 -7774012
42529 -7774012 -1792189 2841752 3599112 2947225 2808931 1783140 -762241 -2343489 -1454884
42520 -1454884 -604306 -2591522 -6113198 -7601225 -5794366 -2270126 1193548 3529428
42512 3529428 3665838 1410979 -1040721 -655435 2775742 6049410 6435315 4841224 3803358
$$ packed form
42571G604292m583958l776140k408387m63316J026671M3904j868983k85431M464848
42562b46500O018033J639442k877879k406663l87824j670988l388473o75149L142493
42553h53508J171076m723152n533819J270756Q175125Q615793M272983j18896
42545A2276358k738866l408897j855941M57629R04528m74350j371164j688082
42537B101215l172007m610388k845530Q52823J438668j484910k142527K088644
42529g774012N981823M633941P57360o51887j38294j025791k545381j581248Q88605
42520a454884Q50578j987216l521676j488027J806859L524240L463674K335880
42512C529428J36410k254859k451700L85286L431177L273668L85905j594091j037866
$$ plain form
42503 3803358 3333440 957546 -3993533 -8593169 -10165963 -9716325 -9117368 -6760845 79831
42494 79831 8906387 12574444 8005652 906733 -736079 4461420 11250602 14434802
42486 14434802 12904355 8724848 5211398 5087487 8056087 10709060 10618636 9385604
42478 9385604 9639525 10488927 8711410 3681669 -1523456 -3604415 -1656285 2882172
42470 2882172 6906508 7434202 4937447 3488740 5145712 6232912 2781648 -2278121
42462 -2278121 -2347548 3070345 7239649 5579418 1131269 -1038318 -370136 689465 1004556
42453 1004556 743447 -232409 -1446254 -1416139 -203831 -251384 -2873545 -5993660 -7002922
42444 -7002922 -5811920 -3753645 -1855467 -1410811 -3365448 -5702679 -4772654 -1048365
$$ packed form
42503C803358m69918k375894m951079m599636j572794M49638N98957K356523O840676
42494G9831Q826556L668057m568792p098919j642812N197499O789182L184200
42486A4434802j530447m179507l513450j23911K968600K652973r0424j233032
42478I385604K53921Q49402j777517n029741n205125k080959J948130M538457
42470B882172M024336N27694k496755j448707J656972J087200l451264n059769
42462b278121o9427N417893M169304j660231m448149k169587O68182J059601L15091
42453A004556k61109r75856j213845L0115J212308m7553k622161l120115j009262
42444g002922J191002K058275J898178M44656j954637k337231R30025L724289
$$ plain form
42436 -1048365 206305 -3468308 -7435693 -6696780 -3134791 -1730303 -2825269 -3176685
42428 -3176685 -2174398 -1601259 -1047866 815589 1692872 -1683404 -6884505 -7772899 -3405858
42419 -3405858 785933 1303121 243730 -355715 -1752892 -4140892 -4905981 -3794573 -4201828
42410 -4201828 -6320307 -4837697 2414393 8953675 8004975 1939643 -2224267 -2886610
42402 -2886610 -3233483 -3750719 -2453271 -828376 -2328126 -5331631 -4455684 569847 3762538
42393 3762538 1911224 -1247024 -1804613 -1076918 -1616639 -2757972 -3201889 -3868551 -5036993
42384 -5036993 -4404111 -1237314 1033926 -159218 -2135270 -1347193 784649 623017 -1513487
42375 -1513487 -2473420 -1851543 -1794729 -2333492 -1612423 -286143 -962202 -3127265 -3339517
$$ packed form
42436a048365J254670l674613l967385P38913L561989J404488j094966l51416
42428c176685J002287N73139N53393J863455Q77283l376276n201101q88394M367041
42419c405858M191791N17188j059391n99445j397177k388000p65089J111408m07255
42410d201828k118479J482610P252090O539282r48700o065332m163910o62343
42402b886610l46873n17236J297448J624895j499750l003505Q75947N025531L192691
42393C762538j851314l158248n57589P27695n39721j141333m43917o66662j168442
42384e036993O32882L166797K271240j193144j976052P88077K131842j61632k136504
42375a513487r59933O21877N6814n38763P21069J326280o76059k165063k12252
$$ plain form
42366 -3339517 -1315465 -1188637 -4967628 -8954528 -9208012 -6995013 -5645663 -4882638 -2218495
42357 -2218495 1647325 3091661 1202103 -502517 882219 3551013 3733470 934459
42349 934459 -1670384 -1659715 -287867 -355338 -2343535 -3863316 -2712119 564393 3433207
42340 3433207 4002708 2557813 990612 948963 2075422 2138094 -181147 -2712466 -1651132
42331 -1651132 3440996 8423891 9726790 8763795 8982336 10176137 9066872 5029372
42323 5029372 1525471 1030638 1900142 2043471 2798322 6256128 10403947 10372932 4691421
42314 4691421 -2271784 -5147923 -3361704 -898280 -1096331 -3118351 -3836167 -2133994
42306 -2133994 -223186 -743940 -3577602 -6074990 -5881123 -3034076 257742 1480208
$$ packed form
42366c339517K024052J26828l778991l986900k53484K212999J349350P63025K664143
42357b218495L865820J444336j889558j704620J384736K668794J82457k799011
42349I34459k604843J0669J371848o7471j988197j519781J151197L276512K868814
42340C433207N69501j444895j567201m1649J126459O2672k319241k531319J061334
42331a651132N092128M982895J302899r62995K18541J193801j109265m037500
42323E029372l503901m94833Q69504J43329P54851L457806M147819l1015n681511
42314D691421o963205k876139J786219K463424j98051k022020p17816J702173
42306b133994J910808n20754k833662k497388J93867K847047L291818J222466
$$ plain form
42298 1480208 -31255 -2419496 -3325481 -2552852 -1514239 -145851 3117051 7253592
42290 7253592 7705579 2432090 -3469221 -3334337 1932422 4812659 1369787 -4085807
42282 -4085807 -5785865 -3648031 -1194476 172575 1464481 2760454 2982304 2336052
42274 2336052 2353785 3397011 3680986 1124929 -4174546 -9159862 -10052223 -6533193 -2859859
42265 -2859859 -2727828 -4040457 -2228819 1781372 1888842 -3805365 -9361550 -9594722 -7232380
42256 -7232380 -7234968 -8459691 -6727408 -3020104 -1898362 -3181849 -2153255 1683029 2705763
42247 2705763 -2049750 -7866057 -9104542 -6627735 -4916893 -5001519 -4305908 -1882475 75169
42238 75169 -157991 -1565489 -2387916 -2496892 -2592495 -1990782 996830 5772638 8040006
$$ packed form
42298A480208j511463k388241r05985P72629J038613J368388L262902M136541
42290G253592M51987n273489n901311J34884N266759K880237l442872n455594
42282d085807j700058K137834K453555J367051J291906J295973K21850o46252
42274B336052J7733J043226K83975k556057n299475m985316q92361L519030L673334
42265b859859J32031j312629J811638M010191J07470n694207n556185k33172K362342
42256g232380k588j224723J732283L707304J121742j283487J028594L836284J022734
42247B705763m755513n816307j238485K476807J710842q4626O95611K423433J957644
42238G5169k33160j407498q22427j08976r5603O01713K987612M775808K267368
$$ plain form
42229 8040006 4118038 -3317256 -6861397 -3329852 1858815 2130811 -964974 -359326
42221 -359326 5722212 10738477 8766305 2198776 -1892162 -380368 3440910 4524077
42213 4524077 1141199 -4010101 -6369118 -3451656 2986895 8521399 9434894 4675237
42205 4675237 -3661699 -10491197 -10639845 -4461816 943318 -459546 -5783592 -7291037
42197 -7291037 -3532744 -1063181 -4210031 -8786380 -8830837 -5045543 -2555711 -3280919 -4648392
42188 -4648392 -4186405 -1735038 1963524 5724305 7469897 6051695 3498882 3407770 6951455
42179 6951455 11754619 14477563 13505412 9650789 5314645 2615087 1665844 1108579 358005
42170 358005 80898 299392 -146375 -1517185 -2361938 -1831466 -1183965 -1797258 -3055945
$$ packed form
42229H040006l921968p435294l544141L531545N188667K71996l095785O05648
42221c59326O081538N016265j972172o567529m090938J511794L821278J083167
42213D524077l382878n151300k359017K917462O438551N534504R13495m759657
42205D675237q336936o829498j48648O178029N405134j402864n324046j507445
42197g291037L758293K469563l146850m576349m4457L785294K489832p25208j367473
42188d648392M61987K451367L698562L760781J745592j418202k552813r1112L543685
42179F951455M803164K722944r72151l854623m336144k699558r49243n57265p50574
42170C58005k77107K18494m45767j370810q44753N30472O47501o13293j258687
$$ plain form
42161 -3055945 -3370081 -2209349 -320090 1013924 538729 -1822817 -4293353 -5308534
42153 -5308534 -5902485 -7653240 -8733549 -5583277 1081421 5903268 5764277 3154755
42145 3154755 1131784 -795120 -3327694 -4220443 -1956286 797368 954533 -700064
42137 -700064 -2225658 -4148312 -6589903 -6338563 -1561291 3556513 4177201 2296062 3055775
42128 3055775 5656713 4711375 -52994 -2546214 202941 3640135 2927845 -569179
42120 -569179 -2691383 -2335785 -1176181 -482299 -494594 -806406 -32154 2643995 4875414
42111 4875414 3039907 -2295337 -5930191 -4478855 -357437 2220980 2378094 1796654
42103 1796654 1377824 956658 593061 168645 -977748 -2535334 -2718468 -626696 2182792
$$ packed form
42161c055945l14136J160732J889259J334014m75195k361546k470536j015181
42153e308534n93951j750755j080309L150272O664698M821847j38991k609522
42145C154755k022971j926904k532574q92749K264157K753654J57165j654597
42137g00064j525594j922654k441591K51340M777272N117804O20688j881139P59713
42128C055775K600938r45338m764369k493220K749155L437194p12290l497024
42120e69179k122204L55598J159604O93882j2295l11812P74252K676149K231419
42111D875414j835507n335244l634854J451336M121418K578417J57114n81440
42103A796654m18830m21166l63597m24416j146393j557586j83134K091772K809488
$$ plain form
42094 2182792 3714372 3988724 4462233 6039336 8420042 10362601 10050605 6359301 275571
42085 275571 -5852512 -10434930 -12880053 -12428397 -8981542 -4906429 -3302540 -3873452 -3044639
42076 -3044639 813010 4663138 4890382 2392075 1711526 5642144 11884318 15180051
42068 15180051 12684624 7142154 3858094 4309097 4726785 2183365 -715937 -98594
42060 -98594 2651883 2927942 209377 -1449323 -162049 1240349 186639 -2281948 -4187599
42051 -4187599 -4820840 -3310587 977185 5333232 5150073 285279 -3950157 -4206142 -3459291
42042 -3459291 -5265712 -7580839 -6256113 -2174094 -666454 -4512500 -10563970 -13448036
42034 -13448036 -11040242 -6239925 -3794223 -5042864 -6423448 -4307710 175083 3533025
$$ packed form
42094B182792J531580K74352M73509J577103K380706J942559l11996l691304o083730
42085B75571o128083m582418k445123M51656L446855M075113J603889n70912Q28813
42076c044639L857649L850128K27244k498307o80549L930618O242174L295733
42068A5180051k495427n542470l284060M51003M17688k543420k899302O17343
42060i8594K750477K76059k718565j658700J287274J402398j053710k468587j905651
42051d187599o33241J510253M287772M356047j83159m864794m235436k55985P46851
42042c459291j806421k315127J324726M082019J507640l846046o051470k884066
42034a3448036K407794M800317K445702j248641j380584K115738M482793L357942
$$ plain form
42026 3533025 5245083 6748531 6652287 2439739 -3396488 -5037471 -1932448 478363
42018 478363 -74350 407654 3817900 5663581 2922160 -592909 -1412066 -2536876 -6837903
42009 -6837903 -10402715 -9107565 -6575996 -8193875 -11524041 -10627918 -6547690 -5023226
42001 -5023226 -5935795 -3749579 2089117 5334202 2258998 -3906405 -8631003 -10346689
41993 -10346689 -8717806 -4467066 -1442115 -3359073 -7985924 -9679011 -7638859 -6095110
41985 -6095110 -6484734 -5766067 -2932231 -626014 733062 3727556 7334543 6541187 1067066
41976 1067066 -2439736 -517295 1268350 -2672494 -8672420 -9360846 -4642173 -1034330
41968 -1034330 -2004325 -4356418 -3756815 193084 4570425 6264904 4470772 1429893
$$ packed form
42026C533025J712058J503448r6244m212548n836227j640983L105023K410811
42018D78363n52713M82004L410246J845681k741421l515069q19157j124810m301027
42009f837903l564812J295150K531569j617879l330166Q96123M080228J524464
42001e023226r12569K186216N838696L245085l075204o165403m724598j715686
41993a0346689J628883M250740L024951j916958m626851j693087K040152J543749
41985f095110l89624P18667K833836K306217J359076K994494L606987p93356n474121
41976A067066l506802J922441J785645l940844n999926o88426M718673L607843
41968a034330r69995k352093N99603L949899M377341J694479j794132l040879
$$ plain form
41960 1429893 143697 793755 1006661 89149 287568 2508348 3667965 639816 -5157469
41951 -5157469 -9394196 -9591370 -6316023 -1044835 4925015 9927691 12074282 10565756
41943 10565756 6907406 4618388 6291158 9985477 10598918 6752814 3537187 4901138
41935 4901138 6398554 1355560 -7600319 -10685155 -4911589 1865810 2779394 92670
41927 92670 -1866453 -4205574 -8459981 -10613142 -7046128 -1861330 -1178422 -3519004 -3069964
41918 -3069964 -43326 -163561 -4842738 -9293474 -10787575 -11968242 -14446903 -15089185
41910 -15089185 -11215356 -5038395 -384287 1661608 1859619 747079 -485070 163787
41902 163787 2614772 3858532 1930833 -1184801 -2407676 -1458238 -73633 801212 744788
$$ packed form
41960A429893j286196O50058K12906r17512J98419K220780J159617l028149n797285
41951e157469m236727j97174L275347N271188N969850N002676K146591j508526
41943A0565756l658350k289018J672770L694319O13441l846104l215627J363951
41935D901138J497416n042994q955879l084836N773566O777399R13584k686724
41927I2670j959123k339121m254407k153161L567014N184798O82908k340582M49040
41918c069964L026638j20235m679177m450736j494101j180667k478661o42282
41910a5089185L873829O176961M654108K045895J98011j112540j232149O48857
41902A63787K450985J243760j927699l115634j222875R49438J384605Q74845n6424
$$ plain form
41893 744788 -1614932 -6716085 -11186981 -10204142 -3798179 1811856 1284241 -3058834 -4263359
41884 -4263359 -47133 4246249 3169023 -1369838 -3019382 270490 4010390 3713697
41876 3713697 370071 -2001090 -1968277 -1763657 -3539355 -6307426 -7105578 -4698028 -1214036
41867 -1214036 738314 1825192 4532687 7868563 7253973 1753131 -2595956 -709688
41859 -709688 3669223 3585821 -152571 -700652 3042949 4503810 646353 -2818330 -741951
41850 -741951 3879120 5999421 6174335 6990991 7042808 4323899 1617786 2438129 4566086
41841 4566086 3478877 -173200 -2252119 -2304075 -3217239 -5109572 -5414345 -4417121 -5123059
41832 -5123059 -7619950 -8640043 -7002265 -4874466 -3365763 -1429917 420147 49493
$$ packed form
41893G44788k359720n101153m470896R82839O405963N610035n27615m343075j204525
41884d263359M216226M293382j077226m538861j649544L289872L739900k96693
41876C713697l343626k371161L2813K04620j775698k768071p98152K407550L483992
41867a214036J952350J086878K707495L335876o14590n500842m349087J886268
41859g09688M378911q3402l738392n48081L743601J460861l857457l464683K076379
41850g41951M621071K120301J74914Q16656N1817k718909k706113Q20343K127957
41841D566086j087209l652077k078919n1956r13164j892333l04773R97224p05938
41832e123059k496891j020093J637778K127799J508703J935846J850064l70654
$$ plain form
41824 49493 -1515951 249408 6810784 13098955 13131886 7167255 1228308 409283 3841515
41815 3841515 6129825 3640402 -1039998 -2448936 12000 956742 -2867091 -7294953
41807 -7294953 -6852507 -2505604 1226130 3775126 7372768 10410217 8562305 2337601
41799 2337601 -2472590 -2476945 314016 3397703 6134618 6579171 2068750 -5102256 -8150629
41790 -8150629 -4598767 120943 499735 -2198436 -3926761 -4151144 -4211777 -3176292 -50921
41781 -50921 2277025 106955 -5032601 -7560475 -5082868 -1200745 -481580 -3026539 -5184066
41772 -5184066 -4459764 -2400099 -2230252 -4116031 -4245309 267004 6865781 10172208 8547940
41763 8547940 5385272 3745413 2689434 174835 -2849182 -3455857 -1057909 1042775
$$ packed form
41824D9493j565444J765359O561376O288171L2931n964631n938947q19025L432232
41815C841515K288310k489423m680400j408938K460936R44742l823833m427862
41807g294953M42446M346903L731734K548996L597642L037449j847912o224704
41799B337601m810191m355K790961L083687K736915M44553m510421p171006l048373
41790h150629L551862M719710L78792k698171j728325k24383o0633J035485L125371
41781e0921K327946k170070n139556k527874K477607L882123P19165k544959k157527
41772e184066P24302K059665J69847j885779j29278M512313O598777L306427j624268
41763H547940l162668j639859j055979k514599l024017o06675K397948K100684
$$ plain form
41755 1042775 -956628 -6543495 -10249774 -7320553 -132 4331601 2209204 -1996706
41747 -1996706 -3305888 -3332230 -6095621 -9935562 -9515856 -4415255 344728 1955840 2072470
41738 2072470 1320463 -2017991 -6501993 -6961046 -2006586 3127122 4100308 3096616 3816889
41729 3816889 5270093 4435217 1832173 487641 1293691 2432001 2065778 -301732 -3706363
41720 -3706363 -5978639 -5964343 -5549736 -6680211 -6974182 -2868182 2928260 3215534 -2889459
41711 -2889459 -7359614 -4538496 1116396 2760175 908023 46213 224062 -1631679
41703 -1631679 -5037264 -6701673 -6225574 -5907015 -6233251 -5932645 -4980202 -3578825 -122404
41694 -122404 5630855 9442941 7325409 1827570 -937699 760282 3613125 5141527
$$ packed form
41755A042775j999403n586867l706279K929221P320421M331733k122397m205910
41747a996706j309182k6342k763391l839941M19706N100601M759983J611112J16630
41738B072470p52007l338454m484002m59053M954460N133708R73186j003692P20273
41729C816889J453204q34876k603044j344532Q06050J138310l66223k367510l404631
41720c706363k272276J4296M14607j130475k93971M106000N796442K87274o104993
41711b889459m470155K821118N654892J643779j852152q61810J77849j855741
41703a631679l405585j664409M76099L18559l26236L00606R52443J401377L456421
41694a22404N753259L812086k117532n497839k765269J697981K852843J528402
$$ plain form
41686 5141527 5668305 5499336 4600399 4340456 5573698 6077605 3866632 1440961 2127949
41677 2127949 3903660 2417699 -971181 -557287 4257810 7402759 5427039 2332656
41669 2332656 2672304 4970821 5199593 2836055 192989 -1305401 -1233325 884007 3795428
41660 3795428 3788996 -1151508 -7606869 -9921473 -6715108 -1925341 631388 1561718 3694251
41651 3694251 6926792 7492539 3129223 -2787664 -4587757 -1267583 2622505 3290705
41643 3290705 1767727 683929 521305 1104188 3374276 6755002 7788541 4852406
41635 4852406 1584728 1903866 4199502 4672400 3891952 4851869 6325986 4112866 -1460422
41626 -1460422 -4876179 -2923389 1694478 4782823 4534834 790330 -5130419 -9313617
$$ packed form
41686E141527N26778j68969q98937k59943J233242N03907k210973k425671O86988
41677B127949J775711j485961l388880M13894M815097L144949j975720l094383
41669B332656L39648K298517K28772k363538k643066j498390P2076K117332K911421
41660C795428o432m940504o455361k314604L206365M789767K556729R30330K132533
41651C694251L232541N65747m363316n916887j800093L320174L890088O68200
41643C290705j522978j083798j62624N82883K270088L380726J033539k936135
41635D852406l267678L19138K295636M72898p80448R59917J474117k213120n573288
41626a460422l415757J952790M617867L088345k47989l744504n920749m183198
$$ plain form
41618 -9313617 -8303701 -4020165 -1652477 -2330524 -2386116 -368917 472726 -1683617 -3640254
41609 -3640254 -2262096 873423 2559383 2409588 1833121 1432914 1528274 2642642 3696131
41600 3696131 2284399 -1712726 -5307923 -6289032 -5197647 -2787993 933694 4153240
41592 4153240 3798465 313566 -2043833 -1518783 -1331420 -3588647 -5153259 -2833425 1216093
41583 1216093 3107934 3089083 3859546 5575916 6448888 6353602 6191326 5290941 2800585
41574 2800585 160062 -946062 -1604154 -3622827 -6019461 -6648941 -5884605 -5493379 -5122541
41565 -5122541 -3187598 -352378 987965 127972 -1569934 -2831458 -2734431 -421189 2596262
41556 2596262 1762164 -4865679 -11462248 -9744452 250845 9144745 9309431 3202495
$$ packed form
41618i313617J009916M283536K367688o78047n5592K017199Q41643k156343j956637
41609c640254J378158L135519J685960j49795n76467m00207R5360J114368J053489
41600C696131j411732l997125l595197r81109J091385K409654L721687L219546
41592D153240l54775l484899k357399N25050J87363k257227j564612K319834M049518
41583A216093J891841j8851P70463J716370Q72972r5286j62276r00385k490356
41574B800585k640523j106124o58092k018673k396634o29480P64336L91226L70838
41565e122541J934943K835220J340343q59993j697906j261524R7027K313242L017451
41556B596262q34098o627843o596569J717796R995297Q893900J64686o106936
$$ plain form
41548 3202495 -1353225 -902516 1705153 3156103 3656272 4667908 5465656 4051899 742376
41539 742376 -1466807 -995197 -277061 -2156778 -4815141 -3453754 2727095 8575097 9447713
41530 9447713 6705104 4620790 4404237 4223835 3325462 2658953 2102857 319203 -2461910
41521 -2461910 -4174216 -3963093 -3296864 -3246719 -2610239 -185730 2271596 1408777 -3022359
41512 -3022359 -6437503 -4199089 2269851 6659247 5929486 4249594 6157223 8763572
41504 8763572 5687139 -2531113 -7996061 -6344708 -2282462 -1829512 -4177133 -4767712
41496 -4767712 -2269604 1526740 5375266 8046247 7113470 2561457 -961437 62389
41488 62389 2263886 192473 -5044182 -7243551 -4202661 -10641 1648980 1454842 1046815
$$ packed form
41548C202495m555720M50709K607669J450950N00169J011636P97748j413757l309523
41539G42376k209183M71610P18136j879717k658363J361387O180849N848002Q72616
41530I447713k742609k084314k16553j80402q98373o66509n56096j783654k781113
41521b461910j712306K11123O66229N0145O36480K424509K457326q62819m431136
41512c022359l415144K238414O468940M389396p29761j679892J907629K606349
41504H763572l076433q218252n464948J651353M062246M52950k347621n90579
41496d767712K498108L796344L848526K670981r32777m552013l522894J023826
41488F2389K201497k071413n236655k199369L040890M192020J659621j94138m08027
$$ plain form
41479 1046815 169329 -1421355 -2582231 -2537603 -1498154 831345 4628817 7701363 6957616
41470 6957616 2719342 -1171814 -2111857 -1143557 -324345 -244959 -576164 -775554 10885
41461 10885 1692929 2165997 -135009 -3149187 -3504518 -1459206 -278764 -892655 -828196
41452 -828196 1123240 2858913 2721766 2194876 3342742 5745286 7107783 5455183 671718
41443 671718 -4419894 -5280090 -535184 5166815 6292525 3554393 2158248 3704993
41435 3704993 4528391 2202704 -1203626 -3207525 -3526730 -1602703 3476213 8946081
41427 8946081 9323948 3787353 -1907107 -3216271 -1892749 -863034 568374 2684294
41419 2684294 1788095 -4150179 -10281004 -10904922 -7749490 -6595691 -8024998 -7657481 -4453419
$$ packed form
41479A046815q77486j590684j160876M4628J039449K329499L797472L072546p43747
41470F957616m238274l891156r40043R68300Q19212P9386l31205j99390P86439
41461A0885J682044M73068k301006l014178l55331K045312J180442o13891O4459
41452h28196J951436J735673j37147n26890J147866K402544J362497j652600m783465
41443F71718n091612q60196M744906N701999J125710k738132j396145J546745
41435C704993Q23398k325687l406330k003899l19205J924027N078916N469868
41427H946081L77867n536595n694460j309164J323522J029715J431408K115920
41419B684294q96199n938274o130825o23918L155432J153799j429307L67517L204062
$$ plain form
41410 -4453419 -2602992 -4642535 -7636173 -7395649 -3086615 2944654 7027511 5925290
41402 5925290 -66017 -5769666 -6086024 -2394002 -769591 -3665084 -6989996 -6396310
41394 -6396310 -2956607 -624032 -534640 -290533 2056964 5238873 6247244 4055468 1381839
41385 1381839 1888274 5421020 7570148 5008402 -355016 -4130963 -4667286 -3332996
41377 -3332996 -1189874 1650599 4169655 5027567 4893303 5518602 6486629 5437744 1764710
41368 1764710 -2168921 -3756816 -2288853 1291964 4630125 4554984 270843 -4164716
41360 -4164716 -3526654 2121011 7498528 8911290 7741540 6441221 4715572 1662721
41352 1662721 -1239732 -1890140 -474366 1604976 4124258 7077619 8636166 6798343
$$ packed form
41410d453419J850427k039543k993638K40524M309034O031269M082857j102221
41402E925290n991307n703649l16358L692022J624411k895493l324912N93686
41394f396310L439703K332575Q9392K44107K347497L181909J008371k191776k673629
41385A381839N06435L532746K149128k561746n363418l775947n36323J334290
41377c332996K143122K840473K519056Q57912j34264O25299R68027j048885l673034
41368A764710l933631j587895J467963L580817L338161p5141m284141m435559
41360d164716O38062N647665N377517J412762j169750j300319j725649l052851
41352A662721k902453o50408J415774K079342K519282K953361J558547j837823
$$ plain form
41344 6798343 2827247 662706 2301831 5370916 6308041 5020781 4792790 7233875
41336 7233875 9025471 5899707 -492588 -2946954 2302462 9795035 11384225 6800888
41328 6800888 3371296 5554691 9527500 9609226 5872920 2499939 1441712 1247246 924975
41319 924975 1580310 3862072 5989783 5486691 2303332 -602577 -280030 2760677 5146374
41310 5146374 5115416 4688461 5938491 7122899 5384134 1873535 451396 1886350 3470334
41301 3470334 4374262 6703181 10317554 11524852 8915940 5923298 5059561 4182042 1651564
41292 1651564 456149 2729598 4322210 451375 -6138010 -8622042 -5857977 -2729576
41284 -2729576 -1854783 -1097530 763518 1852216 1477219 1275726 1052609 -1403942 -5086000
$$ packed form
41344F798343l971096k164541J639125L069085R37125j287260k27991K441085
41336G233875J791596l125764o392295k454366N249416P492573J589190m583337
41328F800888l429592K183395L972809Q1726l736306l372981j058227j94466l22271
41319I24975O55335K281762K127711n03092l183359k905909L22547L040707K385697
41310E146374l0958m26955J250030J184408j738765l510599j422139J434954J583984
41301C470334R03928K328919L614373J207298k608912k992642q63737q77519k530478
41292A651564j195415K273449J592612l870835o589385k484032K764065L128401
41284b729576Q74793P57253J861048J088698l74997k01493k23117k456551l682058
$$ plain form
41275 -5086000 -5568711 -1952422 1017388 212030 -1293122 145846 3146602 5058041
41267 5058041 7124678 11371449 15655753 16852090 16685310 19263010 24122884 26687701
41259 26687701 25104753 22068714 19939391 18406145 17353443 17831158 19188146 18896093
41251 18896093 16369573 13663175 11356381 7405009 1772858 -1402167 1078436 6847450
41243 6847450 11089564 11991075 10450916 6862645 1832114 -1596928 -701559 2379317
41235 2379317 2891025 401150 -689105 1452589 2688657 -403957 -4237927 -2867278
41227 -2867278 3097873 7059629 5791880 3707431 6184209 12007862 15061677 11792588
41219 11792588 4619382 -1240319 -2411621 645758 4499720 5594694 3485112 1322971
$$ packed form
41275e086000m82711L616289K969810q05358j505152J438968L000756J911439
41267E058041K066637M246771M284304J196337j66780K577700M859874K564817
41259B6687701j582948l036039k129323j533246j052702M77715J356988k92053
41251A8896093k526520k706398k306794l951372n632151l175025K480603N769014
41243F847450M242114R01511j540159l588271n030531l429042Q95369L080876
41235B379317N11708k489875j090255K141694J236068l092614l833970J370649
41227b867278N965151L961756j267749k084449K476778N823653L053815l269089
41219A1792588p173206n859701j171302L057379L853962J094974k109582k162141
$$ plain form
41211 1322971 2396503 6442408 10054974 10177946 6354223 365791 -4900677 -6683865
41203 -6683865 -4213588 229585 3087205 2628747 -96051 -2776964 -3363105 -870109
41195 -870109 3706143 7546721 8559521 7507893 6187824 4265302 306521 -4274786
41187 -4274786 -5298628 -897515 5711416 9739806 9404281 6194940 2666076 1116138
41179 1116138 2412720 4657674 4742745 2417469 691001 878916 128976 -3650814 -7159939
41170 -7159939 -5735300 -341421 3630332 3901845 3373737 4307737 4692830 2163541 -1669357
41161 -1669357 -3229047 -1496222 1471402 3261091 2639796 -580132 -5369158 -9459962
41153 -9459962 -10880854 -9750057 -8020616 -7432941 -7906468 -7784369 -5610763 -1814870 1581450
$$ packed form
41211A322971J073532M045905L612566J22972l823723n988432n266468j783188
41203f683865K470277M443173K857620m58458k724798k680913n86141K492996
41195h70109M576252L840578J012800j051628j320069j922522l958781m581307
41187d274786j023842M401113O608931M028390l35525l209341l528864j549938
41179A116138J296582K244954Q5071k325276j726468J87915p49940l779790l509125
41170g159939J424639N393879L971753K71513n28108R34000L85093k529289l832898
41161a669357j559690J732825K967624J789689o21295l219928m789026m090804
41153i459962j420892J130797J729441N87675m73527J22099K173606L795893L396320
$$ plain form
41144 1581450 3101468 3065620 2388324 1250455 -65928 -272470 1261819 2744560 1872841
41135 1872841 -884901 -2953739 -3326189 -3307725 -3594830 -3159566 -1682057 -705935 -1211469
41126 -1211469 -1924054 -1297379 314040 1635973 2349579 2842070 3048981 2514753 1026596
41117 1026596 -1149472 -2949588 -2701977 -67844 2398476 1530963 -2422046 -5888132
41109 -5888132 -6195824 -3800918 -570070 1533221 253194 -4915881 -9888653 -9083926
41101 -9083926 -2802994 2294993 1958403 -478840 -287597 1585384 1594899 155894 223068
41092 223068 1650016 1871529 691367 -209414 -1214416 -3555271 -5291363 -3455692 501366
41083 501366 2518798 2727168 4868020 8718652 9188764 4540903 -139986 -187652 2770179
$$ packed form
41144A581450J520018l5848o77296j137869j316383k06542J534289J482741q71719
41135A872841k757742k068838l72450J8464k87105M35264J477509R76122n05534
41126a211469p12585O26675J611419J321933P13606M92491K06911n34228j488157
41117A026596k176068j800116K47611K634133K466320q67513l953009l466086
41109e888132l07692K394906L230848K103291j280027n169075m972772Q04727
41101i083926O280932N097987l36590k437243J91243J872981R515j439005O7174
41092B23068J426948K21513j180162r00781j005002k340855j736092J835671L957058
41083E01366K017432K08370K140852L850632M70112m647861m680889m7666K957831
$$ plain form
41074 2770179 4894477 5550021 5433019 3463288 -490464 -2920462 -820357 3478149
41066 3478149 5030751 2275531 -2306561 -5589966 -5446023 -1372942 3775394 5134828
41058 5134828 1846027 -874806 1053072 4235740 2957910 -1883452 -4235415 -1779932
41050 -1779932 2080027 4427623 5419336 4529056 -20002 -6587198 -9891107 -7692940
41042 -7692940 -3794804 -2333584 -2698400 -2177847 -155715 2612414 5623533 7178636
41034 7178636 4676963 -850446 -3796479 -1009675 3135199 2730364 -993588 -1774958
41026 -1774958 2197045 6048637 5661594 2715030 1001932 1416482 2474135 3116941 3021800
41017 3021800 1905141 140813 -1195269 -1909443 -2911320 -4059812 -3587647 -842477
$$ packed form
41074B770179K124298O55544j17002j969731l953752k429998K100105M298506
41066C478149J552602k755220m582092l283405J43943M073081N148336J359434
41058E134828l288801k720833J927878L182668j277830m841362k351963K455483
41050a779932L859959K347596R91713q90280m549058o567196l303909K198167
41042g692940L898136J461220l64816N20553K022132K768129L011119J555103
41034G178636k501673n527409k946033K786804M144874m04835l723952p81370
41026a774958L972003L851592l87043k946564j713098M14550J057653O42806r5141
41017C021800j116659j764328j336082p14174j001877j148492M72165K745170
$$ plain form
41009 -842477 2191197 3616768 4134799 4885050 4495432 1286191 -2264623 -868722 6646377
41000 6646377 14562341 16526362 12844296 9072255 8381523 8488604 6559613 3897867
40992 3897867 3505096 4987068 5030230 2527467 190044 352574 1775346 2080757 1304375
40983 1304375 1045898 1565724 2020826 2705775 4565871 6666999 6576304 3767835 685682
40974 685682 -381861 47415 -3283 -1178678 -2286212 -1901865 39055 1761494 922682
40965 922682 -2607772 -5575446 -4612733 -578224 2505653 3032355 3510533 5614954 6704869
40956 6704869 3801770 -1366226 -4573653 -4842945 -4396436 -3704267 -737126 4303820 7474636
40947 7474636 6207919 3084338 2177410 3671578 4629686 3721364 2381840 1732070 1121086
$$ packed form
41009h42477L033674J425571N18031P50251l89618l209241l550814J395901P515099
41000F646377P915964J964021l682066l772041o90732J07081j928991k661746
40992C897867l92771J481972M3162k502763k337423J62530J422772L05411p76382
40983A304375k58477N19826M55102O84949J860096K101128r0695k808469l082153
40974F85682j067543M29276n0698j175395j107534L84347J940920J722439q38812
40965I22682l530454k967674R62713M034509L083877N26702M78178K104421J089915
40956F704869k903099n167996l207427k69292M46509O92169K967141N040946L170816
40947G474636j266717l123581r06928J494168R58108r08322j339524o49770o10984
$$ plain form
40938 1121086 288540 660171 3009499 5184992 4083540 -324716 -4664131 -6366252
40930 -6366252 -6623305 -7721632 -8675006 -6182777 -161784 4609948 4202078 742264 -682204
40921 -682204 1076324 2619035 1761230 291216 281746 1018213 1324732 2236738 4932552
40912 4932552 7719531 7601886 4098428 -406042 -3501543 -4349954 -3152304 -753847
40904 -753847 1499022 2792027 3423955 3603949 2757577 1175946 850260 2708629 4280717
40895 4280717 2640872 -1069407 -2831946 -1156570 1656528 3699984 5425191 6377292
40887 6377292 3607451 -3926807 -11706985 -13747457 -9577516 -4266404 -1563069 218996
40879 218996 4461297 10472390 13562760 10674245 4372855 298960 1114816 4169828
$$ packed form
40938A121086q32546L71631K349328K175493j101452m408256m339415j702121
40930f366252k57053j098327r53374K492229O020993M771732m07870l459814j424468
40921f82204J758528J542711q57805j470014r470P36467L06519R12006K695814
40912D932552K786979j17645l503458m504470l095501q48411J197650K398457
40904g53847K252869J293005O31928J79994q46372j581631l25686J858369J572088
40895D280717j639845l710279j762539J675376K813098K043456J725207R52101
40887F377292k769841p534258p780178k040472M169941N311112K703335J782065
40879B18996M242301O011093L090370k888515o301390m073895Q15856L055012
$$ plain form
40871 4169828 5477593 4581568 3979308 4629636 4553767 2394102 -845 -54808 2083193
40862 2083193 4272135 5332853 5417868 4507686 2828250 2167172 4177984 7324859 8174228
40853 8174228 6378747 5648477 8219826 10766126 8394269 1501171 -4065095 -3574487
40845 -3574487 1984346 8090699 11592747 12750166 13829847 16743716 21553430 26602517
40837 26602517 30022924 30932465 29257203 25698947 22831885 24460497 31321221 38393296
40829 38393296 40054711 38125621 40593763 50506581 60278686 60733118 52724279 44818844
40821 44818844 41112833 37416099 30154194 22921353 20721491 21841014 20266741 14589418
40813 14589418 9912062 10518112 14187441 15431042 12225429 7426923 4443217 3917960
$$ packed form
40871D169828J307765q96025o02260O50328p5869k159665k394947n3963K138001
40862B083193K188942J060718Q5015r10182j679436o61078K010812L146875Q49369
40853H174228j795481p30270K571349K546300k371857o893098n566266M90608
40845c574487N558833O106353L502048J157419J079681K913869M809714N049087
40837B6602517L420407R09541j675262l558256k867062J628612O860724P072075
40829C8393296J661415j929090K468142R912818R772105M54432q008839p905435
40821D4818844l706011l696734p261905p232841k199862J119523j574273n677323
40813A4589418m677356O06050L669329J243601l205613m798506k983706n25257
$$ plain form
40805 3917960 5180675 8564550 13831111 17395783 14959862 8148012 4917765 10319624
40797 10319624 19519345 24015363 22713516 21564477 23311789 24408496 23217747 23896000
40789 23896000 28265277 30384830 25457448 19433747 21869589 31306947 36058672 30132834
40781 30132834 20817934 17723920 20537867 22104902 19380946 15778866 14206220 13008672
40773 13008672 9819010 5931185 4502464 5779058 6635817 5276170 4232057 6723678
40765 6723678 11298255 13220201 11223781 9174707 9726902 10423047 8965847 8475296 13004951
40756 13004951 20611206 26142872 29104971 33016221 38010584 40501919 40421789 42206861
40748 42206861 47034955 50186714 48455587 44502586 41061850 36470335 29592586 23835455
$$ packed form
40805C917960J262715L383875N266561L564672k435921o811850l230247N401859
40797A0319624R199721M496018j301847j149039J747312J096707j190749O78253
40789B3896000M369277K119553m927382o023701K435842R437358M751725n925838
40781C0132834r314900l094014K813947J567035k723956l602080j572646j197548
40773A3008672l189662l887825j428721J276594Q56759j359647j044113K491621
40765F723678M574577J921946j996420k049074N52195O96145j457200m90551M529655
40756A3004951P606255N531666K962099L911250M994363K491335q0130J785072
40748D2206861M828094L151759j731127l953001l440736m591515o877749n757131
$$ plain form
40740 23835455 21691150 19910620 15219886 10791029 11206182 14096927 13153826 7753917
40732 7753917 3526639 3974908 6854694 8693760 8260165 5713259 2574822 2236569 6309990
40723 6309990 10802542 10052375 4100944 -1814836 -4231707 -3520069 -364311 4153756
40715 4153756 5854779 1555545 -4044183 -2905180 3827753 5928188 -645479 -7158127
40707 -7158127 -5652143 -935038 -1687463 -6142681 -5915776 -214227 3664986 2749596 1868183
40698 1868183 3914455 5101047 2375011 -1412459 -2899436 -3024724 -3141841 -1531502
40690 -1531502 2318397 4424421 1818280 -1983957 -1613500 2516969 5754991 6471722
40682 6471722 6899850 7626882 6297634 2421603 -699934 -321865 2419451 4888862 6197007
$$ packed form
40740B3835455k144305j780530m690734m428857M15153K890745r43101n399909
40732G753917m227278M48269K879786J839066m33595k546906l138437l38253M073421
40723F309990M492552p50167n951431n915780k416871P11638L155758M518067
40715D153756J701023m299234n599728J139003O732933K100435o573667o512648
40707g158127J505984M717105p52425m455218K26905N701549L879213r15390q81413
40698A868183K046272J186592k726036l787470j486977j25288j17117J610339
40690a531502L849899K106024k606141l802237L70457M130469L238022P16731
40682F471722M28128P27032j329248l876031l121537L78069K741316K469411J308145
$$ plain form
40673 6197007 6643964 6050342 4391629 2748083 2089590 1941468 1294245 -46321 -1936379
40664 -1936379 -4688722 -8154017 -10718294 -10597899 -7953959 -4599383 -1605591 1666807
40656 1666807 5682018 8881893 9114973 7024003 6381503 9442195 12819525 10705577
40648 10705577 2812485 -3866135 -3351662 1771427 4355663 2309802 -259604 -707279
40640 -707279 -1055135 -2366389 -1632566 2387185 4916797 1569359 -4119443 -4926668 28320
40631 28320 4885185 5860650 4925209 4513738 4238422 4258305 6517700 10110184 10264201
40622 10264201 5383409 867381 1639398 4448253 2950912 -2010455 -3585245 263897
40614 263897 3873306 3448171 3300195 8577286 16230015 18655538 14356597 9476556 8753138
$$ packed form
40673F197007M46957n93622j658713j643546o58493j48122o47223j340566j890058
40664a936379k752343l465295k564277J20395K643940L354576K993792L272398
40656A666807M015211L199875K33080k090970o42500L060692L377330k113948
40648A0705577p893092o678620N14473N123089K584236k045861k569406m47675
40640g07279l47856j311254P33823M019751K529612l347438n688802q07225M954988
40631B8320M856865R75465r35441m11471k75316J9883K259395L592484J54017
40622A0264201m880792m516028P72017K808855j497341m961367j574790L849142
40614B63897L609409m25135j47976N277091P652729K425523m298941m880041p23418
$$ plain form
40605 8753138 10057865 9667731 8674312 10667404 15414013 18824492 18772081 17661087 18700604
40596 18700604 22105961 25737028 27465175 26174605 22385254 18691815 17548266 17726272
40588 17726272 15412540 10223753 7239813 10343166 15839100 16395818 10311288 3207057
40580 3207057 691811 2756688 5864665 7409460 6893571 4938354 2452433 -261181
40572 -261181 -3721420 -7531426 -9383769 -7873753 -5188235 -4076028 -3190370 678744
40564 678744 6298828 8706302 6704844 4566311 4844914 4865835 2974904 2896691 7595286
40555 7595286 13029593 13121374 8128543 3176698 774715 -56852 1034423 5579261 11427316
40546 11427316 13321138 9567546 4461879 2941774 5535565 9181246 10649346 8966004
$$ packed form
40605H753138J304727l90134r93419J993092M746609L410479n2411j110994J039517
40596A8700604L405357L631067J728147j290570l789351l693439j143549J78006
40588A7726272k313732n188787k983940L103353N495934N56718o084530p104231
40580C207057k515246K064877L107977J544795n15889j955217k485921k713614
40572b61181l460239l810006j852343J510016K685518J112207Q85658L869114
40564F78744N620084K407474k001458k138533K78603K0921j890931p8213M698595
40555G595286N434307R1781m992831m951845k401983q31567J091275M544838N848055
40546A1427316J893822l753592n105667j520105K593791L645681J468100j683342
$$ plain form
40538 8966004 6597971 7772108 13209748 17547062 15217192 8006742 2859691 2640154
40530 2640154 3575557 2165779 -250671 -1258886 -1107575 -315451 2552358 7691425 11635933
40521 11635933 11312964 8544352 7541065 9342770 11446801 11923614 11346456 11042997 11359977
40512 11359977 11518194 10127564 6530886 2571956 1932471 6426138 13724433 19667324
40504 19667324 21794887 19888276 14886053 9049903 5846042 7348617 11986674 16334749
40496 16334749 18725062 19811059 20338550 20274720 20037668 20750232 22699590 24678071 25403332
40487 25403332 24896970 24175739 24295971 26022205 29655022 34448099 38575404 40613346
40479 40613346 41270790 42927310 47011016 52591822 58413130 65458255 75818744 89409525
$$ packed form
40538H966004k368033J174137N437640M337314k329870p210450n147051k19537
40530B640154R35403j409778k416450j008215J51311P92124K867809N139067L944508
40521A1635933l22969k768612j003287J801705K104031M76813n77158l03459L16980
40512A1359977J58217j390630l596678l958930o39485M493667P298295N942891
40504A9667324K127563j906611n002223n836150l203861J502575M638057M348075
40496A6334749K390313J085997N27491o3830k37052P12564J949358J978481P25261
40487B5403332n06362p21231J20232J726234L632817M793077M127305K037942
40479D0613346O57444J656520M083706N580806N821308P045125J0360489J3590781
$$ plain form
40471 89409525 104225686 120482060 142030077 172160423 209849099 251187307 291398102
40464 291398102 322999987 335718158 323732513 292397901 253341823 213378339 172957961
40457 172957961 134860037 107043023 93489329 87596879 79532254 67138364 55307818
40450 55307818 47312252 41921504 37778669 35217655 33381524 30270526 27031152 28018473
40442 28018473 34070895 38980350 36343589 28429134 24319479 29083163 38368337 45200736
40434 45200736 48830977 53566238 60942554 67986014 73593292 81591038 94877108 110763771
40426 110763771 126388622 145695277 175278518 213968995 251809768 279670119 294842197
40419 294842197 296418410 281434543 249640537 208493007 169031496 137759952 114452266
$$ packed form
40471H9409525J4816161J6256374K1548017L0130346L7688676M1338208M0210795
40464B91398102L1601885J2718171j1985645l1334612l9056078l9963484m0420378
40457A72957961l8097924k7817014j3553694n892450q064625j2393890j1830546
40450E5307818p995566n390748m142835k561014j836131l110998l239374R87321
40442B8018473O052422M909455k636761p914455m109655M763684R285174O832399
40434D5200736L630241M735261P376316P043460N607278P997746J3286070J5886663
40426A10763771J5624851J9306655K9583241L8690477L7840773K7860351J5172078
40419B94842197J576213j4983867l1794006m1147530l9461511l1271544k3307686
$$ plain form
40412 114452266 95748846 78623317 62420370 49961233 44938376 46250603 47247178
40405 47247178 43103673 36588583 33382509 33768337 32852650 27918579 21542182 17376588
40397 17376588 16143199 16323622 16309399 15275965 13677760 13039493 13880216 14353457 12606663
40388 12606663 9738640 8364507 8899862 9601858 9916202 11250447 14196794 17125853
40380 17125853 18070566 16612483 13830929 11595195 11489246 13008221 13424968 11043179
40372 11043179 7762582 6469228 6795140 5996433 3510817 1799669 2591461 4976027
40364 4976027 7574826 9977517 11389599 10468899 7725866 6023441 7293388 10180148
40356 10180148 12050200 12123548 11636711 11868278 12784700 12985813 10790550 6285891 2238776
$$ packed form
40412A14452266j8703420j7125529j6202947j2459137n022857J312227R96575
40405D7247178m143505o515090l206074L85828r15687m934071o376397m165594
40397A7376588j233389J80423j4223j033434j598205o38267Q40723M73241j746794
40388A2606663k868023j374133N35355P01996L14344J334245K946347K929059
40380A7125853R44713j458083k781554k235734j05949J518975M16747k381789
40372A1043179l280597j293354L25912p98707k485616j711148P91792K384566
40364D976027K598799K402691J412082r20700k743033j702425J269947K886760
40356A0180148J870052P3348m86837K31567R16422K01113k195263m504659m047115
$$ plain form
40347 2238776 1664858 4404966 7487062 8913122 9407424 10159206 10814147 10695441 10495639
40338 10495639 11369927 12998575 13613890 11930543 8733301 6442257 6652023 7962787
40330 7962787 7345803 4301565 2075034 3364762 6686457 9288482 11712935 15767333
40322 15767333 19165741 17165902 10230899 5202612 6635447 10995461 12435307 10819516
40314 10819516 10070493 11092848 11160886 9466129 8511930 9335861 9428807 7174897 5225369
40305 5225369 6900291 11140303 13790123 13046801 10997433 9897545 9640932 9694535 10899465
40296 10899465 13399925 14755716 12883525 9761580 9008816 10275872 9891004 7478419
40288 7478419 7388746 11665261 16251172 17646511 18965019 24223584 30133378 30516443 27373003
$$ packed form
40347B238776n73918K740108L082096J426060M94302P51782O54941j18706j99802
40338A0495639Q74288J628648O15315j683347l197242k291044K09766J310764
40330G962787o16984l044238k226531J289728L321695K602025K424453M054398
40322A5767333L398408j999839o935003n028287J432835M360014J439846j615791
40314A0819516p49023J022355O8038j694757r54199Q23931R2946k253910j949528
40305E225369J674922M240012K649820p43322k049368j099888k56613N3603J204930
40296A0899465K500460J355791j872191l121945p52764J267056l84868k412585
40288G478419q9673M276515M585911J395339J318508N258565N909794L83065l143440
$$ plain form
40279 27373003 29902761 41833862 56933839 69045450 79320424 89639884 95383898
40272 95383898 90749200 77383874 62117459 48771363 37264260 28310185 23332145
40265 23332145 20906143 18346014 16130264 16401748 18174199 18731102 18752504 20831727 23563774
40256 23563774 22944962 19770374 19390479 22965011 25358089 24022013 23639493 28265908
40248 28265908 34572587 37761287 39523998 44547516 52756071 61067119 69978243 81437665
40240 81437665 91416514 91900807 81228406 66508928 54306070 44320969 34304272 25855719
40232 25855719 21766117 21295157 21743631 22219334 22722238 21734216 17978304 13057001 9471796
40223 9471796 7261773 5147390 3660316 4332695 6633836 8281569 8060031 6377592
$$ packed form
40279B7373003K529758J1931101J5099977J2111611J0274974J0319460N744014
40272I5383898m634698j3365326j5266415j3346096j1507103q954075m978040
40265B3332145k426002k560129k215750K71484J772451N56903K1402K079223K732047
40256B3563774o18812l174588l79895L574532K393078j336076l82520M626415
40248B8265908O306679L188700J762711N023518Q208555Q311048Q911124J1459422
40240H1437665R978849M84293j0672401j4719478j2202858r985101j0016697q448553
40232B5855719m089602m70960M48474M75703N02904r88022l755912m921303l585205
40223I471796k210023k114383j487074O72379K301141J647733k21538j682439
$$ plain form
40215 6377592 4058895 2571401 3879220 7432722 8948498 5639178 1435641 2865311
40207 2865311 10117029 16580555 17683655 15732390 14733556 14917156 14958172 15961331 19659360
40198 19659360 24536501 26804514 24478492 18786855 12672340 9121340 9320201 11115888
40190 11115888 11021111 8849513 8090873 10449377 13050025 13186185 12564927 13645390 14810706
40181 14810706 13538949 12193017 15414045 22445152 27296833 27208243 26287001 29179862
40173 29179862 35028578 39879120 42080515 42822237 43326568 43829617 44198023 43835996 41814030
40164 41814030 38280169 34863777 32665590 30678512 27146172 21927991 16930546 14633571
40156 14633571 16143435 19692203 21080681 17116585 9244295 2685100 1373615 4520745
$$ packed form
40215F377592k318697j487494J307819L553502J515776l309320m203537J429670
40207B865311P251718O463526J103100j951265r98834J83600M1016J003159L698029
40198A9659360M877141K268013k326022n691637o114515l551000J98861J795687
40190A1115888r4777k171598p58640K358504K600648J36160o21258J080463J165316
40181A4810706j271757j345932L221028P031107M851681q8590r21242K892861
40173B9179862N848716M850542K201395P41722N04331N03049L68406l62027k021966
40164D1814030l533861l416392k198187j987078l532340n218181m997445k296975
40156A4633571J509864L548768J388478l964096p872290o559195j311485L147130
$$ plain form
40148 4520745 8381170 10266861 10309038 10299436 11628440 14018604 15952543 16550018 16858660
40139 16858660 18847507 23339906 29252951 34327258 36342861 34770348 31955825 31351291
40131 31351291 33525317 35347736 34268509 31476790 29090361 26455655 21943581 16615092
40123 16615092 12989029 11568391 11650945 13870379 18251965 21510160 20822492 18940357
40115 18940357 20448781 24050942 24488975 21458102 19592555 19314532 15880377 9601384
40107 9601384 8268362 14915866 21174435 19103311 12831459 10868410 12544075 11136856
40099 11136856 6685304 5715333 9406516 11499210 8852666 5951935 6999008 10340722
40091 10340722 13004977 14903941 16238321 15958166 14978300 15977656 17952987 16110320
$$ packed form
40148D520745L860425J885691M2177r602J329004K390164J933939N97475L08642
40139A6858660J988847M492399N913045N074307K015603j572513k814523o04534
40131C1351291K174026J822419j079227k791719k386429k634706m512074n328489
40123A6615092l626063j420638Q2554K219434M381586L258195o87668j882135
40115A8940357J508424L602161M38033l030873j865547k78023l434155o278993
40107I601384j333022O647504O258569k071124o271852j963049J675665j407219
40099A1136856m451552r69971L691183K092694k646544k900731J047073L341714
40091A0340722K664255J898964J334380k80155r79866R99356J975331j842667
$$ plain form
40083 16110320 9657320 4566935 5379627 8897429 9657521 7524388 5886406 5947663 7017429
40074 7017429 9379456 12564857 13406531 10178994 6438160 6392468 8534755 8485567 6286151
40065 6286151 5664488 7264087 8259559 8478758 11060531 15965850 18251344 14971118 9418033
40056 9418033 6098757 5343425 5518673 6875516 9714806 11551696 10059827 7267263
40048 7267263 7251201 10603837 14385080 16833726 18819887 20749873 21218477 19408586 16487392
40039 16487392 14063298 13247067 15382764 21123392 28020974 31689328 30980295 29986964
40031 29986964 33004465 39051516 43558863 44443906 43971712 44626045 45462028 43648010 38524783
40022 38524783 32987861 30822839 32950379 36413873 37289884 34610813 30979797 29336267
$$ packed form
40083A6110320o453000n090385Q12692L517802P60092k133133j637982O1257J069766
40074G017429K362027L185401Q41674l227537l740834m5692K142287m9188k199416
40065F286151o21663J599599R95472K19199K581773M905319K285494l280226n553085
40056I418033l319276p55332J75248J356843K839290J836890j491869k792564
40048G267263j6062L352636L781243K448646J986161J929986M68604j809891k921194
40039A6487392k424094q16231K135697N740628O897582L668354p09033r93331
40031B9986964L017501O047051M507347Q85043m72194O54333Q35983j814018n123227
40022C8524783n536922k165022K127540L463494Q76011k679071l631016j643530
$$ plain form
40014 29336267 29995991 31110180 30731331 27594608 21360519 13903454 9472431 11142833
40006 11142833 16801755 20598688 19143662 14824934 12237562 12824645 14353131 14645179
39998 14645179 14036716 14044568 14826969 14722914 12240683 8233796 5668070 6673200 9909405
39989 9909405 11706808 10219250 7747334 8241693 12838198 18530900 21158859 19149958
39981 19149958 14326764 9693104 7016288 6511234 8073211 11711608 16415139 19571516
39973 19571516 18825161 14629632 10051070 7704965 7529748 7781493 7228002 5608263 2851035
39964 2851035 -604776 -2772922 -1174807 4023716 9141101 10872796 10423513 11715767
39956 11715767 15600111 18531024 17901273 15639908 14229760 12140969 7230368 2634747
$$ packed form
40014B9336267O59724J114189l78849l136723o234089p457065m431023J670402
40006A1142833N658922L796933j455026m318728k587372N87083J528486K92048
39998A4645179o08463P852P82401j04055k482231m006887k565726J005130L236205
39989I909405J797403j487558k471916M94359M596505N692702K627959k008901
39981A9149958m823194m633660k676816n05054J561977L638397M703531L156377
39973A9571516p46355m195529m578562k346105j75217K51745n53491j619739k757228
39964B851035l455811k168146J598115N198523N117385J731695m49283J292254
39956A1715767L884344K930913o29751k261365j410148k088791m910601m595621
$$ plain form
39948 2634747 3756231 9541605 12710066 10190449 7349781 8712803 10418334 7224748
39940 7224748 2245902 2588371 7977347 11560800 11370719 12885998 18564780 22338323
39932 22338323 18481800 10515098 6482235 8778674 13148675 15554661 15813440 15511618
39924 15511618 15895734 17552388 19644781 19803606 16854381 13217014 12600306 15555934
39916 15555934 19204976 21436608 23481504 27305138 31514014 31700110 25663091 17017399
39908 17017399 11520684 10247524 9582143 8528366 11226940 18977723 24608201 21037079
39900 21037079 12543719 9800289 14571367 17842367 14349456 10104723 11686857 15930596
39892 15930596 16031391 11923273 8204239 6200302 4509467 3995520 5813320 6972103
$$ packed form
39948B634747J121484N785374L168461k519617k840668J363022J705531l193586
39940G224748m978846L42469N388976L583453j90081J515279N678782L773543
39932B2338323l856523p966702m032863K296439M370001K405986K58779l01822
39924A5511618L84116J656654K092393J58825k949225l637367o16708K955628
39916A5555934L649042K231632K044896L823634M208876J86096o037019q645692
39908A7017399n496715j273160o65381j053777K698574P750783N630478l571122
39900B1037079q493360k743430M771078L271000l492911m244733J582134M243739
39892A5930596J00795m108118l719034k003937j690835n13947J817800J158783
$$ plain form
39884 6972103 4070329 -361057 -1096826 1679701 3231934 2105814 1421306 2911834
39876 2911834 5051351 6908253 8950346 10290020 9850551 9735008 12424624 15197019
39868 15197019 12972135 6747408 3277627 5533918 9326587 10889504 11945217 14639145
39860 14639145 16714917 15460205 12787713 12645792 15500373 18174754 17760056 14079176
39852 14079176 9790182 8840671 12800889 18234459 20151501 18436619 17893927 21297749
39844 21297749 25664265 26600561 23388305 18369753 13853191 11013711 9900406 9603146
39836 9603146 9709596 11038351 13052191 12448509 7954633 4490840 7172070 12484069
39828 12484069 12222420 6100276 2541555 5291539 7683251 4109513 -737863 -23129
$$ packed form
39884F972103k901774m431386p35769K776527J552233j126120o84508J490528
39876B911834K139517J856902K042093J339674m39469j15543K689616K772395
39868A5197019k224884o224727l469781K256291L792669J562917J055713K693928
39860A4639145K075772j254712k672492j41921K854581K674381m14698l680880
39852A4079176m288994r49511L960218N433570J917042j714882n42692L403822
39844B1297749M366516R36296l212256n018552m516562k839480j113305k97260
39836I603146J06450J328755K013840o03682m493876l463793K681230N311999
39828A2484069k61649o122144l558721K749984K391712l573738m847376P14734
$$ plain form
39820 -23129 4238900 5415400 2940400 1515374 2671183 4064942 5149288 6957771
39812 6957771 7588294 4247059 -851169 -2564288 -560831 725897 -72591 545207 3839335
39803 3839335 5722708 3330835 133980 1119858 5814360 9452891 9488478 7852159 7074904
39794 7074904 6694980 4621924 989642 -1155132 248975 3121327 3959517 2898157
39786 2898157 3120576 5251254 6071903 4060108 2438670 4471615 9008855 13120571
39778 13120571 15732560 15900999 11507715 3721898 -958591 1744650 7216079 8418372
39770 8418372 6445712 7887919 13153524 15216900 10817651 5641846 5691652 9250161
39762 9250161 10832577 8866354 5992993 4725026 5737873 8244146 9853458 8138337
$$ packed form
39820b3129M262029J176500k475000j425026J155809J393759J084346J808483
39812F957771O30523l341235n098228j713119K003457J286728p98488O17798L294128
39803C839335J883373k391873l196855R85878M694502L638531L5587j636319p77255
39794G074904l79924k073056l632282k144774J404107K872352Q38190j061360
39786B898157K22419K130678Q20649k011795j621438K032945M537240M111716
39778A3120571K611989J68439m393284p785817m680489K703241N471429J202293
39770H418372j972660J442207N265605K063376m399249n175805M9806L558509
39762I250161J582416j966223k873361j267967J012847K506273J609312j715121
$$ plain form
39754 8138337 4081781 1775562 3074056 4857087 3415799 -588930 -3581609 -3803152
39746 -3803152 -2540677 -1680569 -1796637 -2302106 -2470557 -2287251 -2285769 -2450362 -2278918 -2446394
39736 -2446394 -4341435 -6442997 -4061585 4067167 11596462 11628569 6093089 2612443
39728 2612443 3351162 3630182 1431333 560971 2533327 2931191 -520186 -2984371 -303358
39719 -303358 3992058 4685600 2839968 2052158 1278308 -2087440 -5459750 -4343224 -171722
39710 -171722 1730404 441443 -656063 -915130 -2750064 -5638552 -6421439 -5380095 -5383490
39701 -5383490 -4990770 193145 8168612 10322022 3403246 -5188317 -7709284 -5281476
39693 -5281476 -2555029 432490 5081661 8047909 5483779 490710 -729537 1512232
$$ packed form
39754H138337m056556k306219J298494J783031j441288m004729k992679k21543
39746c803152J262475Q60108j16068n05469j68451J83306J482j64593J71444j67476
39736b446394j895041k101562K381412Q128752P529295L2107n535480l480646
39728B612443P38719K79020k198849q70362J972356L97864l451377k464185K681013
39719c03358M295416O93542j845632p87810p73850l365748l372310J116526M171502
39710a71722J902126j288961j097506k59067j834934k888488p82887J041344l395
39701e383490L92720N183915P975467K153410o918776q591563k520967K427808
39693e281476K726447K987519M649171K966248k564130m993069j220247K241769
$$ plain form
39685 1512232 1515109 -1780651 -3006618 415747 3929121 3406243 1657741 3448935 7654018
39676 7654018 8837567 5052697 132262 -1694466 -600858 189072 -1071105 -2636586
39668 -2636586 -1716111 1600852 3826806 2263212 -1220513 -2390805 -293700 1690184
39660 1690184 920575 -950228 -953849 895726 2480044 3211993 4230315 5718444 6538212
39651 6538212 6304583 5456400 3280803 -1434858 -7020450 -8906650 -4930870 1087532
39643 1087532 3402274 1117109 -1416000 -719306 1793728 2639271 882289 -1703973
39635 -1703973 -3619474 -4600575 -4240037 -2130918 234209 65780 -2958746 -5441114 -4573579
39626 -4573579 -2125985 -1713239 -3257795 -3450058 -1554684 -924207 -3361830 -5491246 -3482608
$$ packed form
39685A512232K877l295760j225967L422365L513374n22878j748502J791194M205083
39676G654018J183549l784870m920435j826728J093608P89930j260177j565481
39668b636586R20475L316963K225954j563594l483725j170292K097105J983884
39660A690184p69609j870803l621J849575J584318P31949J018322J488129Q19768
39651F538212k33629q48183k175597m715661n585592j886200L975780O018402
39643A087532K314742k285165k533109O96694K513034Q45543j756982k586262
39635a703973j915501r81101L60538K109119K365127j68429l024526k482368Q67535
39626d573579K447594M12746j544556j92263J895374O30477k437623k129416K008638
$$ plain form
39617 -3482608 1017355 2945242 448968 -3758761 -6864147 -8425462 -8547380 -6971740
39609 -6971740 -4687455 -3634689 -3901391 -3652690 -2571059 -2592427 -4091071 -4340962 -1744057
39600 -1744057 1093621 1139896 -332274 74102 2323106 3036679 880330 -1353803 -776020
39591 -776020 1857175 3519844 2514496 -295055 -2849814 -3615165 -2426465 -298997
39583 -298997 1469905 2031655 1214094 -180473 -463303 1190197 2915078 1972431 -960283
39574 -960283 -1739934 1434413 4680519 3456888 -1230293 -4938469 -6344827 -7503142
39566 -7503142 -8419001 -6283049 -911581 3392542 3139022 -516775 -4683104 -8022401
39558 -8022401 -9447511 -7355244 -2913056 -802703 -3309544 -6370550 -5225196 -1620055
$$ packed form
39617c482608M499963J927887k496274m207729l105386j561315j21918J575640
39609f971740K284285J052766k66702K48701J081631k1368j498644k49891K596905
39600a744057K837678M6275j472170M06376K249004P13573k156349k234133N77783
39591g76020K633195J662669j005348k809551k554759p65351J188700K127468
39583b98997J768902N61750q17561j394567k82830J653500J724881r42647k932714
39574i60283p79651L174347L246106j223631m687181l708176j406358j158315
39566g503142r15859K135952N371468M304123k53520l655797m166329l339297
39558h022401j425110K092267M442188K110353k506841l061006J145354L605141
$$ plain form
39550 -1620055 -896845 -3431762 -4137644 -506345 3804247 4811410 3545254 3263295 4307710
39541 4307710 4506916 3118612 1896381 2653531 5208097 7572455 7634487 5141596 2141528
39532 2141528 690724 460446 -33423 -483097 456654 1627102 11710 -3968481 -5402714
39523 -5402714 -1562472 3459984 4142647 1168462 -418328 887502 1788934 535736
39515 535736 -434545 665468 1960864 1850978 2173202 4648828 7198368 6974924 4757722
39506 4757722 3062451 1857534 -222892 -2003614 -1359053 14173 -2035929 -7511281
39498 -7511281 -11304973 -10179560 -6841226 -5080080 -4433488 -2586681 -262222 -54884
39490 -54884 -1863782 -2973523 -2159117 -781465 -37422 160382 -461995 -2629068 -5445022
$$ packed form
39550a620055P23210k534917p05882L631299M310592J007163j266156k81959J044415
39541D307710J99206j388304j222231P57150K554566K364358O2032k492891l000068
39532B141528j450804k30278m93869m49674R39751J170448j615392l980191j434233
39523e402714L840242N022456O82663k974185j586790J305830R01432j253198
39515E35736r70281J100013J295396j09886L22224K475626K549540k23444k217202
39506D757722j695271j204917k080426j780722O44561J373226k050102n475352
39498g511281l793692J125413L338334J761146O46592J846807K324459K07338
39490e4884j808898j109741Q14406J377652P44043J97804o22377k167073k815954
$$ plain form
39481 -5445022 -6560784 -5188997 -3014532 -1416218 148512 1998793 2665609 1253722
39473 1253722 -232840 890282 4251225 6970405 7563919 7249015 7270949 6925498 4925509
39464 4925509 1176265 -3638291 -8809685 -12866354 -13519077 -10168420 -5763191 -4114708
39456 -4114708 -5254667 -5236461 -1141909 5063565 8427319 5899369 -1037488 -7600810
39448 -7600810 -9287732 -5524712 -245808 2327822 2465668 3503790 5738457 5417780
39440 5417780 1443900 -1161950 1636165 5724357 4325561 -1316031 -3442708 136986
39432 136986 2795204 72548 -3103614 -617401 5105364 7568253 6539084 7062496
39424 7062496 9994606 10551587 6599909 2186867 972141 1069897 -882042 -4161678 -5642574
$$ packed form
39481e445022j115762J371787K174465J598314J564730J850281O66816j411887
39473A253722j486562J123122L360943K719180N93514l14904K1934l45451j999989
39464D925509l749244m814556n171394m056669o52723L350657M405229J648483
39456d114708j139959J8206M094552O205474L363754k527950o936857o563322
39448g600810j686922L763020N278904K573630J37846J038122K234667l20677
39440E417780l973880k605850K798115M088192j398796n641592k126677L579694
39432A36986K658218k722656l176162K486213N722765K462889j029169N23412
39424G062496K932110N56981l951678m413042j214726R7756j951939l279636j480896
$$ plain form
39415 -5642574 -4822004 -4043989 -4506815 -4559522 -2311145 1371395 3217039 948316 -3891169
39406 -3891169 -7162496 -6499865 -3595911 -1569223 -1303769 -1545140 -1402329 -1167003 -1540037
39397 -1540037 -3457077 -7527572 -12110468 -13496402 -10074690 -4774276 -1091069 1238176
39389 1238176 3450757 3158423 -2278426 -8817782 -8379741 356094 9169835 10472868
39381 10472868 5574501 260679 -3088746 -5036460 -4626932 -577077 4759567 7166419
39373 7166419 5773719 3075720 511886 -2332194 -4408301 -3076279 1574042 5319483
39365 5319483 4587550 857042 -1472411 -493280 1728881 2703325 2665982 3432856 5364187
39356 5364187 6970066 7149466 6147807 4267010 1753707 503158 2958613 7504084
$$ packed form
39415e642574Q20570P78015m62826n2707K248377L682540J845644k268723m839485
39406c891169l271327O62631K903954K026688K65454k41371J42811K35326l73034
39397a540037j917040m070495m582896j385934L421712N300414L683207K329245
39389A238176K212581k92334n436849o539356M38041Q735835Q813741J303033
39381A0472868m898367n313822l349425j947714M09528M049855N336644K406852
39373G166419j392700k697999k563834k844080k076107J332022M650321L745441
39365E319483p31933l730508k329453R79131K222161R74444l7343P66874J931331
39356E364187J605879J79400j001659j880797k513303j250549K455455M545471
$$ plain form
39348 7504084 8108737 1943685 -5266394 -6089541 -1727428 158414 -2888832 -5428886
39340 -5428886 -3962448 -2102046 -2849207 -2617295 1976096 6980757 7147938 5023107 6876323
39331 6876323 11940259 13167309 8183911 2441507 478281 326236 -1178994 -2800657
39323 -2800657 -1944537 260903 523853 -1657802 -3324592 -1672088 3202222 8596100
39315 8596100 11352701 10302937 7118018 4411987 3206699 2850057 2640712 2241398 1100140
39306 1100140 -1008998 -3165579 -4232638 -4154604 -3413868 -2180879 -978846 -653959 -445853
39297 -445853 1774775 5554042 6828137 3596817 -225027 -435219 747539 -1267969
39289 -1267969 -4794851 -3746044 2285489 6595552 5124531 1335468 -599818 -1353296
$$ packed form
39348G504084O04653o165052p210079q23147M362113J885842l047246k540054
39340e428886J466438J860402p47161K31912M593391N004661J67181k124831J853216
39331F876323N063936J227050m983398n742404j963226j52045j505230j621663
39323b800657Q56120K205440K62950k181655j666790J652504M874310N393878
39315H596100K756601j049764l184919k706031j205288l56642k09345l99314j141258
39306A100140k109138k156581j067059P8034P40736J232989J202033L24887K08106
39297d45853K220628L779267J274095l231320l821844k10192J182758k015508
39289a267969l526882J048807O031533M310063j471021l789063j935286p53478
$$ plain form
39281 -1353296 -2259818 -1403676 2010976 4218409 2522800 497014 2620676 6887468
39273 6887468 7971802 5335632 2679370 904796 -2519235 -7351822 -9233736 -5804748
39265 -5804748 -109557 3566973 4230253 3399726 2555544 2670758 4150531 6030756 6756930
39256 6756930 6378029 6391191 7047850 6687547 4407867 1657067 250264 132915 40148
39247 40148 -563792 -1041732 -636856 442697 910443 -288556 -2331746 -3151945 -2380125
39238 -2380125 -2259824 -4304728 -6584892 -6412130 -4354248 -2784440 -1380385 2384468
39230 2384468 8168429 11836118 10794477 7230174 4451250 2692477 603566 -1338276
39222 -1338276 -1543818 -324366 135929 -1432820 -3981235 -5218117 -3463298 690446
$$ packed form
39281a353296r06522Q56142L414652K207433j695609k025786K123662M266792
39273F887468J084334k636170k656262j774574l424031m832587j881914L428988
39265e804748N695191L676530O63280q30527q44182J15214J479773J880225P26174
39256F756930l78901J3162O56659l60303k279680k750800j406803j17349r2767
39247D0148o03940m77940M04876J079553M67746j198999k043190q20199P71820
39238b380125J20301k044904k280164J72762K057882J569808J404055L764853
39230B384468N783961L667689j041641l564303k778924j758773k088911j941842
39222a338276k05542J219452M60295j568749k548415j236882J754819M153744
$$ plain form
39214 690446 4082430 3767705 699714 -1248546 -733522 -744847 -3229266 -4979366 -2243480
39205 -2243480 2780335 4420052 1642026 -801729 460744 3490605 5371480 6279462
39197 6279462 7157204 7005717 5405292 4889292 7420330 10454832 10057536 6778029 4900319
39188 4900319 6266087 8200365 7805515 5242582 1915808 -1953975 -6470447 -10429728
39180 -10429728 -11946146 -10050115 -5313629 164315 3478107 3236944 1520577 1931990
39172 1931990 5150348 7932931 7202451 3621758 192223 -1378986 -1730240 -2072719 -2486251
39163 -2486251 -1955071 45465 1926288 914719 -3230143 -6603107 -5542951 -1901004
39155 -1901004 -814993 -3265078 -4652331 -1940862 1696087 1829323 -842647 -2318780
$$ packed form
39214F90446L391984l14725l067991j948260N15024j1325k484419j750100K735886
39205b243480N023815J639717k778026k443755J262473L029861J880875R07982
39197F279462Q77742j51487j600425n16000K531038L034502l97296l279507j877710
39188D900319J365768J934278l94850k562933l326774l869783m516472l959281
39180a0429728j516418J896031M736486N477944L313792k41163j716367M11413
39172A931990L218358K782583p30480l580693l429535j571209l51254l42479m13532
39163b486251N31180K000536J880823j011569m144862l372964J060156L641947
39155a901004J086011k450085j387253K711469L636949J33236k671970j476133
$$ plain form
39147 -2318780 -1292249 124362 406779 246317 805020 2645977 5549361 7558561 5848258
39138 5848258 847520 -2442430 -224650 4774407 7116727 5962615 4430379 3148356
39130 3148356 -334702 -5781165 -9108590 -8202749 -5639547 -4257232 -3846388 -3601875 -4051981
39121 -4051981 -4847485 -4132928 -1857503 -353384 -27584 1736156 5338760 6729973 3439360
39112 3439360 -820148 -1308220 933034 1477545 -615739 -2715334 -3847628 -5436590
39104 -5436590 -7293976 -7151221 -4754081 -3027626 -4090765 -6462097 -7235603 -5488231
39096 -5488231 -2844642 -1614720 -2553789 -3863847 -2835945 955884 5036138 7283786
39088 7283786 8411630 10122525 12306617 13499585 12880605 10648474 7842992 6605332
$$ packed form
39147b318780J026531J416611K82417j60462N58703J840957K903384K009200j710303
39138E848258n000738l289950K217780M999057K342320j154112j532236j282023
39130C148356l483058n446463l327425R05841K563202J382315M10844K44513m50106
39121d051981p95504P14557K275425J504119L25800J763740L602604J391213l290613
39112C439360m259508m88072K241254N44511k093284k099595j132294j588962
39104e436590j857386J42755K397140J726455j063139k371332p73506J747372
39096e488231K643589J229922r39069j310058J027902L791829M080254K247648
39088G283786J127844J710895K184092J192968o18980k232131k805482j237660
$$ plain form
39080 6605332 8370040 10723881 9143845 3761082 813532 4281878 9613298 10033032
39072 10033032 6038140 3271013 3170807 2068947 -1110993 -2777243 -1226515 378132
39064 378132 -742765 -3505572 -6373715 -9635521 -12282954 -11100242 -5601552 -215856
39056 -215856 1281349 508381 1071859 3227130 4603752 3990032 2045986 134820 25260
39047 25260 2446902 4742457 3085569 -1513680 -3297892 -80647 2802838 227004
39039 227004 -5108731 -7208095 -5531110 -4091770 -4332950 -4450792 -4271560 -5187920 -5933365
39030 -5933365 -3850380 -301322 343645 -2567933 -5198530 -5582697 -5566189 -5595278 -3285419
39021 -3285419 928796 2429613 -208446 -1666759 2253885 7750175 8904274 6695605
$$ packed form
39080F605332J764708K353841j580036n382763k947550L468346N331420M19734
39072A0033032l994892k767127j00206j101860l179940j666250J550728J604647
39064C78132j120897k762807k868143l261806k647433J182712N498690N385696
39056b15856J497205p72968N63478K155271J376622o13720j944046j911166j09560
39047B5260K421642K295555j656888m599249j784212L217245K883485k575834
39039B27004n335735k099364J676985J439340k41180j17842J79232r16360p45445
39030e933365K082985L549058O44967k911578k630597l84167J6508k9089K309859
39021c285419M214215J500817k638059j458313L920644N496290J154099k208669
$$ plain form
39013 6695605 6265766 7750218 6545783 1995844 -940466 209729 1717915 428332
39005 428332 -1068270 337568 2177569 330774 -3717579 -4930192 -2886118 -2314438
38997 -2314438 -4956001 -6362276 -3237597 594172 -375858 -4873296 -6744487 -4189978
38989 -4189978 -1814758 -2634116 -3052574 1143723 7239106 8456873 3342894 -1940483
38981 -1940483 -1597994 2696828 4788461 2336019 -681009 165538 3800978 5286921
38973 5286921 2334080 -2196565 -4577233 -4494337 -3516084 -1689975 1217251 2514237 -1028025
38964 -1028025 -7190133 -9082884 -3821307 3281014 5818554 4276060 3541496 5354139
38956 5354139 7509395 8598439 8825175 7222247 2957435 -960448 -318870 3567373
$$ packed form
39013F695605m29839J484452j204435m549939k936310J150195J508186j289583
39005D28332j496602J405838J840001j846795m048353j212613K044074N71680
38997b314438k641563j406275L124679L831769r70030m497438j871191K554509
38989d189978K375220q19358m18458M196297O095383J217767n113979n283377
38981a940483L42489M294822K091633k452442l017028Q46547L635440J485943
38973E286921k952841m530645k380668Q2896R78253J826109K907226J296986l542262
38964a028025o162108j892751N261577P102321K537540j542494p34564J812643
38956E354139K155256J089044K26736j602928m264812l917883O41578L886243
$$ plain form
38948 3567373 4753135 1267601 -2266756 -2317727 -1501642 -3088648 -5261745 -4767661 -2397669
38939 -2397669 -514350 1555079 4837091 6198446 2140614 -4335773 -6325949 -2256468
38931 -2256468 2557795 3786558 2481260 782308 -1603106 -4458681 -4915919 -1401039
38923 -1401039 3042797 4341341 2557031 1078210 1942631 3998978 4897874 3491300
38915 3491300 890978 -252766 1390033 3510535 2485601 -1726945 -5356402 -5975999
38907 -5975999 -4990534 -3966599 -1940552 1508339 3819373 3143377 1742559 2175225 2500010
38898 2500010 -420646 -4568578 -4791596 -747492 2292247 1322567 -526473 294500 2532369
38889 2532369 3231861 2437067 1583290 41907 -3040460 -5420471 -4217288 -638409 1635133
$$ packed form
38948C567373J185762l485534l534357n0971Q16085j587006k173097M94084K369992
38939b397669J883319K069429L282012J361355m057832o476387j990176M069481
38931b256468M814263J228763j305298j698952k385414k855575m57238L514880
38923a401039M443836J298544j784310j478821Q64421K056347Q98896j406574
38915C491300k600322j143744J642799K120502j024934m212546l629457o19597
38907e975999R85465J023935K026047L448891K311034o75996j400818M32666L24785
38898B500010k920656m147932k23018M044104L039739r69680j849040Q20973K237869
38889B532369O99492p94794q53777j541383l082367k380011J203183L578879K273542
$$ plain form
38880 1635133 2273826 4278167 7708555 8085652 3344041 -1482896 -386573 4994954
38872 4994954 7345391 3782863 -506374 -12977 3604067 4619111 1427976 -1927724
38864 -1927724 -1786018 758989 2102987 609443 -2070204 -2981428 -726253 2862755
38856 2862755 4193928 2153699 -24846 857427 2694632 519849 -5794825 -10376310
38848 -10376310 -9294354 -5605814 -3875737 -3539048 -1753617 125120 -1780682 -6881198
38840 -6881198 -10006898 -8434660 -4464780 -472448 3904933 8199695 9340249 6242217
38832 6242217 2733096 2636898 4316374 3403098 -614933 -3852784 -3479004 -852194 941508
38823 941508 589033 -939642 -2163841 -2830622 -4074670 -6621616 -9031852 -8948415 -6337961
$$ packed form
38880A635133O38693K004341L430388L77097m741611m826937J096323N381527
38872D994954K350437l562528m289237M93397L617044J015044l191135l355700
38864a927724J41706K545007J343998j493544k679647r11224K255175L589008
38856B862755J331173k040229k178545Q82273J837205k174783o314674m581485
38848a0376310J081956L688540J730077L36689J785431J878737j905802n100516
38840f881198l125700J572238L969880L992332M377381M294762J140554l098032
38832F242217l509121r6198J679476r13276m018031l237851L73780K626810J793702
38823I41508l52475j528675j224199o66781j244048k546946k410236Q3437K610454
$$ plain form
38814 -6337961 -3866809 -3282918 -3120854 -1288840 1515969 2632523 862727 -2253239
38806 -2253239 -4009170 -2577672 1594235 5664063 6714818 4835196 2673714 1701471
38798 1701471 1062367 725165 2676208 7017079 9761004 7522083 2375221 -1150553
38790 -1150553 -2312945 -3900736 -6823629 -8697595 -7667052 -4488037 -841596 1675397
38782 1675397 1279894 -2194609 -5533418 -5525909 -3960089 -5477082 -10210419 -12864117 -10346221
38773 -10346221 -6048601 -4315835 -4525894 -3795520 -2431308 -2723527 -4093801 -3492844 -247421
38764 -247421 2798594 3286510 1957895 717081 52827 -813931 -2473460 -4646310 -6153043
38755 -6153043 -5359859 -1646264 3166794 5768923 4515955 1248437 -690548 20200
$$ packed form
38814f337961K471152N83891J62064J832014K804809J116554j769796l115966
38806b253239j755931J431498M171907M069828J050755j879622k161482r72243
38798A701471o39104l37202J951043M340871K743925k238921n146862l525774
38790a150553j162392j587791k922893j873966J030543L179015L646441K516993
38782A675397l95503l474503l338809P509J565820j516993m733337k653698K517896
38773a0346221M297620J732766k10059P30374J364212k92219j370274O00957L245423
38764b47421L046015M87916j328615j240814o64254q66758j659529k172850j506733
38755f153043P93184L713595M813058K602129j252968l267518j938985P10748
$$ plain form
38747 20200 1921187 3310313 4034720 4066387 2149779 -1930927 -4943195 -3452706 464966
38738 464966 667681 -4535943 -9307661 -8296036 -3914662 -1874763 -2860347 -3563578 -3419539
38729 -3419539 -4464523 -5878221 -4795428 -2124829 -1465974 -2233642 -396750 3237064
38721 3237064 2597062 -3774371 -9356201 -9163729 -6056966 -3963828 -1507439 2822831
38713 2822831 5408494 3332369 286424 505521 1494982 -743408 -3781836 -3310736 -1569195
38704 -1569195 -3172137 -5771900 -3703330 1225896 1932207 -1837090 -3039556 653487
38696 653487 3632273 2573593 1000051 1265786 436338 -2669196 -4190952 -2647320 -2233018
38687 -2233018 -4700377 -5258281 -1303216 1825447 -472400 -3928549 -2386666 2364171
$$ packed form
38747B0200J900987J389126P24407L1667j916608m080706l012268J490489L917672
38738D64966K02715n203624m771718J011625M381374K039899r85584p03231J44039
38729c419539j044984j413698J082793K670599O58855p67668J836892L633814
38721C237064o40002o371433n581830J92472L106763K093138K456389M330270
38713B822831K585663k076125l045945K19097R89461k238390l038428M71100J741541
38704a569195j602942k599763K068570M929226P06311l769297j202466L693043
38696F53487K978786j058680j573542K65735q29448l105534j521756J543632M14302
38687b233018k467359n57904L955065L128663k297847l456149J541883M750837
$$ plain form
38679 2364171 4426463 3110218 1746642 887817 -689202 -1359967 440458 1560075
38671 1560075 -1094083 -3907608 -1632376 3330531 4190770 464638 -2546867 -3796838
38663 -3796838 -7231958 -12199130 -12243144 -5892908 -417811 -928054 -2653057 1055567 8485376
38654 8485376 12751288 11480127 8046391 5412213 3459764 1471429 -398571 -1873793
38646 -1873793 -2513755 -1466863 1146198 3440017 3601373 1618971 -1464850 -4583006
38638 -4583006 -6443972 -6299826 -5603893 -6676197 -8908688 -8850104 -5232613 -1214883 -11693
38629 -11693 -945810 -1904189 -3205082 -6279988 -10204618 -12380565 -11933520 -10325272 -9187950
38620 -9187950 -9199523 -10425697 -12238167 -13313793 -12765742 -10892769 -8481595 -6341129 -5614874
$$ packed form
38679B364171K062292j316245j363576q58825j577019o70765J800425J119617
38671A560075k654158k813525K275232M962907Q60239l726132l011505j249971
38663c796838l435120m967172m4014O350236N475097n10243j725003L708624P429809
38654H485376M265912j271161l433736k634178j952449j988335j870000j475222
38646a873793o39962J046892K613061K293819J61356j982402l083821l118156
38638d583006j860966J44146O95933j072304k232491N8584L617491M017730J203190
38629a1693r34117r58379j300893l074906l924630k175947M47045J608248J137322
38620i187950j1573j226174j812470j075626N48051J872973K411174K140466P26255
$$ plain form
38611 -5614874 -6911380 -8773055 -8806327 -6645106 -3798713 -632291 3552324 7175188
38603 7175188 6954356 3039534 -399760 -1465014 -2974825 -5958385 -5649348 1399974
38595 1399974 10114747 12586512 8629981 4817670 4340991 3844653 269182 -4716969
38587 -4716969 -8067477 -8771698 -7131232 -4423989 -3581806 -6218988 -8836081 -6371331
38579 -6371331 176072 4504396 3945145 2118148 1350664 -1234971 -6963062 -10924666
38571 -10924666 -8900847 -4427713 -3461755 -5312453 -4716302 -740546 2432602 2677808
38563 2677808 2091018 1912279 685550 -1562526 -2185952 -619166 41931 -1733164 -2942752
38554 -2942752 -1031395 1523122 1176263 -537461 811768 5030340 6496794 2039820
$$ packed form
38611e614874j296506j861675l3272K161221K846393L166422M184615L622864
38603G175188k20832l914822l439294j065254j509811k983560L09037P049322
38595A399974Q714773K471765l956531l812311m76679m96338l575471m986151
38587d716969l350508p04221J640466K707243Q42183k637182k617093K464750
38579f371331O547403M328324n59251j826997p67484k585635n728091l961604
38571a0924666K023819M473134R65958j850698N96151L975756L173148K45206
38563B677808n86790j78739j226729k248076o23426J566786O61097j775095j209588
38554b942752J911357K554517l46859j713724J349229M218572J466454m456974
$$ plain form
38546 2039820 -3965875 -5000506 -904616 2254475 477078 -3321999 -4157900 -2016827
38538 -2016827 -1116898 -3253577 -5454961 -4865984 -2662431 -1186659 185740 3379619
38530 3379619 7323558 8698633 6772003 4389667 3507845 2461208 -840712 -4971612
38522 -4971612 -6355255 -3974866 -988264 -1214430 -4747024 -7796919 -7111816 -3848886
38514 -3848886 -1798132 -1998356 -1546584 1083608 2469706 -864414 -6074801 -7114466
38506 -7114466 -3598935 -1223884 -2388196 -2231581 2879485 8290694 7742140 3330997
38498 3330997 2218230 5244332 6163726 2634259 629226 4975406 11493721 13073980
38490 13073980 9379023 5489126 3820752 2878955 2421153 3987725 6219514 5158384
$$ packed form
38546B039820o005695j034631M095890L159091j777397l799077q35901K141073
38538b016827Q99929k136679k201384N88977K203553J475772J372399L193879
38530C379619L943939J375075j926630k382336q81822j046637l301920m130900
38522d971612j383643K380389K986602k26166l532594l049895O85103L262930
38514c848886K050754k00224M51772K630192J386098l334120n210387j039665
38506g114466L515531K375051j164312J56615N111066N411209n48554m411143
38498C330997j112767L026102R19394l529467k005033M346180O518315J580259
38490A3073980l694957l889897j668374r41797m57802J566572K231789j061130
$$ plain form
38482 5158384 672942 -2182695 -596442 1360792 -1121098 -6044897 -7492171 -4259396
38474 -4259396 -1022260 -1190897 -2915849 -3089237 -1557601 430230 2849628 5415061
38466 5415061 5714730 1912188 -3788177 -7297632 -7784906 -7861331 -8805107 -8823897 -6864213
38457 -6864213 -4911626 -4536828 -3817061 -583948 3056234 3076652 -58650 -1126761 2644004
38448 2644004 7182718 6516553 244236 -6219713 -7922250 -4714269 379577 4935475
38440 4935475 8383896 10605329 10632095 7409702 1901949 -2432890 -2691427 -163046 793655
38431 793655 -1571257 -3571172 -772308 5673972 9921310 8560840 4455641 2686805
38423 2686805 4537178 6756410 5691108 918979 -4661696 -7402895 -5844619 -1793640
$$ packed form
38482E158384m485442k855637J586253J957234k481890m923799j447274L232775
38474d259396L237136j68637j724952j73388J531636J987831K419398K565433
38466E415061K99669l802542n700365l509455m87274p6425r43776j8790J959684
38457f864213J952587L74798P19767L233113L640182K0418l135302j068111L770765
38448B644004M538714o66165o272317o463949j702537L207981N093846M555898
38440D935475L448421K221433K6766l222393n507753m334839k58537K528381R56701
38431G93655k364912j999915K798864O446280M247338j360470m105199j768836
38423B686805J850373K219232j065302m772129n580675k741199J558276M050979
$$ plain form
38415 -1793640 1503862 2342018 1436563 151228 -1037691 -2005290 -2191196 -1450324 -986705
38406 -986705 -2048646 -3703593 -3261991 332702 4386339 4956412 1363000 -3063846 -5049304
38397 -5049304 -4603528 -3139737 -357890 4207681 7574240 5324674 -1869089 -7655489
38389 -7655489 -8106223 -6826717 -8726961 -11947611 -10781761 -4874461 -177319 -835934
38381 -835934 -4795585 -7900562 -8013187 -4460510 1995022 7244061 6229231 -734880
38373 -734880 -7534233 -9598109 -7905580 -4594228 269888 5077180 5191379 -843448
38365 -843448 -7752700 -10267705 -9561001 -8931624 -7545323 -3712979 -175915 322704 1286540
38356 1286540 6960535 13143749 11789107 3783467 -1369164 858535 4902832 5141428
$$ packed form
38415a793640L297502Q38156r05455j285335j188919r67599j85906P40872M63619
38406i86705j061941j654947M41602L594693M053637N70073l593412m426846j985458
38397e049304M45776J463791K781847M565571L366559k249566p193763n786400
38389g655489m50734J279506j900244l220650J165850N907300M697142o58615
38381h35934l959651l104977j12625L552677O455532N249039j014830o964111
38373g34880o799353k063876J692529L311352M864116M807292J14199o034827
38365h43448o909252k515005P06704O29377J386301L832344L537064M98619R63836
38356A286540N673995O183214j354642q005640n152631K227699M044297K38596
$$ plain form
38348 5141428 3111517 1904327 604417 -1789085 -2931093 -1784844 -1609510 -4242958
38340 -4242958 -6032493 -3563557 779463 3063349 3634488 4500942 4585179 1987616 -2065367
38331 -2065367 -5414500 -7959520 -9036250 -5945272 616653 4054315 185547 -5872984
38323 -5872984 -7038962 -4628501 -4494581 -6347501 -5386609 -2556640 -3831029 -9236938
38315 -9236938 -11724946 -8630955 -5756834 -7196656 -9006509 -7033897 -4039913 -3959463
38307 -3959463 -4796251 -2847865 341218 842333 -1074241 -2396127 -2763076 -3514346 -3682351
38298 -3682351 -1856249 -194383 -1764632 -5371977 -7674877 -8875559 -11145638 -12676061
38290 -12676061 -9426406 -2910171 15121 -3230053 -7060084 -5995168 -1966945 1468
$$ packed form
38348E141428k029911j207190j299910k393502j142008J146249J75334k633448
38340d242958j789535K468936M343020K283886N71139Q66454Q4237k597563m052983
38331b065367l349133k545020j076730L090978O561925L437662l868768o058531
38323e872984j165978K410461J33920j852920R60892K829969j274389n405909
38315i236938k488008L093991K874121j439822j809853J972612K993984Q0450
38307c959463q36788J948386L189083N01115j916574j321886l66949p51270j68005
38298c682351J826102J661866j570249l607345k302900j200682k270079j530423
38290a2676061L249655O516235K925292l245174l830031J064916M028223J968413
$$ plain form
38282 1468 -632108 -822958 410638 1597850 2417101 3549061 3849324 1630483 -1548364
38273 -1548364 -2241378 -574734 -545387 -3731048 -6211185 -3886922 1699281 5392237 4745189
38264 4745189 1995952 605645 1792221 4052980 4680935 2169416 -1915975 -4207575
38256 -4207575 -3424499 -1698081 -1173496 -1311051 -1117292 -1647640 -3685179 -5098099 -3876312
38247 -3876312 -1990222 -2256758 -2939966 -350808 4118993 5263446 2353264 -59785
38239 -59785 -437100 -2272727 -5585673 -4223539 3686518 9846302 7047516 433778 -451125
38230 -451125 3793297 5048333 1763382 112730 1929591 2065100 -806545 -886155 3879434
38221 3879434 6764992 2953703 -2613783 -3757381 -2449573 -3068949 -3311590 1243745
$$ packed form
38282A468o33576j90850J233596J187212Q19251J131960L00263k218841l178847
38273a548364o93014J666644K9347l185661k480137K324263N586203L692956o47048
38264D745189k749237j390307J186576K260759O27955k511519m085391k291600
38256d207575P83076J726418N24585j37555J93759n30348k037539j412920J221787
38247c876312J886090k66536o83208K589158M469801J144453k910182k413049
38239e9785l77315j835627l312946J362134P910057O159784k798786o613738q84903
38230d51125M244422J255036l284951j650652J816861J35509k871645p9610M765589
38221C879434K885558l811289n567486j143598J307808o19376k42641M555335
$$ plain form
38213 1243745 7667611 9082697 5255076 1975310 1101735 -1053106 -5375458 -7471302
38205 -7471302 -5105721 -1755649 -373286 993422 4387920 7202218 5831056 1188322
38197 1188322 -2602860 -3133797 -913738 2581453 5735824 6880691 5444474 2264342
38189 2264342 -2062704 -7514738 -12403904 -13199343 -8761223 -3100790 -1368134 -3864500
38181 -3864500 -6344211 -5872878 -4070059 -4196497 -6856895 -9450939 -8956774 -4695184 1023152
38172 1023152 4592520 3998365 558512 -2253707 -1914367 1072768 3931549 4335072 2639645
38163 2639645 1514490 3026251 6116087 7689616 6419829 4370768 3976252 4500833
38155 4500833 3251414 -143248 -3015451 -3832857 -4603627 -7188935 -9249940 -7202436
$$ packed form
38213A243745O423866J415086l827621l279766q73575k154841m322352k095844
38205g471302K365581L350072J382363J366708L394498K814298j371162m642734
38197A188322l791182n30937K220059L495191L154371J144867j436217l180132
38189B264342m327046n452034m889166p95439M438120N660433J732656k496366
38181c864500k479711M71333J802819j26438k660398k594044M94165M261590N718336
38172A023152L569368n94155l439853k812219L39340K987135K858781M03523j695427
38163B639645j125155J511761L089836J573529j269787k049061l94516N24581
38155D500833j249419l394662k872203q17406p70770k585308k061005K047504
$$ plain form
38147 -7202436 -2555595 -1185815 -4998090 -8200055 -5064014 1337439 2713043 -2957747
38139 -2957747 -8421769 -6811783 -114899 4525975 3836284 412958 -2336297 -3498093
38131 -3498093 -3431932 -2643259 -2346296 -3550171 -4917235 -3815043 -350709 1883783 475700
38122 475700 -2270021 -2239410 1415093 6042199 9201031 10237831 8868528 5214881 1635204
38113 1635204 1370367 3777478 3678007 -1926314 -8600655 -9467885 -4374712 -2652 -757014
38104 -757014 -3874817 -4934351 -3938275 -3139832 -2351940 -186265 2430676 3904421 5337773
38095 5337773 8162030 9931180 7268095 2317679 971735 4100572 5731444 1653575
38087 1653575 -4780948 -7870378 -6599936 -3547866 -76481 3926827 7564533 9242014
$$ packed form
38147g202436M646841J369780l812275l201965L136041O401453J375604n670790
38139b957747n464022J609986O696884M640874o89691l423326k749255j161796
38131c498093O6161P88673K96963j203875j367064J102192L464334K234492j408083
38122D75700k745721L0611L654503M627106L158832J036800j369303l653647l579677
38113A635204k64837K407111r9471n604321o674341q67230N093173M372060p54362
38104g57014l117803j059534R96076P98443P87892K165675K616941J473745J433352
38095E337773K824257J769150k663085m950416j345944L128837J630872m077869
38087A653575o434523l089430J270442L052070L471385M003308L637706J677481
$$ plain form
38079 9242014 8401572 5315506 831151 -2617756 -2513453 -269907 -360300 -3281478 -3371513
38070 -3371513 2836362 9819174 9560832 2444714 -3616329 -3669639 -210086 2320227 2497641
38061 2497641 958200 -1151236 -1871909 -119548 1737099 366820 -3109468 -3981210
38053 -3981210 -1005909 1343488 -697536 -4952033 -6638872 -4342160 -495105 2179416
38045 2179416 2769634 2048339 1708493 2751481 3905532 2839069 -741547 -4811822 -8025723
38036 -8025723 -10855792 -13201053 -13262098 -10123728 -5717842 -2884096 -2627940 -4040896 -5549474
38027 -5549474 -5470820 -2720890 2034411 6712153 9679814 10535156 9279342 6078538 1824666
38018 1824666 -2267434 -5364652 -6391371 -4033955 777634 4075199 3527727 2501805
$$ packed form
38079I242014q40442l086066m484355l448907J04303K243546r0393k921178r0035
38070c371513O207875O982812k58342p116118o061043n3310L459553K530313J77414
38061B497641j539441k109436p20673J752361J856647j370279l476288q71742
38053c981210K975301K349397k041024m254497j686839K296712L847055K674521
38045B179416N90218p21295l39846J042988J154051j066463l580616m070275l213901
38036h025723k830069k345261o1045L138370M405886K833746K56156j412956j508578
38027e549474P8654K749930M755301M677742K967661Q55342j255814l200804m253872
38018A824666m092100l097218j026719K357416M811589L297565n47472j025922
$$ plain form
38010 2501805 5505990 10418075 10195545 2890999 -5017234 -7057107 -4116474 -1009914
38002 -1009914 237105 445269 -217382 -1998184 -3417983 -2491729 527176 3438652 4417634
37993 4417634 3176032 1051254 274959 1376489 1573730 -1441477 -4623753 -2804573
37985 -2804573 3015811 6132400 4273463 2901991 5416642 6978166 3396910 -219908
37977 -219908 2634709 7910685 6177297 -2228565 -6810672 -2298395 4394461 5222511
37969 5222511 1391838 -1552902 -2936045 -5543445 -8625812 -8373225 -4573926 -1986215
37961 -1986215 -4090372 -8455414 -9951320 -7126540 -3542458 -2813646 -4137759 -4199117 -2295169
37952 -2295169 -887703 -1235157 -1885188 -2367891 -4394073 -7279816 -6589011 -1190834 2299642
$$ packed form
38010B501805L004185M912085k22530p304546p908233k039873K940633L106560
38002a009914J247019K08164o62651j780802j419799R26254L018905K911476R78982
37993D417634j241602k124778p76295J101530J97241l015207l182276J819180
37985b804573N820384L116589j858937j371472K514651J561524l581256l616818
37977b19908K854617N275976j733388q405862m582107M512277O692856Q28050
37969E222511l830673k944740j383143k607400l082367K52587L799299K587711
37961a986215k104157m365042j495906K824780L584082P28812j324113o1358J903948
37952b295169J407466l47454o50031m82703k026182k885743O90805N398177L490476
$$ plain form
37943 2299642 -2395750 -11391079 -15144678 -11328061 -6524382 -5423781 -5435870 -3374390
37935 -3374390 -755391 357243 1199378 2683548 2548543 -476629 -3648536 -4639861 -5192300
37926 -5192300 -6896210 -7088407 -3078872 2644855 5835542 6656444 8044061 10016904
37918 10016904 10319111 9242407 8880576 8337920 4782757 -468810 -1923486 2457649
37910 2457649 7621139 7692763 3006659 -1508510 -2829846 -2082063 -1361966 -918661 203572
37901 203572 2222440 4079355 4492193 3214830 1245641 -143844 -490407 -323556 -584261
37892 -584261 -1865603 -3746885 -4774549 -3735272 -1229864 662835 698297 -116197 184498
37883 184498 2332582 5289706 7384431 7646386 6444070 5033239 4220200 3762062 3632989
$$ packed form
37943B299642m695392q995329l753599L816617M803679J100601j2089K061480
37935c374390K618999J112634Q42135J484170j35005l025172l171907r91325n52439
37926e192300j703910j92197M009535N723727L190687Q20902J387617J972843
37918A0016904L02207j076704l61831n42656l555163n251567j454676M381135
37910B457649N163490P1624m686104m515169j321336P47783P20097M43305J122233
37901B03572K018868J856915M12838j277363j969189j389485l46563J66851k60705
37892e84261j281342j881282j027664J039277K505408J892699L5462q14494L00695
37883A84498K148084K957124K094725K61955j202316j410831q13039m58138j29073
$$ [...]
##END NTUPLES=NMR SPECTRUM
##END=
