##TITLE=31Pdec_SR124T4
 CDCl3, 24 sc
 2.6.2022
##JCAMPDX= 6.0         $$ Bruker NMR JCAMP-DX V2.0
##DATA TYPE= NMR SPECTRUM
##DATA CLASS= NTUPLES
##ORIGIN= UXNMR, Bruker Analytische Messtechnik GmbH
##OWNER= root
$$ XWIN-NMR		Version 3.5
$$ Thu Jun  2 14:29:18 2022 Russian Standard Time (UT+4h)  she@DPX200
##.OBSERVE FREQUENCY= 81.013821
##.OBSERVE NUCLEUS= ^31P
##.ACQUISITION MODE= SIMULTANEOUS
##.ACQUISITION SCHEME= undefined
##.AVERAGES= 24
##.DIGITISER RES= 16
##SPECTROMETER/DATA SYSTEM= spect
##.PULSE SEQUENCE= zgpg30
##.SOLVENT NAME= DMSO
##.SHIFT REFERENCE= (INTERNAL, DMSO, 0, 248.564)
##AUDIT TRAIL= $$ (NUMBER, WHEN, WHO, WHERE, WHAT)
$$ ##TITLE= Audit trail, XWIN-NMR		Version 3.5
$$ ##JCAMPDX= 5.01
$$ ##ORIGIN= Bruker BioSpin GmbH
$$ ##OWNER= she
$$ F:/spectra/data/she/nmr/P31/1/pdata/1/auditp.txt
$$ ##AUDIT TRAIL=  $$ (NUMBER, WHEN, WHO, WHERE, WHAT)
(   1,<2022-06-02 14:27:54.85 +0400>,<she>,<DPX200>,
      <created by zg, POWCHK disabled, PULCHK disabled
       configuration hash MD5:
       00 E9 B6 7A A2 85 ED C7 34 08 36 98 17 FE 4E 26
       data hash MD5: 32K
       DE 8D 18 37 60 B2 41 37 8C 35 C0 00 DB BD 9C 78>)
(   2,<2022-06-02 14:27:57.78 +0400>,<she>,<DPX200>,
      <Start of raw data processing
       efp BC_mod = 2 LB = 1 FT_mod = 6 PKNL = 1 PHC0 = -10152.85 PHC1 = -172.7461 SI = 64K 
       data hash MD5: 64K
       D3 09 0A 72 4B 4D C9 9C 60 DF 88 D0 CF AF F5 9A>)
(   3,<2022-06-02 14:28:27.59 +0400>,<she>,<DPX200>,
      <pk PHC0 = -6.183812 PHC1 = 0 
       data hash MD5: 64K
       50 83 E3 AC 3B F0 D6 99 A6 5F FF 87 07 39 13 9C>)
(   4,<2022-06-02 14:28:51.59 +0400>,<she>,<DPX200>,
      <abs ABSG = 5 
       data hash MD5: 64K
       F0 7D D9 6B D6 C1 55 4A 7C A5 A7 17 CB C2 72 4F>)
$$ ##END=
$$ 
$$ hash MD5
$$ B6 4E 19 40 9B 69 83 56 F4 B8 A3 5E 81 D0 31 45
##$RELAX= 
##$RELAX= 
##$RELAX= 
##$RELAX= 
##$RELAX= 
##$RELAX= 
##$RELAX= 
##$RELAX= 
$$ Bruker specific parameters
$$ --------------------------
##$DU= <F:/spectra>
##$EXPNO= 1
##$NAME= <P31>
##$PROCNO= 1
##$TYPE= <nmr>
##$USER= <she>
##$AMP= (0..31)
100 100 100 100 100 100 100 100 100 100 100 100 100 100 100 100 100 100 
100 100 100 100 100 100 100 100 100 100 100 100 100 100 
##$AQSEQ= 0
##$AQ_mod= 1
##$AUNM= <au_zg>
##$AUTOPOS= <>
##$BF1= 81.014009
##$BF2= 200.13
##$BF3= 200.13
##$BF4= 200.13
##$BF5= 200.13
##$BF6= 200.13
##$BF7= 200.13
##$BF8= 200.13
##$BYTORDA= 1
##$CFDGTYP= 0
##$CFRGTYP= 5
##$CHEMSTR= <none>
##$CNST= (0..31)
1 1 145 1 1 1 1 1 1 1 1 1 1 1 1 1 1 1 1 1 1 1 1 1 1 1 1 1 1 1 1 1 
##$CPDPRG= <waltz16>
##$CPDPRG1= <>
##$CPDPRG2= <waltz16>
##$CPDPRG3= <>
##$CPDPRG4= <mlev>
##$CPDPRG5= <mlev>
##$CPDPRG6= <mlev>
##$CPDPRG7= <mlev>
##$CPDPRG8= <mlev>
##$CPDPRGB= <>
##$CPDPRGT= <>
##$D= (0..31)
0 1 0 0 0 0 0 0 0 0 0 0.03 2e-05 3e-06 0 0 0 0 0 0 0 0 0 0 0 0 0 0 0 0 
0 0 
##$DATE= 1654165674
##$DBL= (0..7)
120 120 120 11 120 120 24 19 
##$DBP= (0..7)
150 150 150 150 150 150 150 150 
##$DBP07= 0
##$DBPNAM0= <>
##$DBPNAM1= <>
##$DBPNAM2= <>
$$ [...]
##$SUBNAM3= <"">
##$SUBNAM4= <"">
##$SUBNAM5= <"">
##$SUBNAM6= <"">
##$SUBNAM7= <"">
##$SUBNAM8= <"">
##$SUBNAM9= <"">
##$SW= 501.771253377433
##$SWIBOX= (0..15)
0 1 3 0 0 0 0 0 0 0 0 0 0 0 0 0 
##$SW_h= 40650.406504065
##$TD= 32768
##$TD0= 1
##$TE= 0
##$TE2= 300
##$TE3= 300
##$TEG= 300
##$TL= (0..7)
0 120 53 12 22 120 120 120 
##$TP= (0..7)
150 150 150 150 150 150 150 150 
##$TP07= 0
##$TPNAME0= <>
##$TPNAME1= <>
##$TPNAME2= <>
##$TPNAME3= <>
##$TPNAME4= <>
##$TPNAME5= <>
##$TPNAME6= <>
##$TPNAME7= <>
##$TPOAL= (0..7)
0.5 0.5 0.5 0.5 0.5 0.5 0.5 0.5 
##$TPOFFS= (0..7)
0 0 0 0 0 0 0 0 
##$TUNHIN= 0
##$TUNHOUT= 0
##$TUNXOUT= 0
##$USERA1= <user>
##$USERA2= <user>
##$USERA3= <user>
##$USERA4= <user>
##$USERA5= <user>
##$V9= 5
##$VALIST= <valist>
##$VCLIST= <CCCCCCCCCCCCCCC>
##$VD= 0
##$VDLIST= <DDDDDDDDDDDDDDD>
##$VPLIST= <PPPPPPPPPPPPPPP>
##$VTLIST= <TTTTTTTTTTTTTTT>
##$WBST= 1024
##$WBSW= 4
##$XGAIN= (0..3)
0 0 0 0 
##$XL= 0
##$YL= 0
##$YMAX_a= 3570
##$YMIN_a= -3794
##$ZGOPTNS= <>
##$ZL1= 120
##$ZL2= 120
##$ZL3= 120
##$ZL4= 120
##$ABSF1= 248.5645
##$ABSF2= -253.2056
##$ABSG= 5
##$ABSL= 3
##$ALPHA= 0
##$AQORDER= 0
##$ASSFAC= 0
##$ASSFACI= 0
##$ASSFACX= 0
##$ASSWID= 0
##$AUNMP= <proc_1d>
##$AZFE= 0.1
##$AZFW= 0.5
##$BCFW= 0
##$BC_mod= 2
##$BYTORDP= 0
##$COROFFS= 0
##$CY= -3
##$DATMOD= 1
##$DC= 0
##$DFILT= <>
##$DTYPP= 0
##$F1P= 0
##$F2P= 0
##$FCOR= 1
##$FTSIZE= 65536
##$FT_mod= 6
##$GAMMA= 0
##$GB= 0
##$INTBC= 1
##$INTSCL= 5.30512e-09
##$ISEN= 30
##$LB= 1
##$LEV0= 0
##$LPBIN= 0
##$MAXI= 10000
##$MC2= 0
##$MEAN= 0
##$ME_mod= 0
##$MI= 50
##$NCOEF= 0
##$NC_proc= -9
##$NLEV= 6
##$NOISF1= 182.463
##$NOISF2= 159.3651
##$NSP= 0
##$NTH_PI= 0
##$NZP= 0
##$OFFSET= 248.5645
##$PC= 4
##$PHC0= -10159.03
##$PHC1= -172.7461
##$PH_mod= 1
##$PKNL= yes
##$PPARMOD= 0
##$PSCAL= 0
##$PSIGN= 0
##$REVERSE= no
##$SF= 81.014009
##$SI= 65536
##$SIGF1= 159.3651
##$SIGF2= -187.1042
##$SINO= 113.3802
##$SIOLD= 16384
##$SREGLST= <1H.CDCl3>
##$SSB= 0
##$STSI= 65536
##$STSR= 0
##$SW_p= 40650.406504065
##$SYMM= 0
##$S_DEV= 0
##$TDeff= 32768
##$TDoff= 0
##$TI= <>
##$TILT= no
##$TM1= 0
##$TM2= 0
##$TOPLEV= 0
##$USERP1= <user>
##$USERP2= <user>
##$USERP3= <user>
##$USERP4= <user>
##$USERP5= <user>
##$WDW= 1
##$XDIM= 65536
##$YMAX_p= 324180515
##$YMIN_p= -266544183
$$ End of Bruker specific parameters
$$ ---------------------------------
##NTUPLES= NMR SPECTRUM
##VAR_NAME=  FREQUENCY,     SPECTRUM/REAL,   SPECTRUM/IMAG
##SYMBOL=    X,             R,               I
##VAR_TYPE=  INDEPENDENT,   DEPENDENT,       DEPENDENT
##VAR_FORM=  AFFN,          ASDF,            ASDF
##VAR_DIM=   65536,         65536,           65536
##UNITS=     HZ,            ARBITRARY UNITS, ARBITRARY UNITS
##FACTOR=    0.620285442955139, 1,           1
##FIRST=     20137.2065510759, 0,            0
##LAST=      -20513.1999529892, 0,           0
##MIN=       -20513.1999529892, -266544183,  0
##MAX=       20137.2065510759, 324180515,    0
$$ Real data points
##PAGE= N=1
##DATA TABLE= (X++(R..R)), XYDATA
$$ [...]
45266 -19623679 -20563172 -16706737 -16505885 -18946189 -13976883 2049723 18307602 22057338
45258 22057338 14870779 9423540 11975425 15674555 12243828 3377879 -2700998 -1073989
45250 -1073989 6966187 16721777 21891788 16968291 2642682 -12556921 -19759593 -18096651
45242 -18096651 -13120813 -8903108 -5303939 -1799522 219654 -504802 -3406901 -6808118
45234 -6808118 -8603400 -6786106 -1410491 4316579 6847019 6016816 4726245 5754534
45226 5754534 9967482 15908842 19482742 16327119 7205040 -861683 -1814919 2800421
45218 2800421 7253877 9028744 8611208 4714482 -3748265 -11663472 -10932785 -1360152
45210 -1360152 7947645 10697803 10924133 14326320 17665578 13381078 2067922 -6794204
45202 -6794204 -6968524 -2636379 -1608226 -5837888 -11680018 -16305655 -19635589 -21188864
45194 -21188864 -19525799 -15486477 -12153183 -10130694 -6756972 -2456723 -3214965 -11565880
45186 -11565880 -18881336 -14503739 -1472278 5691309 201616 -9146935 -12757810 -13210153
45178 -13210153 -16954007 -21723455 -21679688 -18999528 -19778712 -22272811 -20019445 -14260964
45170 -14260964 -12110603 -13373958 -10756686 -3840876 -1247995 -6429138 -12195429 -12898558
45162 -12898558 -11652281 -11176036 -7992006 -1584035 664226 -4813491 -9653162 -5401894
45154 -5401894 3717862 8236477 7114450 5276905 3476494 97266 -1970530 -225653
45146 -225653 -102030 -7073976 -14584763 -11435404 380637 7208288 3454842 -2007227
45138 -2007227 -1361469 1745207 1936736 2067646 6510242 11875299 12176607 8812482 8289316
45129 8289316 12323000 16161796 15863367 12609255 9683755 8207437 6469303 2485998
45121 2485998 -2635482 -4479814 -579994 4630318 3902405 -3090735 -8493894 -6722859
45113 -6722859 -1654050 42909 -1444791 -1302945 735962 -30039 -4646397 -7759055
45105 -7759055 -5751059 -2696418 -4438617 -9837383 -12224004 -8172886 -804030 5112497
45097 5112497 7450974 6192816 2871232 1415575 5174149 11392353 13068439 8571690
45089 8571690 4392602 4976826 5749935 1932249 -1523701 2707773 11128416 13901424
45081 13901424 10664320 10603752 16496000 20516231 18400804 15672851 14876460 8525784
45073 8525784 -7268338 -22002445 -23313074 -13319765 -3234375 2418991 6833708 11050437
45065 11050437 12869214 13032240 14322435 16262668 16693518 15838350 14015087 9796287
45057 9796287 4887803 4192262 5909966 627691 -12442902 -19002224 -9988390 2305097
45049 2305097 1944842 -6767445 -9367657 -6268689 -8333116 -13787212 -11230727 -2792925
45041 -2792925 -2058922 -9125668 -10078157 -3096922 -2180316 -10687906 -14277270 -6826400 -566196
45032 -566196 -1815550 271822 9639317 11393481 -1226347 -9935570 268310 15152073
45024 15152073 13986479 1666794 -3593813 -549268 -53281 -1333422 3525483 10011302
45016 10011302 8675211 4864020 8780331 12967863 3473274 -11960881 -12146994 3439864
45008 3439864 13854749 9905394 3407329 1381388 -3878240 -13812835 -16472789 -8306111
45000 -8306111 -2128820 -5000860 -7630411 -4174635 -3043853 -8236834 -9118853 -613047
44992 -613047 4237412 -4565954 -15955964 -15445234 -7302673 -4243395 -6457977 -6056866
44984 -6056866 -3449999 -4875963 -9969581 -13490974 -13515504 -9118478 1949727 14983437
44976 14983437 18118055 9847698 5028726 12350779 18747866 10273524 -4116574 -6747012
44968 -6747012 1525249 7185024 8297930 12017716 14293671 4791648 -10282210 -12652159
44960 -12652159 -184088 10132010 9634115 7762016 10152159 7970035 -2677595 -9487966
44952 -9487966 -3183485 7241232 9942402 7693833 8000052 7695639 1191493 -4883209
44944 -4883209 43119 12628883 19448938 16293261 11915754 13042621 15905678 14446374
44936 14446374 9508785 6957915 10239944 16375276 18329942 12394660 3616305 692642
44928 692642 4736169 8068665 5836969 2386029 2652141 4286266 3969551 4935927 10435280
44919 10435280 14805677 10349996 369417 -4267744 -1020347 1252046 -3107826 -7372813
44911 -7372813 -2444221 9396986 16331976 10933573 -1655585 -9748911 -7402237 453459
44903 453459 5024460 3917643 1712915 1197036 -618187 -5446417 -8298837 -4519278
44895 -4519278 1484482 1377028 -4916597 -9314429 -7740653 -4744363 -4309605 -3614256 -285549
44886 -285549 342194 -7866577 -20495087 -25311386 -16840478 -2697122 6499888 9021052
44878 9021052 10392323 13092453 13473070 9195038 4234725 2935302 2713031 -1722381
44870 -1722381 -8192164 -8079314 528902 7549325 3962331 -4852103 -6258559 1731111
44862 1731111 8545155 7461943 4483498 6593951 9495115 5086456 -3764943 -5950631
44854 -5950631 952602 6085674 734542 -9463780 -13491738 -10840117 -10871052 -18054093
44846 -18054093 -25284820 -23443117 -12251783 928750 9177658 9893018 3832997 -5482192
44838 -5482192 -12393789 -12802309 -7867533 -2198687 1491723 3927758 5643058 4753662
44830 4753662 199126 -4459611 -3652285 2683152 6501669 -74357 -13796888 -21649498
44822 -21649498 -15832767 -3955998 431210 -4998722 -10498562 -10036174 -9193413 -14046726
44814 -14046726 -20392536 -20578662 -15216911 -10404455 -7298539 -2718569 2347644 3434456
44806 3434456 967665 1893 1897120 3900853 6428359 11902440 16187037 11588374
44798 11588374 810079 -2818817 6044094 15740866 13865691 3930250 -2082527 -423922
44790 -423922 3955613 7361619 8065432 2112442 -10857240 -20758971 -17003334 -3973134
44782 -3973134 3837067 1585535 -1776593 200910 2603580 156410 -3359972 -2718840
44774 -2718840 -435281 -1774002 -6287931 -10503368 -14338893 -18646411 -20100925 -15031842
44766 -15031842 -6175987 218980 2672066 4569542 7017032 7217180 4441054 2542333
44758 2542333 4536497 8204268 9576559 8516287 7924292 8237594 5961910 -883204
44750 -883204 -7958709 -8339037 -1119027 6838326 9163092 6868419 4394325 2131491
44742 2131491 -2273901 -7121177 -7427586 -2808549 1405738 2412504 3309777 5619874
44734 5619874 4832438 -1578546 -6948536 -3339674 6077632 10217367 5233453 -1010894
44726 -1010894 -1247730 1624757 1482479 -373631 1522567 5445373 2474569 -10449842
44718 -10449842 -23889557 -26521805 -18377855 -8725681 -3808995 -2788914 -4152073 -8208498
44710 -8208498 -11895219 -9100899 -277870 5100910 1300089 -4643361 -3925533 -377611
44702 -377611 -3922536 -13167497 -16676892 -11670466 -8809745 -14519708 -20072590 -15360797
44694 -15360797 -4600612 484507 -2867460 -7739435 -9378564 -8942311 -7296649 -3241343
44686 -3241343 2017799 4971799 4879386 3933781 2539662 -941790 -5907382 -9446106 -10625410
44677 -10625410 -10856473 -10121418 -6923854 -2226384 440470 -337461 -1806336 -200495
44669 -200495 5778452 13919840 19172053 17115331 9224078 2574937 1551083 2587528
44661 2587528 611449 -2815655 -2834180 381833 2808405 3709425 4877618 4765690 890607
44652 890607 -3491362 -3686465 -3597866 -11278656 -23514600 -26043986 -13017554 4048267
44644 4048267 12148633 11926333 10193512 7066538 416000 -4168619 511983 10929124
44636 10929124 17139344 16976216 15901320 14766827 8929051 -293612 -4478135 -1051290
44628 -1051290 2242211 -502574 -5230366 -6351780 -5569969 -6896941 -9219895 -9556317
44620 -9556317 -8596132 -7685446 -5141778 -802466 873005 -1950400 -3535523 177554
44612 177554 2969443 -1996690 -8872068 -7179616 -375609 -2313170 -14287130 -20732058
44604 -20732058 -13271069 -4708456 -9150506 -20004024 -21183215 -12194385 -6681734 -9831083
44596 -9831083 -12982723 -10594081 -7271564 -4996398 1966710 13280476 16937654 6682405
44588 6682405 -5517319 -5259180 4155048 9203546 7381137 7209494 10252898 8071321
44580 8071321 -1588785 -9243344 -8974459 -7851691 -13140983 -19176370 -15896959 -4793719
44572 -4793719 3012135 2209979 -1559770 -1780225 1073970 3541134 5231635 7300275
44564 7300275 8199568 5197301 -443991 -3289360 -225805 4841283 5525390 2017726
44556 2017726 2220850 11610553 24458928 29046659 20953603 7181828 -3163233 -7757648
44548 -7757648 -8968291 -7766621 -4148247 -855709 -1104485 -2687125 590272 9801216
44540 9801216 17339126 15738893 7376748 1322699 2085587 6381678 10592211 14848094
44532 14848094 17431931 12370242 -1126223 -12095202 -9497961 1932297 7050416 968297
44524 968297 -6164269 -6500696 -4699197 -5865031 -5149535 1838524 7922519 4621477 -3620994
44515 -3620994 -6955849 -5965496 -7679944 -10900446 -9480570 -6608498 -10041810 -14539368
44507 -14539368 -6617867 11065556 18210285 5990485 -9035481 -9411260 -256131 3602720
44499 3602720 1140537 1198376 4234561 3838346 1501710 4829801 12702245 15427308 9943359
44490 9943359 3561146 1340659 -170804 -4062785 -6321110 -1917933 7430662 14750012
44482 14750012 14670421 8116011 1884235 2299114 7574733 9639592 5894710 3926631
44474 3926631 9779291 17007471 14651362 2432786 -9707638 -14829394 -14255325 -11408530
44466 -11408530 -7973112 -5738334 -5923955 -6734949 -5909492 -3886447 -737544 5625371
44458 5625371 13008746 12890129 2728326 -5919927 -2092260 7047756 6029497 -5284952
44450 -5284952 -12427146 -9339652 -4863329 -4463956 -1455329 8103161 15747259 13552911
44442 13552911 5824424 346761 -2658045 -5784746 -7563017 -7651998 -10824584 -18403472
44434 -18403472 -23167237 -20046407 -14673755 -13846151 -14653502 -11363060 -6648560 -6940430
44426 -6940430 -11512559 -14614204 -14133959 -10506338 -2112493 9545569 14838882 6219847
44418 6219847 -9303921 -17402749 -14339444 -8712057 -6873792 -6205386 -3178987 662703
44410 662703 2585938 1982473 -1301403 -6263749 -8198334 -2978827 5676138 9295351
44402 9295351 5656941 697837 -1328416 -3093707 -7601227 -12315987 -13054679 -9406236
44394 -9406236 -3391349 3609179 9652116 10997953 5567532 -3403155 -9371555 -8083862
44386 -8083862 -914244 6443680 8772818 6248320 4482772 8324839 15947501 20591516
44378 20591516 17881636 10005104 2853537 144607 338419 -823164 -4303632 -5500127
44370 -5500127 -373359 7375094 9777648 5398235 1104828 1554512 3158254 1562394
44362 1562394 -1467173 -3429555 -6972336 -13899408 -18863895 -16841341 -12310139 -12122709
44354 -12122709 -12965925 -6407438 5383905 10634095 5877539 1683368 6555569 14673832
44346 14673832 15503657 8288515 335450 -3829645 -4562459 -1696699 5525124 13305243
44338 13305243 14040659 4732386 -7869904 -13167668 -7958237 -144069 585704 -5254252
44330 -5254252 -8323071 -4646719 -2287255 -8984573 -18617535 -18487989 -7707082 1378949
44322 1378949 631648 -4550658 -6103614 -4552538 -4491621 -6221143 -7965114 -10582869 -13642185
44313 -13642185 -11916176 -3233701 4080139 145635 -11857602 -18625353 -14374408 -7133688
44305 -7133688 -5504609 -7444369 -6850743 -4505874 -5402061 -8921237 -9306716 -4981065 -625158
44296 -625158 369478 -884843 -4172893 -11585031 -20313412 -21159483 -9995928 4722004
44288 4722004 12283082 12305712 9483582 2086790 -12313143 -23549804 -17071017 3079657
44280 3079657 15177429 8893487 -1615096 -1695673 2019757 -3448645 -13722225 -15101695
44272 -15101695 -7911727 -3926877 -5146726 -3074317 2565232 2223477 -5026924 -7993572
44264 -7993572 -1729382 5501273 7815371 9902928 14174645 13583562 4671681 -4175530
44256 -4175530 -5344290 -2292927 120492 4605486 12011649 13506065 2993079 -10728009
44248 -10728009 -15063695 -10529404 -6373632 -5189847 -2622314 1872554 4459624 4602972
44240 4602972 4556431 3632839 665747 -829750 2491499 6980264 7303865 4817143 3125721
44231 3125721 -67624 -7681930 -14147147 -12084604 -5228744 -3687521 -7931227 -8880724
44223 -8880724 -3799625 -548652 -4097126 -9324858 -10629195 -9737226 -9921466 -9841771 -7322590
44214 -7322590 -3511364 41917 3412682 5041034 1709989 -5767728 -11648394 -12173339
44206 -12173339 -8993952 -4475262 1214877 6812581 9293231 8733234 8869346 10677569
44198 10677569 10365644 6189351 2520787 4208258 10548249 17027879 19605192 16017077
44190 16017077 7186221 -1089084 -2391598 2489577 6367276 5851323 5557181 9786264
44182 9786264 15478394 17214146 14802497 11633105 8756302 4825561 -94429 -4064504
44174 -4064504 -5394669 -3358365 1481568 6466490 8603129 7906880 6423276 4142995
44166 4142995 92016 -2554757 1491378 10700301 16107936 12954107 7179490 6081800
44158 6081800 7832021 5601456 -2104695 -10799412 -16299123 -16309530 -9169724 2781668
44150 2781668 11131199 9411883 2116410 -411578 4587709 10045326 10121520 7110222
44142 7110222 5942380 7359024 8834397 8039958 3321782 -5319569 -13454341 -14275178
44134 -14275178 -6581159 2115568 3768688 -1091997 -5921152 -7889297 -10080523 -13741022
44126 -13741022 -13774446 -5772947 5229091 8296732 -344553 -11815080 -14669185 -7990483
44118 -7990483 -1219772 -2177255 -8811389 -13015702 -9614616 -654325 6987112 7336690
44110 7336690 518140 -6930332 -8274100 -3320749 2499949 5133456 5325567 5378981 5989480
44101 5989480 6906302 7297885 4713169 -2314169 -9344556 -8602745 524536 8082784 5148474
44092 5148474 -4584327 -10218824 -8388100 -6148836 -9242306 -13883485 -12872184 -5447930
44084 -5447930 2755195 7360749 8879228 8867484 6127988 -874993 -9270513 -12863393
44076 -12863393 -9215643 -3211129 -1118954 -2821941 -3338857 -1050708 192811 -2170618
44068 -2170618 -5316915 -6036973 -5883549 -7913161 -10995543 -11120347 -7111179 -2078785 105661
44059 105661 -2157063 -7536080 -12405386 -13424497 -10929276 -8253296 -6785486 -4263816
44051 -4263816 651040 5261786 6494288 4783582 2112279 -631121 -1991958 456022
44043 456022 5643536 8144522 5724530 3720137 7261351 13271590 15778706 15071268
44035 15071268 14805984 13789197 8883574 3471344 3852889 8450114 10011135 8082435
44027 8082435 9055102 13122833 12506948 5533516 977788 3169758 3738555 -4255993 -13581198
44018 -13581198 -13599409 -6133789 -377410 1833830 4502684 6000433 1688105 -4084371
44010 -4084371 -1472721 8610351 13734431 8282527 1627922 3388060 10164239 13221420
44002 13221420 11367798 8623410 5107095 -1119233 -6400489 -4202777 4852343 12209248
43994 12209248 11571736 5458632 851715 1696440 6339733 9873762 8584181 3505064
43986 3505064 -1072385 -3491643 -6487459 -10881472 -11448627 -4156990 5136610 6170502
43978 6170502 -1787298 -8534742 -6986006 -1680087 128597 -624257 1360793 5380808
43970 5380808 5371368 -254818 -5639972 -5271828 -644002 1924619 -2368054 -12540207 -21481858
43961 -21481858 -20968030 -10472948 8385 278446 -7443389 -11415447 -6078191 1708413
43953 1708413 4531261 5592491 12335016 23634417 30737876 29362172 23940400 19643998
43945 19643998 16626625 13947493 13266562 14900335 14522890 8738599 1680235 839268
43937 839268 6740422 11751950 10238374 5131524 1751467 -347451 -4281802 -7650730
43929 -7650730 -4769234 2941895 6765939 3716024 1800653 6608113 10314509 3586526
43921 3586526 -7088915 -6948018 3572219 7357302 -4124696 -18023458 -19702230 -12664946
43913 -12664946 -8584247 -7957421 -4075637 1043628 -228673 -5853040 -6984830 -4600925
43905 -4600925 -8025835 -16343838 -17162912 -7284457 998065 68629 -1837647 1917657
43897 1917657 2778994 -6770956 -16192638 -11934380 -594854 462403 -9123672 -12202775
43889 -12202775 -653595 14415417 21486218 22430176 22557810 20269389 13857938 8219690
43881 8219690 7066111 6504662 3446200 2928660 9327239 16487516 14961290 4933186
43873 4933186 -5410744 -10798736 -11262095 -7304224 -419911 3941061 1552619 -3679574
43865 -3679574 -4712647 -1804581 -924221 -3193207 -4199356 -3597550 -5992486 -10105280
43857 -10105280 -6635207 7607226 20892459 19453608 5131317 -7055117 -7015418 1168251
43849 1168251 7274336 5899067 -1518919 -10062511 -14010598 -9852799 -124549 7291720
43841 7291720 6606165 582106 -2517907 1469927 8074096 10152630 6459018 1788016
43833 1788016 -619793 -2883671 -7019147 -9711823 -7207310 -3221167 -5389414 -13185570
43825 -13185570 -16411301 -9305361 90399 735772 -5791550 -8454722 -3344391 2101672
43817 2101672 2407788 2404622 7797815 14409085 13402779 3572138 -7582723 -13077689 -11853770
43808 -11853770 -6791509 -2298930 -2698469 -8135038 -12687118 -11026307 -6049377 -4657251
43800 -4657251 -6641289 -4704688 2927642 7331806 1109803 -9569567 -11907999 -3259388
43792 -3259388 5808195 5743967 -633218 -4058449 -2071273 -1166480 -6146563 -12578097 -13244403
43783 -13244403 -9148674 -8362680 -13394665 -15779462 -7382634 7078742 14864112 10964946
43775 10964946 2936826 -30745 3017003 7190002 8666805 6818580 3589517 3079748
43767 3079748 8078262 14947072 15728899 7623603 -3178611 -9127553 -8914477 -5584517
43759 -5584517 -1902620 -519751 -3811412 -9585373 -11255744 -6366375 -653010 577501
43751 577501 127684 2539941 5020068 1907704 -5196212 -9307425 -8005172 -4562528
43743 -4562528 -1021489 2818403 5042762 3498037 1098970 2414275 5991001 6905396
43735 6905396 5371759 5092472 4777242 601470 -3729226 -154908 9263298 12067408
43727 12067408 2984150 -8346628 -11791881 -9446383 -8170025 -7876608 -4455263 1674360
43719 1674360 6548619 7871346 4702992 -2951681 -10298831 -9758321 -1539953 4110335
43711 4110335 394378 -6705642 -8111568 -3989724 -75064 1655354 1320632 -3381565
43703 -3381565 -11311805 -12761887 84497 20408337 32976757 31202409 21175221 11495336
43695 11495336 6094427 4630516 3521164 -1009023 -6058369 -2969712 9403375 19118013
43687 19118013 16475305 7657502 3519564 2580772 -2333540 -7535776 -4335795 2587633
43679 2587633 -198417 -12617242 -20028975 -15609222 -7703008 -2582188 3584183 11273757
43671 11273757 12540023 5879707 993818 1329969 -3028097 -16057503 -24567403 -18178749
43663 -18178749 -7045101 -5536344 -9626710 -6617956 1242161 728732 -9048380 -14689609
43655 -14689609 -9712301 -2836803 -2996026 -8229275 -12504222 -13712735 -11728884 -6673641
43647 -6673641 -2071362 -2788171 -7152094 -7407589 -903657 4752444 1489209 -7911946
43639 -7911946 -12233466 -4755076 8441528 14160761 6434100 -6517724 -12422736 -9918371
43631 -9918371 -7204390 -6946030 -2918298 5243014 6159651 -5729720 -17012077 -12117230
43623 -12117230 3713219 12176272 8049554 2166864 -30068 -5893157 -18216807 -26053923
43615 -26053923 -20513507 -8407246 -1712460 -1719341 -1714327 1135278 4550662 6981137 7453830
43606 7453830 3367071 -4981370 -10929728 -8999017 -3356586 -2342063 -6429571 -8384826
43598 -8384826 -4849294 -873736 -1314148 -3483518 -1839656 3590476 7646961 7492673
43590 7492673 5434945 3671353 193842 -6857037 -13075779 -11161061 -1018529 8446740
43582 8446740 10209655 7427816 6831552 7733212 3951753 -4747449 -10067167 -5684545
43574 -5684545 4450248 10689236 7705970 -1662301 -10244223 -12704500 -9297390 -4440823
43566 -4440823 -1436378 213013 1523117 976914 -2520302 -6308011 -7445462 -7451105 -9426868
43557 -9426868 -12596002 -14577122 -16878337 -21827631 -25345982 -20372686 -8385229 -391448
43549 -391448 -3955604 -14777892 -23400467 -24889539 -19477905 -9456478 507526 4431788
43541 4431788 1062344 -3720052 -4118684 -1648029 -1607738 -4366481 -4478472 1332438 8536729
43532 8536729 9244936 1845342 -5953532 -5886359 111901 2225574 -3223865 -7906611 -3582006
43523 -3582006 5650056 9990973 8624999 9069451 13791187 16774714 13880383 8214129
43515 8214129 3522994 -606386 -5166478 -9380806 -12758008 -13715886 -7168445 8633357
43507 8633357 23787395 25249239 14276043 4800863 3252627 2296313 -2549445 -4374600
43499 -4374600 450694 2855430 -3776657 -10787719 -8312786 -2199394 -3466801 -8688109
43491 -8688109 -5899165 4442031 9560338 4259008 -3023097 -5221887 -5847068 -10160333
43483 -10160333 -16281870 -18731589 -14992045 -6612374 1811332 4726593 964393 -4131482
43475 -4131482 -5746958 -5617044 -6304277 -4493176 2756436 9882746 9974200 6079032 5503080
43466 5503080 6618166 2764192 -3839331 -5354762 -3860892 -8708099 -17668470 -16905525
43458 -16905525 -3836149 5942588 1896967 -5910741 -4441295 2226131 3067653 -13880
43450 -13880 2578091 9373771 9660155 1753483 -4542067 -4104178 -2729861 -4963979 -6644615
43441 -6644615 -3705427 540715 2140033 3480757 7627496 11009936 8486724 2615344
43433 2615344 1038055 5482632 9614283 8636969 5202609 3066699 -24600 -7987721
43425 -7987721 -17780810 -21466663 -16844747 -10184241 -6926656 -5246771 -1573384 2805032
43417 2805032 4538524 2738462 -3698084 -17454758 -34561921 -40328305 -24173854 3181528
43409 3181528 18476191 13163160 1707768 -9148 6086526 8304890 2999623 -4373287
43401 -4373287 -9986055 -14060706 -15373955 -11912432 -6721655 -6426099 -12929900 -20853320
43393 -20853320 -23622821 -19046483 -9597645 -579638 2772273 9488 -2955733 -136972
43385 -136972 7032708 11583434 9954992 5534431 3004545 2911858 3593872 5632484 11114596
43376 11114596 18744500 22579804 17822051 7279186 -443401 -200031 4364190 6296769
43368 6296769 3575613 -1020634 -5679057 -10447443 -13539504 -12092625 -6911927 -1821731
43360 -1821731 1891900 5678193 8826476 9558796 11042060 18445405 28176589 28670239
43352 28670239 16066600 1284453 -3780462 179728 5833736 10689972 14667029 13579818
43344 13579818 5407039 -2020135 -528398 4768835 2714828 -5563652 -8179798 -1922127
43336 -1922127 3089889 489120 -3486232 -3114978 -3246544 -8569670 -12502831 -6639574
43328 -6639574 4661463 8843504 1433518 -10317950 -18407202 -21424157 -21275946 -18966400
43320 -18966400 -15153517 -11007733 -6903843 -1998611 4292159 10992328 15378800 14505869
43312 14505869 8750038 3131699 1862488 2266339 -1041349 -6209888 -5424909 1993634
43304 1993634 5755373 -1293424 -12057372 -14561264 -6946383 3789498 12999781 20116639
43296 20116639 22830716 18591056 10467593 3722632 -2024092 -9655510 -15729732 -13985591
43288 -13985591 -6765808 -3035698 -4494337 -3759645 1957281 5929418 4106996 2059736
43280 2059736 4652421 7935381 7345939 5776227 6950345 8375720 7733654 8707265 12735915
43271 12735915 12495136 2791404 -8688517 -11705096 -8691415 -8482157 -10104629 -5923992
43263 -5923992 2395113 5488071 3108847 4769805 12042189 14726595 8648298 3388145
43255 3388145 5843869 8459769 2165786 -9104818 -15695503 -15519067 -11319854 -2724504
43247 -2724504 9184757 16259372 12888014 5971056 4822724 5949164 -471028 -12510427
43239 -12510427 -18035363 -13573413 -8576600 -9010576 -9164167 -4367896 -796330 -5174638
43231 -5174638 -12533387 -12685355 -4553728 3730606 6933817 7786995 9660028 10026610 4285250
43222 4285250 -6211787 -13213446 -9641978 2604643 14607277 19736298 18463405 13911362
43214 13911362 7281474 446507 -1744971 2458029 5975275 -11739 -13608695 -22957854
43206 -22957854 -20107754 -8857539 1910382 7235558 7110085 3994721 1717327 2690342
43198 2690342 4507534 3419649 1877802 6408538 15739111 18429222 7750155 -7102931
43190 -7102931 -12204136 -7492349 -5301639 -11311775 -16624104 -12042795 -2317735 574517
43182 574517 -5749352 -11828512 -10586113 -6288001 -6235484 -9634839 -10716535 -9319655 -10437331
43173 -10437331 -13528489 -10743349 907807 12561118 14074092 6827856 251588 -605099
43165 -605099 2271137 6566448 11637210 14877842 13059939 7726698 3827738 2881473
43157 2881473 2333052 921578 -808551 -4286891 -10643238 -15247086 -12085124 -4195014
43149 -4195014 -1737161 -7571694 -12451491 -8052034 1849354 7361114 4376737 -3425746
43141 -3425746 -10222019 -12455097 -11152831 -11601907 -16758266 -20761656 -15093728 -1720770
43133 -1720770 7768193 7981520 5923004 8179585 11358035 10399461 7226030 4542795
43125 4542795 -180664 -6774827 -7086846 2625647 11371199 6663833 -7290493 -15966776
43117 -15966776 -14749419 -10950076 -8897736 -5987359 -2818587 -4692728 -11521631 -16903039
43109 -16903039 -18802532 -21098827 -23092621 -18406270 -7488511 -743569 -4183028 -10520595
43101 -10520595 -9866295 -2193804 5712591 9234268 7258768 840159 -4877904 -3420755
43093 -3420755 3844021 7412304 3000347 -1811058 -94529 2608975 -2686016 -13189493
43085 -13189493 -18019102 -14240659 -9537283 -9653048 -12154994 -13439884 -13781029 -13395529
43077 -13395529 -10731512 -7733915 -10466816 -20074277 -27731941 -23772286 -9621487 3642564
43069 3642564 7589922 3937159 413857 2288518 8366472 13210378 12425530 6555447
43061 6555447 97453 -3319861 -3890357 -3472360 -2394684 -196685 1913244 2090119 974546
43052 974546 1092733 3006519 4671022 4788550 3693950 605534 -5618946 -11402867 -9534274
43043 -9534274 605808 8749284 5766886 -3638428 -7756740 -4828659 -3795552 -8525716
43035 -8525716 -12163945 -10145573 -8134544 -10921378 -12724672 -6936394 1814180 5058043
43027 5058043 4379684 7103254 11746625 9569295 -367648 -9115956 -11635197 -11863111
43019 -11863111 -12071867 -8145290 568089 6961064 7353247 7781190 12393932 14313158
43011 14313158 6896327 -3090011 -4340307 1432892 2299566 -5307691 -12291322 -12004692
43003 -12004692 -8807335 -8192622 -8036672 -5360743 -4130314 -8776819 -14743448 -13579063
42995 -13579063 -5592761 -103056 -2808891 -8911344 -10417602 -5835146 -355050 839355
42987 839355 -2414027 -5332367 -2694375 4957385 10002520 5574723 -5545134 -13781872
42979 -13781872 -14598146 -12206043 -10350747 -6600644 -306901 827706 -9270256 -22095521
42971 -22095521 -21636019 -5022804 12192888 13956958 755610 -13809965 -18227420 -12174249
42963 -12174249 -4840413 -6664844 -19214341 -31910195 -32606847 -21783640 -11206004 -8481583
42955 -8481583 -9903432 -9638877 -7456465 -4108154 2248120 9883306 11727196 5830902
42947 5830902 152885 380422 850006 -4448134 -9833527 -7071573 220038 2829080
42939 2829080 1190698 1970906 3969263 1362326 -1931634 3454717 14143836 16122142
42931 16122142 7215824 1514933 6647207 12272123 8873013 3527208 6223801 12360982
42923 12360982 11715881 6436107 6685328 13424440 18178980 17319692 15078029 13335048
42915 13335048 9027487 2587292 -134344 3249387 7594022 7599121 4427958 2821792
42907 2821792 5037770 9218843 11588579 9728645 5171638 2094682 2165397 2565339 738857
42898 738857 -1839698 -3069604 -3761779 -4159056 -735812 8349882 17463080 19076897 13514413
42889 13514413 7413901 3905404 627750 -3183085 -4785969 -4192391 -5479793 -9091587
42881 -9091587 -8659895 287778 12337763 17341731 11604099 571242 -8078958 -10958020
42873 -10958020 -9764087 -8746929 -11232224 -16221266 -18296590 -12954625 -2405519 5777328
42865 5777328 6513998 2174600 -1209056 -990129 550383 355036 -2335990 -6633862 -10744512
42856 -10744512 -11770232 -8188140 -3681431 -4537600 -10685253 -13423444 -6369918 4780573
42848 4780573 9187332 5151930 517433 -79628 41541 -1078229 1149300 9038001
42840 9038001 15609120 13051222 4090773 -1545786 342210 5302505 8151873 8207445
42832 8207445 6532907 2925719 -2732921 -8725772 -12241894 -11034567 -5117940 1954236
42824 1954236 5011364 2253547 -3122381 -7608868 -10970305 -12921909 -10134753 -1546243
42816 -1546243 5837750 3311308 -6874385 -11864251 -4403378 6522220 6793350 -3541931
42808 -3541931 -9098303 776252 16561379 19159305 4075412 -12297427 -12923539 -144074
42800 -144074 10214245 9990598 5309957 3377456 2623733 -759445 -4564117 -4570315 -1562379
42791 -1562379 1296495 4003931 6970915 6507612 -180708 -7865662 -8421368 -2267302
42783 -2267302 2452665 2341888 2676704 6463695 7118649 -2241784 -16820820 -24265356
42775 -24265356 -19330380 -8453019 307035 5766851 9753706 10346456 4478153 -5096029
42767 -5096029 -11438892 -12207846 -11583937 -12372738 -11659485 -6969755 -1525516 756599 1056770
42758 1056770 1761690 1480197 46545 3477240 14812794 23333519 14814548 -6825195
42750 -6825195 -20210412 -13046972 2637792 8165388 1772489 -4308992 -3354814 146734
42742 146734 1512619 2312646 4881378 7795018 9089806 9461332 10423617 12127367 14045115
42733 14045115 15691958 15849086 12383395 3745655 -8869421 -20524667 -25376949 -22785932
42725 -22785932 -18966728 -19141367 -20070636 -15581208 -7527317 -3669229 -5220385 -5692921
42717 -5692921 -3220837 -3397160 -6471014 -3531976 7573304 13630382 3771965 -12619118
42709 -12619118 -17720806 -9326293 -736437 -130557 -2714312 -2622367 -805373 658372
42701 658372 2719937 5426937 6730103 6513312 5972726 3253043 -3707659 -10497484 -9886887
42692 -9886887 -2661213 2308614 -201106 -6416468 -10690040 -11427352 -8820334 -3158360
42684 -3158360 2638873 4047825 229332 -5664246 -11487832 -16780368 -19110576 -15579979
42676 -15579979 -8145860 -1919744 1925545 6080657 10301089 10917072 7352361 2955279
42668 2955279 -1067348 -6347779 -11569610 -12580681 -9461393 -7310896 -8497759 -9616489
42660 -9616489 -7294303 -1832141 5399196 12570237 15197556 9691104 -37861 -5542264
42652 -5542264 -4185931 -698519 1581410 3927984 5980385 4006250 -2183387 -6979930
42644 -6979930 -6261198 -2126189 935097 296027 -3867886 -7035146 -2179701 10066838
42636 10066838 16778124 8123636 -5871051 -6836978 5288343 12633623 7426110 1805427
42628 1805427 4216617 4445874 -6762717 -18713548 -16101001 -2625889 5607860 2935520
42620 2935520 -3413242 -7757708 -9284722 -5291903 5529095 15390267 14814231 6092186
42612 6092186 -901714 -3532051 -5963523 -6765591 -28548 11337288 16245061 11575099
42604 11575099 6623644 8511596 13149752 14242599 11997894 8503247 2828099 -3861683
42596 -3861683 -5248000 1879785 10982473 12990954 7049045 -387418 -4325154 -4699132
42588 -4699132 -3008112 145549 4228728 8067648 10306583 9882872 6895615 3585152
42580 3585152 2999976 5522093 7752848 6217757 1848932 -497148 2417919 7933901
42572 7933901 10271793 7646359 4142398 3163591 2386301 -1271975 -5024038 -4299537 -969449
42563 -969449 -23708 212343 4781705 9354842 3575516 -9479864 -11618517 4194718
42555 4194718 19388880 14685864 -1554392 -6689891 1916546 5916387 -2693138 -10274032
42547 -10274032 -6091221 586974 -2447781 -10307688 -10010636 -411348 8487972 10624366
42539 10624366 8032276 3331922 -2803780 -7947525 -8717724 -5102501 147875 4773726
42531 4773726 6255753 1110190 -10377634 -21417960 -25456420 -23310821 -19304738 -13603252
42523 -13603252 -4300922 5256161 8375221 4338920 -122996 188733 3107106 3552735
42515 3552735 197751 -3642762 -3394499 2757059 11072643 14369164 9750617 2723003
42507 2723003 -126153 -268148 -3105728 -6459529 -2213784 8726546 12911350 1984571
42499 1984571 -13617742 -17132903 -6870995 4339523 8403289 9827383 13770549 17082772
42491 17082772 15553828 11465164 7982497 2827119 -5523207 -10833146 -6791599 1423709
42483 1423709 2286202 -5922605 -12634844 -10173350 -3587569 -1592317 -3783577 -2498093
42475 -2498093 5513084 14717819 17977667 14392377 8802146 5528506 4728589 4937570
42467 4937570 6745559 11285439 16181506 17247383 14802481 13314086 12979842 8115717
42459 8115717 -1768014 -6473201 1142462 11283115 7956435 -8574879 -21599909 -20515923
42451 -20515923 -11945776 -5879485 -2475797 1964076 6206724 8720688 13071537 20638092
42443 20638092 24123756 16616166 2978489 -5062558 -2118899 8090169 18975084 24251702
42435 24251702 19542596 7757366 -778410 -226531 2452831 -1975770 -10226303 -10729033
42427 -10729033 -234096 12479822 18597994 17194326 11586266 5056609 415850 -2324650
42419 -2324650 -7540791 -17558163 -26032340 -24596551 -15099496 -7782262 -7667628 -10478037
42411 -10478037 -12042950 -13077382 -13060030 -8137355 1162347 7131665 4070197 -4879391
42403 -4879391 -13223318 -18042214 -18155716 -11357907 1144468 11413224 11617986 2921902
42395 2921902 -6210682 -9496159 -7646576 -4668857 -2474445 -57821 3145485 4737988
42387 4737988 1997590 -3009966 -4250933 368499 5493771 6120629 4884608 6161730
42379 6161730 6756979 590873 -9089470 -11740463 -4911036 1469383 -748076 -7711455
42371 -7711455 -11881338 -12986063 -14569822 -15548619 -12512765 -7058145 -4036957 -4161649
42363 -4161649 -3920848 -1745637 610264 2069231 3194404 3583808 2285825 633937
42355 633937 950602 2376628 1730734 -825384 -795904 3950839 8445386 6025802 -2366581
42346 -2366581 -7989601 -4829586 2464842 4316301 -1548035 -8048857 -9319010 -7974575
42338 -7974575 -8929885 -10943324 -9601138 -5311924 -1910943 673206 5122337 8780582
42330 8780582 5094444 -5527904 -14046787 -15003340 -13252708 -14435157 -15837378 -12854582
42322 -12854582 -8689755 -9774083 -14953609 -17103975 -13806327 -9177026 -6324553 -5577959
42314 -5577959 -9481404 -20401710 -31460919 -29539163 -12604552 3731302 4303732 -6535111
42306 -6535111 -12377470 -7411343 -1389387 -2624050 -6860675 -6740774 -3772368 -4805561
42298 -4805561 -11778355 -20591204 -26554005 -26211054 -17494785 -3440372 7104999 7752513
42290 7752513 1422608 -5170565 -10170490 -14416130 -15091076 -9312747 -1311697 2185328
42282 2185328 1943957 3409163 5901829 4151565 -514807 -1195386 1999620 1413849 -4354981
42273 -4354981 -7036285 -1888574 5900288 10657429 11744000 7877338 -1691318 -7989314
42265 -7989314 863428 19106705 25882332 15303919 6358551 12468052 19676946 10442718
42257 10442718 -7448930 -14582695 -8967339 -1132331 7851421 20834447 26847962 14288445
42249 14288445 -3826611 -3858281 11467636 16393305 3203872 -7038249 -95364 10970448
42241 10970448 10690206 4118550 2622780 5241728 6968820 10275936 16090342 16343820
42233 16343820 6890516 -3452227 -6366510 -5402677 -5655911 -4392818 -655102 -1331078
42225 -1331078 -7867406 -9536226 -587846 8060197 5664648 -1544760 -2735877 -592311
42217 -592311 -3467906 -8900154 -9235716 -6319888 -6729455 -8286687 -4518516 2159349 3934985
42208 3934985 402300 -2953546 -5087739 -8091894 -9651790 -6592575 -2278552 -1808192
42200 -1808192 -3929034 -5402925 -7897342 -12492088 -13683009 -7784515 -1131252 -903799
42192 -903799 -4087078 -4417370 -3185052 -3675134 -2656163 2090601 3760709 -2398687 -7931625
42183 -7931625 -3655261 4383515 4950603 173920 -649377 1144640 -1984004 -7386917
42175 -7386917 -7192758 -4906053 -9288504 -15241233 -9566819 5766218 14833410 12082507
42167 12082507 7100696 4674476 -565138 -7267384 -4994282 5946342 10533134 1734041
42159 1734041 -9315528 -12882917 -14144902 -18756752 -20453245 -13418700 -4066825 -281581
42151 -281581 -329406 -1688090 -8852551 -21858696 -28576579 -20688976 -7954692 -4151213
42143 -4151213 -6928650 -4578681 3813448 8787091 7105890 4764221 4988795 4853694
42135 4853694 3654205 4492902 6728163 5425883 -456502 -6518909 -10515481 -14815079
42127 -14815079 -20069197 -22870409 -21777071 -19831237 -18096240 -11984518 1102808 13773466
42119 13773466 14759879 3566265 -6614806 -4157951 6481402 10892562 3674944 -5794840
42111 -5794840 -7776840 -4639801 -4143731 -6442431 -5099618 1796204 8336612 7937932
42103 7937932 -508509 -12129054 -18673349 -15027235 -6417339 -4053000 -9529544 -10779226
42095 -10779226 6505 12885178 14507828 8178048 6731143 11540104 13790729 12632260
42087 12632260 14833954 17276266 7915527 -12915045 -28853112 -29908278 -23396742 -17587187
42079 -17587187 -10339088 -1242062 677202 -8020218 -15177181 -9511508 2874657 9104409
42071 9104409 7636023 5235372 4089340 2884369 4045225 9397316 13981616 13185927
42063 13185927 10236799 8239492 2162827 -10973935 -21081403 -16835271 -3928744 1708661
42055 1708661 -3128425 -5639568 2790952 14825699 18728535 12876865 4729107 1252127
42047 1252127 4047175 10289321 15525886 16986535 15170288 11723130 7026667 1321335
42039 1321335 -3425933 -4788193 -2289613 2129657 5166164 4676555 3292378 7231083
42031 7231083 17440584 24811651 20471126 8162298 -1630933 -7007336 -13183252 -17552594
42023 -17552594 -10666946 5555896 15371194 10696300 1989517 997541 5333672 7924503
42015 7924503 8997579 9255676 3395300 -8626119 -15214930 -10028421 -4700063 -11733731
42007 -11733731 -24563180 -28968196 -25584788 -25264038 -28776369 -27609838 -20751084 -15110961
41999 -15110961 -12041365 -7588229 -3306171 -3086428 -2446993 4768832 12244927 9088240
41991 9088240 -548213 -2148291 5742908 9865217 5153713 2003599 6794115 11332556
41983 11332556 7998876 1654034 -847926 -1690689 -5266791 -9460870 -10537471 -9506692
41975 -9506692 -8214911 -5384602 -698250 2913182 3947113 3898401 2976788 340278 -1370512
41966 -1370512 1012956 4103776 2126705 -2483578 -2237761 2083966 2382365 -1634306
41958 -1634306 -249299 10425021 21467369 23774656 17925299 8433530 -1693993 -7546263
41950 -7546263 -4181246 3922024 5334620 -2219065 -8041987 -4665879 2407930 5416610
41942 5416610 4145189 209509 -7548068 -16109666 -17149089 -9205486 -1458455 190330
41934 190330 493177 2766382 1237478 -7020046 -13962144 -13163482 -10039824 -10719101 -11513006
41925 -11513006 -9011089 -9319032 -15895421 -19041615 -10494815 1286871 4364891 2619144
41917 2619144 6341692 11928018 8811856 740489 630333 6737888 3925487 -10083449
41909 -10083449 -18726844 -11501914 1760640 8002414 7789543 7100962 4972256 -553939
41901 -553939 -3337974 3152277 13935232 17260477 8997256 -3827976 -11982978 -11993556
41893 -11993556 -6990396 -3372192 -5577251 -11888127 -16226335 -14599723 -8223521 -1102317
41885 -1102317 2413369 -1190868 -11175538 -20392815 -21351848 -14879269 -8254729 -4881625
41877 -4881625 -1511003 3614261 6471865 3901145 -745647 -2062659 929620 5364028
41869 5364028 8156275 6882412 756693 -6635610 -8827962 -3421612 4949997 10523897
41861 10523897 12358790 12516172 11865850 10734836 10907414 13385751 15766031 15122077 12709174
41852 12709174 12932717 17529320 22674806 22514177 15157118 5124867 -570843 389538
41844 389538 2946663 599644 -6620505 -12282874 -11344426 -5079405 2133325 7879928
41836 7879928 11829967 12898510 9055324 521450 -7809762 -8873000 -495656 10079761
41828 10079761 12208239 4360538 -3095700 -1377136 4405554 3058277 -4900189 -6626586
41820 -6626586 3929481 15331521 13015426 -1657120 -14086385 -15079361 -9218402 -5175095
41812 -5175095 -4971561 -5227741 -3707926 -396568 5366880 14201348 22879743 24900068
41804 24900068 17515488 6828379 2411950 5961232 8600429 2302851 -8762065 -13277251
41796 -13277251 -8170343 -2254390 -2406240 -3135421 4006081 15363569 18426557 9665752
41788 9665752 297498 1084368 8600374 12216622 9490237 6929307 7757486 7547907 3286910
41779 3286910 -1023749 -1930380 -3708910 -11798843 -22334690 -25115246 -16584925 -4015423
41771 -4015423 4026402 6183095 5744072 4749228 3875518 4307079 5678229 4703507 -30381
41762 -30381 -3874133 -1552888 3998559 3787459 -4908670 -13492475 -12780867 -5148762 -1030732
41753 -1030732 -4866938 -10174433 -9527018 -4134046 -238932 75119 -333270 -15403 -716264
41744 -716264 -3063871 -5298095 -6647148 -7426049 -5846705 -669675 2481726 -4459169
41736 -4459169 -18262854 -23992073 -14325226 -810758 2553235 -1329879 -1343294 1179373
41728 1179373 -3364435 -11419365 -8220387 6286303 12499555 -73259 -16042775 -17483592
41720 -17483592 -9232962 -6165224 -7420057 -1707631 9131903 11948742 5606250 3212725
41712 3212725 9025629 11143776 2991914 -4085180 835035 10097543 9530444 17265
41704 17265 -5651385 -2724063 1156771 372544 -1204252 798060 3909932 4644226 4985001
41695 4985001 7677722 9591461 6266884 931801 1712200 9148368 13768183 9766076
41687 9766076 4525739 7756235 15908654 16907102 8675961 2005206 3325626 5895745
41679 5895745 3068166 -218976 3052665 9945526 14414832 18272417 24059008 23888013
41671 23888013 9621612 -9566902 -15427862 -6393438 154558 -5968887 -14304396 -12255715
41663 -12255715 -3349994 2052558 3560711 7255537 12235688 11738158 4809380 -1912619
41655 -1912619 -3092140 558045 5219701 7278488 5341316 2271346 2952770 7459618
41647 7459618 9585297 4593645 -5089459 -13645195 -16719411 -11445096 1325930 12336482
41639 12336482 10146115 -3034820 -10434299 -2355056 9953332 10783031 1971036 -3006505
41631 -3006505 -340224 2369119 2148231 4073126 8846721 10203656 6578887 3697536
41623 3697536 3091517 -735101 -8323424 -11440618 -6158351 25304 -148432 -3525558
41615 -3525558 -3955995 -1771291 610108 4859437 11210251 13731772 9205295 4538439
41607 4538439 6562835 10150634 6722512 21429 1178946 9772428 12883463 5049828
41599 5049828 -3015883 -986549 5784281 5547101 -1862712 -5823643 -1494196 3186947
41591 3186947 -1018421 -11796595 -17840381 -12558870 -1700163 4040324 1963273 -789869
41583 -789869 1150165 3210925 -858256 -6499298 -2709146 10837360 20159274 14658079
41575 14658079 969091 -7161451 -6866124 -5750195 -7352439 -7069376 -2543740 1214334
41567 1214334 -56283 -3716245 -5823888 -7198008 -9769568 -11457501 -9354306 -5124686
41559 -5124686 -3199564 -5545994 -10945897 -16785331 -18886795 -13121538 -1149870 8369131
41551 8369131 8757044 3384961 601015 2892894 5863784 5983344 3732580 -110305
41543 -110305 -5613618 -10706889 -11833083 -8519764 -3982770 -1310257 -2027364 -6678846
41535 -6678846 -12472989 -12679950 -4609357 3572139 1713286 -7438280 -11444752 -7008398
41527 -7008398 -4671205 -10703588 -15347282 -7201938 8880775 18083554 14691530 5346816
41519 5346816 -3141310 -9270141 -11716393 -8700503 -3516889 -2591516 -6178433 -7748616
41511 -7748616 -4464525 -1571978 -3547716 -7166277 -7742706 -7226707 -10091856 -13818198
41503 -13818198 -10555869 475455 8296133 3108156 -8581702 -9428811 5502815 18418831
41495 18418831 9819538 -14359274 -28381384 -20194087 -6202459 -6413413 -16900099 -18738200
41487 -18738200 -6716823 5206155 5143423 -3006934 -8721992 -7742535 -3148441 -813268
41479 -813268 -5482985 -15463014 -21355650 -16527098 -7329206 -4805421 -8300933 -8134726
41471 -8134726 -3650851 -5038761 -14666328 -20705928 -15512269 -7887424 -8924053 -16191389
41463 -16191389 -20719524 -20148861 -15731384 -5572973 8556232 16044974 10791823 2714373
41455 2714373 3873524 9817277 8264348 545175 -1264839 4708479 8551789 7128515
41447 7128515 7491304 10036358 5001342 -9377959 -20436369 -19657716 -14367434 -13289434
41439 -13289434 -13128201 -8793171 -5311858 -8005787 -9815475 -978904 14486827 23595405
41431 23595405 21635178 14431147 7438695 3005530 5016291 14902701 24371362 22623583
41423 22623583 10604051 -1187154 -8209750 -14888942 -21908519 -21893677 -11273604 2705502
41415 2705502 11217194 13219106 12316060 11102307 11811744 15619329 17675660 9891610
41407 9891610 -6868924 -19957121 -19257090 -8388194 2935413 10546606 13680766 9097401
41399 9097401 -2866519 -11550822 -6545571 6831357 13011452 6577621 -3138958 -8364423
41391 -8364423 -12212350 -17923365 -19837580 -12795297 -2794682 890546 -299764 2643152
41383 2643152 11205981 16601332 12962375 5475845 2353608 4354024 6187500 4677166
41375 4677166 1445451 -671505 -464150 1559657 3320494 2032850 -2645940 -6629535
41367 -6629535 -5075487 1443326 6498470 4623639 -2713078 -8942355 -9161667 -4118415
41359 -4118415 1441637 2996512 -321463 -4708724 -4492865 2106600 10150163 13113944
41351 13113944 10828235 9161239 10916115 11205037 5100661 -3609598 -6580543 -2371178
41343 -2371178 1984368 1064411 -3008127 -6211206 -8413853 -10271895 -9239857 -3219749
41335 -3219749 5062813 11550101 15810051 18432194 17064432 10652886 4708662 5422080
41327 5422080 9907431 9489615 2452045 -3679247 -3030351 2765469 10443125 18600041
41319 18600041 23325031 19537828 10874950 9127568 17589963 23570106 15812916 1777504
41311 1777504 -2977541 3034763 7901938 6281880 5808963 12872970 23141128 28709025
41303 28709025 26186694 16430869 4695857 1324797 12111039 26803167 28538445 17091870
41295 17091870 10139315 17232337 26745128 26453413 22623310 26243026 32428157 29606055
41287 29606055 21159488 20357945 27618258 30123801 23279094 15867359 12335849 6535592
41279 6535592 -2214365 -2492029 11241673 26143376 26831043 15858559 8809917 14135719
41271 14135719 26047274 33982344 32531016 24413403 18220288 20733604 28994055 34053656
41263 34053656 33925539 35727246 42206100 45324580 39258993 31013273 29553412 31613900
41255 31613900 28394075 20854401 17196101 18593679 18916655 17051350 17999653 21373151
41247 21373151 19857484 11506225 3910174 2633335 3727773 1748641 -2073261 -4432952
41239 -4432952 -6725339 -11660146 -16788946 -16433406 -8693144 2122646 8953446 7386200
41231 7386200 7075 -4728118 -1241736 5995994 8090174 3477438 -1640512 -3831552
41223 -3831552 -5553774 -6618454 -1611810 9933650 18890592 18281634 13226053 12131974
41215 12131974 13566375 10576485 4478257 4391220 13156738 22448737 24024502 19153363
41207 19153363 14078512 11640567 11102367 12192543 14738489 16056169 12878576 6108406
41199 6108406 893070 850330 3692969 4119539 658914 -2243967 -9661 5742960 8973380
41190 8973380 6846531 2649401 428419 -84818 -980715 -1100032 2972026 11350333 19589991
41181 19589991 23957828 25582504 27453311 28794851 25698377 18079386 12351195 13306302
41173 13306302 15361202 8242367 -7395785 -17081355 -10000278 6395265 16173482 14882997
41165 14882997 10938818 10102314 9837027 9321246 12759072 18532880 16291040 2104931
41157 2104931 -12350745 -14362803 -7052942 -2552060 -4012785 -4845918 -2330541 -933246
41149 -933246 -2752963 -4359252 -3726326 -2056845 1612235 9078434 15387288 11881622
41141 11881622 -246789 -8081992 -3297358 6898864 10778985 7940140 6913531 10650642
41133 10650642 12522156 6945483 -2290365 -6971834 -4516290 145723 2217358 3407476
41125 3407476 8098614 14664488 15810211 9606982 4632025 8562775 15724206 14077325
41117 14077325 3052143 -4966149 -2325217 4091834 4876440 1512096 1141738 4153046
41109 4153046 5165705 3130221 2369282 4270383 4739267 936139 -4079380 -4588231 2440339
41100 2440339 14648213 24389887 23570194 12542158 2532394 4047613 13802339 19216198
41092 19216198 15947997 13491182 20339291 30561748 31506994 21236309 11205599 11914350
41084 11914350 21623651 30590308 31860356 25304278 14355770 2811277 -5686411 -8301017
41076 -8301017 -4783396 1996179 7950652 10284913 8569328 4287904 -100100 -1957102
41068 -1957102 632543 7496485 15467167 19948675 18830363 14607216 11332199 9854386
41060 9854386 7914009 4583559 1594674 -466390 -3648577 -8017490 -8848004 -2118382
41052 -2118382 9220790 18105076 20799995 18127106 11974468 5555940 4584970 11296711
41044 11296711 18368579 16461898 7854348 3995922 8194312 10621763 4441685 -3166098
41036 -3166098 -2889609 2621493 5540130 6819849 12732581 21644558 25134625 20817412
41028 20817412 14600564 10748050 8171937 6389162 7204685 10120558 12829090 15880067
41020 15880067 20348100 22377165 17814873 11071432 10815462 17312173 22602376 22798817
41012 22798817 21017223 18366346 12315002 4937020 2356341 4259246 4157666 1686391
41004 1686391 3562814 10232461 13736166 11977674 11901020 14039399 8634889 -5507761
40996 -5507761 -13269020 -5116408 6515650 5819908 -2757453 -4438159 1361380 3154225
40988 3154225 -1188020 -1688120 6411989 16495949 21949978 22620863 20103581 16150428
40980 16150428 15064859 19292731 24194796 24474158 22244143 21167337 18208295 10575550
40972 10575550 4451401 5615462 7990656 4287687 811600 6124559 11841910 3818087
40964 3818087 -11898966 -15511237 -4354397 4936364 5901486 9835490 19527082 20609156
40956 20609156 8656358 1358710 10334063 21799948 20914284 16181021 21351479 29648627
40948 29648627 26786090 16948372 14358331 18171211 16789971 10509829 9306929 12554396
40940 12554396 10898982 5776053 7727431 15968050 18081535 11198696 6427328 9786350
40932 9786350 14171701 13323144 9821779 6120168 555662 -4695489 -3655374 3026224
40924 3026224 8891586 13708945 22193607 30506827 28925309 19777737 16557661 21377294
40916 21377294 20333570 7812610 -1646770 4389813 17089965 21093296 15836534 10006010
40908 10006010 5857314 2166574 3607877 13690116 25201276 29800514 30466211 32718782
40900 32718782 31037350 17906759 508410 -6657422 -2539005 1368562 482323 1263284
40892 1263284 6396938 10076210 9949625 11424035 17225800 22914166 25036429 24593624
40884 24593624 21393679 14569891 9163709 11448617 16873074 14439864 4724319 563989
40876 563989 6615937 12213372 10262395 9073120 16557765 25494955 25938921 21843224
40868 21843224 22618471 26462923 25707763 22476474 24689562 30535957 31527300 29019764
40860 29019764 32845253 43117520 48101904 43247283 38686087 42503732 48739940 49203847
40852 49203847 46844651 48753885 54089677 58211044 62350483 69383934 74840951 72669064
40844 72669064 67325012 69535298 80393370 89626900 91057662 90573952 95888685 106973866
40836 106973866 121199981 140144526 164425629 187310660 201630350 210515710 223701571
40829 223701571 244123522 265352182 282390755 297359848 312165406 322581195 324180515
40822 324180515 318987406 310816274 297889986 276675307 251129452 230793005 218618638
40815 218618638 206728504 187228615 163368110 146510482 143624745 150039250 153922987
40808 153922987 147154460 132608868 120497064 116440579 115277822 110091180 104653301 109397419
40800 109397419 124349557 134931006 129697128 115232899 106502381 107917143 112603009
40793 112603009 116598943 123004450 132150274 138241478 139206766 141722713 151686684 165556984
40785 165556984 175735504 179747807 179647304 176723619 171800435 167398533 164580373 160115959
40777 160115959 151311265 141278303 134837814 131542886 127864126 124196316 123524180 123895582
40769 123895582 118902349 106999515 94873323 89434477 90969083 96426097 104798946 115510094
40761 115510094 125034068 130198606 133718355 141880605 156246736 171345627 182123629
40754 182123629 190649736 202526933 218266444 232198944 240636538 247357276 258240952
40747 258240952 273113094 286934309 297427519 305951730 310545053 304852669 287596768
40740 287596768 267596404 253474259 241731126 222013097 193124672 166384226 151249856
40733 151249856 143702508 132842101 115458287 99462635 93366831 95454242 94809911 82899341
40725 82899341 63246369 47970382 44336498 47468045 48332686 45464575 44202030 46603597
40717 46603597 48515253 46793067 43227139 39637591 34748023 28584055 24909573 25901996
40709 25901996 28645609 30226079 31860426 34007675 32224846 23861631 15451485 16259035
40701 16259035 25556462 33006629 31987468 26440598 23149389 22795418 21474078 17290063
40693 17290063 12567547 11624183 17739503 29730081 40322674 41197585 31936627 21520725
40685 21520725 18654548 22648490 26049053 24106164 18771856 14785746 14853346 18161400
40677 18161400 21170210 20191050 15239251 10801603 10726652 13245062 13788711 11987452 12099240
40668 12099240 16140005 20726075 22382581 21979363 21152899 18350156 12991355 10373261
40660 10373261 15751065 24253039 24152433 12459663 658162 452230 8915985 13781054
40652 13781054 10111486 4613120 4348722 8322122 11768673 13088130 13779001 15338415
40644 15338415 18649258 23453100 26678235 24476964 17716377 12170902 11410217 13063247
40636 13063247 14115318 15343526 17044764 15090391 6871755 -1838875 -2365219 5685444
40628 5685444 14603572 19420500 22398875 26103231 28425420 27179366 24632092 23934251
40620 23934251 24489657 24197174 23508760 23782684 23624447 20557485 15602843 13127462 15887027
40611 15887027 21919247 26389884 25665557 20316171 15141496 15358636 21472356 28292839
40603 28292839 29795084 24732349 17693567 15665177 22815287 36261763 47125789 48836941
40595 48836941 44812010 44440602 51031325 58733608 63099245 68133222 78077933 88295532
40587 88295532 92072949 92573318 98708599 110642156 119315768 120923309 121329120 123111299
40579 123111299 119150447 105831990 93498932 94083537 103791242 107891922 99605667 84973996
40571 84973996 71270523 60724485 55527454 58596346 66530130 70283901 66734418 62821283
40563 62821283 64374880 67217043 64108473 55245520 46518439 41184904 38464161 37663044
40555 37663044 38842146 40997382 43359069 47055712 52431760 56312422 54854927 48105678
40547 48105678 39953769 34831167 34977661 38420769 39508703 35227413 30929541 34289748
40539 34289748 43111693 46520461 40369360 33119911 32694700 36545664 40183468 45591703
40531 45591703 53013929 54158611 44593126 34576029 34750945 38289229 32165564 20464292
40523 20464292 19021599 29509672 37439254 36549431 36465947 42551591 46369237 42424427
40515 42424427 37503927 35722265 30656770 21515026 20682049 33337011 44979597 43531144
40507 43531144 39691774 48112943 60218219 56189197 36862056 22683873 23492006 29015157
40499 29015157 30025680 30593296 35228019 39019520 36687257 30790102 26127110 24123469
40491 24123469 25386088 30230378 35616961 38985075 44010213 53552525 59569609 52806106
40483 52806106 41500567 44864251 65077375 81499263 79041620 67651099 64300880
40476 64300880 68499470 68240728 61466189 57803753 62675635 71368491 78103962 82056180
40468 82056180 83832966 82514801 77703062 71354775 67211423 69119634 77608311 87354206
40460 87354206 91796594 91434991 92962784 98822302 103398684 101969406 97135283 92694781
40452 92694781 87272651 79012925 71518155 69424528 71303023 71706821 67952782 61660381
40444 61660381 56233235 55099754 59196973 64564583 66250722 65232342 66236602 68750431
40436 68750431 67852281 64739519 66666845 73790315 76966625 73150374 71275279 76353283
40428 76353283 80441950 78881814 82393764 99167428 115918959 114271006 99182206 92595702
40420 92595702 102099395 114407160 119411566 121870219 126165851 127278397 123390177 122366238
40412 122366238 127628650 130191275 123274810 113759350 109963150 107908372 99974795 89171523
40404 89171523 83826673 83860501 83125772 81233525 82289250 84398385 81342558 74563680
40396 74563680 73352017 80807959 87766881 84480061 72684047 62163198 59250777 62494510
40388 62494510 66960583 68709416 65857237 58882759 50980482 46103347 45092614 44695235
40380 44695235 42022496 39100660 40129888 44057287 44128971 37573294 31732925 35270053
40372 35270053 45531823 51477072 49214931 47194403 53055916 61924511 63280517 55400115
40364 55400115 46604676 43743889 45654697 48630364 52625757 58646833 63357713 61330097
40356 61330097 52937549 45853920 46069590 50164873 50647242 47404754 47818398 54730630
40348 54730630 61489867 62771814 63220115 68415618 73231161 69122333 59700586 57319624
40340 57319624 64145484 68517200 62809178 53315137 47499407 42947280 36799251 35669384
40332 35669384 45123311 56876262 59009435 54081691 53816999 58495077 56463696 45399030
40324 45399030 39268239 48191172 63152233 69035175 64272595 58512231 57138345 58088064
40316 58088064 60452409 66159387 73591667 77834159 78050827 78020696 78986753 78846901 79146078
40307 79146078 84753965 93662409 95305430 84852256 72582802 71254265 78797448 82983539
40299 82983539 80785841 81541029 89060400 92471223 82194683 66500369 61412329 67858582
40291 67858582 70507810 60414606 48214858 49295011 63041710 74555421 73800258 65318010
40283 65318010 58936053 57721408 58096835 57382564 56677586 57452507 58882846 59263248 58346400
40274 58346400 57554108 58465659 61117032 63295657 61877335 55597733 46327558 37380263
40266 37380263 31452895 30391165 34567773 40648656 42604760 38562140 34686809 37353109
40258 37353109 42857181 41772524 33800307 29675471 35016893 41187296 38556298 30762652
40250 30762652 26974529 27034021 25694138 26203925 35511555 48203886 50750509 42808520
40242 42808520 38528098 43024028 44173306 35238096 29167013 38180255 52795140 56493573
40234 56493573 51146834 50799282 56685332 56509174 46456505 37018782 35662462 37933030
40226 37933030 38151128 36713128 34256469 29671255 26383835 30218827 38739367 42805596
40218 42805596 40528194 38899817 39650007 35732945 25683793 18990916 21150099 24665162
40210 24665162 22101602 17828717 18638861 21902419 22162095 21770671 25332591 29638868
40202 29638868 28697320 24218228 22161913 22465185 20497405 15769039 11491405 8036733
40194 8036733 4122394 2339697 6459814 14451528 19968777 19652368 14661638 7539431
40186 7539431 2168597 3586123 12251337 20920163 22375671 18079513 14825644 15821146
40178 15821146 19538547 23821396 26073839 22853385 14535802 7248638 5593540 7368712
40170 7368712 9852538 15616633 25955595 34392678 34551476 29741704 26822424 25526336
40162 25526336 22729645 22166172 28995693 38197379 39915730 34442666 30556086 30338057
40154 30338057 27624256 21352789 17912502 18418671 15520201 6116584 -3214376 -6787793
40146 -6787793 -5840748 -827895 11616017 29218039 41510214 42716258 38897384 36769133
40138 36769133 33869952 26219472 17709310 14129271 13957436 12555553 10548392 10992503
40130 10992503 12436077 11567855 9582165 10142249 13851502 19355626 26499168 34077861
40122 34077861 38281519 37469422 34323184 29842509 21174685 9863691 4836889 10124725
40114 10124725 16391848 13446159 5218575 1945133 2543403 -2234272 -11132518 -11244035
40106 -11244035 2015929 16558065 20667630 17915234 17796253 20013798 17681626 11396490
40098 11396490 9770031 16135824 22981064 22201071 15569518 11420018 13737991 18396776
40090 18396776 19784387 17867461 17006338 19502612 23091663 24956550 25421279 25998760
40082 25998760 26026100 24159406 22130468 23386550 27415525 28837132 24292134 17793896
40074 17793896 15844517 18163595 17624595 10917024 5043310 8768805 19822843 26754480
40066 26754480 23840818 17288455 13820210 10553101 2708035 -4684827 -2539996 7527693
40058 7527693 14780835 15552201 16945201 22355468 24814603 19878998 14414772 14838307
40050 14838307 15923548 10981180 5263478 7418065 13293507 11765113 3907016 2079960
40042 2079960 9692705 16320379 16358214 18359719 28421830 36316357 29217921 11838484
40034 11838484 1262461 5061385 14728147 19636120 18415823 15887076 16315267 21454194
40026 21454194 29499711 34421072 31316652 23678919 20247235 23125815 24601026 18600077
40018 18600077 9965202 7721205 12887808 18366862 18913866 15878118 12738074 11059493
40010 11059493 11461111 14086222 16584031 15208208 9866971 5381696 5899917 10302718
40002 10302718 14693968 17072215 17776667 17515274 16775865 15323207 11361712 4330383
39994 4330383 -459592 4743792 18577684 28035856 23757683 13542048 12495601 22447248
39986 22447248 30912739 29911039 24669701 21168622 16611506 8744122 4922990 12427061
39978 12427061 25838167 33668697 33559742 31610108 29835216 24705952 17074392 12966685
39970 12966685 13250439 12058762 7782164 6372333 10096515 12079740 7654993 3172396
39962 3172396 6204438 13376927 16526746 16295481 19742986 26649804 28697978 23207738
39954 23207738 18025748 19246569 22010311 18601064 9588273 987893 -4959883 -9354445
39946 -9354445 -10166531 -4055640 6042043 12714372 14629851 18250761 26399772 32085447
39938 32085447 28777701 21370162 20046948 26365167 32738361 34262959 33223455 31598478
39930 31598478 27592746 22559130 23266633 31370891 36812245 29765105 15860124 10584706
39922 10584706 18778143 28372805 27190377 18498806 14505729 19236166 24715538 22767082
39914 22767082 14374611 6212779 2587452 3347083 6624855 10092187 10570736 5886615
39906 5886615 -2027350 -7966992 -8545789 -5068682 -341572 5510721 13645064 21829894
39898 21829894 24591414 19430266 10835343 6198587 8699383 15693628 22890262 27651062
39890 27651062 28473376 24490817 17595229 13333129 16486784 25062189 30907034 28111976
39882 28111976 19819384 14864533 18079651 25714384 30153285 27018457 17730276 7919898
39874 7919898 3954357 7746604 13384689 12141416 3106825 -4489820 -2568352 5683640
39866 5683640 11042479 10190299 7054342 5031460 4430290 5877641 9107482 9544549 4165079
39857 4165079 66372 7251584 21666491 26805481 16467818 4497205 4720386 12050438
39849 12050438 13825189 10576512 11842796 17181175 16903700 10379160 8528131 15664421
39841 15664421 21946995 18576626 9638714 3194568 -109956 -3108999 -4605894 -2890149
39833 -2890149 -915819 -1371488 -1355430 2221109 6744978 9132319 11611774 15601709 15329117
39824 15329117 6272534 -4183291 -4778016 2874052 6349314 1371586 -2598796 1290813
39816 1290813 6283784 3696314 -3097981 -4851691 -781384 2577016 3482200 6161217
39808 6161217 10601504 10852090 5581275 1833310 4124148 6760646 2687728 -5287012
39800 -5287012 -8897128 -6677490 -4424966 -4811891 -4191914 -617529 1966887 370027
39792 370027 -2311931 -1204018 4209748 11400779 18282810 21992390 18296338 7088239
39784 7088239 -4321994 -8659627 -7668403 -8385103 -11839647 -11872600 -5680180 1031972 2226342
39775 2226342 -343409 -1285064 -62779 -81103 -1036192 1852928 9787414 16573256 16509882
39766 16509882 13201806 15407233 24393524 30936979 27277701 17069904 8799390 3568529
39758 3568529 -3071014 -9241174 -6912152 3582307 9150948 796447 -12363365 -14637263
39750 -14637263 -4784134 4119955 3749581 -675616 -1580947 282558 69575 -2875822
39742 -2875822 -5406449 -5245038 -2109732 2531185 4699861 655143 -7314708 -11660561
39734 -11660561 -8865602 -4455249 -5570638 -11567388 -15655307 -13846956 -8574304 -4287799
39726 -4287799 -2621177 -2079182 -550872 2362164 4810492 4326499 -48233 -7233280
39718 -7233280 -14530681 -17889348 -14095196 -5287922 622001 -2203432 -10233127 -14893611
39710 -14893611 -13155914 -9270837 -6807881 -4855649 -2795205 -2717082 -4851871 -5850737
39702 -5850737 -4372385 -3829789 -6798568 -10984237 -13473729 -14451615 -13546780 -7432363 4363517
39693 4363517 15242780 18397973 15302013 12511649 12248530 11387591 8576841 6912226
39685 6912226 8842762 12406448 14096756 13350494 12720535 13935158 14441895 9314692 -1759085
39676 -1759085 -11004454 -10008046 -453030 7377241 7753200 5679725 7566509 11568764
39668 11568764 11857452 8070239 4679528 3347126 1659324 -1061073 -1480464 3108239
39660 3108239 10387953 14544599 12159930 6650751 5322423 10149524 14096844 10873615
39652 10873615 5248164 6015590 10514038 6996062 -6092790 -15406426 -12413520 -6037754
39644 -6037754 -7503704 -13257086 -13626330 -9598242 -8467809 -9329568 -6090082 -445730
39636 -445730 1188557 414775 3652590 8998225 9550225 7482713 10440490 15421485 12219969
39627 12219969 3304899 2971094 13481753 19724347 13838347 7730640 11510992 15802224
39619 15802224 8842353 -2195120 -2994702 4047224 4744511 -3006600 -6627570 797614
39611 797614 11655320 16851489 16391798 14191536 11286510 7850689 6064116 7860504
39603 7860504 12731413 18216754 20385051 15965112 7302328 2010484 3464229 5595510
39595 5595510 2432171 -2016746 -806585 3447242 2678271 -2663842 -4370350 -608164
39587 -608164 1547990 -928022 -2051890 2002145 6322520 6205994 4183476 3193776 876848
39578 876848 -3328955 -3098088 5063738 13201496 11825408 4027021 281918 2030702
39570 2030702 825614 -6540600 -12652964 -11752346 -7962590 -6628531 -5637170 -1988279
39562 -1988279 -269810 -5626947 -12276654 -9442902 1720210 7511639 726544 -9125731
39554 -9125731 -10188439 -4899508 -4017011 -9199038 -11447179 -5504262 3278455 7333368
39546 7333368 4848388 -1532955 -6880920 -4073931 9831354 24936051 25402222 9892406
39538 9892406 -3631959 -627781 10467239 11110997 -875157 -10017414 -6432647 2302087
39530 2302087 4863495 1073653 -2127134 -1923439 -382053 1566249 4634374 7227622
39522 7227622 5680452 -1146473 -9457156 -12977637 -8009017 2606549 10922691 11416821
39514 11416821 6714872 3348031 2904711 1584481 -1789949 -3026079 264658 4140121
39506 4140121 4687048 4540124 7801075 11028938 5810277 -8784926 -21452302 -19807251
39498 -19807251 -4367794 11919685 18071115 15805305 14066986 15842675 15671267 10521990
39490 10521990 6606904 10565811 18084106 18264456 8221570 -3479006 -8523093 -7457769
39482 -7457769 -4819223 -2274394 -392238 -1714294 -6877958 -11489314 -12236281 -13220786
39474 -13220786 -20239744 -30397798 -33946526 -26971947 -16570813 -11558447 -12616696 -14313010
39466 -14313010 -13182005 -10062032 -6393413 -2245452 1849804 4041841 3360070 1336857
39458 1336857 346024 1031451 2241697 3057439 3946966 5898224 9065430 12411116 14319843
39449 14319843 13767235 11505266 9737984 9499655 8588081 3874688 -3908030 -9684307
39441 -9684307 -9523898 -4952547 -485095 1271009 335064 -2507300 -5217605 -3764050
39433 -3764050 4031123 13820668 17561822 12133152 2574349 -4163921 -6267741 -6711774
39425 -6711774 -7984794 -8874933 -6034812 1419234 8528896 7659741 -2326771 -11901871
39417 -11901871 -10554069 -318823 6057299 1928917 -4515518 -2363709 6564152 10939013
39409 10939013 5862943 -1870386 -4644713 -3217170 -2292172 -2269604 -201284 3511235
39401 3511235 4353977 -112213 -6529194 -9205138 -5620003 1778474 7521366 6888490
39393 6888490 216815 -6056135 -5610673 -536550 574622 -4627745 -6378235 4484915
39385 4484915 21461305 28475588 20392086 8363539 3196345 3309468 3554945 5668195
39377 5668195 11537093 14272394 7193139 -2984428 -3588099 5498533 12106801 10135980
39369 10135980 6280310 6843717 8726310 7387401 4687730 3859604 3572746 1615034
39361 1615034 -872576 -2298637 -3041825 -3023583 -2011515 -2913338 -7967071 -11449252 -5235356
39352 -5235356 6997592 11689601 4592279 -3393820 -4444769 -5418319 -13150368 -19856511
39344 -19856511 -14652394 -1377404 6687589 4021303 -5317584 -16843795 -26049968 -25630318
39336 -25630318 -13929616 -1933262 -1124252 -8467300 -13312690 -13417753 -12612963 -8922256
39328 -8922256 739884 8763268 5318156 -4256647 -6445953 -1954869 -4035805 -14675605
39320 -14675605 -20490661 -14849117 -6747551 -3693230 -2592998 -2616241 -10001955 -23212817
39312 -23212817 -29657084 -25127678 -20780345 -22628956 -21075962 -11110434 -5113446 -11533883
39304 -11533883 -17264658 -8392956 5502145 6956728 -967403 -2696231 2083887 872315
39296 872315 -6462030 -7411690 -538614 1676549 -4825350 -9720956 -7539872 -5080923
39288 -5080923 -5992575 -4924195 -1375311 -2754115 -8585150 -8500852 -2150392 -3408214 -15957591
39279 -15957591 -22575049 -11364201 3429372 2602266 -9287896 -14455067 -10889607 -10436337
39271 -10436337 -13832496 -9506330 2830249 7809348 -1741043 -13644204 -15931725 -12857141
39263 -12857141 -12581270 -11686302 -3761878 5376626 4001947 -8252088 -20706176 -26775077
39255 -26775077 -28230179 -25711166 -16561894 -4102629 1632644 -2511137 -6666534 -1588794
39247 -1588794 8165704 12087540 9480488 8102423 9601982 6703613 -3762264 -14145894
39239 -14145894 -16151588 -10768064 -3435505 4689591 14563007 22505402 22600321 14586573
39231 14586573 4122867 -3873523 -7604322 -5461606 3629335 16341554 25824129 27595444
39223 27595444 21880216 10782375 -2641330 -12655669 -13800164 -8091124 -5253150 -12174572
39215 -12174572 -24056573 -29248314 -22352085 -10078113 -3549808 -6274070 -11353144 -10922881
39207 -10922881 -6243693 -5278458 -10656131 -15051982 -11395005 -3311778 -69578 -3379613
39199 -3379613 -5501661 -583212 7837670 12361677 10328491 4649344 -525841 -2421518
39191 -2421518 -298178 3899869 6569434 5703634 2538441 -592661 -2944397 -5189782
39183 -5189782 -7302283 -7389891 -3270230 3919608 8422929 4915965 -4638021 -12543235
39175 -12543235 -14859810 -14856923 -14892998 -11055774 -1117046 7848857 7662649 1243483 -1966302
39166 -1966302 -237198 321019 -1695927 -1464363 394407 -3324806 -12255386 -14793593
39158 -14793593 -5017492 6740897 8496801 3539993 3057923 8016897 9411749 3669008
39150 3669008 -2703020 -3744751 -893557 1737289 2365025 848696 -1706218 -2120610
39142 -2120610 1403742 5123160 3993885 -158864 -366549 5004074 9474523 8145538
39134 8145538 4647914 4914222 8125781 8317901 2922295 -4538919 -9698196 -11424975
39126 -11424975 -9918247 -4301410 4910632 12630091 12730710 5841676 -27067 740016
39118 740016 4093544 2749183 -2879443 -6016476 -4469678 -3006241 -3995901 -3490953 73219
39109 73219 502335 -7272058 -18125406 -22577754 -18032771 -8738949 1647141 11025732
39101 11025732 15324684 11265156 1737412 -7475857 -15078276 -22333775 -25521820 -18527401
39093 -18527401 -3961683 6029031 3321047 -7368305 -16339234 -20322527 -21722815 -20729576
39085 -20729576 -14523854 -3936572 4185605 3669548 -3705343 -9833108 -9284212 -5082025
39077 -5082025 -4284809 -8956218 -13905856 -13277373 -6556097 2608736 10353311 13791952
39069 13791952 11458953 5244666 -117863 -1753711 -1306427 -1783363 -4208221 -8271578
39061 -8271578 -12671993 -13499078 -6846248 4783238 13481331 15650390 14963458 13101321
39053 13101321 5705011 -7003286 -14244629 -8250196 2817298 5571821 -310893 -5301754
39045 -5301754 -6604849 -8960583 -12188941 -11694276 -9974048 -13370678 -17446846 -10853232
39037 -10853232 4385662 12448592 7761127 3296546 8337686 14331404 12561800 10134765
39029 10134765 15028029 18758095 10258257 -3027097 -5643375 924352 1974617 -5288105
39021 -5288105 -8680307 -2908222 3029703 3249882 3911652 9319450 12793927 8670333
39013 8670333 2439067 1101454 2186374 306605 -2367996 -349947 5144441 7539260
39005 7539260 3335367 -5643284 -14935537 -18465546 -11674496 1582026 10087329 8668301
38997 8668301 5791577 11463618 22348773 27239440 24015785 21128940 22578643 21658568
38989 21658568 12630400 112025 -8217659 -12060329 -15783941 -19589418 -19805945 -15848493
38981 -15848493 -10900796 -6468678 -1785962 1389334 -724623 -6914530 -9767549 -4782011
38973 -4782011 3376685 7667382 8230854 9969835 12916684 11633342 4498365 -2518561
38965 -2518561 -3360795 1642525 8787401 15329325 17961895 12809098 2277604 -2740103
38957 -2740103 5247770 18602110 22324803 12883473 1414062 -2728445 -3039056 -6636186
38949 -6636186 -11599046 -10684714 -3853653 455884 -3574339 -11944671 -15638907 -9630931
38941 -9630931 3069651 13890897 15350826 7528251 -2092778 -6550296 -5960191 -4548037
38933 -4548037 -3708711 -1810978 678558 892324 -1275394 -2210048 -196844 1603866 -458664
38924 -458664 -5874627 -10966535 -12037399 -7119707 1824115 7739444 4198186 -5783089
38916 -5783089 -11537929 -8204267 -3046205 -4149656 -8665040 -9094106 -6383980 -7321621
38908 -7321621 -11056968 -8876875 1327252 10182506 9962652 4340953 582528 -521483
38900 -521483 -1414136 -1141621 1367182 2618202 86683 -1812994 1827000 7965904 10753951
38891 10753951 10868290 11375290 8696076 -1264887 -10697001 -7140403 5978547 10430310
38883 10430310 -345803 -9619921 -1160314 16892658 24258393 16649006 7325804 4457301
38875 4457301 2422690 -2994270 -5066625 1846655 10775196 11057650 3364707 -1843041
38867 -1843041 1732327 9988330 14835331 11775266 1672177 -10567829 -18692286 -19696403
38859 -19696403 -16242939 -12618447 -9311099 -4585093 -264295 -1144027 -7646278 -13465797
38851 -13465797 -12933537 -7338736 -1216448 4258769 10162435 14700460 14521287 10505352
38843 10505352 7102283 5396918 1802244 -4923763 -10270120 -10198694 -6565075 -3097473
38835 -3097473 249112 5004840 9504042 11114014 10846016 11084751 10596340 6689632 825826
38826 825826 -3185922 -5442993 -8665413 -11448583 -9552419 -4412661 -3004574 -6868246
38818 -6868246 -8333696 -1801636 7232261 9758712 5175487 -398182 -4207233 -8261369
38810 -8261369 -12085749 -11214389 -4199130 4098424 8326140 8130318 5827052 1834447
38802 1834447 -4414245 -10516915 -11634085 -6050666 1597544 4567247 1356840 -2820882
38794 -2820882 -2496425 1841710 5423510 5462080 3329173 1464317 1042596 2427573 4853103
38785 4853103 5406258 1528475 -4528452 -6603785 -1407163 7592830 13965908 14217806
38777 14217806 9663983 4707449 3477219 5832255 6839281 2781380 -3268241 -5614526
38769 -5614526 -4528457 -5265709 -8742132 -9767042 -5883057 -1174337 1175810 3253179
38761 3253179 6028612 5911493 2531865 2732406 10064054 16508634 12764522 1980245
38753 1980245 -5553417 -7643293 -10268833 -14499114 -14165610 -7603703 -1947844 -2375615
38745 -2375615 -4579198 -2091406 4290346 8424897 6569425 134928 -6584683 -9224276
38737 -9224276 -6077053 428867 6288294 9740154 10796150 8861948 4632635 2749385
38729 2749385 7294912 14895272 17597568 13148555 7522424 6562988 9831548 13318084
38721 13318084 13472570 8307217 -30113 -3512599 4336037 18002710 23982686 17310620
38713 17310620 6664545 158656 -5041037 -13247606 -19136299 -15373761 -5775700 -571894
38705 -571894 -1440426 -1526771 783857 -855727 -7823518 -11277284 -4975767 4470808 6677851
38696 6677851 1282376 -4397526 -7540623 -11421463 -16148411 -16374524 -10286661 -4007078
38688 -4007078 -3154599 -4958573 -3369828 1634066 5168467 5534019 5348716 5476599 3806288
38679 3806288 468225 -1654626 -2887756 -6875988 -12077529 -10091923 2003438 13284241
38671 13284241 10915872 -2108117 -9506994 -2176498 11439219 17688739 14078455 8978356
38663 8978356 8729425 10299269 6992057 -1430977 -6580321 -546946 13344146 21921015
38655 21921015 16421215 2852481 -5233215 -2352253 4842446 7950315 6080185 4194093
38647 4194093 6898457 15350928 26391135 32810263 27826271 11922854 -6345333 -17758609
38639 -17758609 -19363317 -14069418 -6360693 173137 3481272 3625268 2340194 1114761
38631 1114761 -229818 -3233974 -9192579 -16752556 -20952267 -17129901 -6967000 2367102
38623 2367102 6880026 9705593 13738936 15585982 12134445 8278623 10458502 15705284
38615 15705284 15757448 10141087 5634300 3506576 -1798878 -9728255 -10837137 -1653423
38607 -1653423 7636471 6993017 135370 -2857462 -57149 3073182 4137130 5361738
38599 5361738 7351916 8361546 8459116 9058230 9684610 9336195 8812031 7961024 4142657
38590 4142657 -1872585 -2499198 7653312 21992256 28095809 22449311 12773911 6796531
38582 6796531 5513060 7316012 11165925 13510544 8563591 -4317332 -17402545 -22389252
38574 -22389252 -19086149 -13639017 -10507485 -9512335 -9307813 -9622722 -9436211 -6586245 -1710647
38565 -1710647 -105059 -5618443 -13563640 -14899811 -8502786 -3139588 -3857228 -3409758
38557 -3409758 5523874 15442908 12498420 -2205573 -12314592 -8946279 -1453822 -798676
38549 -798676 -3763731 -1640243 4636016 7789242 6366135 4020618 1123929 -3729585
38541 -3729585 -7039070 -3891078 3958423 10837749 15345746 18554704 17626359 10238761
38533 10238761 2877285 4561935 12708319 14974066 6207276 -5385092 -10745600 -10142598
38525 -10142598 -8091713 -5965184 -3892995 -4189041 -8398945 -14327121 -18632156 -19491285
38517 -19491285 -15844495 -8018511 82561 3779279 3383109 2771203 2259951 -1136525
38509 -1136525 -5684244 -4591002 3281656 9292054 6566114 201433 -327587 4577203
38501 4577203 5251792 -2666360 -10699660 -7503058 6784604 20036073 22100021 16094262
38493 16094262 13159983 17851815 23611140 23332636 18475414 14130174 10521927 5434034
38485 5434034 1114205 1235573 2936719 -286679 -8143850 -13544771 -13541636 -12792025 -14559210
38476 -14559210 -15529705 -12418080 -7531500 -4473741 -3383501 -3350953 -4844809 -7027927
38468 -7027927 -7158203 -5094936 -3943943 -4293125 -2978161 427199 2086749 1672426 4489668
38459 4489668 11159575 12558410 2581661 -9582106 -9482768 2518754 10785101 4864879
38451 4864879 -7899940 -13547130 -8992882 -3004773 -2633177 -4553171 -1063208 8962862
38443 8962862 18459687 20944898 17639003 14385373 14197802 15735561 17246639 18051271
38435 18051271 16733276 11982337 5672436 1621382 816617 1018323 985602 1281080 991065
38426 991065 -1653067 -4741182 -3737775 1534586 5737776 5610447 4106973 4983514 7730561
38417 7730561 9830284 9465276 4346574 -6479907 -17228142 -18272147 -8610881 557780
38409 557780 -27657 -5384650 -4455264 3843762 10262782 8711435 2984778 225482 2938774
38400 2938774 7713204 8489027 1895567 -8116330 -13135842 -10314399 -5839656 -4939415
38392 -4939415 -3599263 3585946 11844991 11134611 775049 -9398112 -12427715 -10848112
38384 -10848112 -9245707 -8247893 -8137664 -11125150 -16401671 -18660441 -15376133 -11023606
38376 -11023606 -10527873 -12621278 -13334655 -12372241 -11909122 -11800815 -10178243 -7235828 -4851017
38367 -4851017 -3317485 -1259567 1860797 5325022 8549661 11165859 12572917 12944722
38359 12944722 13678149 15374501 16452764 15163101 11703293 6852169 171463 -8128902
38351 -8128902 -14826771 -16244724 -13046577 -9626039 -8155612 -6126933 -1485614 2369967
38343 2369967 192468 -7032382 -11494276 -7933223 -822397 1184822 -3329877 -6979104
38335 -6979104 -3824786 3559209 9787478 14840559 21399867 26755976 24374269 14043494
38327 14043494 3978029 164823 -975154 -5478875 -12200714 -15659237 -14994239 -13451416
38319 -13451416 -10817896 -3966107 4784779 7613578 1995392 -5293137 -8446498 -10097328
38311 -10097328 -13565123 -14624574 -8727398 -1046263 305251 -2324883 -374830 4885174
38303 4885174 3126528 -6755020 -12417814 -7167068 -482618 -1081650 -1203287 9822080
38295 9822080 24911148 27343483 15639733 4878434 3232821 2219138 -5843619 -14112296
38287 -14112296 -12658594 -4144917 1078090 162950 -613106 2739967 6287871 4758032
38279 4758032 -827814 -4344663 -2106550 2699779 4488516 3324158 4745166 10228938
38271 10228938 13059931 8042023 358471 -1958514 -396711 -2313090 -7518400 -8272252
38263 -8272252 -1999409 5725328 11038100 14547696 13621909 3497592 -10895366 -15582328
38255 -15582328 -5178102 9610692 16948263 16913686 14803001 11896434 9449151 11758372
38247 11758372 17416028 16866726 7076171 -672845 2859690 9776138 7369456 -2495626
38239 -2495626 -8663236 -8666123 -8103248 -7115220 -1649255 4497719 2827131 -5190300 -9074848
38230 -9074848 -5385310 -1558303 -2950053 -6453974 -8123685 -7722991 -4823807 843423
38222 843423 4870795 2644534 -2079614 -2101435 820902 -1122955 -7205647 -8214236 -1835982
38213 -1835982 3954704 4689653 4610360 5583198 3275749 -1853073 -2439004 1763844 543388
38204 543388 -9253137 -15660413 -10254826 -2813915 -5283467 -11219146 -6308129 6675277
38196 6675277 10041530 -2283154 -15584754 -15840604 -8548845 -8615166 -18425793 -24928677
38188 -24928677 -17534309 -2003902 6812325 3176441 -3584731 -2395581 5276333 9353269
38180 9353269 6406731 3498330 6124257 9671443 6610113 -2831073 -11624664 -14651503
38172 -14651503 -12578044 -8603110 -4410284 582790 6630500 10538119 7580614 -1102717
38164 -1102717 -6384519 -1444407 8467105 13053970 11450609 11257343 14396370 14583627
38156 14583627 10432764 9790514 16224067 21005436 15167152 1803227 -10309506 -18319942
38148 -18319942 -23266671 -22684246 -13735144 -186082 10736177 15786518 15036822 8212399
38140 8212399 -2283745 -8995976 -7090703 -1592530 -736004 -4698827 -6753567 -3003858
38132 -3003858 4686765 12870864 18107161 17037961 10377195 4392638 3617106 5360383
38124 5360383 6155168 8570569 14789885 18630762 13452186 4825161 4693013 13644493
38116 13644493 19531666 15099827 7118824 4642481 6745205 6975220 3661102 54982
38108 54982 -1929553 -2942965 -3200320 -2362951 -1523909 -2282292 -3959055 -3717133 109804
38099 109804 5672716 9253143 9365434 8366812 8843228 9450175 7040479 2492511 397209
38090 397209 2002374 2907574 46677 -3174872 -1798884 4104917 10822402 15602932
38082 15602932 16983813 14278560 9987574 8779129 10625202 9336330 1790376 -6437282
38074 -6437282 -9533245 -10093444 -12878958 -14956076 -10227982 -535245 6269780 7598400
38066 7598400 7496963 7858258 6181029 2065463 -1234509 -2419666 -3511850 -5503313
38058 -5503313 -7764826 -10936304 -15080728 -16491718 -12255703 -6122584 -3286254 -1636112
38050 -1636112 3924000 10570137 10604850 4892211 2883352 7702549 11164884 6837676
38042 6837676 -703465 -3571066 -33671 7328079 15723671 20685237 17683327 9661400
38034 9661400 6504938 12323774 19103393 17678272 9415593 2006077 -1100690 -1484160
38026 -1484160 -319690 2062595 4127400 5430808 8259502 12912703 14680326 10321898
38018 10321898 4659272 5016676 10261338 10840017 660431 -14621558 -22977860 -18485846
38010 -18485846 -7164292 60746 -542671 -2778041 -574154 3319528 2428579 -3280981
38002 -3280981 -8299549 -10440565 -11858025 -12309830 -9263542 -5132529 -6370849 -13490082
37994 -13490082 -19225278 -18672261 -14095049 -7808536 1326050 10999849 13751975 7524225
37986 7524225 674393 596488 3693054 2949062 -93449 2019812 11502728 22674224
37978 22674224 28184184 24422479 14167058 6421212 8740290 17186003 20012547 13880661
37970 13880661 8243034 9629421 11515449 6847868 718135 360763 742357 -7344716
37962 -7344716 -20095671 -24765539 -18547937 -11109275 -8987669 -9037443 -8272668 -9492908
37954 -9492908 -14162737 -17791881 -15707323 -8340888 567173 7088634 9235126 9809491
37946 9809491 14125841 20247610 17149486 550832 -15369813 -13572645 2307724 12905765
37938 12905765 9530217 1654400 -1567875 -1959376 -2097492 364077 3343560 -487973
37930 -487973 -9196855 -10357238 -1800778 861947 -12280320 -28132324 -30008027 -22507782
37922 -22507782 -20931666 -24804617 -20652877 -7170688 1185446 -3361518 -12060814 -15430245
37914 -15430245 -14850909 -13688511 -9343973 -730762 6264712 7819529 8614468 12248294
37906 12248294 12560315 3084861 -9806538 -12713270 -2975088 7239733 5970357 -4688657
37898 -4688657 -12248329 -8752174 634419 4430044 -1027288 -7288400 -5657492 210355
37890 210355 -572565 -9838648 -17313850 -15665992 -10058677 -7783531 -6359454 -125983
37882 -125983 7144432 6802143 107515 -2608173 1692908 3903575 -2138029 -9307774
37874 -9307774 -8326007 -2010829 -328246 -5433896 -9989249 -8787690 -4359086 -574648
37866 -574648 2715895 6628059 9705234 10198557 9083573 8763636 10430375 13403242 15174410
37857 15174410 12260541 4097284 -3609618 -3361582 4617909 10970279 8014300 -937387
37849 -937387 -6400255 -4479472 630341 4919233 9820195 17032806 22220953 18540779
37841 18540779 5902030 -7254303 -12849090 -11228684 -8455154 -7954133 -8113103 -6931915
37833 -6931915 -5031329 -3773549 -4013452 -7291865 -14388992 -21734972 -23678423 -19982238
37825 -19982238 -16335239 -15461124 -13628140 -9098522 -6814401 -9196166 -9790487 -4095783
37817 -4095783 434108 -4141832 -10934158 -7799479 2038544 4985370 1145969 4908541
37809 4908541 18801202 26329801 18572720 9269961 11372982 15293114 6610484 -7846972
37801 -7846972 -10383811 164608 10568591 16387380 23074575 27540241 19732856 3291338
37793 3291338 -5448066 -2710321 -2792313 -12530271 -18529255 -9361453 5180660 9137691
37785 9137691 2779198 -2703900 -3852400 -5280522 -7273496 -5473004 -351603 2833278
37777 2833278 2163578 -40607 -2319615 -3920599 -2455927 2125300 4211455 -671645
37769 -671645 -8520299 -12086296 -10297278 -6551498 -1400940 5703023 10293267 7057816
37761 7057816 -618241 -3283254 1556384 5932406 2862466 -4325015 -7077981 -2454859
37753 -2454859 4328460 7032967 5659349 5184840 7212267 6185439 -2225224 -11703351
37745 -11703351 -11817552 -3889248 -697550 -7257973 -12599798 -7550994 -287412 -3182062
37737 -3182062 -12175980 -13175116 -4678453 1014668 -1422863 -3144747 2506068 9674577
37729 9674577 11280273 9507292 8383118 5063609 -3662512 -12836845 -15228856 -11642233
37721 -11642233 -8745926 -9662758 -12185706 -13797840 -13779868 -12437321 -11746673 -14200641 -18157864
37712 -18157864 -17897994 -11452948 -4154393 -572162 2194303 7846914 12304844 9315570
37704 9315570 1826451 -757343 3609283 6608283 2037725 -5853128 -9736101 -8938690
37696 -8938690 -7162804 -4868119 48141 5680094 6363659 788521 -4535907 -2859397
37688 -2859397 3891793 6920040 958112 -9662236 -16053763 -14205200 -8292214 -5456591
37680 -5456591 -8258997 -12307351 -11610708 -6470235 -4008443 -8326477 -12451857 -6019931
37672 -6019931 8856455 17303814 11268904 1601020 2818337 11902232 13393225 2977361
37664 2977361 -6992445 -7364679 -4990667 -9584023 -17813780 -19345686 -12663593 -5968680
37656 -5968680 -5270870 -8846695 -11881125 -11030334 -6008482 -1119946 -2884160 -11913755
37648 -11913755 -20164635 -20593529 -15633258 -10992103 -6107555 1716844 8132947 6645345
37640 6645345 712850 486791 7264469 11415734 7598574 1990053 730663 554495
37632 554495 -3460794 -8468591 -8867054 -5209724 -1591658 1657273 6310078 10294551
37624 10294551 9560808 4534223 58314 -251543 3291551 7614409 8574539 4390652
37616 4390652 -462090 1158027 8846302 13155886 8348477 920348 -554792 1333995
37608 1333995 -2127799 -11196513 -17355809 -16144058 -11406209 -6876440 -2125790 2035343
37600 2035343 2219238 -1229719 -3282950 -1592068 1176157 3332116 5594012 5748425
37592 5748425 406670 -5991742 -3841693 5835960 8664231 -3116039 -17517195 -18861948
37584 -18861948 -8699850 512028 5618804 12487233 19228410 16021767 3504791 -3557698
37576 -3557698 3267595 14052963 16593321 14306600 17874274 26026593 26774105 15821468
37568 15821468 2981558 -1290899 2338896 6624766 7715825 6448381 3923128 952720
37560 952720 479363 5696356 14638055 19959519 16672755 8539853 3717557 4439358 4870037
37551 4870037 613820 -3873158 -1515749 6219420 9967626 4348502 -5749389 -12085256
37543 -12085256 -12025988 -8629642 -5583128 -4935918 -7299847 -11360136 -14422698 -15145785 -14399796
37534 -14399796 -12638169 -8771251 -2828726 2758600 5843403 6186434 3889189 -244483
37526 -244483 -2142935 2544978 10639603 12300394 3764765 -5994456 -6540172 924781
37518 924781 7968417 11680847 14656091 15576526 10140540 1177542 -2249500 2035146
37510 2035146 6087991 4957184 4301895 9771042 16381247 15603632 8033327 1740375
37502 1740375 986279 3162346 5021703 5764239 4842778 2312655 1189873 4478934 9575349
37493 9575349 10244010 5135155 301423 1497533 6873347 9390688 5019406 -3129539
37485 -3129539 -8516113 -8211824 -5636583 -5675619 -8132836 -8727747 -6419264 -5274850 -7126837
37476 -7126837 -7398479 -2624700 2226678 496164 -4790056 -4329396 2977243 7556270
37468 7556270 3503662 -2809160 -3402578 -987615 -3008687 -7641952 -5142425 6684855
37460 6684855 16732881 14010605 1587956 -7557111 -5992252 1452176 5617604 3341349
37452 3341349 -1306801 -3032294 -278176 4426866 6908359 4522236 -1363712 -5953147
37444 -5953147 -5276142 43069 5927518 8985826 8316928 4520771 -582823 -3969028
37436 -3969028 -4182325 -3792279 -5721763 -7708647 -5310824 -459996 -82730 -3911240 -1851049
37427 -1851049 10672253 22128055 18615739 3321582 -8020445 -8310293 -4581621 -3304232
37419 -3304232 -2488392 -459696 -572016 -2681337 -512182 6938554 11360902 8818108
37411 8818108 7129275 11304355 12006645 70257 -15917653 -20498698 -14368571 -11533599
37403 -11533599 -16118909 -17879457 -11800326 -6675049 -9241347 -12751622 -8688677 -339738
37395 -339738 3072965 -642052 -6113616 -8170494 -5367459 -63778 1781006 -4084844
37387 -4084844 -12597336 -13316821 -4690449 2988982 2472299 -949152 -220469 1654944 -1717046
37378 -1717046 -8409897 -11741302 -10526756 -7493277 -2011463 6753982 12969010 9702315
37370 9702315 -248129 -7083435 -6315275 -1559036 2780805 4367723 845186 -7114219
37362 -7114219 -12472646 -9705514 -4434157 -6504077 -14580499 -17208924 -9581138 174222
37354 174222 3097783 -732002 -6633122 -11818968 -14656161 -13780662 -10328424 -6277889
37346 -6277889 -709516 6504981 9309329 2526571 -6989403 -7145072 1113523 4410749
37338 4410749 -2070215 -7350782 -3105703 3662350 3656508 -660517 -2753966 -3398454 -4708153
37329 -4708153 -2092078 7110158 14746933 12704424 6163327 5056191 8195733 7301754
37321 7301754 1836921 -1718192 -1239126 1494760 8060765 18261385 22333770 11952530
37313 11952530 -4286822 -10942374 -8808817 -11667650 -20852939 -22010052 -11044347 -4365940
37305 -4365940 -14166643 -28966263 -30467653 -18210849 -5507205 -76633 -1057257 -7972169
37297 -7972169 -19265711 -25809664 -18743375 -3341840 5188520 540522 -8151724 -9622588
37289 -9622588 -3451939 2117594 555829 -6457520 -10502064 -4818806 6815876 12414946
37281 12414946 6532412 -1051007 2468059 14569519 19394302 8543361 -8055460 -15390651
37273 -15390651 -11221993 -5376746 -4905907 -6516279 -3989662 2173125 5746214 3339673
37265 3339673 -1570772 -3551259 -1571162 1010054 1177762 -835458 -2523786 -1613014
37257 -1613014 1432059 2507832 -2330735 -10464965 -13121415 -5468380 6376953 12545594
37249 12545594 11010164 6997182 3715308 689505 -374984 3430014 9010391 9443106
37241 9443106 4770464 2197206 3591110 2318804 -3799898 -6628310 -1287881 3581726
37233 3581726 -2140194 -14720078 -22658026 -22815301 -20781948 -19165215 -15893946 -12467623
37225 -12467623 -14062247 -20833663 -26403110 -25482766 -17791889 -6065341 3971540 4489398
37217 4489398 -5789338 -15701133 -12863120 96503 9057891 7692664 3853028 5607468
37209 5607468 10362498 11218350 6563239 -530802 -6797233 -9648133 -8312328 -5922551
37201 -5922551 -5995300 -6733852 -4630261 -2888437 -7831748 -16441349 -17612591 -8842476 -1537301
37192 -1537301 -4558824 -11874263 -13465750 -10280061 -9743710 -12431721 -12345999 -7103807 -56390
37183 -56390 5520364 8106799 6215342 668272 -3621353 -2888963 1048437 5161918 9503996
37174 9503996 13065245 11708737 6369737 6320972 15647405 23055539 16411187 2448329
37166 2448329 -1430382 7519676 15170793 14124810 13522635 20218393 25021518 17391907
37158 17391907 3074528 -4362557 -2828403 -1113763 -2636104 -1028527 7675951 17127052
37150 17127052 17873077 8242908 -3928836 -8727830 -3381898 4853273 6420761 617779
37142 617779 -4226083 -2668286 1120870 1678018 1201229 4167791 7843276 6237633 1039181
37133 1039181 -130256 3849985 5540684 1287663 -2260739 1738178 9501355 11441104
37125 11441104 4744175 -3974983 -7398189 -4548753 1116951 7111441 13174534 18098917
37117 18098917 17931803 9646051 -3461927 -12738106 -12430448 -5515105 352577 901512
37109 901512 -2608179 -6767147 -8487899 -6447180 -3864924 -7498188 -18978339 -29158732
37101 -29158732 -27292568 -15002305 -4396055 -2384393 -4553872 -5809098 -8165389 -13676984
37093 -13676984 -17464909 -14433821 -7813550 -4420274 -4920037 -4882129 -2859966 -1618965
37085 -1618965 -2837827 -5112051 -5844138 -2256299 6318123 14272651 13093858 3664549
37077 3664549 -826832 8391688 21345409 21180795 6790472 -7127257 -10890672 -9099100
37069 -9099100 -8465224 -8204021 -6116667 -4117262 -2640769 2267472 10987860 16311405
37061 16311405 12560215 3043527 -5716290 -11151347 -12166813 -6620504 3277942 9371161
37053 9371161 7288595 2375060 747130 892476 182510 2275535 9428550 13772243
37045 13772243 6725394 -6962645 -15200401 -15777756 -16639664 -20592424 -21572303 -16887048
37037 -16887048 -11766355 -9069703 -4903945 1586192 3800612 -1475472 -7209932 -6661108
37029 -6661108 -3813263 -5852426 -10721847 -10736142 -5560918 -2826931 -5977544 -9128509
37021 -9128509 -6324928 -597807 -72386 -7206857 -15124629 -14995069 -5653574 5340007
37013 5340007 10301835 9503159 9087981 12237085 15461550 13810834 6672753 -2565474
37005 -2565474 -9791955 -11750283 -7211830 1140682 7849575 9880431 9464369 10103525
36997 10103525 11276285 9463722 3891516 -1024615 102261 7443150 14732783 15201230
36989 15201230 9000356 3135255 2915458 5932937 7256854 7732397 11625002 17197726
36981 17197726 17007659 9443131 2631332 2325255 2345094 -5736019 -17654848 -20392939
36973 -20392939 -10489710 467505 1262631 -5260719 -8468459 -4512169 1452786 4784148
36965 4784148 6437327 8416585 9656677 8516990 5860119 3286132 621358 -2624494
36957 -2624494 -5175638 -5809357 -5901624 -7453165 -9343321 -8576965 -5439530 -4406530 -8484288
36948 -8484288 -14591173 -16423393 -11272699 -2834581 2468793 1252711 -4602205 -10878297
36940 -10878297 -15279497 -17708405 -16934734 -10091488 2640572 15347763 21414462 19816604
36932 19816604 13828779 5801688 -2899423 -9066765 -10162643 -8555361 -7911897 -6867532
36924 -6867532 -2876854 -698789 -7753121 -20485849 -25849515 -19405625 -11450676 -10419641
36916 -10419641 -11250839 -7399359 -3277446 -4321457 -4217887 4963638 16690026 17987966
36908 17987966 9174577 1615294 -1098710 -4962855 -9987404 -8495482 -286464 5578157
36900 5578157 7055761 12239064 21607079 22586878 9867306 -2712312 -1467959 6864706
36892 6864706 6468861 -3899806 -11559409 -9502014 -2861362 2418243 6164854 8564990
36884 8564990 7394864 3266595 1355877 4843201 10150298 10987195 5394242 -2591635
36876 -2591635 -7645220 -8641418 -8577813 -9140664 -8239921 -5002742 -3320320 -5772526 -7726965
36867 -7726965 -4209648 579856 -708354 -5491586 -4867848 681078 1457371 -4751862
36859 -4751862 -9478471 -9665029 -12417030 -18716001 -17863941 -6569883 1252521 -4866619
36851 -4866619 -14646248 -13668380 -5722860 -3515891 -6805698 -6498324 -3345631 -5047665
36843 -5047665 -9159769 -6156468 2613481 6313586 3117545 1954597 5858305 8436523
36835 8436523 7501338 7596613 7839108 2044015 -6966402 -8107373 -374175 4318127 1114423
36826 1114423 173837 8112279 15571407 12134622 1776728 -6320505 -12367593 -20778289
36818 -20778289 -28008242 -26571665 -17084022 -7525585 -3090149 -2928806 -3935197 -2699416
36810 -2699416 2915781 9707486 10133222 1226118 -10889132 -18180677 -18472924 -14144706
36802 -14144706 -8233643 -3922398 -2430982 172515 7749574 14837773 11274478 -1804333
36794 -1804333 -10648406 -7630376 -953316 -146051 -2766944 -3337302 -4889203 -11052231
36786 -11052231 -15213021 -9670458 252303 3157301 -1454186 -4493789 -2510678 -473364
36778 -473364 -1148495 -2156100 -2692834 -3745878 -2593151 3756110 10776676 11512649 8401767
36769 8401767 9901441 15717390 16417279 8961996 1522549 59648 878753 678886 3273189
36760 3273189 9735038 11201554 504902 -14963518 -21026650 -14179240 -3640657 1774538
36752 1774538 1467845 -1306807 -4465057 -6535389 -6336481 -5171574 -5975408 -8761595 -9573519
36743 -9573519 -5433907 1622625 6795421 7403093 4455953 642842 -1724562 -1129001
36735 -1129001 3287350 11128534 19628380 23794580 19536653 8203018 -2837725 -6552941
36727 -6552941 -3716096 -1767409 -5031655 -8856818 -6466246 682242 4467834 1744158
36719 1744158 -1624671 -570625 1206620 -2151663 -8362739 -9646986 -3780320 3611047
36711 3611047 7389026 8195372 9206892 12140678 16667865 20019367 18068168 10993337
36703 10993337 5850992 7739732 10772262 5862178 -4027968 -6708685 555955 6879213
36695 6879213 5650083 4307324 9437543 13680666 7881919 -2460158 -5008984 877996
36687 877996 5720381 6289358 7710360 10566312 8485708 -23266 -8187089 -11778318
36679 -11778318 -13580010 -14271438 -8835845 2892731 10696130 6118836 -5278384 -10703024
36671 -10703024 -5922980 1769443 4404977 1528922 -2148425 -2835874 -323484 3017389
36663 3017389 4761394 4624716 4207969 4297665 3248349 -903465 -6861472 -9825329 -6277016
36654 -6277016 712015 3178579 -2243721 -8380729 -5785011 3463206 6810806 -1797950
36646 -1797950 -13312172 -16781647 -13856123 -11957564 -9007083 3048687 21003810 29532085
36638 29532085 21009607 5988510 -1563079 -1228530 -1372203 -3772072 -2161668 5901915
36630 5901915 14049394 15629372 11907817 8802507 8041035 5010860 -4048834 -14925289
36622 -14925289 -18451467 -11272494 -652095 3841588 982570 -3066711 -3757855 -1136675
36614 -1136675 4464503 12912065 19893236 19013637 10914962 4403627 5071920 8181957
36606 8181957 6962072 2524393 -335957 -2737576 -9243782 -17517580 -18690125 -9622119
36598 -9622119 1513327 4873540 6831 -5578790 -5778966 -1021173 3636608 2901166
36590 2901166 -4415624 -13014708 -14851993 -7892444 597193 2516456 -1144557 -2883505
36582 -2883505 408466 4879289 7915177 11638176 15606177 13525016 3012975 -7439001
36574 -7439001 -9179728 -6727517 -10779260 -20255185 -22720269 -13719448 -4071566 -3476815
36566 -3476815 -7194143 -5935718 -507062 2111716 1089190 663936 732877 -1853084 -4547316
36557 -4547316 -1061767 7754352 13212811 10642966 5338000 4173072 6289050 5331865
36549 5331865 -1470504 -9029630 -9553803 -2321103 3063380 -2719454 -14681409 -16930414
36541 -16930414 -3263494 13274852 17519532 11454163 7480401 8865969 8924879 6363160
36533 6363160 7929098 14889752 18843594 14291115 5952682 179831 -2838847 -5200859
36525 -5200859 -7108911 -9591988 -14611996 -19977976 -20827507 -17979908 -17363353 -19226618
36517 -19226618 -16374000 -6246852 3629933 6362721 4184671 2031409 121321 -2470670
36509 -2470670 -3933165 -4029768 -5485119 -6997417 -2575266 7588839 14088101 11827575
36501 11827575 7761250 8254151 8102315 1431850 -5127039 -2156226 5698369 5814789
36493 5814789 -2370659 -6546511 -877834 5803215 4277287 -1688026 -1031631 10399752
36485 10399752 24940388 30728996 23721703 12738221 9839816 14640937 14376756 3283032
36477 3283032 -6709204 -3268991 6070983 4254098 -8490101 -13875051 -3060494 10325939
36469 10325939 10965585 3002057 569638 5870663 8682058 4175581 -458557 1493817
36461 1493817 6231787 6366914 2237466 255670 2252052 3163634 351952 -1411812
36453 -1411812 1337947 2773787 -3579451 -11577213 -8730459 3699850 8972761 -1855452
36445 -1855452 -16122208 -17233264 -6668282 2110578 3873598 3145165 1240115 -3647837
36437 -3647837 -5903897 2661886 16390400 18616413 4653500 -10798353 -14249185 -9611243
36429 -9611243 -7263506 -7938093 -6590769 -4108851 -4923820 -7665453 -7406167 -4685254 -4534138
36420 -4534138 -7742132 -9455125 -6300390 -499006 3051597 1374849 -3751363 -6230643
36412 -6230643 -1511501 6947571 11059327 9101282 7587904 9814044 9869061 3287688
36404 3287688 -3262150 -812108 8152886 13612139 12846461 12012043 13690745 12462488
36396 12462488 5017206 -3257339 -5727708 -3187021 -1222206 -2786099 -7046738 -12748091
36388 -12748091 -18741015 -22177164 -19399037 -9520591 3543329 13019943 14180679 8472792
36380 8472792 2168438 -345147 -787964 -2659803 -4607735 -2198191 4024385 7404679
$$ [...]
##END NTUPLES=NMR SPECTRUM
##END=
