##TITLE=31Pdec_SR124T2
 CDCl3, 24 sc
 30.5.2022
##JCAMPDX= 6.0         $$ Bruker NMR JCAMP-DX V2.0
##DATA TYPE= NMR SPECTRUM
##DATA CLASS= NTUPLES
##ORIGIN= UXNMR, Bruker Analytische Messtechnik GmbH
##OWNER= root
$$ XWIN-NMR		Version 3.5
$$ Mon May 30 11:29:01 2022 Russian Standard Time (UT+4h)  she@DPX200
##.OBSERVE FREQUENCY= 81.013821
##.OBSERVE NUCLEUS= ^31P
##.ACQUISITION MODE= SIMULTANEOUS
##.ACQUISITION SCHEME= undefined
##.AVERAGES= 24
##.DIGITISER RES= 16
##SPECTROMETER/DATA SYSTEM= spect
##.PULSE SEQUENCE= zgpg30
##.SOLVENT NAME= CDCl3
##.SHIFT REFERENCE= (INTERNAL, CDCl3, 0, 248.564)
##AUDIT TRAIL= $$ (NUMBER, WHEN, WHO, WHERE, WHAT)
$$ ##TITLE= Audit trail, XWIN-NMR		Version 3.5
$$ ##JCAMPDX= 5.01
$$ ##ORIGIN= Bruker BioSpin GmbH
$$ ##OWNER= she
$$ F:/spectra/data/she/nmr/P31/1/pdata/1/auditp.txt
$$ ##AUDIT TRAIL=  $$ (NUMBER, WHEN, WHO, WHERE, WHAT)
(   1,<2022-05-30 11:27:41.93 +0400>,<she>,<DPX200>,
      <created by zg, POWCHK disabled, PULCHK disabled
       configuration hash MD5:
       00 E9 B6 7A A2 85 ED C7 34 08 36 98 17 FE 4E 26
       data hash MD5: 32K
       73 5C 31 E2 17 F1 12 56 D5 F3 BF 39 D6 88 14 AB>)
(   2,<2022-05-30 11:27:44.43 +0400>,<she>,<DPX200>,
      <Start of raw data processing
       efp BC_mod = 2 LB = 1 FT_mod = 6 PKNL = 1 PHC0 = -9871.107 PHC1 = 30.8537 SI = 64K 
       data hash MD5: 64K
       57 DA E3 45 77 E2 48 4F 92 13 DB 30 93 5A DD 78>)
(   3,<2022-05-30 11:28:15.42 +0400>,<she>,<DPX200>,
      <pk PHC0 = 5.069402 PHC1 = 0 
       data hash MD5: 64K
       D6 82 C9 A1 E6 33 13 0B B8 5E 45 F8 13 2F BE C3>)
(   4,<2022-05-30 11:28:33.98 +0400>,<she>,<DPX200>,
      <abs ABSG = 5 
       data hash MD5: 64K
       FE FA A4 29 15 0C 5F 42 65 97 A9 B1 17 FA BA 9B>)
$$ ##END=
$$ 
$$ hash MD5
$$ 78 E7 27 FA 37 00 D3 E1 A9 7A D8 20 60 FB 71 96
##$RELAX= 
##$RELAX= 
##$RELAX= 
##$RELAX= 
##$RELAX= 
##$RELAX= 
##$RELAX= 
##$RELAX= 
$$ Bruker specific parameters
$$ --------------------------
##$DU= <F:/spectra>
##$EXPNO= 1
##$NAME= <P31>
##$PROCNO= 1
##$TYPE= <nmr>
##$USER= <she>
##$AMP= (0..31)
100 100 100 100 100 100 100 100 100 100 100 100 100 100 100 100 100 100 
100 100 100 100 100 100 100 100 100 100 100 100 100 100 
##$AQSEQ= 0
##$AQ_mod= 1
##$AUNM= <au_zg>
##$AUTOPOS= <>
##$BF1= 81.014009
##$BF2= 200.13
##$BF3= 200.13
##$BF4= 200.13
##$BF5= 200.13
##$BF6= 200.13
##$BF7= 200.13
##$BF8= 200.13
##$BYTORDA= 1
##$CFDGTYP= 0
##$CFRGTYP= 5
##$CHEMSTR= <none>
##$CNST= (0..31)
1 1 145 1 1 1 1 1 1 1 1 1 1 1 1 1 1 1 1 1 1 1 1 1 1 1 1 1 1 1 1 1 
##$CPDPRG= <waltz16>
##$CPDPRG1= <>
##$CPDPRG2= <waltz16>
##$CPDPRG3= <>
##$CPDPRG4= <mlev>
##$CPDPRG5= <mlev>
##$CPDPRG6= <mlev>
##$CPDPRG7= <mlev>
##$CPDPRG8= <mlev>
##$CPDPRGB= <>
##$CPDPRGT= <>
##$D= (0..31)
0 1 0 0 0 0 0 0 0 0 0 0.03 2e-05 3e-06 0 0 0 0 0 0 0 0 0 0 0 0 0 0 0 0 
0 0 
##$DATE= 1653895661
##$DBL= (0..7)
120 120 120 11 120 120 24 19 
##$DBP= (0..7)
150 150 150 150 150 150 150 150 
##$DBP07= 0
##$DBPNAM0= <>
##$DBPNAM1= <>
##$DBPNAM2= <>
$$ [...]
##$SUBNAM3= <"">
##$SUBNAM4= <"">
##$SUBNAM5= <"">
##$SUBNAM6= <"">
##$SUBNAM7= <"">
##$SUBNAM8= <"">
##$SUBNAM9= <"">
##$SW= 501.771253377433
##$SWIBOX= (0..15)
0 1 3 0 0 0 0 0 0 0 0 0 0 0 0 0 
##$SW_h= 40650.406504065
##$TD= 32768
##$TD0= 1
##$TE= 0
##$TE2= 300
##$TE3= 300
##$TEG= 300
##$TL= (0..7)
0 120 53 12 22 120 120 120 
##$TP= (0..7)
150 150 150 150 150 150 150 150 
##$TP07= 0
##$TPNAME0= <>
##$TPNAME1= <>
##$TPNAME2= <>
##$TPNAME3= <>
##$TPNAME4= <>
##$TPNAME5= <>
##$TPNAME6= <>
##$TPNAME7= <>
##$TPOAL= (0..7)
0.5 0.5 0.5 0.5 0.5 0.5 0.5 0.5 
##$TPOFFS= (0..7)
0 0 0 0 0 0 0 0 
##$TUNHIN= 0
##$TUNHOUT= 0
##$TUNXOUT= 0
##$USERA1= <user>
##$USERA2= <user>
##$USERA3= <user>
##$USERA4= <user>
##$USERA5= <user>
##$V9= 5
##$VALIST= <valist>
##$VCLIST= <CCCCCCCCCCCCCCC>
##$VD= 0
##$VDLIST= <DDDDDDDDDDDDDDD>
##$VPLIST= <PPPPPPPPPPPPPPP>
##$VTLIST= <TTTTTTTTTTTTTTT>
##$WBST= 1024
##$WBSW= 4
##$XGAIN= (0..3)
0 0 0 0 
##$XL= 0
##$YL= 0
##$YMAX_a= 3108
##$YMIN_a= -3990
##$ZGOPTNS= <>
##$ZL1= 120
##$ZL2= 120
##$ZL3= 120
##$ZL4= 120
##$ABSF1= 248.5645
##$ABSF2= -253.2056
##$ABSG= 5
##$ABSL= 3
##$ALPHA= 0
##$AQORDER= 0
##$ASSFAC= 0
##$ASSFACI= 0
##$ASSFACX= 0
##$ASSWID= 0
##$AUNMP= <proc_1d>
##$AZFE= 0.1
##$AZFW= 0.5
##$BCFW= 0
##$BC_mod= 2
##$BYTORDP= 0
##$COROFFS= 0
##$CY= -3
##$DATMOD= 1
##$DC= 0
##$DFILT= <>
##$DTYPP= 0
##$F1P= 0
##$F2P= 0
##$FCOR= 1
##$FTSIZE= 65536
##$FT_mod= 6
##$GAMMA= 0
##$GB= 0
##$INTBC= 1
##$INTSCL= 5.30512e-09
##$ISEN= 30
##$LB= 1
##$LEV0= 0
##$LPBIN= 0
##$MAXI= 10000
##$MC2= 0
##$MEAN= 0
##$ME_mod= 0
##$MI= 50
##$NCOEF= 0
##$NC_proc= -8
##$NLEV= 6
##$NOISF1= 182.463
##$NOISF2= 159.3651
##$NSP= 0
##$NTH_PI= 0
##$NZP= 0
##$OFFSET= 248.5645
##$PC= 4
##$PHC0= -9866.038
##$PHC1= 30.8537
##$PH_mod= 1
##$PKNL= yes
##$PPARMOD= 0
##$PSCAL= 0
##$PSIGN= 0
##$REVERSE= no
##$SF= 81.014009
##$SI= 65536
##$SIGF1= 159.3651
##$SIGF2= -187.1042
##$SINO= 113.3802
##$SIOLD= 16384
##$SREGLST= <1H.CDCl3>
##$SSB= 0
##$STSI= 65536
##$STSR= 0
##$SW_p= 40650.406504065
##$SYMM= 0
##$S_DEV= 0
##$TDeff= 32768
##$TDoff= 0
##$TI= <>
##$TILT= no
##$TM1= 0
##$TM2= 0
##$TOPLEV= 0
##$USERP1= <user>
##$USERP2= <user>
##$USERP3= <user>
##$USERP4= <user>
##$USERP5= <user>
##$WDW= 1
##$XDIM= 65536
##$YMAX_p= 202589214
##$YMIN_p= -181670938
$$ End of Bruker specific parameters
$$ ---------------------------------
##NTUPLES= NMR SPECTRUM
##VAR_NAME=  FREQUENCY,     SPECTRUM/REAL,   SPECTRUM/IMAG
##SYMBOL=    X,             R,               I
##VAR_TYPE=  INDEPENDENT,   DEPENDENT,       DEPENDENT
##VAR_FORM=  AFFN,          ASDF,            ASDF
##VAR_DIM=   65536,         65536,           65536
##UNITS=     HZ,            ARBITRARY UNITS, ARBITRARY UNITS
##FACTOR=    0.620285442955139, 1,           1
##FIRST=     20137.2065510759, 0,            0
##LAST=      -20513.1999529892, 0,           0
##MIN=       -20513.1999529892, -181670938,  0
##MAX=       20137.2065510759, 202589214,    0
$$ Real data points
##PAGE= N=1
##DATA TABLE= (X++(R..R)), XYDATA
$$ [...]
##PAGE= N=2
##DATA TABLE= (X++(I..I)), XYDATA
13051B205038j408225P3608K070545J146555n92750l21810P23309N97893Q6259
$$ 2205038 796813 870421 2940966 4087521 3494771 3172961 3896270 4494163 4580422
13042D580422r0083j132573k711102k040866J128849L015052J737526K22499O57304
$$ 4580422 4490339 3357766 646664 -1394202 -265353 2749699 4487225 4709724 5367028
13033E367028R39397l05506k94994K335800L375727n42852n297264m674920K94784
$$ 5367028 6306425 6000919 5705925 8041725 11417452 10874600 5577336 902416 1197200
13024A197200L116329J321076j380053j915686j585325k170765k569967j221414
$$ 1197200 4313529 5634605 4254552 2338866 753541 -1417224 -3987191 -5208605
13016e208605O53344M03791k150009l765260j584663K504471L286327p23025m014397
$$ -5208605 -4555261 -4151470 -6301479 -10066739 -11651402 -9146931 -5860604 -6583629 -10598026
13007a0598026j081248N245766P247273L163367j340902k767407l797809n688220
$$ -10598026 -11679274 -6433508 813765 3977132 2636230 -131177 -3928986 -9617206
12999i617206m223188K238307P262507N030080m75915j685496J056105J524149
$$ -9617206 -13840394 -11602087 -4339580 690500 214585 -1470911 -414806 1109343
12991A109343j428018k677806J20679L315171L626718J994714K14479j423319
$$ 1109343 -318675 -2996481 -2875802 439369 4066087 6060801 6275280 4851961
12983D851961k296184j414941J09322J34500q42580n59235P94718R78000j02380
$$ 4851961 2555777 1140836 1250158 1384658 542078 -17157 777561 1755561 1653181
12974A653181n15504j34032k22960J14691K408369M262797J674982l889963o247106
$$ 1653181 1137677 1003645 780685 895376 3303745 7566542 9241524 5351561 -895545
12965h95545l239575N31354R77332o57408j784817k052171r55443K903967P608978
$$ -895545 -4135120 -3603766 -2626434 -3283842 -5068659 -7120830 -8076273 -5172306 2436672
12956B436672P935860K634845k799406l782158k567634k983590l835608k214317
$$ 2436672 10372532 13007377 10207971 6425813 3858179 874589 -2961019 -5175336
12948e175336L55511L82685j392483j367425Q53062K385726K100604J496400J116912
$$ -5175336 -4819825 -4437140 -5829623 -7197048 -6343986 -3958260 -1857656 -361256 755656
12939G55656Q66j383570j084135J079040K764462K016178p22912l368164l807409
$$ 755656 756522 -627048 -1711183 -632143 2132319 4148497 3425585 57421 -3749988
12930c749988j521480J428328K292402J212062P85615J352631J37625l166602
$$ -3749988 -5271468 -3843140 -1550738 -338676 446939 1799570 1937195 -1229407
12922a229407m152469l84543L548142K246826k307766m001045j616409J145063
$$ -1229407 -5381876 -5766419 -2218277 28549 -2279217 -6280262 -7896671 -6751608
12914f751608K921979N443005P534632N250612q17868m497026k546902Q43208
$$ -6751608 -3829629 1613376 9148008 14398620 13580752 9083726 6536824 7380032
12906G380032O65952k155902l600179k626137j254039r06602j346166j755188
$$ 7380032 8045984 5890082 2289903 -336234 -1590273 -2496875 -3843041 -5598229
12898e598229j185313O74841K391910K264604J115249J075462J610920K74443
$$ -5598229 -6783542 -6108701 -3716791 -1452187 -336938 738524 2349444 2623887
12890B623887k201916j938149J587622L638408J253061k109549k197635l74311
$$ 2623887 421971 -1516178 71444 3709852 4962913 2853364 655729 281418
12882B81418l92851j924787j951149m99070j10400o14651P12616L607831L926313
$$ 281418 -111433 -2036220 -3987369 -4486439 -4596839 -5211490 -4498874 -891043 3035270
12873C035270j74600m512777l849855J052415M029431J308968l499868m045154
$$ 3035270 2860670 -1652107 -5501962 -4449547 -420116 888852 -2611016 -6656170
12865f656170K24070L420619J868579o94587L62915K805852J727129j379512j102805
$$ -6656170 -6432100 -3011481 -1142902 -1837489 -1474574 1331278 3058407 1678895 576090
12856E76090J558861J72337m941397n273622J573523N961794Q82444o256335n067085
$$ 576090 2134951 2307288 -2634109 -7907731 -6334208 -372414 510030 -5746305 -10813390
12847a0813390J789153M307269J643375J269466M275243L672820k254040o057055
$$ -10813390 -9024237 -4716968 -3073593 -1804127 2471116 6143936 3889896 -2167159
12839b167159l148597J493557J985291p05359k960622l788009k758506J103682
$$ -2167159 -5315756 -3822199 -1836908 -2542267 -5502889 -9290898 -12049404 -10945722
12831a0945722N284952M619215o66249l585355m72534L369284K086182k064729
$$ -10945722 -5660770 -1041555 -1707804 -5293159 -5765693 -2396409 -310227 -2374956
12823b374956l126253j06101L456842N134511M655560K294313k79871m88601R78129
$$ -2374956 -5501209 -5607310 -2150468 2984043 7639603 9933916 9654045 9165444 10143573
12814A0143573P046m153971o252757k678836K593317L891460J654664k21776j078610
$$ 10143573 10150619 5996648 -256109 -2934945 -341628 3549832 5204496 4982720 3904110
12805C904110k380648k998710j012515J874781K575657J476227Q16868L76001
$$ 3904110 1523462 -1475248 -2487763 -612982 1962675 3438902 4255770 4631771
12797D631771r19219j402738O38832K760575J596693j549445k983623k478263
$$ 4631771 3712552 2309814 2948646 5709221 7305914 5756469 2772846 294583
12789B94583j995383p61663K739326N578764L445667j833753m042701j833862
$$ 294583 -1700800 -2462463 276863 5855627 9301294 7467541 3424840 1590978
12781A590978j79791j877039l508205j639455J922645L379690J823378j029726
$$ 1590978 1411187 -465852 -3974057 -5613512 -3690867 -311177 1512201 482475
12773D82475l148980k964488l37737K475285L044422J938381J284771R18438p65367
$$ 482475 -2666505 -5630993 -5968730 -3493445 -449023 1489358 2774129 3692567 2927200
12764B927200k776799k291774N41753K384684J630106J0397j000698j859248k601801
$$ 2927200 150401 -2141373 -1599620 785064 2415170 2425567 1424869 -434379 -3036180
12755c036180k172580o07358R58273K406962L914067L869865J091200j735802
$$ -3036180 -5208760 -5816118 -4857845 -2450883 1463184 5333049 6424249 4688447
12747D688447j051082J720616J974116o71771j895478L9421J801311R10253q44036
$$ 4688447 3637365 5357981 7332097 6660326 4764848 4804269 6605580 7515833 6671797
12738F671797j500039j922312k871249l008710j559491L56037K073478L742914
$$ 6671797 5171758 3249446 378197 -2630513 -4190004 -3833967 -1760489 1982425
12730A982425M062114J619091j440416j674793k62080j321663m209934l827972
$$ 1982425 6044539 7663630 6223214 4548421 4286341 2964678 -1245256 -5073228
12722e073228M63347L141985J612974p8135O80263N47751k393203l785288m91561
$$ -5073228 -4609881 -1467896 145078 66943 747206 1294957 -1098246 -4883534 -5375095
12713e375095L221353K448875p53494j962865j500992j403926l14916K582905
$$ -5375095 -2153742 295133 -458361 -2421226 -3922218 -5326144 -5641060 -3058155
12705c058155L353245m33633l707592j191441L483696L632065O93897Q77878L463718
$$ -3058155 295090 -138543 -3846135 -5037576 -1553880 2078185 2772082 3649960 7113678
12696G113678K151211k982424m807652j272952J169722j270536l590786r27006
$$ 7113678 9264889 6282465 1474813 201861 1371583 101047 -3489739 -4416745
12688d416745L397733L653263L80769j749624j238576j82451L68845J141458J661798
$$ -4416745 -1019012 2634251 3015020 1265396 26820 -155631 213214 1354672 3016470
12679C016470J67086l204533n449272l898400M27473L597387L189779J104506
$$ 3016470 3183556 -20977 -5470249 -9368649 -8941176 -5343789 -2154010 -1049504
12671a049504O39075J526885P44409j622383j521039K181078M479053J559699
$$ -1049504 -410429 1116456 1860865 238482 -1282557 898521 5377574 6937273
12663F937273k663741k317817J289305K190759o54383k715845j940026r78437
$$ 6937273 4273532 1955715 3245020 5435779 4781396 2065551 125525 -852912
12655h52912j186435n43098J393131J964704K86440j215539j424708j950194k680031
$$ -852912 -2039347 -2582445 -1189314 775390 1061830 -153709 -1578417 -3528611 -6208642
12646f208642r60981K957091M583927J769874j716221j882828P5808R05500M31698
$$ -6208642 -7169623 -4212532 371395 2141269 425048 -1457780 -1381972 -476472 -44774
12637d4774N48968J616556K488899K294105N73957k329085m193160k919644j77362
$$ -44774 504194 2120750 4609649 6903754 7477711 5148626 955466 -1964178 -2141540
12628b141540L62158j026468k68929L289580M823299J420422l332105n081530
$$ -2141540 -1779382 -2805850 -3074779 214801 5038100 6458522 3126417 -1955113
12620a955113m359089l117727m15405M021907O214875L240041j115097j504487
$$ -1955113 -6314202 -9431929 -9847334 -5825427 389448 3629489 2514392 1009905
12612A009905P94436O49884k031433k677192n84458l44864l616802n423307j434716
$$ 1009905 1804341 2454225 422792 -2254400 -2838858 -3183722 -6800524 -12223831 -13658547
12603a3658547N167080P412139L045358l330286n771409k930550J460715L282165
$$ -13658547 -8491467 -1079328 1966030 -1364256 -7135665 -10066215 -8605500 -5323335
12595e323335K539905K254644L163144K201074k195894o070746m515278J264564
$$ -5323335 -2783430 -528786 2634358 4835432 2639538 -3431208 -7946486 -6681922
12587f681922N163497M003230N89250j282702j419934j624071k154521j675912
$$ -6681922 -1518425 2484805 3074055 1791353 371419 -1252652 -3407173 -5083085
12579e083085M17619K916634L790259K119596o43296j871804p53490Q72750J306866
$$ -5083085 -4665466 -1748832 2041427 4161023 3517727 1645923 892433 1765183 3072049
12570C072049J002068O77281l91377k166450k226259O52539L185340J563063k527693
$$ 3072049 4074117 4751398 4360021 2193571 -32688 619851 3805191 5368254 2840561
12561B840561l941606j406570J487504K317493K145978J536817o00009k919388
$$ 2840561 -1101045 -2507615 -1020111 1297382 3443360 4980177 4380168 1460780
12553A460780j657842K858143M647913M08583m946830n245163j729874K92276
$$ 1460780 -197062 2661081 7308994 7717577 2770747 -2474416 -4204290 -3912014
12545c912014M21331K480669O164910O200057R53496l958781l341074O16562K260562
$$ -3912014 -3490683 -1010014 5154896 11354953 12308449 8349668 5008594 5625156 7885718
12536G885718J91694k535468l811035m143682l791544k074197R4136M14710p91844
$$ 7885718 8077412 5541944 1730909 -2412773 -6204317 -8278514 -8184378 -7769668 -8561512
12527h561512J16043M447680P373847L615230m025741o569831o40831O105073
$$ -8561512 -8445469 -3997789 3376058 6991288 2965547 -3604284 -4245115 1859958
12519A859958M790817k678224o454902k172171M294596O060622L342369j37072
$$ 1859958 6650775 3972551 -2482351 -4654522 -359926 5700696 9043065 8905993
12511H905993l396536o443918o440321j391271M571777N511280K286219R46642
$$ 8905993 5509457 -934461 -7374782 -8766053 -4194276 1317004 3603223 4549865
12503D549865K806268K688016j592407m719683k283227J973533K151641p62336
$$ 4549865 7356133 10044149 8451742 3732059 1448832 3422365 5574006 4811670
12495D811670j485648O24745J246498j279617l616510l070756q84806R36934K032177
$$ 4811670 3326022 3950767 5197265 3917648 301138 -2769618 -3654424 -2717490 -685313
12486f85313J862325o73727m224993m936604j442179K683385L474928J487712
$$ -685313 1177012 503285 -3721708 -8658312 -10100491 -7417106 -3942178 -2454466
12478b454466K11697J258017L019252L054692M83611l101559m535059k276574
$$ -2454466 -2242769 -984752 2034500 5089192 5572803 2471244 -2063815 -4340389
12470d340389J080713J677940M6876O62694M605394O565364K208922m664823o662632
$$ -4340389 -3259676 -1581736 -1534860 -872166 3733228 10298592 12507514 7842691 1180059
12461A180059k744589J074698N76239j828848k184363p40192r2672l50091N06845
$$ 1180059 -1564530 -489832 86407 -1742441 -3926804 -4666996 -4759668 -5109759 -4602914
12452d602914K344534K175510j327285m740450l484495J945474N804756M208567
$$ -4602914 -2258380 -82870 -1410155 -6150605 -9635100 -7689626 -1884870 2323697
12444B323697J06095j312952k57909j150054m273670m195792J358126O357407
$$ 2323697 2429792 1116840 858931 -291123 -4564793 -8760585 -7402459 -1045052
12436a045052M589762r61450k591932N26295J794084j980324n800530m521725
$$ -1045052 3544710 2583260 -8672 517623 2311707 331383 -5469147 -9990872
12428i990872k28853J799899O80225m28505L2358O23801L18936J2100M03883P42112
$$ -9990872 -10219725 -8419826 -7739601 -8168106 -8135748 -7511947 -7193011 -7180911 -6777028 -6034916
12418f034916M23820L94692J918652M423142N511344L573333m4343k414447k543168
$$ -6034916 -5611096 -5216404 -3297752 1125390 6636734 10210067 10165724 7751277 5208109
12409E208109k090361k161779j487918O62067J923845P499k956627k700882R25472
$$ 5208109 3117748 955969 -531949 130118 2053963 2061462 -895165 -3596047 -2670575
12400b670575L476661K113999r12195j980243o21609R19933O95860j279694k888180
$$ -2670575 806086 2920085 2007890 27647 -593962 325971 1021831 -257863 -3146043
12391c146043j470147K577692M569459R78763m597675n229746m42229L015298
$$ -3146043 -4616190 -2038498 2530961 3509724 -1087951 -6317697 -6759926 -3744628
12383c744628J368190j109531o7104J795212L38574k246029j506808R48891K80461
$$ -3744628 -2376438 -3485969 -3553073 -1757861 -1419287 -3665316 -5172124 -4223233 -3942772
12374c942772k426740j451795L358367N421723K093354q19738J326212M327950
$$ -3942772 -6369512 -7821307 -4462940 958783 3052137 2232399 3558611 7886561
12366G886561K335532k111095j958653K908722N204163J209455m272051n740928
$$ 7886561 10222093 8110998 6152345 9061067 14265230 15474685 11202634 5461706
12358E461706m201906l275530k665107j99401K542613K133904l81747o19444J729933
$$ 5461706 1259800 -2015730 -4680837 -4880238 -2337625 -203721 -585468 -1204912 525021
12349E25021K369007L57998K93723L631250M286142j749629p836297n257418L021472
$$ 525021 2894028 3252026 3545749 7176999 11463141 9713512 1877215 -3380203 -358731
12340c58731N883527K32913n455022m721287j197120j7561L55469K593787L837664
$$ -358731 5524796 5757709 302687 -4418600 -5615720 -5633281 -5277812 -2684025 1153639
12331A153639J033551k296884j399982J516239J215272j505773j668371J085943
$$ 1153639 2187190 -109694 -1509676 6563 1221835 -283938 -1952309 -866366
12323h66366K559132J665546J204759J482470j23348l051896l522089j327907
$$ -866366 1692766 3358312 4563071 6045541 5922193 2870297 -651792 -1979699
12315a979699l90001j455186o81549K720437L985740Q28783k098913o35633K292868
$$ -1979699 -2369700 -3824886 -4506435 -1785998 2199742 3028525 929612 293979 2586847
12306B586847J989274n42086j374907m03343j83052o61173j28291N39921m19341
$$ 2586847 4576121 4034035 2659128 2255785 2072733 1411560 1283269 1823190 1403849
12297A403849j255088Q26974L728221K499515k528756n107664j965867K503441
$$ 1403849 148761 975735 4703956 7203471 4674715 -432949 -2398816 104625
12289A04625K886586J28633j010313P68643K210840O56258k725203m806880l703495
$$ 104625 2991211 3119844 2109531 2878174 5089014 5745272 3020069 -1786811 -5490306
12280e490306j42273L030808L036618Q5374k376715j634498Q01792J431111j66538
$$ -5490306 -5632579 -2601771 434847 520221 -1856494 -3490992 -2689200 -1258089 -1424627
12271a424627j031956K99742J620201J018485J94196J351872K896800J549403
$$ -1424627 -2456583 -2156841 -536640 481845 676041 2027913 4924713 6474116
12263F474116k202253m309620k929467o50353q6727k94957P76582K620361K999314
$$ 6474116 4271863 -37757 -2967224 -3617577 -3704304 -3999261 -3222679 -602318 2396996
12254B396996J135479j432535k338464k32169L452648M550481M15902n577611
$$ 2396996 3532475 2099940 -238524 -470693 2981955 7532436 7948338 2370727
12246B370727p035666k920238R97685P60005l45364J793790M848810M126851M25866
$$ 2370727 -4664939 -7585177 -6587492 -5827487 -6172851 -4379061 469749 4596600 5022466
12237E022466j848315j927386k129698k060559J65822K240557K57600l453915
$$ 5022466 3174151 1246765 -882933 -2943492 -2777670 -537113 -279513 -3733428
12229c733428k589801K546800M628919J091613j881452j57037J868449K60692
$$ -3733428 -6323229 -3776429 852490 1944103 62651 -94386 1774063 2034755
12221B034755r37145K270476N149632J757078l969523l828879J055786J949214
$$ 2034755 1097610 3368086 8517718 10274796 6305273 2476394 3532180 5481394
12213E481394l081734n967775j364143N530012O928033K102084m142536p752028
$$ 5481394 2399660 -3568115 -4932258 597754 7525787 9627871 5485335 -2266693
12205b266693p064173k332367L093322M291183M81332l274907k503502J078619
$$ -2266693 -9330866 -11663233 -8569911 -4278728 -3797396 -7072303 -9575805 -8497186
12197h497186K786721J304988r39432j770906q85565J080895K674776K119060
$$ -8497186 -5710465 -4405477 -5344909 -7115815 -8001380 -6920485 -4245709 -2126649
12189b126649j02932o71083K060394M554435K394501k837296m963826j856968
$$ -2126649 -2229581 -2900664 -840270 3714165 6108666 3271370 -1692456 -3549424
12181c549424J387115j15045l749956l056087K861183P552863N488556r89426
$$ -3549424 -2162309 -2277354 -6027310 -9083397 -6222214 1330649 6819205 5829779
12173E829779m845425k738003J967370L968274J804096j469461k181778j6738
$$ 5829779 984354 -1753649 213721 4181995 5986091 4516630 2334852 2318114
12165B318114J793512M68677k364087k335554J371371L853800R57787m261178
$$ 2318114 4111626 4580303 2216216 -119338 1252033 5105833 6063620 1802442
12157A802442n337469j462416J934350J624574K93963M57430K12239j887610k748633
$$ 1802442 -3535027 -4997443 -3063093 -1438519 -1144556 -687126 -474887 -2362497 -5111130
12148e111130L4582K879935J406960k062741k030835J104610J850718j074995
$$ -5111130 -5076548 -2196613 -789653 -2852394 -4883229 -3778619 -1927901 -3002896
12140c002896k656766J57260L727878L476311J29646k278256j724063N66465K154514
$$ -3002896 -5659662 -5502402 -1774524 1701787 1831433 -446823 -2170886 -1604421 550093
12131E50093J361129j155985k447992o97810J896952K113713N69213J66995P07947
$$ 550093 1911222 755237 -1692755 -2390565 -493613 1620100 2189313 2356308 3064255
12122C064255m51583k784265k818571m06744N98283r78435j663717L77179K454766
$$ 3064255 2612672 -171593 -2990164 -3396908 -2798625 -3777060 -5440777 -5063598 -2608832
12113b608832K657984K581530K637210N15148l034340l155481R85172L475816
$$ -2608832 49152 2630682 5267892 5783040 2748700 -406781 578391 4054207
12105D054207J078712j475018m42720K24865k439432k943837K714056O881835
$$ 4054207 5132919 3657901 3215181 3440046 1000614 -1943223 770833 7652668
12097G652668J152217q124597q062695M33453M526339N02796j906549J953575
$$ 7652668 8804885 680288 -7382407 -6948954 -2422615 -1919819 -3826368 -1872793
12089a872793L863592j332060n623272j648343M556717L979365r40401k110671
$$ -1872793 1990799 658739 -4964533 -6612876 -2056159 1923206 982805 -1127866
12081a127866P02135J950481Q42752L96032j83208l182313n470967k614692K359576
$$ -1127866 -425731 1524750 2367502 2763534 2580326 -601987 -6072954 -8687646 -6328070
12072f328070K731291r81398k022454J611643M986268M655029K011227j539231
$$ -6328070 -3596779 -4578177 -6600631 -4988988 -2720 4652309 6663536 5124305
12064E124305n674284p450037l521563L436090O904850N361567K816080J070491
$$ 5124305 -549979 -8000016 -11521579 -8085489 -1180639 4180928 6997008 8067499
12056H067499j437547l424071j527511K150686J720694k149601k578238J056987
$$ 8067499 6629952 3205881 1678370 3829056 5549750 3400149 821911 1878898
12048A878898J142192m144162n644674J719956Q741646N375848l746494p177046
$$ 1878898 3021090 -1123072 -6767746 -5047790 3693856 9069704 5323210 -1853836
12040a853836l758140j087321j214135O12880M614603M971470L83720l183398
$$ -1853836 -5611976 -6699297 -7913432 -7300552 -2685949 2285521 2669241 -514157
12032e14157k067984M98125J189267J043031J118566K615k125833k475075o65896
$$ -514157 -2582141 -2084016 -894749 148282 1266848 1269463 -856370 -3331445 -3997341
12023c997341L98552K31224J730401M670977M337685n40098m352459k752205J048882
$$ -3997341 -3598789 -3367565 -1637164 3033813 7371498 6831400 2478941 -273264 775618
12014G75618K241523J694058K317267K512981p07778m848627m474631L78939L889287
$$ 775618 3017141 4711199 7028466 9541447 8833669 3985042 -489589 -110650 3778637
12005C778637K557510j001472k887937k519778j352678k29592N00552L29978n95806
$$ 3778637 6336147 5334675 2446738 -73040 -1425718 -1655310 -1154758 -824780 -1420586
11996a420586j174917o18140O44995J468225R54413n94907j264318P56023M180922
$$ -1420586 -2595503 -3213643 -2568648 -1100423 -146010 -740917 -2005235 -1249212 2931710
11987B931710M999754J440027k994863l667232q02856J279298K81872j628512
$$ 2931710 7931464 9371491 6376628 2709396 1906540 3185838 3467710 1839198
11979A839198j674962j07192R55840M83624p09931j130986J3977J816123K084175
$$ 1839198 164236 57044 1012884 1496508 786577 -344409 -330432 1485691 3569866
11970C569866j60603k860886l068886p64944J260173J392005Q52286P68096J09919
$$ 3569866 3409263 548377 -2520509 -3285453 -2025280 -633275 219011 987107 1097026
11961A097026j775464k767717q19330K035627J841832j133989k012947J479566
$$ 1097026 -678438 -3446155 -4265485 -2229858 -388026 -1522015 -3534962 -2055396
11953b055396M738990K372418l552697n621851j093418M636874N802421L340806
$$ -2055396 2683594 5056012 1503315 -4118536 -5211954 -575080 5227341 8568147
11945H568147J626656J637323J182936k79488j313662j968672l554509n279033
$$ 8568147 10194803 11832126 13015062 12735574 11421912 9453240 5898731 619698
11937F19698m779028j969742R62767L097767M724582M370566M92152l872022l472156
$$ 619698 -4159330 -6129072 -5166305 -2068538 2656044 7026610 7518762 3646740 174584
11928A74584J105143L237783o8629l927494l588738r29325O92410K266484M914893
$$ 174584 1279727 4517510 4448881 521387 -3067351 -3996676 -3304266 -1037782 3877111
11919C877111N213986Q66191l376580k265681J173842Q44820j738429o84530K527246
$$ 3877111 9091097 9957288 6580708 4315027 5488869 6333689 4595260 3910730 6437976
11910F437976P16853n453246o356223J184292P349958L749851l853755m652447
$$ 6437976 7154829 1701583 -4654640 -3470348 3879610 7629461 3775706 -876741
11902h76741J282736M727694J871041j542466o02116J756080O81755k798579l865633
$$ -876741 405995 5133689 7004730 5462264 4860148 6616228 7297983 4499404 633771
11893F33771j412709O33258l07030j238208J635452N826219M826963j900104o476152
$$ 633771 -778938 -145680 -452710 -1690918 -55466 5770753 10597716 8697612 2221460
11884B221460l435989J978929J959719j664939j317928K842119L312428q93986
$$ 2221460 -1214529 764400 2724119 1059180 -258748 2583371 5895799 5001813
11876E001813j786420L278392N778595K61199n709244l954012P33540l66278m254732
$$ 5001813 3215393 6493785 12272380 12533579 6824335 2870323 3603863 3237585 -1017147
11867a017147j822230N195263O191334m32365m450414o75816L366187P03690m491405
$$ -1017147 -2839377 2355886 8547220 8114855 3664441 2988625 6354812 7058502 2567097
11858B567097n237768k343903m07090J87375R88565O13613j695714k304498R41914
$$ 2567097 -2670671 -5014574 -5421664 -5234289 -4245724 -3632111 -5327825 -7632323 -6690409
11849f690409L342754K79926m295277l485187J412022L337375J371872J504179
$$ -6690409 -3347655 -3067729 -7363006 -10848193 -9436171 -6098796 -4726924 -3222745
11841c222745N161307N813036J5576n715439m127187K001258M283260Q52799k141000
$$ -3222745 1938562 7751598 7767174 2051735 -2075452 -74194 4209066 5061865 2920865
11832B920865m54143K465297J237316l589373o230138l109132K561097M333247
$$ 2920865 2466722 4932019 6169335 2579962 -3650176 -6759308 -4198211 135036
11824A35036J51066m720155l640453K896803P146735L774357k927344m597554
$$ 135036 286102 -4434053 -8074506 -5177703 1969032 5743389 2816045 -1781509
11816a781509m5975L629767J600329k093946j441280K230998K918943k34482j868311
$$ -1781509 -1827484 1802283 3402612 1308666 -132614 2098384 5017327 4782845 2914534
11807B914534O01346K860720Q90460k720882l381551j620410r99806j484398j24880
$$ 2914534 3515880 6376600 7267060 4546178 1164627 -455783 -1455589 -2939987 -3064867
11798c064867K798484L654251J606702j24328q2807p14961k773249k480406K201379
$$ -3064867 -266383 3387868 4994570 4870242 4787435 4072474 1299225 -1181181 1020198
11789A020198O375499M109395k556745n612646j758350L618691M212513N72051
$$ 1020198 7395697 11505092 8948347 3335701 1577351 5196042 9408555 9980606
11781I980606k183489j635413Q9827O17324K63645J42944k40572j802305l423707
$$ 9980606 7797117 6161704 6251531 6868855 7132500 7275444 7034872 5232567 1808860
11772A808860k801341Q1026K154098J043319j567319k010585M06063K433245J287413
$$ 1808860 -992481 -911455 1242643 2285962 718643 -1291942 -885879 1547366 2834779
11763B834779j625049k566854k11747K775064K888287k83422l567893l437834
$$ 2834779 1209730 -1357124 -1568871 1206193 4094480 3811058 243165 -3194669
11755c194669L79665M506196N182481J966397j865086k605162J54817L108013
$$ -3194669 -2815004 1691192 6873673 8840070 6974984 4369822 4524639 7632652
11747G632652K855194k0120j477282O13887L081796J653600k424218l601883l07374
$$ 7632652 10487846 10467726 8990444 9604331 12686127 14339727 11915509 8313626 8006252
11738H006252K312553J56434l532223l569374j097818j018660l186801k594807
$$ 8006252 10318805 10475239 6943016 3373642 2275824 1257164 -1929637 -4524444
11730d524444J716946M360178J982175j583323j492378J087515J587907j299547
$$ -4524444 -2807498 1552680 3534855 1951532 459154 1546669 3134576 1835029
11722A835029m748483n571522k606918K642029O120196M515759o2000j836946
$$ 1835029 -2913454 -8484976 -11091894 -8449865 -2329669 2186090 2124090 287144
11714B87144O13504K161493n84980l554455j938481J669145J545674j751977k670121
$$ 287144 900648 3062141 2477161 -1077294 -3015775 -1346630 199044 -1552933 -4223054
11705d223054J67410K526527K039850R70277P86402k91389k665889l280841n30463
$$ -4223054 -4055644 -1529117 510733 1481010 2267412 1976023 -689866 -3970707 -4501170
11696d501170K637413K923654R52980o92795j042409m93636N88556J316651L95783
$$ -4501170 -1863757 1059897 2012877 1320082 277673 -215963 372593 1689244 2085027
11687B085027j786478l021395k141303r6110K158669M235723M500274J168795
$$ 2085027 298549 -2722846 -4864149 -4960259 -2801590 1434133 5934407 7103202
11679G103202l736201n202033j774690K091794K271926J86735o49746M7259N38507
$$ 7103202 3367001 -1835032 -3609722 -1517928 753998 940733 290987 338246 876753
11670H76753O67797Q33547j74513k728494l973392j731181J191530Q82567j088436
$$ 876753 1544550 2378097 2203584 -524910 -4498302 -6229483 -5037953 -4155386 -5243822
11661e243822J23678M537199O692215L679624j045432l363500l627729l804448
$$ -5243822 -5120144 -582945 6109270 9788894 8743462 5379962 1752233 -2052215
11653b052215l249551o34815K276397K310156m31237k285606n13794L571879O105512
$$ -2052215 -5301766 -5936581 -3660184 -1350028 -1781265 -4066871 -4580665 -1008786 5096726
11644E096726M425015n05026m845472n363518k470013O75206J946225J944660
$$ 5096726 9521741 9016715 4171243 -1192275 -3662288 -2987082 -1040857 903803
11636I03803J822424J251632l37294j913351j863987k89853J027193P70411o11622
$$ 903803 2726227 3977859 3640565 1727214 -136773 -426626 600567 1370978 759356
11627G59356j530851p33233J367062K563165J003095k135742l459268j633755
$$ 759356 -771495 -1504728 -137666 2425499 3428594 1292852 -2166416 -3800171
11619c800171P44739Q79231l93431o46827j59092r63199k295130q86743L461969
$$ -3800171 -3055432 -2176201 -2569632 -3216459 -3375551 -4338750 -6633880 -7520623 -4058654
11610d058654O352702M731143J177960l73834m31987j860879l995521l414545
$$ -4058654 2294048 7025191 8203151 7829317 7397330 5536451 1540930 -1873615
11602a873615j41751J658964J98768j101018M97349K170741O8948l969430m648621
$$ -1873615 -2015366 -356402 -157634 -1258652 -761303 1409438 1478386 -2491044 -7139665
11593g139665j087611K067149J800708P62920K296605M843726M434171R33143
$$ -7139665 -8227276 -6160127 -4359419 -3596499 -1299894 3543832 7978003 8911146
11585H911146j678958j048132N83291P8245k223364l522204k568702o22128J081288
$$ 8911146 7232188 6184056 6767347 6845592 4622228 1100024 -1468678 -2090806 -1009518
11576a009518K633490L805717L124783L1905l253309l845395j807993k3911l97331
$$ -1009518 1623972 5429689 8554472 8586377 5333068 1487673 -320320 -344231 -741562
11567g41562j670715j451687P67397L219522L752317J760600j153005k411082
$$ -741562 -2412277 -3863964 -3096567 122955 3875272 5635872 4482867 2071785
11559B071785j081299R20274J129804m61829k019501k748962l118701k748389
$$ 2071785 990486 1910760 3040564 2578735 559234 -2189728 -5308429 -8056818
11551h056818q49327J244983J180316l27315q4382K006990K238629k42269r37224
$$ -8056818 -8906145 -7661162 -6480846 -6808161 -6892543 -4885553 -2646924 -2889193 -3826417
11542c826417K519825N198760K140114l246398m216533j126460K63979r25466
$$ -3826417 -1306592 3892168 6032282 2785884 -1430649 -2557109 -2293130 -3218596
11534c218596q0163L442252M477924J245851j392841n63866P7011j898280k486072
$$ -3218596 -3298759 143493 4621417 5867268 4474427 3910561 3987572 2089292 -396780
11525c96780J196507M481182K381797j945431k671329q78121j312632k972204
$$ -396780 799727 5280909 7662706 5717275 3045946 2167825 855193 -2117011
11517b117011j136551L079925L690760Q5455j837419K79466J865013R9818j489594
$$ -2117011 -3253562 -173637 3517123 3602578 1765159 2044625 3909638 4009456 2519862
11508B519862l83284j27768l416511n868449k446315M017364O736184M678956
$$ 2519862 2136578 2008810 -1407701 -7276150 -9722465 -5705101 1031083 5710039
11500E710039K314906J335491r14043m641803n473281j339488L135280K521481
$$ 5710039 8024945 9360436 8446393 3804590 -1668691 -3008179 127101 2648582
11492B648582j832560l667267k35415M382921M846656J071730k314817j958306
$$ 2648582 816022 -2851245 -3086660 1296261 6142917 7214647 4899830 2941524
11484B941524O31390J699698k5143k371001k831483j297198L87900O40714l57830
$$ 2941524 3572914 5272612 5247469 2876468 44985 -1252213 -864313 -223599 -581429
11475e81429r28158J90015J874067J478348j423143l482880j745699J720503K333537
$$ -581429 -1509587 -1319572 554495 2032843 609700 -2873180 -4618879 -2898376 -564839
11466e64839j99870j319520J260936L822475K411606j040283j917569J3671Q82449
$$ -564839 -764709 -2084229 -823293 2999182 5410788 4370505 2452936 2466607 3349056
11457C349056q45847k276761q28353K141784L412735J503238k359602n207142
$$ 3349056 2503209 226448 -601905 1539879 4952614 6455852 4096250 -1110892
11449a110892m305688l4042L530637L074198N18442K09525K215401K376981n59399
$$ -1110892 -5416580 -5450622 -1919985 1154213 1672655 1882180 4097581 6474562 5915163
11440E915163k452552l84315K374045J221097k916464n104943k902514J730423
$$ 5915163 3462611 3078296 5452341 6673438 3756974 -1347969 -4250483 -2520060
11432b520060N482131N987897K718886j860389l771707k479389j900716l883787
$$ -2520060 2962071 8949968 11668854 9808465 6036758 3557369 1656653 -2227134
11424b227134m355126k16630L851521J895614k903195k415452L045287M772204
$$ -2227134 -6582260 -6798890 -2947369 -1051755 -3954950 -6370402 -3325115 1447089
11416A447089J23441k797169J416840O377032M224782k279304n254560l747568
$$ 1447089 1570530 -1226639 190201 6567233 10792015 8512711 3258151 -489417
11408d89417k461592k400338q19318J798489K240651P80778L12673N31678o61328
$$ -489417 -2951009 -5351347 -6170665 -4372176 -2131525 -1350747 -1038074 -506396 -1167724
11399a167724j418511J459366N233092L973445j629466m749712l107818j432833
$$ -1167724 -2586235 -1126869 4106223 8079668 6450202 1700490 -1407328 -2840161
11391b840161k176367j871451R25412J961292q96405l212726j453384J401018
$$ -2840161 -5016528 -6887979 -5962567 -4001275 -4897680 -8110406 -9563790 -8162772
11383h162772J941116J960589L373127L389477J08668k421722o28828J766593
$$ -8162772 -6221656 -4261067 -887940 2501537 2610205 188483 -440345 1326248
11375A326248l68847m803853n554467k157717J094285K583681L562215L069888
$$ 1326248 957401 -3846452 -9400919 -11558636 -10464351 -7880670 -4318455 -1248567
11367a248567n59161m243727k780163L086684O742591M198449j856727o352084
$$ -1248567 -1807728 -6051455 -8831618 -5744934 997657 5196106 3339379 -3012705
11359c012705o380041k214260K576118L327612L3016j441618K243443N863257
$$ -3012705 -9392746 -11607006 -9030888 -5703276 -5670260 -7111878 -4868435 994822
11351I94822L494474j420299j394882K584407K846212j891064m806424k770243
$$ 994822 4489296 3068997 1674115 4258522 7104734 5213670 407246 -2362997
11343b362997l49507l08639N98643L455420L701373k24816k963925j449563j91910
$$ -2362997 -2712504 -3021143 -2422500 1032920 4734293 4509477 1545552 95989 -95921
11334i5921k323998l280062L34350L080382l58746m894919k566444M318332O865506
$$ -95921 -2419919 -5699981 -5365631 -2285249 -2643995 -7538914 -10105358 -5787026 1078480
11325A078480L380792J94094L24951M27333j070773j262548O16619J185299o71152
$$ 1078480 4459272 4653366 4978317 5405650 4334877 3072329 3688948 4874247 4203095
11316D203095j630635j01542R76075m85461k408926k511035j204946Q68148L699458
$$ 4203095 2572460 2470918 3446993 2961532 552606 -1958429 -3163375 -2295227 1404231
11307A404231N125643K300369k473525l046658J073201K677345j925529n925807
$$ 1404231 6529874 8830243 6356718 3310060 4383261 7060606 5135077 -790730
11299g90730k123100N135618N879940n27370m921544k412113J585853J469196
$$ -790730 -2913830 2221788 8101728 7574358 2652814 240701 1826554 3295750
11291C295750j10980J558183M390332K987746k081871m817510k798701r375Q4558
$$ 3295750 3184770 4742953 9133285 12121031 10039160 5221650 2422949 2413574 2498132
11282B498132o54355P46110L139554L312985R88806j345275k423328l121621l820239
$$ 2498132 1843777 2589887 5729441 9042426 10031232 8685957 6262629 3141008 -679231
11273f79231l487865j703242M12896J752655K162736J561173k07376k092043k089387
$$ -679231 -4167096 -5870338 -5457442 -3704787 -1542051 19122 -188254 -2280297 -4369684
11264d369684J72188K315520J902711m97665k098120j338606N97263J687200J401351
$$ -4369684 -4197496 -1881976 20735 -476930 -2575050 -3913656 -3316393 -1629193 -227842
11255b27842N83208k33662j173560j582989J95255M146827O650665L748833l273871
$$ -227842 355366 121704 -1051856 -2634845 -2439590 1707237 8357902 12106735 8832864
11246H832864q143937o792648k060207O83734M36987K67085J677599K805768J967108
$$ 8832864 688927 -6103721 -8163928 -7480194 -7043207 -6776122 -5098523 -2292755 -325647
11237c25647j01429j806256k062225j48920L232771M904743K196554k741645m622154
$$ -325647 -427076 -2233332 -4295557 -4444477 -1211706 3693037 5889591 3147946 -1474208
11228a474208j580684K844457M817717M081663J940996j033959l723397m186990
$$ -1474208 -3054892 -210435 4607282 8688945 10629941 9595982 5872585 1685595
11220A685595k622847j685677k083396j141667K065257L839524J394762j990639
$$ 1685595 -937252 -2622929 -4706325 -5847992 -3782735 56789 1451551 -539088
11212e39088j518131J804306K951052N25761k084603k581135k069967j247823
$$ -539088 -2057219 -252913 2698139 3223900 1139297 -1441838 -3511805 -4759628
11204d759628J132359M589480N594942K187559k726235m893351l635534j271945
$$ -4759628 -3627269 962211 6557153 8744712 6018477 1125126 -2510408 -3782353
11196c782353O30743K018587K465576J342999p0610P46844L701310M988948J850002
$$ -3782353 -3151610 -1133023 1332553 2675552 2604942 3351786 7053096 12042044 13892046
11187A3892046k963181m252503j501810M82244j081660k792627q70511K344706
$$ 13892046 10928865 6676362 5174552 5656796 4575136 1782509 911998 3256704
11179C256704K055658r67323j351658K360826N479158M209026J45936l497836
$$ 3256704 5312362 4345039 2993381 5354207 10833365 15042391 15188327 11690491
11171A1690491n577673n422834k248107J787596K471669k17665j357541J030948
$$ 11690491 6112818 689984 -1558123 229473 2701142 2483477 1125936 2156884
11163B156884K591968K89599k319176j836219j115231k799975k570629L468374
$$ 2156884 4748852 5038451 2719275 883056 -232175 -3032150 -5602779 -2134405
11155b134405R400943O819102j350656m417912k91130K222102j515370n094410
$$ -2134405 7266538 14085640 12734984 8317072 8025942 10248044 8732674 3638264
11147C638264k755727J295062P15920k917913m014030j921285j37238K8523n3488
$$ 3638264 882537 2177599 2893519 -24394 -4038424 -5959709 -6096947 -6068424 -6121912
11138f121912K43549Q30720K171231L592379K995886P11660J43607J857955J298678
$$ -6121912 -5878363 -5047643 -2876412 715967 3711853 4423513 4567120 6425075 7723753
11129G723753l842443q283312o129830K81056L984891L145972J476532R27666
$$ 7723753 3881310 -4402002 -10531832 -10250776 -6265885 -3119913 -1643381 -715715
11121g15715Q5007j025266l97070J644495K593471K213546K148541J493343j917259
$$ -715715 -630708 -1655974 -2053044 -408549 2184922 4398468 6547009 8040352 6123093
11112F123093n846182n265181n27132K218005N54430n95182K141700M477626J952386
$$ 6123093 276911 -4988270 -5515402 -3297397 -2742967 -3338149 -1196449 3281177 5233563
11103E233563j984018j592658J437325J034382k707250l578465L99055L888822
$$ 5233563 3249545 1656887 3094212 4128594 1421344 -2157121 -1758066 2130756
11095B130756K882009J4666j188677j627820k754312k444572P66199L250250J160393
$$ 2130756 5012765 5027431 3838754 2210934 -543378 -2987950 -2221751 1028499 2188892
11086B188892l077518m354463k711448j874709j668923J298725N640953N421930
$$ 2188892 -888626 -5243089 -7954537 -9829246 -11498169 -10199444 -4558491 863439
11078H63439K01363k490835J555918O079070L869401k076527l849602j131644
$$ 863439 1064802 -1426033 129885 6208955 10078356 8001829 4152227 3020583
11070C020583l04628k877146l389065M63386L523876J622882k100501k850430
$$ 3020583 2715955 -161191 -3550256 -3086870 437006 2059888 -40613 -2891043
11062b891043j054212K50595P64470J578494J699806K3214j574067q30289J130979
$$ -2891043 -3945255 -3694660 -2930190 -1351696 348110 371324 -1202743 -2033032 -902053
11053i02053J906801J647323J482822L71594k609495m791525l133598M34293J502516
$$ -902053 1004748 2652071 4134893 4506487 1896992 -2894533 -6028131 -5593838 -4091322
11044d091322J38508L70950K882841L596621O91583k007222r59271J852614K451692
$$ -4091322 -3952814 -3581864 -699023 2897598 3589181 1581959 622688 2475302 4926994
11035D926994N22308j410142k100215j973611j071549O80795K165580K149457
$$ 4926994 5449302 4039160 1938945 -34666 -1106215 -425420 1740160 3889617
11027C889617Q53600r51351l041455m524833l474886J01543K691672J311124k122238
$$ 3889617 4743217 3791866 750411 -3774422 -7249308 -7147765 -4456093 -3144969 -5267207
11018e267207l146877n56512K885646M691663M543276K450671j450717m888173
$$ -5267207 -8414084 -8970596 -6084950 -1393287 3149989 5600660 4149943 -738230
11010g38230m671640j111451J661498J205926j16331O32161K237699J574430j151809
$$ -738230 -5409870 -6521321 -4859823 -3653897 -3770228 -3138067 -900368 674062 -477747
11001d77747k584978j156682J021995J568331Q00770L54805N09310K79708o02971
$$ -477747 -3062725 -4219407 -3197412 -1629081 -828311 -473506 35804 315512 -287459
10992b87459j169625p13048J21744K62378k14208j77866Q65798K041339K499201
$$ -287459 -1457084 -2170132 -2048388 -1786010 -2000218 -2178084 -1312286 729053 3228254
10983C228254K620914K887054K401836J20177k829900l932115k596436q85455
$$ 3228254 5849168 8736222 11138058 11258235 8428335 4496220 1899784 1014329
10975A014329m57223o79847o39103r85442k173829k491652n0652L959752O096814
$$ 1014329 557106 -122741 -761844 -1747286 -3921115 -6412767 -6463419 -2503667 3593147
10966C593147M732232J727753j26529o0684O83841Q22688K11088p13732j914621
$$ 3593147 8325379 10053132 9926603 9865919 10549760 11372448 11583536 10869804 8955183
10957H955183l485754m546751l693271j298708Q3437q34942j735234k13307J854475
$$ 8955183 5469429 922678 -2770593 -4069301 -3985864 -4820806 -6556040 -6769347 -4914872
10948d914872J102147j132212k97802L435860M446290O99459k382539n49000K386132
$$ -4914872 -3812725 -4944937 -5242739 -1806879 2639411 3338870 956331 407331 2793463
10939B793463J224644j903299j690786J232931K274391J296175J657663K533351
$$ 2793463 4018107 2114808 424022 1656953 3931344 5227519 6885182 9418533
10931I418533Q3863m218048m537092o28224J159747j523021l400058j244211P20137
$$ 9418533 9502396 5284348 747256 119032 1278779 -244242 -3644300 -4888511 -4168374
10922d168374q18887j860485J448257N143321L640486j124107l309956k217251
$$ -4168374 -4987261 -6847746 -5399489 -256168 3384318 2260211 -1049745 -3266996
10914c266996j078348J41340L489850O346837L623083l201197o217092k003864
$$ -3266996 -4345344 -4204004 -714154 5632683 9255766 6054569 -162523 -2166387
10906b166387L354081K905173j993327m702683k647051M12664O93981o29479r1075
$$ -2166387 1187694 4092867 2099540 -2603143 -5250194 -4837530 -4143549 -4773028 -4864103
10897d864103K503863L713475J592900j389773k036934q65112l97698p84431m94604
$$ -4864103 -2360240 1353235 2946135 1556362 -480572 -1345684 -1743382 -2527813 -3022417
10888c022417j13715j276062k432754n16924L019931L158733o63817l026202r17281
$$ -3022417 -3136132 -4412194 -6844948 -7361872 -4341941 -1183208 -1847025 -4873227 -5790508
10879e790508J905834J628238l2254l17572k16609p85822K21535L491116M728879
$$ -5790508 -3884674 -2256436 -2288690 -2606262 -2822871 -3608693 -3387158 103958 4832837
10870D832837J166553k982168k916499p20500o69857j518230j22947J364232m65468
$$ 4832837 5999390 3017222 100723 -619777 -1289634 -2807864 -2930811 -1566579 -2032047
10861b032047k510504J61123M412075K922022l329726n908671k308290R23669
$$ -2032047 -4542551 -4381428 30647 2952669 -377057 -6285728 -8594018 -7670349
10853g670349j65212j293945J172064L925966L273087J151288M12114p3777j470966
$$ -7670349 -7835561 -9129506 -7957442 -4031476 -758389 392899 805013 731236 -739730
10844g39730j484481Q77441J890710r12341l594069j617459K629372L416889M48952
$$ -739730 -2224211 -1346770 543940 -368401 -3962470 -5579929 -2950557 466332 915284
10835I15284j308950M33875K504290J790533l99389r41888N44699J523101J43089
$$ 915284 -393666 40209 2544499 4335032 3935643 2993755 3538454 5061555 5204644
10826E204644k328698l128210j515316M19070P41231N8487p9332L20253L93762
$$ 5204644 2875946 -252264 -1767580 -1348510 -607279 -548792 -628124 -307871 85891
10817H5891L33525P24073J079845Q75489P90543J150674Q21472l73879m34216
$$ 85891 419416 1143489 2223334 3098823 3889366 5040040 5861512 5487633 5053417
10808E053417J067190Q45530k867091n863942l597566J075274J654005j887149
$$ 5053417 6120607 6966137 4099046 -1764896 -5362462 -4287188 -2633183 -4520332
10800d520332l304215l10913K222825Q27915j058900Q31392M732973N669813K363498
$$ -4520332 -7824547 -8135460 -5912635 -5084720 -6143620 -5312228 -579255 5090558 7454056
10791G454056j667306k519087K25317L154026K341728j910860m683038k671412
$$ 7454056 5786750 3267663 3492980 6647006 8988734 7077874 2394836 -276576
10783b76576R49655R51010k426195m357547k661467J54070J433083Q89045r03605
$$ -276576 673079 1624089 -802106 -5159653 -7821120 -7667050 -6233967 -5344922 -6248527
10774f248527k805075k709425l24454J220819K18935K04624M131439P794171N403634
$$ -6248527 -9053602 -11763027 -12087481 -10866662 -10647727 -10443103 -6311664 1482507 6886141
10765F886141p68271l556356j878883p54808j648334j204373Q23936R48528n77569
$$ 6886141 6117870 2561514 682631 -72177 -1720511 -2924884 -2100948 -1152420 -1729989
10756a729989r3153J471230k08178l371738j725706L500440L755244k185677m868000
$$ -1729989 -1823142 -351912 -560090 -3931828 -5657534 -2157094 1598150 -587527 -5455527
10747e455527M60454N832792L562730k320465m113825j690896P95683K236875
$$ -5455527 -4995073 837719 4400449 2079984 -2033841 -3724737 -2929054 -692179
10739f92179K508365j65021m253544m124672P26309L052069m51749l181492k75713
$$ -692179 1816186 1651165 -2602379 -6727051 -6000742 -2948673 -3400422 -6581914 -6857627
10730f857627K827578R00422j116741K121185M987023K38029o841638n641732
$$ -6857627 -4030049 -3129627 -4246368 -2125183 2861840 3099869 -3741769 -9383501
10722i383501K697430P211752L806561r11579j550496J84202J595486K479921
$$ -9383501 -6686071 525681 4332242 3420663 1870167 2054369 3649855 6129776
10714F129776J969825j007779l753005k380104J653814L095703N64304k407296
$$ 6129776 8099601 7091822 3338817 958713 2612527 5708230 6272534 3865238
10706C865238l283480k668187j363096K90951J028063L39899J46850J621737K580528
$$ 3865238 581758 -2086429 -3449525 -3158574 -2130511 -1790612 -1643762 -22025 2558503
10697B558503J129044r52902j486502j062518j10378K641555N631444M036294
$$ 2558503 3687547 2734645 1248143 185625 75247 2716802 8348246 12384540
10689A2384540k085371n472196k408155R45903j069865m101651k223833J001587
$$ 12384540 10299169 4826973 2418818 3364721 2294856 -1806795 -4030628 -3029041
10681c029041q32698m853893l556390K307732N413327L769765J737278J256399
$$ -3029041 -3861739 -8715632 -12272022 -9964290 -4550963 -781198 956080 2212479
10673B212479N77408j12866N00144N49657j535067k297802J016956M002418J903996
$$ 2212479 2789887 2677021 3177165 3726822 2191755 -106047 910909 4913327 6817323
10664F817323j752319j641246m52742k675537m148575Q79760P188116N749886
$$ 6817323 5065004 3423758 2971016 295479 -3853096 -2973336 4214780 9964666
10656I964666m52291j421155K035789M10718n905380o064751J934368O974657
$$ 9964666 9512375 8091220 10127009 10537727 4632347 -1432404 501964 7476621
10648G476621L341362r39519O60803K790696m36595m964301m795149j517855N73373
$$ 7476621 10817983 9878464 10539267 13329963 12893368 7929067 3133918 1616063 2189436
10639B189436J286483J192126j221225m407525l063125K979699O343991K984309
$$ 2189436 3475919 4668045 3446820 -960705 -4023830 -1044131 5299860 8284169
10631H284169j619528j654848N60136K10992k159044l450853l386704k587869
$$ 8284169 6664641 5009793 5569929 5780921 3621877 171024 -3215680 -5803549
10623e803549P25L844180N328956K851829o17613k392454l140443l417351k167569
$$ -5803549 -5802824 -1958644 3370312 6222141 5604528 3212074 71631 -3345720 -5513289
10614e513289m36772j273434m012977l912918N89940N279656O389564M473750
$$ -5513289 -5950061 -7223495 -11236472 -15149390 -14559450 -9279794 -2890230 1583520
10606A583520J061613l098081n516449l485488P88641K245392Q13002J040172
$$ 1583520 2645133 -452948 -5969397 -9454885 -8666244 -6420852 -5607850 -4567678
10598d567678L409261L095982j209737m271847k302021K075586M768682M607932
$$ -4567678 -1158417 1937565 727828 -3544019 -5846040 -3770454 998228 5606160
10590E606160J606684l445104o688533m285507J370878M027864K249590L5653
$$ 5606160 7212844 3767740 -2920793 -7206300 -5835422 -1807558 442032 477685
10582D77685n19886o95638k10622K001788L028564l95151m569023l292162J588912
$$ 477685 -42201 -737839 -948461 1053327 4081891 3686740 -882283 -4174445 -2585533
10573b585533K973894N84783M12975K933487K535839j208968k520814l19079M74962
$$ -2585533 388361 973144 1386119 4319606 6855445 5646477 3125663 2806584 3281546
10564C281546p39535N15016L384505J804008l646273n358960j791617L91283j094056
$$ 3281546 2542011 3057027 6441532 8245540 4599267 -759693 -2551310 -2160027 -3254083
10555c254083j016378K075318L194622J616564K434192N384867M137314j207007
$$ -3254083 -4270461 -2195143 999479 2616043 5050235 10435102 14572416 13365409
10547A3365409l152107l49477M07519k477477l129983r87453k144856o118939
$$ 13365409 10213302 9863825 10271344 7793867 4663884 3676431 1531575 -4587364
10539d587364n515817o29286N88014j480573J494270P861468O532404j964384
$$ -4587364 -10103181 -10732467 -10144453 -11625026 -10130756 -2269288 4263116 2298732
10531B298732m245707K345323N095096k84101k445617K576460L125419m882925
$$ 2298732 -1946975 398348 5493444 5209343 2763726 5340186 8465605 3582680
10523C582680q403667j001764N040362J327328k614254O47268K862676j583561
$$ 3582680 -4820987 -5822751 -782389 544939 -2069315 -1422047 1440629 -142932
10515a42932l922244O10470K694018j651841k442462L145670L673189k642151
$$ -142932 -4065176 -3454706 -760688 -2412529 -4854991 -1709321 1963868 -678283
10507f78283k096343O421704N996661m816126n438766P081639Q606087o255729
$$ -678283 -2774626 3647078 9643739 4827613 -611153 6470486 15076573 8820844
10499H820844j0286234M536971Q054977r634052j3305672R846405J6697701j1562222
$$ 8820844 -1465390 3071581 11126558 1492506 -11813166 -1966761 14730940 3168718
10491C168718k1148795J6189622K4200427o2433450j55864031j12119149M8069301
$$ 3168718 -17980077 -1790455 22409972 -40023478 -195887509 -308006658 -259937357
10484b59937357J47307801R5334268k160021k0425612J7625054K3491987n459316
$$ -259937357 -112629556 -17295288 -19455309 -39880921 -22255867 1236120 -4223196
10477d223196j1450755Q868828J1232159p112599r169081P497190R881499n625887
$$ -4223196 -15673951 -6805123 4427036 -2685563 -11854644 -4357454 5524045 -101842
10469a01842r629451L034214P242508k209037l518644P462158R704151k211327
$$ -101842 -9731293 -6697079 545429 -1663608 -5182252 2279906 11984057 9772730
10461I772730r051038l256042P08195l043877k810327M222864N599253j329809
$$ 9772730 721692 -2534350 -1826155 -4870032 -7680359 -3457495 2141758 811949
10453H11949m155819N00178J808974k992290l990397R85779K996218R22640K731886
$$ 811949 -3343870 -2843692 -1034718 -4027008 -8017405 -7031626 -4035408 -3112768 -380882
10444c80882O839116L460034m702235m780318K406688L052282l754484m093209
$$ -380882 6458234 9918268 5216033 435715 2842403 5894685 2140201 -1953008
10436a953008L894806N066371n099313j1042346l641870M900963K947540k417307
$$ -1953008 1941798 7008169 1908856 -9133490 -12775360 -7874397 -4926857 -7344164
10428g344164o63705M412305M344187J141099J266821L589201L069202k34443
$$ -7344164 -8007869 -3595564 748623 1889722 3156543 6745744 9814946 9580503
10420I580503k953730l646529j978130J623207L495057N30253l151120j203124
$$ 9580503 6626773 2980244 1002114 2625321 6120378 6650631 3499511 2296387
10412B296387L820121L768187j396729m021720k560578k946351n584382l762555
$$ 2296387 6116508 9884695 8487966 4466246 1905668 -1040683 -6625065 -10387620
10404a0387620K855334N676387J342189l148582k934610j857680k925501k836084
$$ -10387620 -7532286 -1855899 -513710 -3662292 -6596902 -8454582 -11380083 -14216167
10396a4216167M1351J907192J251515J316555K428920J206911r49498J132894
$$ -14216167 -14174816 -12267624 -11016109 -9699554 -7270634 -6063723 -7013221 -5880327
10388e880327N428977M132745k068094l571586J444659L221164k269413n803323
$$ -5880327 -451350 3681395 1613301 -1958285 -513626 2707538 438125 -5365198
10380e365198j102461M365913K862719r56786m5255K477987P62726k088297p9648
$$ -5365198 -6467659 -2101746 760973 -195813 -241068 2236919 2999645 911348 831700
10371H31700M163384L693922j366247n132702n132815l145082k06122L015416
$$ 831700 4995084 8689006 7322759 2190057 -2942758 -6087840 -6293962 -3278546
10363c278546L902152J283712j628614j785900n33885q2180J68596P41591J62383
$$ -3278546 623606 1907318 278704 -1507196 -2041081 -2123261 -1954665 -1213074 -1050691
10354a050691j161626k79952K271282J714853k447741l748516J145718O105675
$$ -1050691 -2212317 -2492269 -220987 1493866 -953875 -4702391 -3556673 2549002
10346B549002M498410j215281m294385l198126r52085N91950R20390p54661l027689
$$ 2549002 7047412 5832131 1537746 -1660380 -2612465 -2020515 -1100125 -1854786 -4882475
10337d882475k288750J294887K672838K05311r61322J887396L154544j753845
$$ -4882475 -7171225 -5876338 -3203500 -2998189 -3959511 -2072115 1082429 -671416
10329f71416p382185n820353J285389N832348M967448K469469J010335j3119n60757
$$ -671416 -8053601 -13873954 -12588565 -6756217 -1788769 680700 1691035 1677916 1117159
10320A117159p758Q9572j611631k767490j097195O53728j130528l976488k578704
$$ 1117159 1109401 1198973 -412658 -3180148 -4277343 -3623615 -4754143 -8730631 -11309335
10311a1309335K275673M284464J026787k901706k920568J18438K738692L263749
$$ -11309335 -9033662 -4749198 -3722411 -6624117 -9544685 -9426247 -6687555 -3423806
10303c423806K090651L72777l73750O98291K413686K693113J219443l33314p50848
$$ -3423806 -1333155 -960378 -1334128 -635837 1777849 4470962 5690405 5357091 4606243
10294D606243o99647j380978k448402j947460R91711L670576K223857k418161
$$ 4606243 3906596 2525618 77216 -1870244 -878533 2792043 5015900 2597739
10286B597739m158467k01905L762063J870685j945616P3134N767614N234842k757808
$$ 2597739 -1560728 -1762633 1999430 3870115 1924499 1997633 7765247 13000089 10242281
10277A0242281p569935l416335J613078m20299m286358j642284L929217L048323
$$ 10242281 2672346 -743989 869089 448790 -3837568 -5479852 -1550635 1497688
10269A497688l318119n488965p40950L564309K512674l82400j039881l35160J85656
$$ 1497688 -1820431 -7309396 -8050346 -4486037 -1973363 -2355763 -3395644 -3730804 -3545148
10260c545148J040457J325058j058000l897160j955006L977603O001004M43315
$$ -3545148 -2504691 -1179633 -2237633 -6134793 -8089799 -4112196 1888808 2332123
10252B332123n974183n751468q94434J906852J872814L091126N430076M040422
$$ 2332123 -3642060 -9393528 -10287962 -8381110 -6508296 -3417170 2012906 6053328
10244F053328j810934o049297m249122J77059J484836l73135j242537M7193P23851
$$ 6053328 4242394 -1806903 -6056025 -5878966 -4394130 -4767265 -6009802 -5962609 -5238758
10235e238758k57525l41103J641372K702477M23681k581862k147405J394496L933575
$$ -5238758 -5496283 -5837386 -4196014 -1493537 -1069856 -3651718 -5799123 -4404627 -471052
10226d71052L245737P91571j427655k701316k656621j440282o62325j392500j669768
$$ -471052 2774685 3566256 2138601 -562715 -3219336 -4659618 -5321943 -6714443 -8384211
10217h384211Q68053M346082M370096M26636l296176l837834k212697K05818L370980
$$ -8384211 -7516158 -3170076 1200020 1626656 -1669520 -5507354 -7720051 -7514233 -4143253
10208d143253N471420L296587j923507l919747O0904M518089L551295o08470j980194
$$ -4143253 1328167 4624754 2701247 -1218500 -1157596 3360493 6911788 6303318 4323124
10199D323124m44390p04750l281637l416590M09669L195914J235393j808448o13900
$$ 4323124 3878734 3173984 -107653 -3524243 -3114574 81340 1316733 -491715 -1105615
10190a105615L375177M146307L49085k927630k296333r20688k400609m069261
$$ -1105615 2269562 6415869 6764954 3837324 1540991 620303 -1780306 -5849567
10182e849567j346308L725099M609282N46925k139928m70018O35908k298218m499445
$$ -5849567 -7195875 -3470776 1138506 1685431 -454497 -924515 -288607 -2586825 -7086270
10173g086270j249118L160624K319803j260452q20241K396615J573502k689076
$$ -7086270 -8335388 -5174764 -2854961 -4115413 -4935654 -2539039 -965537 -3654613
10165c654613k595970L194419O810960M223390Q87673R74348Q36669k083266l288001
$$ -3654613 -6250583 -3056164 3754796 7978186 8865859 9840207 10676876 8593610 5305609
10156E305609k37614J347179k556870n804763j970987L978457L463443j379711
$$ 5305609 5067995 6415174 3858304 -1946459 -3917446 61011 3524454 2144743
10148B144743j605237L367493N260916R51181l139579k084213Q06741J076102
$$ 2144743 539506 3906999 9167915 10119096 6979517 4895304 5702045 6778147
10140F778147j27808p0956J35029j728479m193969l950231r17953J448320O10921
$$ 6778147 6650339 6579383 6714412 4985933 791964 -3158267 -4076220 -2627900 -2016979
10131b016979j976829k606156K21104L574426L276483p48485m014945k988975
$$ -2016979 -3993808 -6599964 -6378860 -2804434 472049 -276436 -4291381 -7280356
10123g280356Q30836L401938K877067O27801q28819J09833K588105L356447M13085
$$ -7280356 -6449520 -3047582 -170515 457286 -371533 -261700 2326405 5682852 6095937
10114F095937l402217l380428L86615K987075J733603j043214k903057m036289
$$ 6095937 2693720 -686708 -300093 2686982 4420585 3377371 474314 -3561975
10106c561975l974292j156387K468893K485284j12136J010980O389754P565373
$$ -3561975 -7536267 -8692654 -6223761 -3738477 -3850613 -2839633 3550121 11115494
10098A1115494J86366p460999o147461P64542L790364J738904L81057R35854j71084
$$ 11115494 11301860 3840861 -2306600 -1542058 2248306 3987210 4368267 5304121 5133037
10089E133037k466976j933479P94894J374345m1187K21842J262015q47279m088977
$$ 5133037 2666061 732582 1527476 2901821 2860634 3082476 4344491 3497212 -591765
10080e91765k266031L905260O563576K858747j315732j583094p00774j485189
$$ -591765 -2857796 1047464 7611040 10469787 9154055 7570961 6870187 5384998
10072E384998k128904j624416k456908m537887l346869K323673P115266O996319
$$ 5384998 3256094 1631678 -825230 -5363117 -8709986 -6386313 728953 7725272
10064G725272M284439J708882j818825n835385n785677o80039L187114J510574
$$ 7725272 12009711 13718593 11899768 6064383 278706 -401333 2785781 4296355
10056D296355j259716l59185M76284l668095q101511m569686M721663Q935178
$$ 4296355 3036639 2677454 3153738 -514357 -8615868 -13185554 -8463891 471287
10048D71287M137614k088275l026239j365816j852155k610997M23226M919238
$$ 471287 4608901 2520626 -505613 -1871429 -3723584 -6334581 -5911355 -992117
10040i92117M697678n36620m141222k117308J375257Q30054k198570k096700J315745
$$ -992117 3705561 3168941 -972281 -3089589 -1714332 -884278 -3082848 -5179548 -3863803
10031c863803K165775j749907m521528j041293M270443L410033k969182o009146
$$ -3863803 -1698028 -3447935 -7969463 -9010756 -4740313 -1330280 -4299462 -10308608
10023a0308608j444931M557582M724929N52306j145648J739326M664317L489232
$$ -10308608 -11753539 -7195957 -2471028 -1918722 -3064370 -1325044 3339273 6828505
10015F828505n24680l418029l501779k069780n68369Q46219J838227J090867j419781
$$ 6828505 6303825 2885796 -615983 -2685763 -3254132 -2407913 -569686 521181 -898600
10006h98600k801609n31024L249175L924593R50468j519863j167538k83539n60706
$$ -898600 -3700209 -4231233 -982058 2942535 3893003 2373140 1205602 922063 361357
9997C61357j21680J568488J008873l141668o001257l470894J029456K146155P03419
$$ 361357 239677 1808165 2817038 -324630 -6325887 -9796781 -8767325 -6621170 -5917751
9988e917751M14977Q12883R4031O50946M084492N041022r13825p251401m972013
$$ -5917751 -5502774 -4689891 -4595860 -3944914 139578 5180600 4266775 -2984626 -7956639
9979g956639K020630K440638l227007l377580M056331P013869j98317o657026
$$ -7956639 -5936009 -3495371 -6722378 -10099958 -6043627 970242 771925 -5885101
9971e885101k750929M600979M582537k88783r68715J982972J124327l833660n918188
$$ -5885101 -8636030 -4035051 547486 258703 -710012 1272960 2397287 -1436373 -7354561
9962g354561k452471K433170N248035N663196L401783q13386l174016j457094
$$ -7354561 -9807032 -7373862 -2125827 3537369 6939152 6125766 2951750 1494656
9954A494656P14997l39529j792679M83444L951045L578601O03998l17788J45492
$$ 1494656 2209653 1870124 77445 560889 4511934 8090535 8694533 8376745 8522237
9945H522237j937114n033511l758691J576936M730157K836952p88774l132256
$$ 8522237 6585123 1551612 -2207079 -630143 4100014 6936966 6148192 3015936
9937C015936m376814m273429j692696J843962L421477L338539L586802K879180
$$ 3015936 -1360878 -5634307 -7327003 -5483041 -2061564 1276975 4863777 7742957
9929G742957j140824n867438o193931k386190P18864J705082L129677M590331
$$ 7742957 6602133 734695 -5459236 -7845426 -7126562 -5421480 -2291803 2298528
9921B298528K640373j794633l234920l75393J736192J13756j927405j201724N47073
$$ 2298528 4938901 3144268 -90652 -466045 1270147 1383903 -543502 -1745226 -1198153
9912a198153Q58527L96431O3768j076852k712296k426706J4290J589763R19731
$$ -1198153 -339626 56805 120573 -956279 -3668575 -6095281 -6080991 -4491228 -3571497
9903c571497J70717O14338M78503j246239k839455l020661k398483j098733J172170
$$ -3571497 -3400780 -2786442 -2307939 -3554178 -6393633 -9414294 -11812777 -12911510 -11739340
9894a1739340K740372K106724J719525L962780M614152j824048j0419907r247296
$$ -11739340 -8998968 -6892244 -5172719 -1209939 3404213 1580165 -8839742 -18087038
9886a8087038K996557J2741798R717878K89192l771112j598473j25036j148250
$$ -18087038 -15090481 -2348683 7369195 7658387 3887275 2288802 2163766 1015516
9878A015516j064513J82332q68817l566856l310594P79911M386186M275108J431343
$$ 1015516 -48997 133335 -735482 -4302338 -7612932 -6833021 -2446835 1828273 3259616
9869C259616j740941l462816k595256K7424J434982M10023n65494J61693L07276
$$ 3259616 1518675 -1944141 -4539397 -4511973 -3076991 -2666968 -3232462 -3070769 -2763493
9860b763493j505151j875071J623121M737127K482162k435890l636584r09187
$$ -2763493 -4268644 -6143715 -4520594 216533 2698695 262805 -3373779 -4282966
9852d282966R17530R30995K344990M687215L660203p24348l171471j521146M34985
$$ -4282966 -3365436 -2434441 -89451 4597764 8257967 7533619 4362148 2841002 3275987
9843C275987N0372n34889K79912N21941p89487j410618m81250k84990j244652
$$ 3275987 3326359 2791470 3071382 3593323 2803836 1393218 911968 626978 -617674
9834f17674m01644K645571L657980P08792j925603n33618K055735J450902j410120
$$ -617674 -1019318 1626253 5284233 5993025 4067422 3533804 5589539 7040441 5630321
9825E630321k804518k286445j760668j338395l73335m2068q14478q0867L386524
$$ 5630321 2825803 539358 -1221310 -2559705 -2933040 -2975108 -3789586 -3870453 -483929
9816d83929N542691K770764j183713j57354M260537M560379q02088m714428k438733
$$ -483929 5058762 7829526 6645813 6488459 10748996 15309375 14507287 9792859 7354126
9807G354126J491590J071646k063067k462405r2725K18710k769368m507251j764511
$$ 7354126 8845716 9917362 7854295 5391890 5299165 5517875 2748507 -1758744 -3523255
9798c523255K378292K800119r77337m743195m971807k108626J105129K694041
$$ -3523255 -1144963 1655156 677819 -4065376 -9037183 -11145809 -10040680 -7346639
9790g346639K468766J382096P04070J098830J777902J150625r45961k368908j179888
$$ -7346639 -4877873 -3495777 -2791707 -1692877 85025 1235650 289689 -2079219 -3259107
9781c259107J459728K462781Q63585j002198q11171R06543K088065J828434O51286
$$ -3259107 -1799379 663402 1526987 524789 -286382 620161 2708226 4536660 5187946
9772E187946o47251j231319m54863R29203J004804n74844j571558n34689N60022
$$ 5187946 4540695 3309376 2854513 3783716 4788520 4213676 2642118 2107429 2667451
9763B667451n37829k244388j536051P24168J074055k56984O59785M165986N121547
$$ 2667451 2129622 -114766 -1650817 -926649 147406 -109578 550207 4716193 9837740
9754I837740J000777l250820k773719p10781k556318n886424l519121L970103
$$ 9837740 10838517 7587697 4813978 4103197 1546879 -4339545 -7858666 -3888563
9746c888563P405157K588285l207698k519374J359384R51263k918436l075257
$$ -3888563 3516594 6104879 2897181 377807 1737191 2688454 -229982 -3305239
9738c305239J883486N498342L665287k37644k150500k955620m360537m462753
$$ -3305239 -1421753 4076589 7741876 7504232 5353732 2398112 -1962425 -6425178
9730f425178j475612J925719K346286J169067J958879M093157L553507l65783
$$ -6425178 -7900790 -5975071 -3628785 -2459718 -500839 3592318 7145825 6780042
9722F780042l424314k381917O98056J689226j45386j792632p75851J736282K496136
$$ 6780042 3355728 973811 1671867 3361093 3215707 1423075 647224 2383506 4879642
9713D879642L12393k357359k660385j299353j348601l330826m144264j810696
$$ 4879642 5192035 2834676 174291 -1125062 -2473663 -5804489 -9948753 -11759449
9705a1759449J443190K664586K264433K185020K171191J000603j68811O97902
$$ -11759449 -10316259 -7651673 -5387240 -3202220 -1031029 -30426 -199237 498665
9697D98665K415536J641904j917659m662134l969220j158477R68208J125551k83111
$$ 498665 2914201 4556105 2638446 -2023688 -5992908 -7151385 -6183177 -5057626 -5340737
9688e340737j616022m45706L801285P453458N874845k36521m961680m564698j540705
$$ -5340737 -6956759 -7402465 -3601180 3852278 9727123 9490602 4528922 -35776 -1576481
9679a576481J76928N58477J482026K337602J183630j172889j737694K13207J924998
$$ -1576481 -1399553 -841076 640950 2978552 4162182 2989293 1251599 1464806 3389804
9670C389804Q79828k052906l841884k724892J50598K248642K419455J684374J177354
$$ 3389804 4269632 2216726 -1625158 -4350050 -4199452 -1950810 468645 2153019 3330373
9661C330373N05993p56123j289632J46658K025074J838402L6596q73200p79117
$$ 3330373 3836366 3080243 1790611 1937269 3962343 5800745 5837341 4964141 4185024
9652D185024j717129l026099j435462K574885L462292j294769o099557m460194
$$ 4185024 2467895 -558204 -1993666 581219 4043511 2748742 -3350815 -7811009
9644g811009J769084N103083K567710j567847k522527k43715K315149K850980
$$ -7811009 -6041925 -938842 1628868 61021 -2461506 -2705221 -390072 2460908
9636B460908J049321j461261k151994j33853K548699L277363J597931j347273
$$ 2460908 3510229 2048968 -103026 -236879 2311820 5589183 7187114 5839841
9628E839841m235093n011410j643089M051648O045639J146780n637138o683717
$$ 5839841 1604748 -3406662 -5049751 -998103 5047536 6194316 557178 -6126539
9620f126539j237868M539423N661153K471059k002300m520270k476297L184758
$$ -6126539 -7364407 -2824984 2836169 5307228 3304928 -1215342 -3691639 -506881
9612e06881O616207L273084l217168n301889j861944J356702J209139K97889K8207
$$ -506881 6109326 9382410 6165242 863353 -998591 358111 1567250 1865139 1893346
9603A893346j984269n211796m311060K009684O717456M307796m63266J23778M770435
$$ 1893346 -90923 -5302719 -9613779 -7604095 -886639 3421157 2957891 3081669 7852104
9594G852104N371248q25474p758363q958407m304217J898270N561793N020934
$$ 7852104 13223352 12397878 4639515 -4318892 -8623109 -6724839 -1163046 3857888
9586C857888J606455j376897j861524q22537N5992O31685P69307o69672k946657
$$ 3857888 5464343 4087446 2225922 1403385 1459377 2091062 2860369 2190697 -755960
9577g55960k622078J192053L860087J520635k584382k891603J0288J350673M95471
$$ -755960 -3378038 -2185985 1674102 3194737 610355 -2281248 -2270960 -920287 -424816
9568d24816P01497J758528K71398k564176j286164L979536N677447J88279n996542
$$ -424816 276681 2035209 2306607 -257569 -1543733 2435803 8113250 8301529 2304987
9559B304987o074762k633758j759476k807391j189167K354345L147401J363582
$$ 2304987 -3769775 -6403533 -8163009 -10970400 -12159567 -9805222 -6657821 -5294239
9551e294239J472894L289132J616259l774574n621274q5699O398108O117537Q73898
$$ -5294239 -3821345 -532213 1084046 -2690528 -8311802 -8397501 -1999393 4118144 4992042
9542D992042j994053p14767L81578n03084n33784J027064O70019k638536m164087
$$ 4992042 2997989 2283222 2664800 2161716 1627932 2654996 3325015 686479 -3477608
9533c477608l95728M698598M669483n39794m915785m476760j264537O52043M0445
$$ -3477608 -3873336 825262 5494745 4954951 39166 -4437594 -5702131 -5050088 -5009643
9524e009643j270243j055015J007445K824183K060059m99647j228211J360739
$$ -5009643 -6279886 -7334901 -6327456 -3503273 -1443214 -1942861 -3171072 -1810333
9516a810333L958914L107045L47895o46845k65729j717257m420678l959618N95713
$$ -1810333 2148581 5255626 5603521 4956676 4690947 2973690 -1446988 -5406606 -4810893
9507d810893M398840L774009J003636l53906q39960k395286l599350j789488J897861
$$ -4810893 -412053 3361956 4365592 4011686 3171726 776440 -2822910 -4612398 -2714537
9498b714537L598979K200871M93254Q08270J988409J313684j818217m747394m201298
$$ -2714537 884442 3085313 3578567 4386837 6375246 7688930 5870713 1123319 -3077979
9489c077979l45247K796980K403780Q66442J815639L630353J767047k808488l831040
$$ -3077979 -3423226 -626246 1777534 2643976 4459615 8089968 9857015 7048527 3217487
9480C217487J18169K499244p34565m311509k546291J105359N28710k001322o7749
$$ 3217487 3335656 5834900 5100335 788826 -1757465 -652106 -123396 -2124718 -2192467
9471b192467M586758L846481l027328p006176k741935L793492M681221N21684
$$ -2192467 2394291 6240772 3213444 -3792732 -6534667 -2741175 1940046 2461730
9463B461730k755069k592368q01680P77456J450932N65051j461047k340546n87255
$$ 2461730 -293339 -2885707 -3687387 -2909931 -1458999 -893948 -2354995 -4695541 -5282796
9454e282796K047974K520273O9207l085806l887625j191316K666919L763781J406095
$$ -5282796 -3234822 -714549 -645342 -3731148 -7618773 -8810089 -6143170 -2379389 -973294
9445i73294n67312N12763J653661p33065l789274j977749L425422N351201J563304
$$ -973294 -1540606 -1027843 625818 -107247 -3896521 -5874270 -2448848 2902353 4465657
9436D465657k686954l685801l651780l987673j800078L064631M738860L32005
$$ 4465657 1778703 -1907098 -5558878 -9546551 -11346629 -8281998 -3543138 -3211133
9428c211133l964577j826881L319381L978350k4302k810160k014011q4768J756259
$$ -3211133 -7175710 -9002591 -5683210 -1704860 -1729162 -4539322 -6553333 -6638101 -4881842
9419d881842L958361M528727J216987l004275l028249L62560J845285M55710L07153
$$ -4881842 -923481 3605246 4822233 1817958 -1210291 -847731 997554 1453264 1760417
9410A760417K144935J501447k951757o059355m117799k88063J285824J478766
$$ 1760417 3905352 5406799 2455042 -3604313 -7722112 -8010175 -6724351 -5245585
9402e245585K452012K744932P60792p28853J210535L700593J745801l603136o169301
$$ -5245585 -2793573 -48641 712151 -16702 1193833 4894426 6640227 3037091 -3132210
9393c132210l420190O48500K023712J542232J640289K054928J308026j07579p80615
$$ -3132210 -6552400 -5903900 -3880188 -2337956 -697667 1357261 2665287 2557708 1777093
9384A777093j021117j815519k215474n86550J906742K054543n50353k184436m0380
$$ 1777093 755976 -1059543 -3275017 -3861567 -1954825 99718 -450635 -2635071 -2675451
9375b675451L595344M373988J615517j456527k382296j760476j062662o88795
$$ -2675451 919893 5293881 6909398 5452871 3070575 1310099 247437 -441358
9367d41358o04974q04211o11198O58777K046601J881261N38060k4049K22147r38121
$$ -441358 -1046332 -1850543 -2461741 -1802964 243637 2124898 2662958 2638909 2861056 1922935
9357A922935l933045n880227m418019n68341L425296O369979O980872L868482
$$ 1922935 -2010110 -7890337 -12308356 -12876697 -9451401 -3081422 3899450 7767932
9349G767932j244724l700606k029012n81035k764019n093136k463071L415617
$$ 7767932 6523208 2822602 793590 212555 -2551464 -7644600 -10107671 -6692054
9341f692054O236756M201157J334768K64279p07522k706614l652524k176555j40301
$$ -6692054 -455298 3745859 5080627 5344906 4637384 1930770 -1721754 -3898309 -4038610
9332d038610N50495N02010P79233J086449J103419J035558J84346k161750l999900
$$ -4038610 -3488115 -2986105 -2206872 -1120423 -17004 1018554 1202900 -958850 -4958750
9323d958750k262053K023996M015269J802982r68182r65261L72419P20832J229360
$$ -4958750 -7220803 -5196807 -1181538 621444 -346738 -1311999 -939580 -218748 1010612
9314A010612L385767M703930J930443l248236n931207m555273j927503k19167
$$ 1010612 4396379 9100309 11030752 7782516 1851309 -2703964 -4631467 -4850634
9306d850634J160777K338843J491303j619906l401888n24751M714597N987696
$$ -4850634 -3689857 -1351014 140289 -1479617 -4881505 -5406256 -691659 5296037
9298E296037P89198n314502m692479K487725P543799M055017l503610n432706
$$ 5296037 6085235 770733 -3921746 -1434021 6109778 10164795 6661185 1228479
9290A228479M44697O377601N312921q00775n257269n107922k363270M37376K227775
$$ 1228479 1673176 8050777 13363698 12562923 7305654 2197732 -165538 271838 2499613
9281B499613K357254O44381j822208l596775l850212j735605K957804P156102
$$ 2499613 4856867 5501248 3679040 82265 -3767947 -5503552 -2545748 4610354
9273D610354N693357j911012q567663p387783m90482M140365L207927O54363J16820
$$ 4610354 10303711 8392699 -174964 -7562747 -8053229 -3912864 -704937 -50574 66246
9264F6246K87641q34772j854637q68979Q47809J003155p508k34062M79982P57070
$$ 66246 353887 -480885 -2335522 -3204501 -2356692 -1353537 -1361045 -1595107 -1115125 -358055
9254c58055L39294K27496N86006L72513r40469k530498l138659k073454M12691
$$ -358055 -18761 208735 794741 1167254 226785 -2303713 -5442372 -7515826 -7103135
9245g103135L049547M203715L281911J234593o62285j901051k251961j272798
$$ -7103135 -4053588 150127 3432038 4666631 4004346 2103295 -148666 -1421464
9237a421464O35566J538337m8143k583703k590444R54449M553095L914694o53186
$$ -1421464 -785898 752439 704296 -1879407 -4469851 -3515402 1037693 4952387 4299201
9228D299201m215612l104478O54414K270691N48822j056596J27180K236751K118008
$$ 4299201 83589 -3020889 -2366475 -95784 453038 -603558 -476378 1760373 3878381
9219C878381J26426r07464k84180M8853o15817m99520J123510J889839l04206
$$ 3878381 4004807 3097343 2813163 2862016 2246199 1746679 2870189 4760028 4455822
9210D455822l682477m447624j535003K211734L395030J354999j783596l333485
$$ 4455822 773345 -3674279 -5209282 -2997548 397482 1752481 -31115 -3364600
9202c364600k183778O13845L028035L751385K773231Q98048n87611m42464R51348
$$ -3364600 -5548378 -4934533 -1906498 1844887 4618118 5516166 4928555 4486091 5437439
9193E437439J035387j870619n098178m007059J391747N361580L908677J81502
$$ 5437439 6472826 4602207 -495971 -4503030 -3111283 2250297 6158974 6340476
9185F340476p29710M67033n27030l261599k499881K717745O023765K769453k758468
$$ 6340476 5610766 6077799 5550769 2289170 -210711 2507034 8530799 11300252 8541784
9176H541784l608420j14684J853916N06412l02863R71762N37777l561747o762244
$$ 8541784 4933364 4818680 6672596 7179008 6876145 7847907 8385684 4823937 -1938307
9167a938307m456439P42285K971970J767642J374914K700517J961897j949075
$$ -1938307 -6394746 -5652461 -2680491 -912849 462065 3162582 5124479 3175404
9159C175404m557983k764463J60749K30799n84192J752952N464060M908766k38889
$$ 3175404 -1382579 -4147042 -3986293 -3755494 -4339686 -2586734 2877326 7786092 7547203
9150G547203l713745j735461J850791J936346o59897j761975m88151N64828O7505
$$ 7547203 3833458 2097997 3948788 5885134 5225237 3463262 2975111 3539939 3607444
9141C607444p42718q00518l80527Q4617K45651l82273j128210j03345K486246
$$ 3607444 2864726 2064208 1683681 1768298 2013949 1631676 503466 400121 2886367
9132B886367L068310j82739l209603j422091K575911K343745j854875k740596
$$ 2886367 5954677 5771938 2562335 1140244 3716155 6059900 4205025 1464429
9124A464429K188755N639385J412738n504180n736746J127010O436559M363175
$$ 1464429 3653184 9292569 10705307 5201127 -535619 591391 7027950 11391125
9116A1391125j877694n646521m003570J227110N611561M861698j079404o371487
$$ 11391125 9513431 3866910 -136660 1090450 6702011 11563709 10484305 4112818
9108D112818n129053Q28465L914775J022172k633615j659662J960103K784505
$$ 4112818 -1016235 -187770 3727005 4749177 2115562 455900 2416003 5200508
9100E200508J25017j911574j027039Q02119J309479P62596p2211j832675m582806
$$ 5200508 5325525 3413951 2386912 3189031 4498510 5261106 5188895 3356220 -1226586
9091a226586n820133l008954K190118M590226J472407l583069m637726n23475
$$ -1226586 -7046719 -10055673 -7865555 -3275329 -1802922 -5385991 -10023717 -10547192
9083a0547192M080415M787463K360006M37465O13556J561415J509020k89215l323253
$$ -10547192 -6466777 -1679314 680692 1118157 1731713 3293128 4802148 4512933 1189680
9074A189680n383988l813676R19220M571574M241971K152304J588858J532883
$$ 1189680 -4194308 -8007984 -7088764 -2517190 1724781 3877085 5465943 6998826
9066F998826n74588k868582j432271K247196K511993j222238l055178m23479J362453
$$ 6998826 6424238 3555656 2123385 4370581 6882574 5660336 2605158 2181679 3544132
9057C544132j786105n160914k433763L952856O175450K451941j498851j662993
$$ 3544132 1758027 -3402887 -5836650 -1883794 4291656 6743597 5244746 3581753
9049C581753j82427P2199j54041M29630N55884r03355k086411q78878J358136
$$ 3581753 3399326 3471525 3317484 3747114 4302998 3399643 1313232 434354 1792490
9040A792490J650510R97p94534J37918K47968j910701l361926q48428L330332
$$ 1792490 3443000 3443997 2649463 2787381 3035349 1124648 -2237278 -3085706 244626
9031B44626L815371M11270j259139J043240K094159j652235m602498n90204N483160
$$ 244626 4059997 4471267 3212128 4255368 6349527 4697292 94794 -495410 4987750
9022D987750L848136m254386p451486j713261L900280K166564k081854j999743
$$ 4987750 8835886 4581500 -2869986 -4583247 -682967 1483597 -598257 -2598000
9014b598000N65160J325300J979898M342845L758256k476488p033543l142656
$$ -2598000 -2032840 -707540 1272358 5615203 9373459 6896971 -136572 -3279228
9006c279228K916600J459575l797976k041251N009785N033837l547970p756213
$$ -3279228 -362628 1096947 -2701029 -4742280 267505 5301342 1753372 -6002841
8998f002841q71780P144605N832771j227588m980693l822887o73302L985088Q506574
$$ -6002841 -6874621 269984 6102755 4875167 -105526 -3928413 -4601715 -616627 7889947
8989G889947P266480p60362p220897n589296p99602k62257j894975J82335L848351
$$ 7889947 15156427 14396065 7175168 1585872 786270 524013 -1370962 -1188627 2659724
8980B659724K827414j624790k848876k15525R11623q49456j759721q56204o09220
$$ 2659724 5487138 3862348 1013472 797947 1709570 860114 -899607 -1755811 -2365031
8971b365031l35099K708416N887905L424233l305355o149358k409693J424296
$$ -2365031 -2700130 8286 5896191 9320424 6015069 -134289 -2543982 -1119686
8963a119686M86970j738618q61619J333341J521145P26600J056080J236722k36611
$$ -1119686 -632716 -2371334 -3232953 -1899612 -378467 348133 1404213 2640935 2404324
8954B404324j373581p0553K105247K837560K359468R68771k514683o371820m982525
$$ 2404324 1030743 960190 3065437 5902997 8262465 9231236 6716553 344733 -4637792
8945d637792K763111Q509408M489215m575813p240384j552364K878743j33631
$$ -4637792 -1874681 6634727 11123942 6548129 -692255 -2244619 634124 500493
8937E00493m792282l477631J633162L223939N43693p80005J216019K272454N0565
$$ 500493 -4291789 -7769420 -6136258 -2912319 -2368626 -3148631 -1932612 339842 390407
8928C90407j684620L43259L316070L081116O17205o47893r55440k557169m088472
$$ 390407 -1294213 -950954 2365116 5446232 6063437 5415544 4460104 1902935 -2185537
8919b185537k457214P00592Q98468q86787R67338O146335O737442j0177n339344
$$ -2185537 -4642751 -3942159 -3043691 -3930478 -2963140 3183195 9920637 9910460 4571116
8910D571116j966498L542343N32756q239664r870626q37574P818817O804606L06811
$$ 4571116 2604618 6146961 6679717 -1559947 -11430573 -12268147 -4449330 2355276 2662087
8901B662087k679134p81286J439916J770953J129153j52022j813662k135265p74474
$$ 2662087 -17047 -798333 641583 2412536 3541689 3389667 1576005 -559260 -1333734
8892a333734m09377k213360k912020Q54L410889L089918Q5411j776787k029388
$$ -1333734 -1743111 -3956471 -6868491 -6867637 -3456748 -366830 -281419 -2058206 -4087594
8883d087594k467722k331551K41447L615031M536822L275404K076294K00001l923337
$$ -4087594 -6555316 -8886867 -8645420 -5030389 -493567 2781837 4858131 5058132 1134795
8874A134795p041232m218467K577346N847340L345276O79173J434107J794233
$$ 1134795 -5906437 -10124904 -7547558 -1700218 1645058 2324231 3758338 5552571
8866E552571j594539m852615k963889J996710M012951J452832k358545m420732
$$ 5552571 3958032 -894583 -3858472 -1861762 2151189 3604021 1245476 -3175256
8858c175256l815081n24213L538817M458639J017689k666591k644500n29176L86304
$$ -3175256 -6990337 -7514550 -3975733 482906 1500595 -1165996 -3810496 -4339672 -3953368
8849c953368Q95395K676309K837611j595645o204840m033333L038997N984218
$$ -3953368 -3057973 -381664 2455947 860302 -5344538 -9377871 -6338874 -354656
8841c54656J989684k258116k042921o06720p91253M09013M141359M799675o54048
$$ -354656 1635028 -623088 -2666009 -3272729 -4063982 -3654969 486390 5286065 4632017
8832D632017n476724k852276K932685L377465p68700k046170R07843K641013J311487
$$ 4632017 -844707 -3696983 -764298 2613167 1844467 -201703 706140 3347153 4658640
8823D658640M06714N75234j053566l157731j067991L691491M125668j76066j573269
$$ 4658640 5065354 5640588 4587022 1429291 361300 4052791 8178459 8002393 6429124
8814F429124K074124K874848l075476p584454l746785J892604K25643m850492
$$ 6429124 8503248 11378096 8302620 718166 -3028619 -1136015 -910372 -5760864
8806e760864l188038M143009O433076N82375m979117m250884j048400j81645l01326
$$ -5760864 -8948902 -4805893 1627183 2209558 -2769559 -7020443 -8068843 -8250488 -8551814
8797h551814J110758K932412L960997N138005N432347J670201m631483o669741
$$ -8551814 -7441056 -4508644 -547647 4590358 10022705 11692906 7061423 391682
8789C91682k253389J907473K44400l251461k100256K398826M384311K842740R03008
$$ 391682 -1861707 45766 290166 -2961295 -5061551 -2662725 1721586 4564326 5467334
8780E467334j204138n046528p678649m233993L355318P548191N828120L097924
$$ 5467334 4263196 -783332 -8461981 -12695974 -9340656 -1792465 4035655 7133579
8772G133579K181993k77636n292806o750433j002429N011519K951374l650151
$$ 7133579 9315572 9037936 3745130 -3005303 -4007732 1003787 3955161 305010
8764C05010m133620K890674P324471K977167l821295m862491j609217j87380p96404
$$ 305010 -3828610 -937936 6386535 9363702 5542407 679916 -929301 -1116681 -1913085
8755a913085L89006K468008J147285k675308l634156j211093n56198k798113k434027
$$ -1913085 -1524079 943929 2091214 -584094 -4218250 -5429343 -5985541 -8783654 -11217681
8746a1217681K734886O607285M273378j05002o66557O11128j227555m186901k501165
$$ -11217681 -8482795 -1875510 2397868 2292866 1626309 2237437 1009882 -3177019 -5678184
8737e678184K691280M334956O11546k788798k245009o83539p72514m96909J613020
$$ -5678184 -2986904 1348052 1959598 -829200 -3074209 -3757748 -4530262 -5027171 -3414151
8728c414151K652112L05620k801419l143079j163858P92827K180978L202819L106780
$$ -3414151 -762039 -456419 -3257838 -6400917 -7564775 -6771948 -4590970 -1388151 1718629
8719A718629K029386J687553K117766Q37958k660572n022594l953201j469605
$$ 1718629 3748015 5435568 7553334 8391292 5730720 708126 -3245075 -4714680
8711d714680K34720K182999M775217M791701M66299m041958m053657j329237n60024
$$ -4714680 -4479960 -2296961 2478256 7269957 7736256 3694298 -359359 -1688596 -2248620
8702b248620j424442Q6772L846668N109251J936117k027167l028927j456164J74330
$$ -2248620 -3673062 -3586290 260378 5369629 7305746 5278579 2249652 793488 967818
8693I67818J96864j705641m185560m432510j345522K106147K618020J514676K225974
$$ 967818 1164682 -540959 -4726519 -9159029 -10504551 -8398404 -5780384 -4265708 -2039734
8684b039734L896819K385929k340024m950420k256385K356976L892193J660303
$$ -2039734 1857085 4243014 1902990 -3047430 -5303815 -2946839 945354 2605657
8676B605657j594708l481880l047296n96068J871316K000914J5789j436522q22732
$$ 2605657 1010949 -2470931 -5518227 -6114295 -4242979 -2242065 -2226276 -3662798 -4485530
8667d485530Q82511K293264K611264Q67713k640360m452375j431870L689995M707166
$$ -4485530 -3603019 -1309755 1301509 2169222 -471138 -4923513 -6355383 -2665388 2041778
8658B041778O32036k728824j278859K141853L102107J414180r61133l269517m289821
$$ 2041778 2673814 -55010 -1333869 807984 3910091 5324271 4363138 1093621 -3196200
8649c196200j895578K331420K769133j864726m616526q1871O281489N341711k160975
$$ -3196200 -5091778 -2760358 8775 -1855951 -6472477 -6554348 -272859 5068852 2907877
8640B907877o732133l696697J655323L094667J128469l33977J0002Q23588J021165
$$ 2907877 -3824256 -7520953 -5865630 -2770963 -1642494 -1976471 -1966469 -1142881 -121716
8631a21716O20371L78094J208317K566104K178657n58289k454519q19213J826735
$$ -121716 498655 876749 2085066 4651170 6829827 6271538 3817019 2997806 4824541
8622D824541J272418j660688k649081j019987P2232J34301J833695M431389L247713
$$ 4824541 6096959 4436271 1787190 767203 839435 973736 2807431 7238820 10486533
8613A0486533k282393o088026m050360J41485J220139l01541j008878p21939j206078
$$ 10486533 8204140 2116114 -1934246 -1792761 -572622 -874163 -1883041 -2604980 -3811058
8604c811058j773269o58931J266905K022430J971028K376143K362059O57369j359386
$$ -3811058 -5584327 -6243258 -4976353 -2953923 -982895 1393248 3755307 4412676 3053290
8595C053290j586117n34055K43139J108766K511683K336900j008304m520765l897132
$$ 3053290 1467173 933118 1176257 2285023 4796706 7133606 6125302 1604537 -2292595
8586b292595o324K118707M84637j579662o86396K332949M129771K643786j038051
$$ -2292595 -2298919 -180212 304425 -1275237 -1961633 371316 4501087 7144873 6106822
8577F106822l262632j172256L092002L658091j294623n816010l926154J651381
$$ 6106822 2844190 1671934 4763936 8422027 7127404 1311394 -2614760 -963379
8569i63379L533501M17381k351237k010209j265921j421112J17745L197647K768007
$$ -963379 2570122 2987503 636266 -1373943 -2639864 -4060976 -3943231 -745584 2022423
8560B022423k618939o192776k294994M275036M684118j006910m313975r63816
$$ 2022423 -596516 -6789292 -9084286 -4809250 -125132 -1132042 -5446017 -6409833
8552f409833L763063L767215M86774p53102J017147J994595r264k610831k669111
$$ -6409833 -2646770 1120445 1607219 854117 1871264 3865859 3856595 1245764 -1423347
8543a423347l24822J961146K577976J456034j033459l818623m582658k039626
$$ -1423347 -1748169 212977 2790953 4246987 3213528 -605095 -5187753 -7227379
8535g227379J351721J820534j19857L5636L491269N201990J379106l726712l407258
$$ -7227379 -5875658 -4055124 -4174981 -4139345 -648076 4553914 5933020 2206308 -1200950
8526a200950J496540L949016J242404j918644j529648L68250N06934m76891o31303
$$ -1200950 295590 4244606 5487010 3568366 2038718 2406968 2913902 2437011 1805708
8517A805708m42505q98692r18088L84411J507955J220460P92764J133426N04618
$$ 1805708 1363203 464511 -453577 -69166 1438789 2659249 3452013 4585439 5090057
8508E090057k173895m522780m202547k534531j484446N3790L158963M975213K737024
$$ 5090057 2916162 -1606618 -5809165 -8343696 -9828142 -9774352 -6615389 -1640176 1096848
8499A096848n00743K84627L771387L924322k11966k884304j221018O4724l060451
$$ 1096848 596105 880732 4652119 8576441 8364475 5480171 4259153 4323877 1263426
8490A263426o570550m415377J774923M994867L151929R38484J347044J371719
$$ 1263426 -5307124 -9722501 -7947578 -2952711 199218 1137702 2484746 3856465
8482C856465j590108m167913k020326K790733M443731K043913M18435J928560
$$ 3856465 2266357 -1901556 -3921882 -1131149 3312582 5356495 5774930 7703490
8474G703490K818623k6467l339661k469901J017992J607290j753185m419897l192016
$$ 7703490 10522113 10495646 7155985 4686084 5704076 7311366 5558181 1138284 -2053732
8465b053732k04857J197983O81774l13865q28852n9698K241601L746132J154949
$$ -2053732 -2258589 -1060606 -378832 -692697 -1521549 -1581247 660354 4406486 5561435
8456E561435m369524o683116k284990M239199N723801J555210k310800j659774
$$ 5561435 1191911 -5491205 -7776195 -3536996 2186805 3742015 1431215 -228559
8448b28559J314758K227150M35352j045897k24124J392085J396399N0697m89628
$$ -228559 1086199 3313349 3748701 2702804 2478680 3870765 5267164 5317861 4828233
8439D828233o1832r56623l544958m461801j642962J564790J059094j431797j164837
$$ 4828233 4766401 3809778 264820 -4196981 -5839943 -4275153 -3216059 -4647856 -5812693
8430e812693J671779K501899M51261l74143J459044K204989J08738j162740O97410
$$ -5812693 -4140914 -1639015 -1187754 -1561897 -102853 2102136 2210874 1048134 1745544
8421A745544K248291N04721j817886j640865j141608k996683m412529j635624
$$ 1745544 3993835 4498556 2680670 1039805 -101803 -3098486 -7511015 -9146639
8413i146639K953577M086663J511734p51476r86594m86061L93557J830827J890867
$$ -9146639 -6193062 -2106399 -594665 -1346141 -2332735 -2818796 -2425239 -594412 1296455
8404A296455q34587l536866k849945m36425p6551j099982q8053K474424L003414
$$ 1296455 461868 -3074998 -5924943 -6361368 -6437919 -7537901 -7625954 -5151530 -2148116
8395b148116J281578M19370R31252M59137q49274k84859J881847K148698k96506
$$ -2148116 -866538 -447168 484084 943221 93947 -190912 1690935 3839633 3543127
8386C543127k271377j989908j323628j855000k619024k495474j507612L95164
$$ 3543127 1271750 -718158 -2041786 -3896786 -6515810 -9011284 -10518896 -10123732
8378a0123732K742807L386334J351115k78138J761317N353298N531279J396897
$$ -10123732 -7380925 -3994591 -2643476 -2921614 -1160297 4193001 9724280 11121177
8370A1121177l572027o506720o299053k272081L385137M868495K35260l814127
$$ 11121177 7549150 1042430 -5256623 -7528704 -4143567 724928 960188 -2853939
8362b853939j346309K910281J754586j099015K382557P933586L825959p804023
$$ -2853939 -4200248 -1289967 464619 -634396 1748161 9681747 13507706 5703683
8354E703683j0857247l52909Q502571L709075n792556o042611Q81152M146828
$$ 5703683 -5153564 -5506473 2996098 6705173 912617 -5129994 -4248842 -102014
8346a02014K596378K269413K566637j210674n848579l983040K470406M708206
$$ -102014 2494364 4763777 7330414 6119740 271161 -3711879 -1241473 3466733
8338C466733J471630l12519J354964J124604k366262l592337o38650J190880p79828
$$ 3466733 4938363 4625844 5980808 7105412 4739150 1146813 508163 1699043 919215
8329I19215j917873Q85251L465027J819206j193409j248459N31467O55869p65321
$$ 919215 -998658 -113407 3351620 5170826 3977417 2728958 3260425 3916294 3150973
8320C150973j391493r19757l09104P41213K359610K747611P51229j582918j528678
$$ 3150973 1759480 839723 530619 1271832 3631442 6379053 7130282 5547364 4018686
8311D018686O07109K174911J300350j892561n434809n912327j153256N945306
$$ 4018686 4625795 6800706 8101056 6208495 773686 -5138641 -6291897 -346591
8303c46591Q830678M691280j823324m703255l999156l727626m399471k680686
$$ -346591 8484087 13175367 11352043 6648788 2649632 -1077994 -5477465 -8158151
8295h158151J552666L396124N81153j813463J223097N880002M420892k405900
$$ -8158151 -6605485 -3209361 -2628208 -4441671 -3218574 2661428 7082320 4676420
8287D676420n310461m37472M203780R76800n272028m828465J487136L944452l28838
$$ 4676420 -634041 -1071513 3132267 4109067 -1162961 -5991426 -4504290 -559838 -888676
8278h88676l240806N44399M959823K547875l776943n412218m45949M896363N316454
$$ -888676 -4129482 -3585083 1374740 3922615 145672 -5266546 -5712495 -816132 4500322
8269D500322J822694j429131j992799o44688J04883r36095k047416j504537j065539
$$ 4500322 6323016 4893885 2901086 2256398 2361281 1425186 -622230 -2126767 -3192306
8260c192306k985505m379959k76212P031080Q603362J622789n384697m603073
$$ -3192306 -6177811 -10557770 -10833982 -3802902 4800460 6423249 1038552 -3564521
8252c564521K70028J380303p51353Q4784M109794N108613Q01191l761698l967530
$$ -3564521 -3294493 -1914190 -2665543 -2580759 1529035 6637648 7438839 3677141 -290389
8243b90389j194664O40195P4966j440506j578760N74843K849192J946837j616830
$$ -290389 -1485053 -844858 -769892 -2210398 -3789158 -3214315 -365123 1581714 -35116
8234c5116l337937j413402K79222j100875k142945Q66418N009076N297543K657740
$$ -35116 -3373053 -4786455 -4507233 -5608108 -7751053 -6884635 -1875559 3421984 6079724
8225F079724J312777J191470n38440k739163j983350N64431O81503j455624j778520
$$ 6079724 7392501 8583971 8045531 5306368 3323018 3887449 4568952 3113328 1334808
8216A334808L99463J799444J278618N50046m39862k782891m189757j801370J440996
$$ 1334808 1734271 3533715 4812333 5362379 4922517 2139626 -2050131 -3851501 -2410505
8207b410505K97145l464004l048732J830136L790530j87500l804738j688718K654695
$$ -2410505 -2113360 -5577364 -8626096 -6795960 -3005430 -3192930 -6997668 -8686386 -6031691
8198f031691L316780O16787j213389o94834O02435J367652J043450n65501k138617
$$ -6031691 -2714911 -2098124 -3311513 -4006347 -3403912 -2036260 -992810 -1558311 -3696928
8189c696928j603398Q18041K763059L173130K650753Q30986k700148n251601l355266
$$ -3696928 -5300326 -4482285 -1719226 1453904 4104657 4935643 2235495 -3016106 -6371372
8180f371372J615230M485014K930231r31420m592689o132874l016251L978510
$$ -6371372 -4756142 -271128 2659103 1727683 -2865006 -8997880 -12014131 -8035621
8172h035621P569674K301647n414693m549203L918360P952210K810029k955240
$$ -8035621 -465947 1835700 -3578993 -8128196 -4209836 3742374 6552403 3597163
8164C597163k624916p43316k412480m176356k295811l47105j174764l69255M279293
$$ 3597163 972247 228931 -2183549 -6359905 -8655716 -9002821 -10177585 -10546840 -6267547
8155f267547N835255j07290n402048j682754M969762L898773j976888j747162
$$ -6267547 -432292 -539582 -5941630 -7624384 -2654622 1244151 -732737 -2479899
8147b479899M012458M482240j981458m992041m66324K706942j187297m936117
$$ -2479899 1532559 6014799 4033341 -958700 -1425024 1281918 94621 -4841496
8139d841496j604748L475873K437875j935894k218598N84395k7660l621324l363451
$$ -4841496 -6446244 -2970371 -532496 -2468390 -4686988 -4102593 -4130253 -7751577 -11115028
8130a1115028J914495N332576K944924o39903m64348J293813K28426k511711k418699
$$ -11115028 -9200533 -3867957 -923033 -1562936 -2027284 -733471 -505045 -3016756 -5435455
8121e435455R59741L797129M057179L135441J788523p67061l054768j648369K766007
$$ -5435455 -4475714 -678585 3378594 6514035 8302558 7535497 4480729 2832360 5598367
8112E598367M406061N31980l896235l741852j447269j694893k350886J488649
$$ 5598367 10004428 10536408 6640173 2898321 1451052 -243841 -2594727 -1106078
8104a106078O678173M692644m210048r003299l542257M163880L851307k548019
$$ -1106078 5572095 10264739 6054691 -2948608 -6490865 -2326985 1524322 -1023697
8096a023697n428582k018937J484998O80459j319519Q6364M141209O037325L024693
$$ -1023697 -6452279 -8471216 -6986218 -6305759 -7625278 -7538914 -3397705 2639620 5664313
8087E664313k129574l733477K81868M947208L715147k734088o737219l642908
$$ 5664313 3534739 -198738 83130 5030338 8745485 6011397 -725822 -4368730
8079d368730K549955N472332M068126J159025j605858l585987l223965m09592
$$ -4368730 -1818775 3653557 7721683 8880708 7274850 3688863 464898 55306
8071E5306J623552M78591j524799j071269R33843J475081M61946j20053p4743
$$ 55306 1678858 2157449 632650 -438619 495224 1970305 2432251 2312198 2237455
8062B237455l29809l12488M98697M51639j347674k330270m96444J421107K56699
$$ 2237455 1907646 1595158 2093855 2545494 1197820 -1132450 -1628894 -207787 48912
8053D8912j593019L19332M776029O311402L486926K77101o28303p23059j530140
$$ 48912 -1544107 -1224775 3551254 9862656 13349582 13626683 12998380 12275321 10745181
8044A0745181k277256k443537k554655j895573O88922L314980K427087j629943
$$ 10745181 8467925 6024388 3469733 1574160 2263082 5578062 8005149 6375206
8036F375206m280767k945025k1801J385468J239880P37902r2387j300275k052368
$$ 6375206 2094439 -850586 -872387 513081 1752961 2490863 2398476 1098201 -954167
8027i54167k221702k773198l452428k382020P37814L208730K801285R99683Q82384
$$ -954167 -3175869 -5949067 -9401495 -11783515 -11045701 -7836971 -5035686 -4036003 -3153619
8018c153619K636565L133955K77110l556334l827874K94282M141292L272741m91347
$$ -3153619 -517054 2616901 2894011 -662323 -4490197 -4195915 -54623 3218118 2726771
8009B726771j842843J3443O04902j931176l496443j070955K008337J846471N24534
$$ 2726771 883928 897371 1502273 -428903 -3925346 -4996301 -2987964 -1141493 -616959
8000f16959J570702K738315j00305m318887l297714K689257N742161J771109l861352
$$ -616959 953743 3692058 3591753 -727134 -4024848 -1335591 4406570 6177679 2316327
7991B316327m615599j263378J202467J013835K18455L36221Q35412Q40567Q9361
$$ 2316327 -2299272 -3562650 -2360183 -1346348 -1127893 -791672 43740 884307 973668
7982I73668j179145k053301j451303M60599K201746K665372J945209N64978q67936
$$ 973668 -205477 -2258778 -3710081 -3249482 -1047736 1617636 3562845 4127823 3259887
7973C259887j416677o41866M56264O04402j8331n05185r19353j668874k024986
$$ 3259887 1843210 1201344 1657608 2262010 2243679 1738494 819141 -849733 -2874719
7964b874719j121142L39403J249349K009955L147059L102926J26771m189106o022720
$$ -2874719 -3995861 -3656458 -2407109 -397154 2749905 5852831 5979602 1790496 -4232224
7955d232224l964966l42312J956755J996621N21182q09690k97713J825482K915717
$$ -4232224 -8197190 -8539502 -6582747 -4586126 -4064944 -4874634 -5172347 -3346865 -431148
7946d31148J186066j513566k176184o90632Q82813J747137K312976J885579m12132
$$ -431148 754918 -758648 -2934832 -3625464 -2742651 -995514 1317462 3203041 2790909
7937B790909l038331l429454j693497j71676K79077Q16483J764214J974198R83434
$$ 2790909 -247422 -3676876 -5370373 -5542049 -5262972 -4446489 -2682275 -708077 275357
7928B75357m67744j833409k742767k307574m34637J204959J521221J813224L005300
$$ 275357 -192387 -2025796 -4768563 -7076137 -7510774 -6305815 -4784594 -2971370 33930
7919C3930L193435R86418r40921L82628K711566J567536k256678l338367K9769
$$ 33930 3227365 4213783 3272862 3655490 6367056 7934592 5677914 2339547 2369316
7910B369316L082041J575316k450349m068785k049102K74433j13044j720308k02457
$$ 2369316 5451357 7026673 4576324 507539 -1541563 -1267130 -1380174 -3100482 -3302939
7901c302939N239811Q685760M048926n530558r922736n165850J366500K110572
$$ -3302939 1936872 10622632 14671558 9141000 -781736 -5947586 -4581086 -2470514
7893b470514n95766o78887J419579J779514J430020L310244M280059n76348p575222
$$ -2470514 -3066280 -3745167 -2325588 -546074 883946 4194190 8474249 7897901 322679
7884C22679p873199r23217M555008L597070L50406p56232p67937j058379j27389
$$ 322679 -7550520 -8473737 -3918729 -321659 28747 -727485 -1495422 -2553801 -2681190
7875b681190J865086J981582J06003m89308M12939m13789k417385j118167L133570
$$ -2681190 -816104 1165478 1271481 782173 1195112 781323 -1636062 -2754229 379341
$$ [...]
##END NTUPLES=NMR SPECTRUM
##END=
