##TITLE=31Pdec_SR120_k
 DMSO-d6, 124 sc
 30.5.2022
##JCAMPDX= 6.0         $$ Bruker NMR JCAMP-DX V2.0
##DATA TYPE= NMR SPECTRUM
##DATA CLASS= NTUPLES
##ORIGIN= UXNMR, Bruker Analytische Messtechnik GmbH
##OWNER= root
$$ XWIN-NMR		Version 3.5
$$ Mon May 30 13:59:29 2022 Russian Standard Time (UT+4h)  she@DPX200
##.OBSERVE FREQUENCY= 81.013821
##.OBSERVE NUCLEUS= ^31P
##.ACQUISITION MODE= SIMULTANEOUS
##.ACQUISITION SCHEME= undefined
##.AVERAGES= 124
##.DIGITISER RES= 16
##SPECTROMETER/DATA SYSTEM= spect
##.PULSE SEQUENCE= zgpg30
##.SOLVENT NAME= DMSO
##.SHIFT REFERENCE= (INTERNAL, DMSO, 0, 248.564)
##AUDIT TRAIL= $$ (NUMBER, WHEN, WHO, WHERE, WHAT)
$$ ##TITLE= Audit trail, XWIN-NMR		Version 3.5
$$ ##JCAMPDX= 5.01
$$ ##ORIGIN= Bruker BioSpin GmbH
$$ ##OWNER= she
$$ F:/spectra/data/she/nmr/P31/1/pdata/1/auditp.txt
$$ ##AUDIT TRAIL=  $$ (NUMBER, WHEN, WHO, WHERE, WHAT)
(   1,<2022-05-30 13:57:17.32 +0400>,<she>,<DPX200>,
      <continue with go, POWCHK disabled, PULCHK disabled
       configuration hash MD5:
       00 E9 B6 7A A2 85 ED C7 34 08 36 98 17 FE 4E 26
       data hash MD5: 32K
       E9 E4 55 37 D9 2A 2E A4 CC D5 94 9B FC 7C E2 97>)
(   2,<2022-05-30 13:58:22.10 +0400>,<she>,<DPX200>,
      <Start of raw data processing
       efp BC_mod = 2 LB = 1 FT_mod = 6 PKNL = 1 PHC0 = -9873.144 PHC1 = 30.8537 SI = 64K 
       data hash MD5: 64K
       2B 2E D3 9D 2D 58 4D 3B AA 82 FB 7D 01 AB 08 6A>)
(   3,<2022-05-30 13:58:43.06 +0400>,<she>,<DPX200>,
      <pk PHC0 = -201.7509 PHC1 = 433.6001 
       data hash MD5: 64K
       C0 4F A0 99 42 68 1F 7F 38 1E 89 4F B1 07 BC AE>)
(   4,<2022-05-30 13:58:47.50 +0400>,<she>,<DPX200>,
      <abs ABSG = 5 
       data hash MD5: 64K
       09 70 FD D4 21 20 C4 A0 BC B5 EC B2 4C A4 55 A5>)
(   5,<2022-05-30 13:58:58.92 +0400>,<she>,<DPX200>,
      <abs ABSG = 5 
       data hash MD5: 64K
       5B 7C 58 3E EA 15 01 B6 8C A0 CD F5 46 1B E6 3A>)
$$ ##END=
$$ 
$$ hash MD5
$$ 48 4C 13 0E 5A 8A 07 9A A9 59 F9 DB 04 DF 9F 2A
##$RELAX= 
##$RELAX= 
##$RELAX= 
##$RELAX= 
##$RELAX= 
##$RELAX= 
##$RELAX= 
##$RELAX= 
$$ Bruker specific parameters
$$ --------------------------
##$DU= <F:/spectra>
##$EXPNO= 1
##$NAME= <P31>
##$PROCNO= 1
##$TYPE= <nmr>
##$USER= <she>
##$AMP= (0..31)
100 100 100 100 100 100 100 100 100 100 100 100 100 100 100 100 100 100 
100 100 100 100 100 100 100 100 100 100 100 100 100 100 
##$AQSEQ= 0
##$AQ_mod= 1
##$AUNM= <au_zg>
##$AUTOPOS= <>
##$BF1= 81.014009
##$BF2= 200.13
##$BF3= 200.13
##$BF4= 200.13
##$BF5= 200.13
##$BF6= 200.13
##$BF7= 200.13
##$BF8= 200.13
##$BYTORDA= 1
##$CFDGTYP= 0
##$CFRGTYP= 5
##$CHEMSTR= <none>
##$CNST= (0..31)
1 1 145 1 1 1 1 1 1 1 1 1 1 1 1 1 1 1 1 1 1 1 1 1 1 1 1 1 1 1 1 1 
##$CPDPRG= <waltz16>
##$CPDPRG1= <>
##$CPDPRG2= <waltz16>
##$CPDPRG3= <>
##$CPDPRG4= <mlev>
##$CPDPRG5= <mlev>
##$CPDPRG6= <mlev>
##$CPDPRG7= <mlev>
##$CPDPRG8= <mlev>
##$CPDPRGB= <>
##$CPDPRGT= <>
##$D= (0..31)
0 1 0 0 0 0 0 0 0 0 0 0.03 2e-05 3e-06 0 0 0 0 0 0 0 0 0 0 0 0 0 0 0 0 
0 0 
$$ [...]
##$SUBNAM3= <"">
##$SUBNAM4= <"">
##$SUBNAM5= <"">
##$SUBNAM6= <"">
##$SUBNAM7= <"">
##$SUBNAM8= <"">
##$SUBNAM9= <"">
##$SW= 501.771253377433
##$SWIBOX= (0..15)
0 1 3 0 0 0 0 0 0 0 0 0 0 0 0 0 
##$SW_h= 40650.406504065
##$TD= 32768
##$TD0= 1
##$TE= 0
##$TE2= 300
##$TE3= 300
##$TEG= 300
##$TL= (0..7)
0 120 53 12 22 120 120 120 
##$TP= (0..7)
150 150 150 150 150 150 150 150 
##$TP07= 0
##$TPNAME0= <>
##$TPNAME1= <>
##$TPNAME2= <>
##$TPNAME3= <>
##$TPNAME4= <>
##$TPNAME5= <>
##$TPNAME6= <>
##$TPNAME7= <>
##$TPOAL= (0..7)
0.5 0.5 0.5 0.5 0.5 0.5 0.5 0.5 
##$TPOFFS= (0..7)
0 0 0 0 0 0 0 0 
##$TUNHIN= 0
##$TUNHOUT= 0
##$TUNXOUT= 0
##$USERA1= <user>
##$USERA2= <user>
##$USERA3= <user>
##$USERA4= <user>
##$USERA5= <user>
##$V9= 5
##$VALIST= <valist>
##$VCLIST= <CCCCCCCCCCCCCCC>
##$VD= 0
##$VDLIST= <DDDDDDDDDDDDDDD>
##$VPLIST= <PPPPPPPPPPPPPPP>
##$VTLIST= <TTTTTTTTTTTTTTT>
##$WBST= 1024
##$WBSW= 4
##$XGAIN= (0..3)
0 0 0 0 
##$XL= 0
##$YL= 0
##$YMAX_a= 9489
##$YMIN_a= -6062
##$ZGOPTNS= <>
##$ZL1= 120
##$ZL2= 120
##$ZL3= 120
##$ZL4= 120
##$ABSF1= 248.5645
##$ABSF2= -253.2056
##$ABSG= 5
##$ABSL= 3
##$ALPHA= 0
##$AQORDER= 0
##$ASSFAC= 0
##$ASSFACI= 0
##$ASSFACX= 0
##$ASSWID= 0
##$AUNMP= <proc_1d>
##$AZFE= 0.1
##$AZFW= 0.5
##$BCFW= 0
##$BC_mod= 2
##$BYTORDP= 0
##$COROFFS= 0
##$CY= -3
##$DATMOD= 1
##$DC= 0
##$DFILT= <>
##$DTYPP= 0
##$F1P= 0
##$F2P= 0
##$FCOR= 1
##$FTSIZE= 65536
##$FT_mod= 6
##$GAMMA= 0
##$GB= 0
##$INTBC= 1
##$INTSCL= 5.30512e-09
##$ISEN= 30
##$LB= 1
##$LEV0= 0
##$LPBIN= 0
##$MAXI= 10000
##$MC2= 0
##$MEAN= 0
##$ME_mod= 0
##$MI= 50
##$NCOEF= 0
##$NC_proc= -9
##$NLEV= 6
##$NOISF1= 182.463
##$NOISF2= 159.3651
##$NSP= 0
##$NTH_PI= 0
##$NZP= 0
##$OFFSET= 248.5645
##$PC= 4
##$PHC0= -10074.89
##$PHC1= 464.4538
##$PH_mod= 1
##$PKNL= yes
##$PPARMOD= 0
##$PSCAL= 0
##$PSIGN= 0
##$REVERSE= no
##$SF= 81.014009
##$SI= 65536
##$SIGF1= 159.3651
##$SIGF2= -187.1042
##$SINO= 113.3802
##$SIOLD= 16384
##$SREGLST= <1H.CDCl3>
##$SSB= 0
##$STSI= 65536
##$STSR= 0
##$SW_p= 40650.406504065
##$SYMM= 0
##$S_DEV= 0
##$TDeff= 32768
##$TDoff= 0
##$TI= <>
##$TILT= no
##$TM1= 0
##$TM2= 0
##$TOPLEV= 0
##$USERP1= <user>
##$USERP2= <user>
##$USERP3= <user>
##$USERP4= <user>
##$USERP5= <user>
##$WDW= 1
##$XDIM= 65536
##$YMAX_p= 471593148
##$YMIN_p= -478997766
$$ End of Bruker specific parameters
$$ ---------------------------------
##NTUPLES= NMR SPECTRUM
##VAR_NAME=  FREQUENCY,     SPECTRUM/REAL,   SPECTRUM/IMAG
##SYMBOL=    X,             R,               I
##VAR_TYPE=  INDEPENDENT,   DEPENDENT,       DEPENDENT
##VAR_FORM=  AFFN,          ASDF,            ASDF
##VAR_DIM=   65536,         65536,           65536
##UNITS=     HZ,            ARBITRARY UNITS, ARBITRARY UNITS
##FACTOR=    0.620285442955139, 1,           1
##FIRST=     20137.2065510759, 0,            0
##LAST=      -20513.1999529892, 0,           0
##MIN=       -20513.1999529892, -478997766,  0
##MAX=       20137.2065510759, 471593148,    0
$$ Real data points
##PAGE= N=1
##DATA TABLE= (X++(R..R)), XYDATA
$$ [...]
38592E4076869j7152619j3346835P085905J7004056J823655j7856153j7857785
38585A3777093m099916K579061j192081l205979J251528O198241P661206N088909
38577B8058062l273648j4178677j6261200n042902P220899Q554610M754440O587104
38569A6418688R208637O48831j5728978k3688478j5959245p38460J0073564R027377
38561a0738064l700695j5091090p341162J6599801K8662811J3090814p193375
38554A4289040m546628Q555721Q69269k1509171k1093435P639798K4381546O653629
38546A5239769j3378580j396173K3791572K2568651j454887j0481648N361844
38539D0250548J6386448N136391p972225k580557Q633450L783417j2761180k0362666
$$ y = [54076869, 36924250, 23577415, 30663320, 47667376, 49491031, 31634878, 13777093, 9677177, 12256238, 11064157, 7858178, 9109706, 15307947, 22969153, 28058062, 24784414, 10605737, -5655463, -10698365, -3477466, 5077144, 9831584, 16418688, 25627325, 26276156, 10547178, -13141300, -29100545, -29839005, -19765441, -10738064, -14438759, -29529849, -36871011, -20271210, 8391601, 21482415, 14289040, 9742412, 18298133, 19167402, -2341769, -23435204, -15795406, 8586140, 15239769, 1861189, 465016, 24256588, 46825239, 45370352, 34888704, 40250548, 56636996, 61773387, 53801162, 51220605, 59854055, 63637472, 50876292, 30513626]
38531C0513626j4797157r559886j0376226q328454J227923R376521P955244J498157
38523G509748j005266J859783N846548Q590904R154218M797194n157321j4749458
38515A6846350j6568870j0524236l172168L56537L6473j316971M8530O380697
38507g913658J3131576R999346n706040k0393623j8543471l835735N393526J822547
38499b6045532k902218Q29347N594920J069701p948561q309543L248634J7627711
38491a6835541K4407899J8909594L856698j0500734j4339866j0254806q363830
38484a3120586p150306N193258K4149108K5017338P41994j8224128n814418J6735108
38476B7527368J1698693j5101669k4512515r103885k620516j7261256j8768069
$$ y = [30513626, 15716469, 6156583, -4219643, -12548097, -11320174, -1943653, 6011591, 7509748, 6504482, 8364265, 14210813, 22801717, 31955935, 36753129, 31595808, 16846350, 277480, -10246756, -13418924, -13062387, -13025914, -14342885, -14294355, -7913658, 5217918, 15217264, 9511224, -10882399, -29425870, -33261605, -27868079, -26045532, -28947750, -28118403, -22523483, -21453782, -29402343, -37711886, -34463252, -16835541, 7572358, 26481952, 30338650, 19837916, 5498050, -4756756, -13120586, -20270892, -15077634, 9071474, 34088812, 34830806, 16606678, 10792260, 27527368, 39226061, 24124392, -388123, -9492008, -12112524, -29373780, -48141849]
38469d8141849J3319628M2032299K5359731j6576565k8686927k63094K4983333
38462A2026556J5664386q842327j5125658j255093R589056L494845j0565819j4511254
38454i525308j273031J6413699J8885275M969850m300216L340997J0154238l385638
38446C5279866k1934275j5475404R614718J5016045r257120k6203390r325143
38439b2284703J6425458J7579439N676909J1260214K6183046J7336226j0803844
38432F1372745j7016271P443679J9671072m524073k6327081n058246L2754639
38425F8316464L3539093L291535l305501K5105989L7641674R260014j2495374
38418A61353894J4437258N0904642L3357595k3847313m6822452j4047785J4694982
$$ y = [-48141849, -34822221, 7210078, 32569809, 15993244, -12693683, -12956777, 12026556, 27690942, 18848615, 3722957, 2467864, 12056920, 15551765, 4985946, -9525308, -10798339, 5615360, 24500635, 29470485, 25170269, 28511266, 38665504, 35279866, 13345591, -2129813, 7484905, 22500950, 13243830, -12959560, -22284703, -5859245, 11720194, 17397103, 28657317, 54840363, 72176589, 61372745, 44356474, 51800153, 71471225, 66947152, 40620071, 35561825, 68316464, 101855557, 105147092, 101841591, 126947580, 164589254, 173849268, 161353894, 175791152, 226695794, 260053389, 236206076, 189383624, 175335839, 190030821]
38411A90030821p159980m7466257n2683958k5539001o953030j0038128j3309560
38404B6880907m746290M598836O355903N370459N793191P861823J5033943K5933319
38396I3082091K5689026M842364j9976912k4949599j2408328m170899p826699
38389E4281044j2408466j2474790j2248885r001957L093937J4438187R908039
38382C5587109m199301q170507j868201k297179r523455o039643P931482J1393814
38374B2814119P8812o576535l185036p336051k0301832j7283024P156591K2877068
38366a755888J3897553M628993J1229619R108841j6828895l1604998n382262K7090153
38358A0383116J6852204j7706578k1287222N376860J1153903j3408402k1071424
$$ y = [190030821, 182870841, 135404584, 82720626, 57181625, 50228595, 40190467, 26880907, 22134617, 26733453, 33089356, 38459815, 44253006, 52114829, 67148772, 93082091, 118771117, 123613481, 103636569, 78686970, 66278642, 62107743, 54281044, 41872578, 29397788, 17148903, 8146946, 11240883, 25679070, 35587109, 31387808, 23217301, 21349100, 19051921, 9528466, 3488823, 11420305, 22814119, 22892931, 16316396, 13131360, 5795309, -14506523, -31789547, -24632956, -1755888, 12141665, 16770658, 28000277, 37109118, 20280223, -11324775, -16707037, 10383116, 27235320, 9528742, -11758480, -6381620, 4772283, -8636119, -29707543]
38351b9707543O500255K7045083J3304152k648396P193689J4978178r461053l8941204
38343a1736839l1340365J790939J8901588J6423927K1819148L3633797K1278077
38336G0770272j6880802m2227599l0867087k951045J2867961J2764156M413822
38329G889678j0451239k4409116j9005860R574753L5187865L0979623M783675
38322C4549379j1406996k597088J3797058J4286579j109571j2149594o225537
38315B9144230N761753M992811r300475j8759266j1209575L470737Q246073Q21317
38307A3167605p411801p762444r74071P559619J1453701O586490k637520n554555
38299A4427024M02735N118940J869211k337861j117980q47855n969346n645940
$$ y = [-29707543, -23207288, 3837795, 17141947, 14493551, 21687240, 36665418, 27204365, -11736839, -43077204, -41286265, -22384677, -5960750, 15858398, 49492195, 70770272, 53889470, 11661871, -19205216, -22156261, -9288300, 3475856, 7889678, -2561561, -26970677, -45976537, -36401784, -1213919, 29765704, 34549379, 23142383, 20545295, 34342353, 48628932, 47519361, 35369767, 29144230, 34905983, 39898794, 30598319, 11839053, 629478, 4100215, 12346288, 13167605, 5755804, -2006640, -2980711, 4578908, 16032609, 22619099, 19981579, 14427024, 14829759, 19948699, 21817910, 19480049, 18362069, 17514214, 11544868, 5898928]
38291E898928P565092J8082488Q284774j0360275j2350114J917059R007086K193948
38283C0238986k222446N45685l875541j5363309j2625736O524250J3003855m872730
38275A1353014j4125467J2162929M5576931M1190422N620762j5514503p765239
38268G8498849j889290j7396374l3494966k7262380p054899P864098J4948874
38261A4213912J9130645J6788683N728170m282732n270641k658103k252634M20085
38253D1817385O969616P101673m570711j5813675j3832920l431558L551398M637568
38245B6428776J300939q342734j8367960j2807503Q820143K0422180M608970j6875579
38237E187232j3739048N682630R427441m689975p382365J0564291K2835863J2450368
$$ y = [5898928, 13464020, 31546508, 39831282, 29471007, 17120893, 19037952, 28045038, 30238986, 28016540, 28562225, 24686684, 9323375, -3302361, 3221889, 16225744, 11353014, -2772453, 9390476, 54967407, 96157829, 101778591, 86264088, 78498849, 76609559, 59213185, 25718219, -1544161, -8599060, -734962, 14213912, 33344557, 50133240, 55861410, 51578678, 46308037, 43649934, 41397300, 41817385, 48787001, 55888674, 51317963, 35504288, 21671368, 18239810, 21791208, 26428776, 27729715, 19386981, 1019021, -11788482, -2968339, 17453841, 22062811, 5187232, -8551816, -2869186, 6558255, 1868280, -5514085, 5050206, 27886069, 40336437]
38229D0336437k918810n509101n462949j3612791j4613917N671897K7324586K1527519
38221E2742871m516201j8058952r130076J069806j294714m018572N493294J8705411
38213D0992867K0075339P615549r186996k1087299k2575023j3122903k69393N738514
38205H180655L200827j769416o662887j3128280j5895790m367250J9625946L6764328
38197B5948133L0968351Q765537q775888r443996j24503L910170l608059j3193330
38189C4446415j0899383L257492J3409138Q274366l956066r265786q220334r754012
38181A7291830j1274523k912107J0642532J2863701K734530r98807R963690J8411975
38173E6722821Q008661j2158893k3393279k3673411k2261785j9297367q598619
$$ y = [40336437, 37417627, 31908526, 26445577, 12832786, -1781131, 3890766, 31215352, 52742871, 48226670, 30167718, 21037642, 22107448, 20812734, 16794162, 22287456, 40992867, 61068206, 68683755, 59496759, 38409460, 15834437, 2711534, 2442141, 8180655, 11381482, 9612066, 2949179, -10179101, -26074891, -30442141, -10816195, 25948133, 56916484, 65682021, 56906133, 47462137, 47337634, 51247804, 47639745, 34446415, 23547032, 26804524, 40213662, 48488028, 44531962, 35266176, 27045842, 17291830, 6017307, 3105200, 13747732, 26611433, 29345963, 28347156, 38310846, 56722821, 64731482, 52572589, 29179310, 5505899, -16755886, -36053253, -44651872]
38166d4651872N803564J3077476J2699220J3563903J7275343J5283694L631160
38159C6682488r053762j0282410L432414K0553429K0975420k412926k6688880
38152C3205773j9147063J7818448M1705188K5070524n007599p202548J2415085
38145I8857808J3626190j2450328l1795543k4007699r979446j0073470j1212049
38138A2965463L024586J9576695J9175391R301991O871944O779286m078670j6617507
38130E6999179j3304393j179391q51362r978872q695057K671750L368891j0089600
38122A8941145j7825277j2074261p188039p058940M681822K8910715L7323836
38115D5711001J4358322j4324510j8492854n114281K201858M131619J4763955
$$ y = [-44651872, -38848308, -25770832, -13071612, 492291, 17767634, 33051328, 36682488, 27628726, 17346316, 20778730, 41332159, 62307579, 59894653, 33205773, 14058710, 31877158, 73582346, 98652870, 93645271, 86442723, 98857808, 112483998, 100033670, 68238127, 44230428, 34250982, 24177512, 12965463, 15990049, 35566744, 54742135, 64044126, 70916070, 77695356, 73616686, 56999179, 43694786, 42515395, 41664033, 31685161, 22990104, 25661854, 29030745, 18941145, 1115868, -10958393, -18146432, -25205372, -20523550, 8387165, 45711001, 60069323, 45744813, 27251959, 22137678, 24339536, 28471155, 43235110]
38108D3235110K5400180J4713730j1256365k3437403j4015530m583830o146498
38101B3909394k773770J4080590K4073505R278575j4257298j7949264r58537J1845403
38093D7248598O306771n117610m267614R013261J8088447Q892990j4204382l1189981
38085C4770480k6706869p076973P494892P054807Q68495J278679P549060J0225887
38077C5458458N035801k718927m665085J597209P901217K892713j1152575j5277461
38069A9071350K044327K4362508K6802804J1755431L996447J0414262J0293677
38062A08740806o618301j8603329m796796K1660805L3717154K7878503K0149675
38055A82128517J6978112J3390608J2004493K0026652K9876857K4140146Q29937
$$ y = [43235110, 68635290, 83349020, 72092655, 48655252, 34639722, 30055892, 23909394, 21135624, 35216214, 59289719, 68568294, 54310996, 36361732, 35403195, 47248598, 53555369, 48437759, 44170145, 53183406, 71271853, 80164843, 65960461, 34770480, 8063611, 986638, 8481530, 15536337, 16404832, 17683511, 25232571, 35458458, 40494259, 37775332, 33110247, 34707456, 42608673, 45501386, 34348811, 19071350, 21115677, 45478185, 72280989, 84036420, 88032867, 98447129, 108740806, 102122505, 83519176, 78722380, 100383185, 134100339, 161978842, 182128517, 199106629, 212497237, 224501730, 244528382, 274405239, 298545385, 299375322]
38048B99375322k3384061l5972178l9276758l8018692l1512541k1287907j3868265
38041I6054920j1970371j1073577o160678L861941J5996471K1815155J2919932
38034A21443793m205423q263642R305924K6028090J4632602j8277963l8416448
38027A02246933k6612145K102100K2176301K3980343J4502801N164701K101065
38020A45662099Q10912p693085j9653211j7265109M477100K2706033J5747673
38013A44792412n138746j4455206j0658040r149456p935371O451098K3621926
38006A27528617J6975327j0170211k1907992j910030K4741558L3227441L0812635
37999A99297345L2452451L4043176K7477061J7250366N788590j3800872l5576630
$$ y = [299375322, 275991261, 240019083, 200742325, 162723633, 131211092, 109923185, 96054920, 84084549, 73010972, 66850294, 70712235, 86708706, 108523861, 121443793, 117238370, 108974728, 118280652, 144308742, 158941344, 140663381, 102246933, 75634788, 77736888, 99913189, 123893532, 138396333, 143561034, 145662099, 146473011, 138779926, 119126715, 101861606, 106338706, 129044739, 144792412, 139653666, 125198460, 114540420, 105390964, 97455593, 103906691, 127528617, 144503944, 134333733, 112425741, 110515711, 135257269, 168484710, 199297345, 231749796, 265792972, 293270033, 310520399, 316308989, 302508117, 266931487]
37992B66931487l7485955j6838176k190967j1020547k3043443j7261064o844964
37985A52246371j0247303j5023325l270621R724202j109600k5211648l1413831
37978G5694245j6618244l562337M71016N910671Q732710n097889k4654338k2492534
37970A8383300j669867L860990j5407822k6429395o957058J7341018J3760825
37963B881991n725920m541914K0807837L5102750J6020866j4949912k3498789
37956B6096909q148055J486295j1726737k7706337j7203856J5937787L7731396
37949A6467402K8689752P336691J837620J3872512K3301309J7745174L134132
37942A12384592r474677j5434137j7115833j9583953k2567651j6449047L680763
$$ y = [266931487, 229445532, 212607356, 210416389, 199395842, 176352399, 159091335, 152246371, 141999068, 126975743, 123705122, 133429324, 132319724, 107108076, 75694245, 59076001, 55513664, 55984680, 61895351, 70628061, 65530172, 40875834, 18383300, 16713433, 20574423, 5166601, -21262794, -28219852, -10878834, 2881991, -2843929, -7385843, 13421994, 48524744, 64545610, 49595698, 26096909, 17948854, 19435149, 7708412, -19997925, -37201781, -21263994, 16467402, 45157154, 52493845, 54331465, 68203977, 91505286, 109250460, 112384592, 102909915, 87475778, 70359945, 50775992, 28208341, 11759294, 15440057]
37935A5440057K0882557J1814342j6735870k9788889j2537409Q178820O399593
37928C653201n012784k123360P939685K763099j3932781j8632863o196215P354377
37920b4187641J3180363J4541477J0470338k87954o212205K090145J2392215R591068
37912C1577806K142998M155269N815460p279792j9796406q354099J3716771J3408734
37904C5386741p806780j8809270j2547564j0050070j2891736n53120K0719819
37897f551980J7319576j1654455k2966665L872461L3866715L3017345J5358033
37890F2261030P715979O130948l113051j2029391j0740971j0807621k0397660
37883A9019263k2154603l698310J4375188R350576p056334j1137847n548935o560195
$$ y = [15440057, 36322614, 48136956, 31401086, 1612197, -10925212, -2746392, 3653201, -1359583, -3482943, 4456742, 7219841, -6712940, -25345803, -31542018, -24187641, -11007278, 3534199, 14004537, 13716583, 7504378, 9594523, 21986738, 31577806, 33720804, 37876073, 43691533, 36411741, 16615335, 8261236, 21978007, 35386741, 27579961, 8770691, -3776873, -13826943, -26718679, -27271799, -6551980, 10767596, -886859, -23853524, -19981063, 13885652, 46902997, 62261030, 69977009, 76107957, 72994906, 60965515, 50224544, 39416923, 19019263, -3135340, -6833650, 7541538, 16892114, 9835780, -1302067, -6851002, -13411197]
37875a3411197j0958066m578011R719326J8310613J9297760J7023681P247059
37868D2651165j1389464k4185554j8456047k655187Q671573J4221595J5592019
37861B4450100O440220j1126579j8857107q987518J047139k259896o833437j034299
37853a7161377L367615l830004q346862J685044J0456474L204263m035495O648294
37845h012048J9327094J0401584r284291j2462777P58357R653014Q500307M715422
37837B3596662l328210j6901029k1598451r860508K38249l434404j795638J7111803
37829a5971526K5105498N11833k3282864p137220K3624072J8185637j2433663
37822H601767j5099798J1209587J5198177j3027590k3990084K176981K1087637
$$ y = [-13411197, -24369263, -28947274, -19227948, -917335, 18380425, 35404106, 42651165, 31261701, 7076147, -11379900, -14035087, -5363514, 8858081, 24450100, 30890320, 19763741, 906634, -8080884, -7033745, -9293641, -16127078, -17161377, -13793762, -17623766, -25970628, -24285584, -13829110, -10624847, -14660342, -8012048, 11315046, 21716630, 12432339, -30438, 727919, 10380933, 18881240, 23596662, 20268452, 3367423, -18231028, -28091536, -27853287, -31287691, -33083329, -15971526, 9133972, 9645805, -13637059, -20774279, 2849793, 21035430, 8601767, -6498031, 4711556, 19909733, 6882143, -17107941, -14930960, 6156677]
37815F156677L133692j7880519p933415J1370533P621973q010064r579589j885043
37807a7005755j095185j654433M846340O505363l753889p872214M915272J3686374
37799a428127J428877j3569386j0643958k584166p426464j1736497L135715K1303525
37791b1520481J5757265n796359j4291582n557910N55736k437299l164275R02469
37783c5552436J167349j209348K844641J0158465Q724814o99538n027265M46270
37775a9147048O664031M963202l587797j0626439p664905L015242N380906r077102
37767c0079910k0633105m952849K4348309K9071827O033147o439806O918258J3088129
37759A7354000p105178k0044264Q49746K1300391J567042l0965299k3394910J3935422
$$ y = [6156677, 9290369, -8590150, -16523565, -5153032, 2468941, -5541123, -15120712, -17005755, -18100940, -19755373, -14909033, -8403670, -12157559, -20029773, -15114501, -1428127, 750, -13568636, -24212594, -26796760, -34223224, -45959721, -42824006, -21520481, -5763216, -11559575, -25851157, -31409067, -30853331, -33290630, -36454905, -35552436, -34385087, -35594435, -32749794, -22591329, -13866515, -14566053, -19593318, -19147048, -12483017, -7519815, -11107612, -21734051, -29398956, -26383714, -21002808, -30079910, -50713015, -55665864, -31317555, -2245728, 3787419, -2652387, 4265871, 17354000, 10248822, -9795442, -8945696, 12354695, 13921737, -17043562, -40438472, -26503050]
37751b6503050K4822608M72070j1486091P952162K0063002j034071k5871822k2124555
37743c3709747l388433K980790K18224M481124J0884429O767207j095146O90722
37735a2170830O439720K021775r105615j1208554j218917Q723399J0073088N904208
37727e41726J833683j161631m332323o693013m503006L798061J1403381P454903
37719G258329p389820j6721475q477146P230062J1194728N61801j0094394q379851
37711b4817766N286552K0640784K2531417K835470k2886216k4911434J225882
37704b0095311K2185869J1507540j2838062j9253575r829414n363785k681185
37697c6367923J3041602K7348720J3972891j3408554j5532038O959143J3407990
$$ y = [-26503050, -1680442, -1208372, -12694463, -4742301, 15320701, 14286630, -11585192, -33709747, -37098180, -34117390, -33899166, -29418042, -18533613, -11766406, -12861552, -12170830, -5731110, -3709335, -12814950, -24023504, -25242421, -16519022, -6445934, -541726, 1291957, 130326, -4201997, -10895010, -15398016, -11599955, -196574, 7258329, -131491, -16852966, -25330112, -18100050, -6905322, -6343521, -16437915, -24817766, -19531214, 1109570, 23640987, 26476457, 3590241, -21321193, -20095311, 2090558, 13598098, 760036, -18493539, -28322953, -33686738, -36367923, -23326321, 4022399, 17995290, 4586736, -10945302, -3986159, 9421831]
37690I421831o139287j4387512M794261J6377773k828708k2648876j3893660K000507
37682b7303671l031785j0885840N887936K7733670J8810919r676285j7713931
37675a6178987k080179O396243J288607N852571K1842000K1694753j384738j8144755
37667A9285515j0065585M206246L157366o882390j0520826q430934q462487r733795
37659b7446890p843257k527949O224448J6358742J6916225L60153j8246595j5670892
37651c1876015M386928J4498813N383967k139915N053283J0799228K39188j3348385
37643g002908j1638029j193769M26737o612080r503679m822930K268183R917125
37635b8161350J4607770O780882j1197843j6376500M220639K6742285J9851919
$$ y = [9421831, 3282544, -11104968, -6310707, 10067066, 7238358, -15410518, -29304178, -27303671, -30335456, -41221296, -35333360, -7599690, 11211229, 1534944, -16178987, -18259166, -11862923, -10574316, -4721745, 17120255, 38815008, 37430270, 19285515, 9219930, 13426176, 16583542, 9701152, -819674, -9250608, -17713095, -27446890, -35290147, -37818096, -31593648, -15234906, 1681319, 2041472, -16205123, -31876015, -27489087, -12990274, -7606307, -9746222, -4692939, 6106289, 6345477, -7002908, -18640937, -19834706, -19407969, -26020049, -35523728, -40346658, -38078475, -28161350, -13553580, -6772698, -17970541, -34347041, -30126402, -3384117, 16467802]
37628A6467802p571930j7146971L114916K3987293K0497980L209760o612717p318654
37620B8627479o579962k104580P646297R003071q994071l1357468l2474642j0389793
37612d6623669J2053823J7838118J1083632L030401j027235L43631N335499N554984
37604G589184m541399j3566079l704068K1147313L3629974J6724284j4164752
37597D3114457l1596406k6882230j1362088K042373P650872N734360K602169N574848
37589c121645J0887695N752577j0544037k0282018j2368426J44932J669560j079545
37581b8940907N207797J2621468M295554j3182175j6465396k467419P879361M548229
37573b6503488O43317M309653M716458l589923o274380O343704J9891959J7032450
$$ y = [16467802, 8895872, -8251099, -5136183, 18851110, 39349090, 42558850, 35946133, 28627479, 22047517, 19942937, 27589234, 36592305, 27598234, -3759234, -36233876, -46623669, -34569846, -16731728, -5648096, -2617695, -3644930, -3301299, 2034200, 7589184, 3047785, -10518294, -14222362, 6924951, 40554925, 57279209, 43114457, 11518051, -15364179, -26726267, -24683894, -17033022, -11298662, -8696493, -3121645, 7766050, 13518627, 2974590, -17307428, -29675854, -29530922, -27861362, -28940907, -23733110, -11111642, -6816088, -19998263, -36463659, -38931078, -31051717, -26503488, -25860171, -21550518, -16834060, -20423983, -26698363, -20354659, -462700, 16569750]
37565A6569750K874306o013824n458599k053846J331983M127968J156117r239823
37557C294032j7005339j2032556J532294J1605560J2727147P326889j18265m049222
37549C280540j221516K194079k920645j1718291q995136N493978J2535664K574896
37541A223569q599397m964656N737115P060686j337276p753653n428890M957310
37533i105192J6816035J5169246q588425l3138880k4592121J1860319K9316101
37526b262917N773002k1828529j6117502N125916Q258801L164612J5285737K7026023
37518B4425143M999596l1326648l0225228Q319411L0234053J2539973q005045
37511A0961255k515220R696265O454980j847858l638700q398022j6496097r161495
$$ y = [16569750, 19444056, 13430232, 7971633, 5917787, 7249770, 11377738, 12533855, 3294032, -13711307, -25743863, -24211569, -12606009, 121138, 7448027, 7329762, 3280540, 2059024, 4253103, 1332458, -10385833, -19380969, -13886991, -1351327, 1223569, -7375828, -12340484, -6603369, 457317, -879959, -8633612, -14062502, -9105192, 7710843, 22880089, 14291664, -18847216, -43439337, -31579018, -2262917, 3510085, -18318444, -34435946, -29310030, -21051229, -17886617, -2600880, 24425143, 29424739, -1901909, -32127137, -23807726, 6426327, 18966300, 10961255, 8446035, 18142300, 24597280, 22749422, 19110722, 10712700, -5783397, -14944892]
37503a4944892J1351094J4922786k597458n533328J7281619K5033749n230102
37496D0283468l2106556j6230130J3369118J0889557q531270k334340J9152927
37489B4492774J1769793k0661965k9649524k578981K0542367J4418840j405129
37482A6928175p697439j2129998j9117170j5719530o29567R209538J0692546J7914734
37474e48711K6630044J4710430j2269741j8216537M936943J7953477m024710l0450761
37466a279566k5552337l995988M66434o029252O660129L3606819L7005184O305646
37458D7187069k3395657k2264062l980041K270599m921889n032878P175926J3492715
37450A0531782K309124j2064864j0597054J532819K829673j1782944k3780084
$$ y = [-14944892, -3593798, 11328988, 8731530, 3198202, 20479821, 45513570, 40283468, 8176912, -8053218, 5315900, 16205457, 7674187, 5339847, 24492774, 36262567, 15600602, -14048922, -16627903, 3914464, 18333304, 16928175, 9230736, -2899262, -22016432, -37735962, -38365529, -29155991, -18463445, -548711, 26081333, 40791763, 28522022, 10305485, 15242428, 33195905, 29171195, -1279566, -26831903, -30827891, -30361457, -36390709, -29730580, 3876239, 40881423, 47187069, 23791412, 1527350, -2452691, -182092, -5103981, -10136859, -2960933, 10531782, 12840906, 776042, -9821012, -8288193, -5458520, -17241464, -41021548]
37443d1021548j8822724l971395R346695K0915318K9080679K1817487k157638
37436A5186874j9981269j3269624L988058Q479943L668233N987255R350942k707678
37428A0702734j8811585j1976180J2651704K1699232P466993k306621M861034
37421B4287311P734860l807447q094769M372218P391725j3434310k7340566o602330
37413a5493308K3570262K2499921k780128j3597943k138820N242628j508795m926619
37405A0867198R25907p52794j4379314j8522439m6144K2750940K4637937M531776
37397C0013067j8424202k7390580j8811914j323084J0068030O325420n517287
37390b5060550j0543819m341851L803171N331793K351916K635591R718550J7894881
$$ y = [-41021548, -59844272, -63815667, -54468972, -33553654, -4472975, 17344512, 15186874, -4794395, -18064019, -14075961, -5596018, -1927785, 4059470, 13410412, 10702734, -8108851, -20085031, -7433327, 14265905, 21732898, 19426277, 24287311, 32022171, 28214724, 20119955, 24492173, 31883898, 18449588, -8890978, -15493308, 8076954, 30576875, 27796747, 14198804, 12059984, 17302612, 15793817, 10867198, 11793105, 11040311, -3339003, -21861442, -21907586, 843354, 25481291, 30013067, 11588865, -15801715, -34613629, -35936713, -25868683, -19543263, -25060550, -35604369, -39946220, -36143049, -30811256, -28459340, -25823749, -16105199, 1789682]
37382A789682J6108468J320729j2745728j0516363J415477J098709j4097187k0406580
37374c6032793n331058J0613136P190502k631114K740381J4956126J1907790r32283
37366B480687M03414J4046696J2563353j0446435k7127111j7538070K535256Q116832
37358a4965378k179047j2686483j3670698n955898N810229J5377574J8075065
37351a0194636J5951779J3377110R289313K593096m83397K990624K612279q152560
37343B7983608j4249926n74516J7960596J5911196K09455j04899J5049677J4924790
37335G7109981p405776j9885116n413671R073158k76108j4612000q538500N895491
37327C5947459M926395l337754J995756J2161592M549597j2963758j3273627K373369
$$ y = [1789682, 17898150, 19218879, 6473151, -4043212, -2627735, -1529026, -15626213, -36032793, -41363851, -30750715, -23560213, -26191327, -23450946, -8494820, 3412970, 2480687, 2884101, 16930797, 29494150, 19047715, -8079396, -25617466, -23082210, -14965378, -17144425, -29830908, -43501606, -49457504, -43647275, -28269701, -10194636, 5757143, 19134253, 28423566, 31016662, 30533265, 33523889, 36136168, 27983608, 13733682, 13159166, 31119762, 47030958, 47240413, 47135514, 62185191, 77109981, 69704205, 49819089, 44405418, 53478576, 53202468, 38590468, 30051968, 35947459, 40873854, 37536100, 39531856, 51693448, 56243045, 43279287, 30005660, 32379029]
37319C2379029P144680m126255q563020K352722J0444841O250328K192722K285405
37311E0360452p294743k5479915k7663391o944125P203812o018521k2634924j0682797
37303d9154152J8782167K9457411J4455120J10898J870224Q551255J0342976J2201926
37295D6617825J3755375L139832j8309845k7907556j2243883J1499814J9512857
37288C6064419J2058548M626221J345204l857033q405536m869512n05058j0812586
37280B5644667l0318959l1164354j685661L0193447K8758383k799585k5368633
37273f740695j2990132J6926659K8499560J1248303j1719940j5320993m21152
37266I481610J3515440J4955854R718059N915398J352524p990576j5422769j0760453
$$ y = [32379029, 39523709, 35397454, 26834434, 29187156, 39631997, 45882325, 48075047, 50360452, 43065709, 17585794, -10077597, -17021722, -9817910, -15836431, -38471355, -49154152, -30371985, -914574, 13540546, 13651444, 15521668, 24072923, 34415899, 46617825, 60373200, 63513032, 45203187, 17295631, 5051748, 16551562, 36064419, 48122967, 52749188, 54094392, 50237359, 41831823, 36962311, 36457253, 25644667, -4674292, -35838646, -37524307, -7330860, 21427523, 18627938, -6740695, -19730827, -2804168, 25695392, 36943695, 25223755, 9902762, 9481610, 22997050, 37952904, 47670963, 53586361, 54938885, 46948309, 31525540, 20765087]
37258B0765087K216998P243207k832875j5632315j5851073m753876M193777M092702
37250e58368L40222q19940j006603m571964j0222256j1872699o194333L603077
37242c1302864J1236940J2496707P101969j260462n179691J587402J4342641J7113047
37234B6135689J667012j6000919j2874108O236727J0804380r808128k5407507
37227a9246854q745851K0065600K1943543j913369j4771919l183438Q270196M689395
37219G107303K516251J0678309R757993q572350j7323589K458783K5175807J9922703
37211E1721210n89739o297692j346882q474821k0256617j1393901J0997676J5891184
37203C0250418K775283J096105J4806600J5346921l011194r501856O099891R819550
$$ y = [20765087, 22982085, 30225292, 27392417, 11760102, -4090971, -8844847, -4651070, -558368, -218146, -1038086, -2044689, -6616653, -16838909, -28711608, -34905941, -31302864, -20065924, -7569217, -467248, -1727710, -6907401, -5319999, 9022642, 26135689, 27802701, 11801782, -1072326, 5164401, 15968781, 6160653, -19246854, -27992705, -7927105, 14016438, 12103069, -2668850, -5852288, 2417908, 7107303, 9623554, 20301863, 30059856, 21487506, 4163917, 6622700, 31798507, 51721210, 51131471, 44833779, 43486897, 35012076, 14755459, 3361558, 14359234, 30250418, 33025701, 34121806, 48928406, 64275327, 61264133, 51762277, 57862168, 67681718]
37195F7681718j8384006m4267833k9890210P222691K1498356M085546j4812038
37188f865776j4536096k944419O047840P855241M186397L273246J6136338L6991535
37180E0144306L9347869J0398589k3419026k7780898p123992M883258n193801
37173D1256305j6918570j0626707Q663253K4991958K8645409J5576574j1629984
37166G9958238l6028006l5817238j0424274J4325796J5660676M45946o107230
37159B2013908O313267K0509115J5183466m265938q299626J7871599M7699748
37152A17025539M1973027J480583l0688867k5144853q33627J0522289J1174167
37145A25508258K3226872M3731243M6726316K7491948J3976110K6501849M9243015
$$ y = [67681718, 49297712, 5029879, -24860331, -17637640, 3860716, 7946262, -6865776, -21401872, -24346291, -18298451, -10443210, -6256813, -2983567, 13152771, 50144306, 89492175, 99890764, 76471738, 48690840, 41566848, 46450106, 41256305, 24337735, 13711028, 22374281, 47366239, 76011648, 91588222, 79958238, 43930232, 8112994, -2311280, 12014516, 27675192, 28121138, 22013908, 28327175, 48836290, 64019756, 59753818, 51454192, 69325791, 117025539, 158998566, 160479149, 129790282, 104645429, 103811802, 114334091, 125508258, 148735130, 192466373, 239192689, 266684637, 280660747, 307162596, 356405611]
37138C56405611N3081866L0803235j329180k5206943l3789993l0522000k4792124
37131C24650472k3905936k5385127k1888768j4728076j4056310k2887450l0525847
37124A71272958k7542070j8993364j5042392j4553682p633670P595735K0228566
37117A15332081K0833596J3506966Q539883P116802J042498j1950077k1364376
37110A33057373j8154013r053367p208021j2255447j1869482l117825J338711
37103G2737929o777132j7270154j5639351k546943R704502J3449896R727366J670544
37095F5056657p080519j1058153q215956l929082l400582l863119j219512Q5260
37087B6374994o587897j5674647j2187001P557800K5621509K0514854n252487
$$ y = [356405611, 409487477, 440290712, 438961532, 413754589, 379964596, 349442596, 324650472, 300744536, 275359409, 253470641, 238742565, 224686255, 201798805, 171272958, 143730888, 124737524, 109695132, 95141450, 87507780, 95103515, 115332081, 136165677, 149672643, 158212526, 165329328, 166371826, 154421749, 133057373, 114903360, 105849993, 98641972, 86386525, 74517043, 71399218, 72737929, 65960797, 48690643, 33051292, 30504349, 40208851, 53658747, 63386113, 65056657, 57976138, 46917985, 38702029, 34772947, 31372365, 27509246, 26289734, 26374994, 19787097, 4112450, -8074551, -516751, 25104758, 45619612, 40367125]
37080D0367125k3289272j1271130J6971959K5109915R36777k5301519k0606908
37073B916947O196968J9239967O769437p754015n551837L092043K403420m145709
37065B3167221n782634l438860k945251k380845J956540P637550J2011194J4320874
37057D4545789Q056646j1668300k9170213k0163210Q750001J9936049r13220j9302149
37049G1393l722657K4678966K5701592J742265j1550023l449761K375227o658617
37041B9188385j4063330o902192L960261N489047J563914J086419L688329M819118
37033B8829951L478934J103674Q25709N996619J1944339O960026q400317j5066015
37025C5672920l132114Q236911j456939j9734263j9235902L2411J3394851R724746
$$ y = [40367125, 17077853, 5806723, 22778682, 47888597, 48825374, 23523855, 2916947, 9113915, 28353882, 35123319, 27369304, 21817467, 24909510, 27312930, 23167221, 17384587, 13945727, 11000476, 8619631, 10576171, 18213721, 30224915, 44545789, 52602435, 40934135, 11763922, -8399288, 350713, 20286762, 19373542, 71393, -3651264, 21027702, 46729294, 48471559, 36921536, 33471775, 35847002, 29188385, 15125055, 8222863, 12183124, 17672171, 19236085, 20322504, 24010833, 28829951, 32308885, 33412559, 34238268, 40234887, 52179226, 59139252, 50738935, 35672920, 32540806, 40777717, 39320778, 19586515, 350613, 383024, 13777875, 23502621]
37017B3502621M78687m318184l563781N547380J9522587J7720666j0762742l7094521
37009A1032713k4214224J6364196L7211162K3039385M546406R41661n267002k2830491
37001D0823806k6468092j402555K3721159J7593568p618634j9144739j0841305
36994A6663208o54045J976917J005825j550056m984802m127253K03838l119903
36986E413729j6149608k2419176j0448638P887413J5711896J3047916P905428
36979I48960J430131n121694m648342J823112J679740p236967r548846Q25997
36971a9847909P667754L09629p501028k677662N875615Q606761J3676557K3483963
36963B9593680J9052701o211889k2990814q216772J2452839K185540k5547239
$$ y = [23502621, 23981308, 19663124, 16099343, 21646723, 41169310, 58889976, 48127234, 11032713, -13181511, 3182685, 40393847, 63433232, 67979638, 68921299, 63654297, 40823806, 14355714, 12953159, 36674318, 54267886, 46649252, 27504513, 16663208, 16009163, 17986080, 18991905, 17441849, 12457047, 8329794, 8533632, 5413729, -10735879, -33155055, -43603693, -35716280, -20004384, -6956468, 948960, 2379091, -2742603, -7390945, -5567833, -3888093, -11125060, -20673906, -19847909, -12180155, -11870526, -19371554, -22049216, -16173601, -7566840, 6109717, 29593680, 48646381, 42434492, 19443678, 11226906, 23679745, 25865285, 318046]
36956C18046k6677878K588585K1045422Q455006q475104m835782P905889J1629166
36948A1953350J1607057J6001468J2526496r563840l2270254k9099562l762378
36941b2607663J3574759O582868q880640r857092M146592J5288171J4049899R474745
36933B1771639J0602856R814711l470915j9541749j7392216K063555J2309088
36926A6156969q86836j7489762j3588932K958671O766157o524027j7184780j1559678
36918d1352218L789923J6015672J8413424J0486570j453011o058931L7804N834000
36910E713233K362135l316887k571118j737525p407616p978239O912104J8856387
36902A0832474K411243k8943517l1964738M465780L8042460K9493160n007614
$$ y = [318046, -26359832, -23771247, -2725825, 5729181, -2745923, -7581705, 324184, 11953350, 23560407, 39561875, 52088371, 42524531, 10254277, -18845285, -22607663, -9032904, -2450036, -11330676, -21187768, -17041176, -1753005, 12296894, 21771639, 32374495, 42189206, 38718291, 19176542, 1784326, 3847881, 16156969, 15270133, -2219629, -15808561, -12849890, -6083733, -12607760, -29792540, -41352218, -37562295, -21546623, -3133199, 7353371, 5900360, -158571, -120767, 5713233, 8075368, 4758481, 2187363, 449838, -6957778, -14936017, -8023913, 10832474, 13243717, -15699800, -47664538, -43198758, -5156298, 24336862, 19329248]
36895A9329248k0136192l202322J6306125J2824579m502087j1816963l234146
36888E568242P683881R855151N203551q12739o844757r977166l460467J0908385
36880A8124081J6818257K875984j7658559k2068694r394037J965269N684312J2970993
36872I317606K3731271J9702795k573677j8163311j0017430M542518L695501m534061
36864B5701212j870424N998625K936508n547333l891731J822313m767567j6186165
36856D195438j1493071M292747N466019r857135j4575802K876835K0291502J7299957
36848A8496490K336795o580319n081984L267388J4892034J9576874O484254j4204815
36840C9186717j6116665O277345K4452816J1975600k1558111m4186251l6794334
$$ y = [19329248, -806944, -4009266, 12296859, 25121438, 20619351, 8802388, 5568242, 13252123, 23107274, 28310825, 27498086, 20653329, 10676163, 7215696, 18124081, 34942338, 37818322, 20159763, -1908931, -11302968, -9337699, -3653387, 9317606, 33048877, 52751672, 50177995, 32014684, 21997254, 26539772, 30235273, 25701212, 23830788, 29829413, 32765921, 27218588, 23326857, 25149170, 20381603, 4195438, -7297633, -3004886, 2461133, -7396002, -21971804, -19094969, 1196533, 18496490, 20833285, 14252966, 9170982, 12438370, 27330404, 46907278, 53391532, 39186717, 23070052, 29347397, 53800213, 65775813, 44217702, 31451, -36762883]
36833c6762883o213037K4611969L2679107J3448504j1031435j4142927K859040
36826E448338J4708692Q866667j201976l089588l538303j0335594j6049302j1887178
36818a7078244k219744N245080R894978J0939945M978429k084602K043787J3661815
36810B5381444J3244074k451963j0428206K440832J5742283Q029415o196170K312049
36802D8073758L0855762M6008231K8660389m254817k4773960k3920172j2952411
36795H7696780o096255p000007q338292l512607K567424L78468p557847q801237
36787D9336427k209046j906662j3046027j9593993q465368Q001109R559295j703368
36779A9972367o113796L285438J1872653N713498r397807j4966459q71770K2219370
$$ y = [-36762883, -42975920, -18363951, 14315156, 27763660, 16732225, 2589298, 5448338, 20157030, 29023697, 27821721, 24732133, 21193830, 10858236, -5191066, -17078244, -19297988, -14052908, -4157930, 6782015, 11760444, 9675842, 11719629, 25381444, 38625518, 36173555, 25745349, 28186181, 43928464, 51957879, 45761709, 48073758, 78929520, 124937751, 153598140, 149343323, 124569363, 100649191, 87696780, 81600525, 74600518, 66262226, 62749619, 65317043, 65695511, 58137664, 49336427, 47127381, 45220719, 32174692, 12580699, 4115331, 12116440, 21675735, 19972367, 13858571, 17144009, 29016662, 34730160, 25332353, 10365894, 9494124, 31713494]
36771C1713494L1464868J6044177q507204j7304808o177655O014730M741941m899689
36763E3089854j2659149j6525376j5792783p029651M784384O437218l262228q739229
36755C03040k235391M014882J178207K67269R801110J5600315L005654j5780376
36747A6154710j8873205p926410j600931m553228n753805j543116K225822O925909
36739a4944254J7694068K5432548J4699442r398399k2872494j4782273K89237
36732c882125N422283Q91289l905115l871240J278018Q528851J0178556J012888
36724A5653405j1256976j2443736K26842J5495009K2388026J8123450M924712
36717E3110732r889990j4414445n857262N8068j1470627k9016740k7265877l615490
$$ y = [31713494, 63178362, 79222539, 70715335, 53410527, 47232872, 53247602, 57989543, 53089854, 40430705, 23905329, 8112546, 1082895, 5867279, 12304497, 9042269, 303040, -1932351, 2082531, 3260738, 3528007, 13329117, 28929432, 31935086, 16154710, -2718495, -10644905, -12245836, -16799064, -22552869, -24095985, -21870163, -14944254, 2749814, 28182362, 42881804, 33483405, 10610911, -4171362, -3882125, 1540158, 2431447, -1473668, -5344908, -4066890, 4461961, 14640517, 15653405, 4396429, -8047307, -7820465, 7674544, 30062570, 48186020, 53110732, 43220742, 28806297, 22949035, 23007103, 11536476, -17480264, -44746141, -48361631]
36709d8361631J7616427J9839791J2474948R012624P329715J808432k880272k670804
36701A4169230m131775j0594171j1386277O23915J2093620O509210r364102j3986659
36693a6067009k248487R220397Q142033J652937Q24820L824235K789162j541161
36685F596927j994294K048881K869523l807703j1357283r523370K983202J5313523
36677C129406J4235013k331287k0883176k3257217m980044J7651398K2520062
36670F084155M928352j7214416k2772079q440881J1142058J9558696J1612045
36663D897930m888050j5411350j0628214L387965J1152179P504800L444207O415305
36655E874772O600670m725110j4883556p300944Q295694P326066j0044196j7314439
$$ y = [-48361631, -30745204, -10905413, 1569535, 10582159, 17911874, 19720306, 16840034, 14169230, 10037455, -556716, -11942993, -11319078, 774542, 7283752, -2080350, -16067009, -18315496, -9095099, -953066, 699871, 1524691, 5348926, 8138088, 6596927, 4602633, 6651514, 9521037, 5713334, -5643949, -15167319, -12184117, 3129406, 17364419, 15033132, -5850044, -29107261, -34087305, -16435907, 6084155, 11012507, -6201909, -28973988, -37414869, -26272811, -6714115, 4897930, 9880, -15401470, -26029684, -22641719, -11489540, -3984740, -540533, 5874772, 12475442, 7750332, -7133224, -14434168, -6138474, 1187592, -8856604, -26171043]
36647b6171043l678776R249891K714060j1995035j5605715q125702J794058J4058022
36639c7760240K5722929K2171627O98628j4639779m837104J2959042J1141856
36632A5456959n413751j0046901K404601J2852658J2619232J1064188J0625839
36625D9562825K974046q932176j1727513o726989q474103j5986875j2405048K327856
36617i387977O765666n513230j2344691Q55895J6302581J2625773j420339j819567
36609F064111J4859012K8453750K1682782k215780k3700670k3540807k397878
36602A9204520J5153923P711675j3134478j7829683l173368L741689q176744j3567418
36594a0069884P000774L1152780K6399327j345209j9060837j4710737n628396
$$ y = [-26171043, -29849819, -20599928, -17885868, -29880903, -45486618, -53612320, -51818262, -37760240, -12037311, 10134316, 10832944, -3806835, -8643939, 4315103, 15456959, 10043208, -3693, 2400908, 15253566, 27872798, 38936986, 49562825, 52536871, 43604695, 31877182, 25150193, 16676090, 689215, -11715833, -9387977, -2622311, -8135541, -20480232, -19624337, -3321756, 9304017, 7883678, 6064111, 20923123, 49376873, 71059655, 68843875, 45143205, 21602398, 19204520, 34358443, 42070118, 28935640, 11105957, 7932589, 11674278, 3497534, -10069884, -3069110, 28083670, 54482997, 53137788, 34076951, 19366214, 13737818]
36587A3737818m062140j900789P668625J5407507J0413948m060920j5073153j3063025
36579I067871M05259J2058343P112703j2871943k7260668j9976711j51634J0719677
36571b0897103O162198k433400m979807j471846M953285J0494301Q329292l517490
36563c360570j3590208q945352N603701J3269944R373448M930299N150878Q99760
36555A3331900j2244510k1149623j2297896P398352J8748512J4995311P604646
36548A6386692P759043J1485974P474876n483629j5525591j2496539l22155Q773646
36540A8052317Q462428J618488p010530j3697448j3433038m698825L572048J087055
36532f047505o634661l804466R699014J4744345L223447o669957l8279P400522
$$ y = [13737818, 9675678, 7774889, 15443514, 30851021, 41264969, 37204049, 22130896, 9067871, 9473130, 21531473, 28644176, 15772233, -11488435, -31465146, -31616780, -20897103, -14734905, -17168305, -22148112, -23619958, -18666673, -8172372, 156920, -3360570, -16950778, -25896130, -20292429, -7022485, 2350963, 7281262, 12432140, 13331900, 1087390, -20062233, -32360129, -24961777, -6213265, 8782046, 16386692, 24145735, 35631709, 43106585, 37622956, 22097365, 9600826, 9278671, 18052317, 26514745, 28133233, 21122703, 7425255, -6007783, -10706608, -7134560, -6047505, -12682166, -16486632, -6787618, 7956727, 11180174, 4510217, 4471938, 11872460]
36524A1872460o156301k8747961k7003434M193002L1285884K6681807J902204
36517A4027661j2887189n879312R616788J3846344j234978k3566000k8262425
36510c4339111m493111K5035750K7578511M199101j1069111q45367J2353845N296325
36502B3716832r484959q212019M386383P388219M08855k323069l586108j5074078
36494b779944k3999833o291441K5151182K6841705q533165l2510407j0809487
36487c2931390K3985236K2517753q390533k3802303j1351300K198432N055064
36480b2719041J2098420K1490932R099648k0987674k7064504N540444L1660836
36473I119061J1260832k6320885k4852238J3920833L4470849R406605k7001873
$$ y = [11872460, 5716159, -23031802, -50035236, -45842234, -14556350, 12125457, 14027661, 1140472, -4738840, 4877948, 18724292, 17489314, -6076686, -34339111, -38832222, -13796472, 13782039, 17981140, 6912029, 6066662, 18420507, 23716832, 14231873, 6019854, 10406237, 17794456, 18203311, 15880242, 12294134, -2779944, -26779777, -33071218, -7920036, 18921669, 10388504, -22121903, -32931390, -8946154, 13571599, 5181066, -18621237, -29972537, -27774105, -22719041, -10620621, 10870311, 19969959, -1017715, -28082219, -22541775, 9119061, 20379893, -5940992, -30793230, -16872397, 17598452, 27005057, 3184]
36466C184l2619041q527393J6032780K2645296J2915570k547478j0888155m827300
36458g812537P502146J0337587J953846l242063K416092Q425603L266626q478340
36450A4368960j2770502k732001J4695062K3633935J2580093j0774999k3465744
36443A5534804j4467126Q71924M789621K201413M707899N491106m416238r925193
36435D788210M770130J9161068L930962k2630289j5702589J8529770K4215952
36428C7063214j2513418l4734538n832791K9635463J9214840j4300611j7215220
36421A316939P036728J4736773l22656p884833l615592r833148k1995169j2362828
36413c2923786J4520538K4010567J0780666M895869J4942152J5645304j252640
$$ y = [3184, -32615857, -41143250, -25110470, -2465174, 10450396, 7902918, -2985237, -7812537, -310391, 10027196, 11981042, 8738979, 11155071, 19580674, 22847300, 14368960, 1598458, -1133543, 13561519, 37195454, 49775547, 39000548, 15534804, 1067678, 1939602, 6729223, 8930636, 13638535, 19129641, 14713403, 4788210, 9558340, 28719408, 32650370, 10020081, -5682508, 12847262, 37063214, 24549796, -10184742, -16017533, 13617930, 32832770, 18532159, 1316939, 8353667, 23090440, 22767784, 14882951, 11267359, 1434211, -20560958, -32923786, -18403248, 5607319, 16387985, 21283854, 36226006, 51871310, 50618670]
36406E0618670j3235312j2609656j6903689k4329136j0428803J7843582J9439334
36399A0394990r850741k0193744J0237546L2083588L524131l8076076l3646995
36392d5527301P353738K9629249J8171345N221644O197389L094648j1328878j9780017
36384f968183j5045962j1152935j3909059j0198859O614054K3167470K3311374
36377d182100M358491k2304484l5414505j8327504J6576091L2229483J3323241
36370a3741287q981437j257795K2657733K6127600O704025p515529p571768j0388323
36362F033219j9367406j6919542L30143J3096908J2208218R758205J1709896Q285363
36354B5135004j257634j916590R931186J7134240Q515627o494418j6910873k2797526
$$ y = [50618670, 37383358, 24773702, 7870013, -16459123, -26887926, -9044344, 10394990, 544249, -19649495, -9411949, 22671639, 26195770, -11880306, -45527301, -38173563, -8544314, 9627031, 14848675, 21046064, 24140712, 12811834, -6968183, -22014145, -33167080, -47076139, -57274998, -50660944, -27493474, -4182100, 176391, -22128093, -57542598, -75870102, -59294011, -27064528, -13741287, -22722724, -23980519, -1322786, 24804814, 31508839, 23993310, 16421542, 6033219, -13334187, -30253729, -29923586, -16826678, -4618460, 5139745, 16849641, 25135004, 23877370, 21960780, 31891966, 49026206, 57541833, 51047415, 34136542, 11339016]
36346A1339016k3254803j3650636n55040K266835k266956K527932J5804458J6589111
36338H799917k42791j2582196p117242l53824p871673j6158363n158985J8068728
36330b2616429K8531035J6491506l824081j2655072k874999J4213822J8016347
36323C5282129J790524j5506724j3820548k463632m205057j4085346n347481K1208005
36315B851870K9758221M069949k3894321j9840839O241059K1731069J6461965
36308C7378973L096575q338960j3835719q738404L167167Q146399M366730P310193
36300C2552954K1358061L0808233L3849386N3035354Q7669420R0652061L0605223
36293C80530692m9969348q2803297o1594848l5603310k9480308k2033567k610168
$$ y = [11339016, -11915787, -25566423, -26121463, -23854628, -26121584, -23593652, -7789194, 8799917, 8557126, -4025070, -11142312, -11496136, -19367809, -35526172, -40685157, -22616429, 5914606, 22406112, 18582031, 5926959, 3051960, 17265782, 35282129, 37072653, 21565929, 7745381, 5281749, 1076692, -13008654, -18356135, 2851870, 32610091, 36680040, 12785719, -7055120, -814061, 20917008, 37378973, 40475548, 32136588, 18300869, 9562465, 12729632, 20876031, 25242761, 32552954, 53911015, 84719248, 118568634, 171603988, 259273408, 349925469, 380530692, 330561344, 247758047, 186163199, 150559889, 121079581, 99046014, 96435846]
36286I6435846N871457o754044j4875868j976382Q312923p971176l2460318l1190272
36278A5392166o333499Q839574M06897p602250R615936L9593113M5207279J1808877
36270A16928093l1157032m3543488k1675144K783919P937198L282471J080497
36263C5636514o729183k5309629l4351086j5231358J5005727K4935772J3061231
36256G017988K744980J853309k085410j0880496j0571713J644923J1658336J1505770
36248A2887687O222094q95048q348280o981158N557523R062128j1397929l0973026
36240b4866009j4932298K2476176L2135670M646213j5749452k218708J6492111
36233A7983703Q931230j0552707j3662105l841697j47310k672413k572149l720936
$$ y = [96435846, 102307303, 95553259, 80677391, 78701009, 87013932, 79042756, 46582438, 15392166, 9058667, 17898241, 18305138, 10702888, 20318824, 59911937, 105119216, 116928093, 85771061, 42227573, 20552429, 23336348, 31273546, 34556017, 35636514, 28907331, 3597702, -30753384, -45984742, -30979015, -6043243, 7017988, 9762968, 11616277, 9530867, -1349629, -11921342, -10276419, 1381917, 12887687, 19109781, 18214733, 9866453, 2885295, 8442818, 17504946, 6107017, -24866009, -39798307, -17322131, 14813539, 19459752, 3710300, 1491592, 17983703, 26914933, 16362226, 2700121, -1141576, -1288886, -3961299, -6533448, -10254384]
36225a0254384q521100l978341J3337502K0703730L457961j5924078j0670359
36218a1849069Q426723J3339828L109254l116722k471179n848096r882523k634865
36210a0926649J0075700J2706654Q079680J0167538J4852447N821565j3862573
36203C6914362k3280501j6091192o971171n241328m367254P55912N428493N850741
36195g001938L227262j615744n392269m85245J0810243J0885167p501342k2876858
36187a9950724j3381034R367656J9111365J4919965J3737269J4469877L301177
36180D1575551j2070472j0083577M410915M401036j2341401j7705121j309899
36173c122968J2538882P012765l151676m162656o121746j5255993j4907653L178441
$$ y = [-10254384, -18775484, -22753825, -9416323, 11287407, 14745368, -1178710, -11849069, -3422346, 9917482, 13026736, 9910014, 7438835, 1590739, -8291784, -10926649, -850949, 11855705, 19935385, 30102923, 44955370, 50776935, 36914362, 13633861, -2457331, -9428502, -14669830, -19037084, -18281172, -12852679, -7001938, -3774676, -5390420, -10782689, -11267934, -457691, 10427476, 2926134, -19950724, -33331758, -23964102, -4852737, 10067228, 23804497, 38274374, 41575551, 29505079, 19421502, 23832417, 28233453, 15892052, -1813069, -3122968, 9415914, 16428679, 13277003, 9114347, 2992601, -12263392, -27171045, -23992604]
36165b3992604J6407794N656396j1358376q017099R378973J6100426R911212P605304
36157B1692026J0541339L924168j2348420j9545831r936010J190522l06137p526904
36149a2315247n129119Q007289J7079666J0034306o592337j3806474l906898P896640
36141A267826M657684n622042j955271J2654217J0761355j5044564l2741141j4010723
36133d0032659K3051399L7375568J8211175q342842j7860949r768980M780611
36126G413323J5778925J5416782L453331q341493r920797p204250r513306j0701110
36118c618595n92336J2446980J2395653L616662K983323P078837l445484k4772727
36110F092313k7906202n813378R945083k120832j8166300q534115J2762502J2348815
$$ y = [-23992604, -7584810, -1928414, -13286790, -21303889, -11924916, 4175510, 14086722, 21692026, 32233365, 36157533, 23809113, 4263282, -5672728, -4482206, -4788343, -12315247, -17444366, -9437077, 7642589, 17676895, 11084558, -2721916, -6628814, 1267826, 5925510, 303468, -1651803, 11002414, 21763769, 6719205, -26021936, -40032659, -16981260, 20394308, 38605483, 30262641, 12401692, 2632712, 7413323, 23192248, 38609030, 42062361, 33720868, 23800071, 16595821, 7082515, -3618595, -4210931, 8236049, 20631702, 24248364, 27231687, 34310524, 30865040, 6092313, -21813889, -27627267, -17682184, -19803016, -37969316, -46503431, -33740929, -21392114]
36102b1392114n282557m821122J9894074L3248264J3166641j6139133k3183204
36095d509151j2294412n597488m328050M345367J5647405J2481937j629212l358895
36087G57501J3068608K4303159J2748749p835465j4600484p028373p99026k720586
36079A7894083q416455j5821081k3224762k0382272r97896J9342476J8990452
36072a2615455M156059L077352K0335775K3692073o756953l9961384l2427080
36065d0499613Q101841L1128677J4234575r200944l992178J6758799J8563210
36058C5094367l93642j3007135r470528o119843r322361m445782J0245766J0599874
36050A3180716j3656885l2720606j7222343J4170633K0477490J118813m723032
$$ y = [-21392114, -26674671, -31495793, -11601719, 21646545, 34813186, 18674053, -4509151, -16803563, -22401051, -26729101, -22383734, -6736329, 5745608, 4116396, 757501, 13826109, 38129268, 50878017, 43042552, 28442068, 21413695, 20614669, 17894083, 9477628, -6343453, -29568215, -49950487, -50948383, -31605907, -12615455, -8459396, -5382044, 14953731, 38645804, 31888851, -8072533, -40499613, -32397772, -1269095, 12965480, 3764536, -227642, 16531157, 35094367, 34700725, 21693590, 12223062, 6103219, -3219142, -7664924, 2580842, 13180716, -476169, -33196775, -50419118, -36248485, -15770995, -14652182, -19375214]
36043a9375214J7642884L3584494J3376651k1163676k9169085q132132R672742
36036c563336O152175n961228j1794949j2820315j2679505o584103O147896J4600474
36028b6502891J1396242M521058M406960P372306K492370r407818j4566268n026094
36020b5314135R577994J3419932L341263r495564j5094849j4056970r975615k291917
36012d9889861O410053O155869m616307p702262J1472721L4229933K7514495o077235
36004A7497406k6270246j2930460N098859j360022j4533730k699926K2477730
35997a2720389K2555811m096071j8294660j244203J9906911J7679773J040484
35990B4827656q695831r957894j0489804p798500N80869M813215j513788p971031
$$ y = [-19375214, -1732330, 31852164, 45228815, 24065139, -5103946, -13236078, -3563336, 2588839, -3372389, -15167338, -27987653, -40667158, -47251261, -41103365, -26502891, -15106649, -10585591, -6178631, 1193675, 3686045, -5721773, -20288041, -25314135, -15736141, -2316209, 1025054, -8470510, -23565359, -37622329, -47597944, -49889861, -43479808, -37323939, -41940246, -49642508, -38169787, -3939854, 23574641, 17497406, -8772840, -21703300, -16604441, -17964463, -32498193, -35198119, -12720389, 9835422, 5739351, -12555309, -13799512, 6107399, 23787172, 24827656, 16131825, 6173931, -4315873, -12114373, -11533504, -6720289, -8234077, -16205108]
35982a6205108m871175N05160K66280K580382J4218750K1295051Q953696j0235163
35974A6507873j0660358Q364645K0519187Q369848j6076268k9038432k0608371
35967b2621876q96686J0854759L977696j0666616j0505887R127330K4754651J5687816
35959A9711187n520327j1249686M15063N824587m925027j3570702n029757R010411
35951e334251J0760463L757721L012545Q494328O933459l747878r506694k350420
35943A2019273O845780N043358l119843k625010Q744541J5653594N747143j3488654
35935C4820182k3840364j7422750k561254Q315593R939280M544834k182086m536564
35927G076871j206107L038622L734531K889305L168694l60887j2279607k2356447
$$ y = [-16205108, -21076283, -20571123, -20304843, -17724461, -3505711, 17789340, 26743036, 16507873, 5847515, 14212160, 34731347, 43101195, 27024927, -2013505, -22621876, -23518562, -12663803, -8686107, -19352723, -29858610, -20731280, 4023371, 19711187, 14190860, 2941174, 3356237, 9180824, 4255797, -9314905, -14344662, -5334251, 5426212, 9183933, 12196478, 20690806, 27624265, 23876387, 14369693, 12019273, 18865053, 23908411, 20788568, 18163558, 26908099, 42561693, 48308836, 34820182, 10979818, -6442932, -9004186, -688593, 9250687, 13795521, 11613435, 7076871, 5870764, 8909386, 12643917, 15533222, 18701916, 18341029, 6061422, -16295025]
35919a6295025j3958454R149185K0486103N721408j4444419j2561974N044552
35912a6858624Q578164p603406j4726526M159912K3261179J1257478j7410409
35905i342232j9734273J0761325L0899020J1655317j7128257j2214992J6630879
35898A1526787K3569738n97184j6503916j580562J6254188Q560303q615689q373199
35890B4240466J11613n567287j5349281n578857J2000538N308401k0418179k5894450
35882c1147036q23422K0574849J5925426M625987O640022J0314974J690040p931338
35874A9869502o658446m937342j0669595r139736P447512J7009205K295021j5126319
35866H9802o797462J5721772J8488830l689233k4721807k6305966j1972494Q891125
$$ y = [-16295025, -30253479, -21104294, -618191, 5103217, -9341202, -21903176, -16858624, -8280460, -15883866, -30610392, -26450480, -3189301, 8068177, -9342232, -29076505, -18315180, 12583840, 24239157, 7110900, -5104092, 11526787, 35096525, 34499341, 17995425, 16414863, 32669051, 41229354, 32613665, 24240466, 24352079, 18784792, 3435511, -2143346, 9857192, 15165593, -5252586, -31147036, -31970458, -11395609, 4529817, 9155804, 15795826, 26110800, 27800840, 19869502, 13211056, 8273714, -2395881, -11535617, -4088105, 12921100, 15216121, 89802, -6707660, 9014112, 27502942, 23813709, -908098, -27214064, -39186558, -30295433]
35858c0295433K5223282K1886878j470718j8574643q346142J2427881J4404314
35851A5255419R23313k764744N340968M455370q814450j5509372q445770L49786
35843i209480N360804J0513538R362803n515160j7396689n739404J2255595K588318
35835B220325k3703348j9175338K1573835M5543950K2686495r055537r794520
35828C0295862Q88657j0770745k8864869j9514238N046010Q323040n498522l668455
35820b3763260J1080285N673794j7717342j9057546R162751K4206415L477571
35813f937332j7856079o505580J5588366J2490871o342125q634447M132880O560626
35805g502820j98238O476729K1427559J4039752j5715906k7970898m385468K1047280
$$ y = [-30295433, -5072151, 16814727, 15344009, -3230634, -11576776, 851105, 15255419, 16178732, 13413988, 18754956, 23210326, 14395876, -1113496, -9559266, -9209480, -3848676, 6664862, 16027665, 10512505, -6884184, -12623588, -367993, 2220325, -21483023, -40658361, -19084526, 26459424, 49145919, 40090382, 30295862, 31184519, 20413774, -8451095, -27965333, -22919323, -14596283, -20094805, -23763260, -12682975, -7009181, -24726523, -43784069, -34621318, -10414903, -6937332, -24793411, -31298991, -15710625, -3219754, -9561879, -18196326, -14063446, -7502820, -7701058, -1224329, 20203230, 34242982, 18527076, -9443822, -13829290, 7217990]
35797G217990J5857088j333900K469062J6097528M405894k7670088l7439327j1189932
35789c1585685J4818263J1720746k273575k76651Q316089J006099j3355372q599749
35781b0229835J2329651K0256986O527279n620294o89986P468579M074745j684413
35773B2432712M044662J4134555J2432201j97566r419842j0529438j1758146j6844648
35765D294490j8740371j2390241k786380L472497O750380R584974Q906515J77450
35757g30686j1816446j3887202m16418J6363140J9371564Q319874p69935J090559
35749A7524450M015964l473276j5971457k0064241j3721140m907282L061783J1110775
35741b2424424J3576322L703650j0381649j1181065L370256J4834808R437313
$$ y = [7217990, 23075078, 21741178, 24210240, 40307768, 44713662, 17043574, -20395753, -31585685, -16767422, -5046676, -7320251, -7596902, 719187, 1725286, -11630086, -20229835, -7900184, 12356802, 18884081, 13263787, 12573801, 20042380, 24117125, 22432712, 26477374, 40611929, 53044130, 52846564, 43426722, 32897284, 21139138, 4294490, -14445881, -26836122, -29622502, -26150005, -19399625, -9814651, -908136, -730686, -12547132, -26434334, -26850752, -10487612, 8883952, 17203826, 16433891, 17524450, 21540414, 18067138, 2095681, -17968560, -31689700, -36596982, -33535199, -22424424, -8848102, -5144452, -15526101, -26707166, -23336910, -8502102, 935211]
35734I35211m148476r091931j957699P987550J2712615J0348115K121290p746825
35726A1159850j2561443r514694l227250K77020m00697m138193r761531j2871160
35718d1038098o499977Q768441J9435796J1836993r181390k0543340m860208K6669026
35710a5412757M1126602J9127291j9914769l7550659k1924129J69553L454067
35703c0924801p62382J2249650L5027598L3946927J504117k6665418k0315475
35696D060216K917581N106624j5989264k5275491k983659K6560473K9374199P359899
35688C1130578q430500k601429P339082K156773j0172738j1091206l657340n945331
35680a272111j6482572j2231314J2595363L0357243J7797422r323533j8975187
$$ y = [935211, -3213265, -12305196, -14262895, -6275345, 6437270, 16785385, 18906675, 11159850, -1401593, -10916287, -14143537, -13866517, -14267214, -18405407, -28166938, -41038098, -47538075, -38769634, -19333838, -7496845, -16678235, -37221575, -42081783, -15412757, 25713845, 44841136, 24926367, -12624292, -34548421, -34378868, -30924801, -31687183, -19437533, 15590065, 49536992, 51041109, 24375691, 4060216, 6977797, 12084421, -3904843, -29180334, -32163993, -5603520, 23770679, 31130578, 22700078, 20098649, 27437731, 29594504, 19421766, 8330560, 4673220, -1272111, -17754683, -29985997, -17390634, 12966609, 30764031, 21440498, 2465311]
35673B465311n940928R192468J3233610R401889K11919j4700052k6421449k4280633
35665c6837865j3898348p912591k923515J1470564K5352961J8574842k405956
35658h579908r212549K403690M630578j3444220k3124194k080269K6796889K9086943
35650F476960R251620j792333N109241J0824433K444441j1972515k1604369k4671099
35642b5933621k1179145j0334382K801784R539984P578876K016489j397676N34544
35634c6373147O363068P838764o58807q029256K783672K4540464K7056596J007635
35626B4528989k2067438j3339910J0525022J4939554J005877j993171J0999072
35619B4597995J3249419o319015k2638605j3452664P943879J4771828K867021
$$ y = [2465311, -3475617, 5716851, 18950461, 28352350, 28564269, 13864217, -12557232, -36837865, -50736213, -58648804, -61572319, -50101755, -24748794, -6173952, -8579908, -17792457, -15388767, -10758189, -24202409, -47326603, -49406872, -22609983, 6476960, 15728580, 13936247, 19045488, 29869921, 32314362, 20341847, -1262522, -25933621, -47112766, -57447148, -54645364, -45105380, -37526504, -35510015, -36907691, -36373147, -30010079, -22171315, -22830122, -30859378, -28075706, -3535242, 23521354, 24528989, 2461551, -10878359, -353337, 14586217, 15592094, 13598923, 24597995, 37847414, 31528399, 8889794, -4562870, 3381009, 18152837, 21019858]
35612B1019858j0823697j3084923m453721O811895J0677556K088565j1549810
35605F85723j6537970j0156753k576152R53761O608004J5407954J5521996J875040
35597A1781603r782370l013604J4189048K0310232J0601536m63768m768862j0111096
35589B8742719k0493070k4159111j1548331O707788J2586371M803092k794679
35582f155221l453400m183229r319376j0904145j421983J3212303K0467393J5367376
35574A3609718K949426p964572r891528k331331M521521J60036r382565p343140
35566a5672435O404321J0550409m853461j9461058j3202412K536416P107755O386136
35558b0204329J5731595K1563710k4957l1754972k8444243J1173852L2545805
$$ y = [21019858, 10196161, -2888762, -7342483, -530588, 10146968, 12235533, 685723, -15852247, -26009000, -28585152, -27631391, -21023387, -5615433, 9906563, 11781603, 1999233, -1014371, 13174677, 33484909, 44086445, 43622677, 38853815, 28742719, 8249649, -15909462, -27457793, -20750005, -8163634, -3360542, -6155221, -9608621, -13791850, -23111226, -34015371, -35437354, -22225051, -1757658, 13609718, 16559144, 8594572, -1296956, -3628287, 893234, 1053270, -8329295, -15672435, -9268114, 1282295, -3571166, -23032224, -36234636, -33698220, -26590465, -20204329, -4472734, 17090976, 17066019, -14688953, -43133196, -31959344, 586461]
35551E86461M482013l2410167k6383794J1322906L0767657J7429053P02990L98318
35543F895437M361840j041170r669100j0277937j785923R797273J6229736J0319064
35535B4829220m504516j3401713q913931r01538J948527N135149J0248799M496144
35527A8936141j2612041j4990996J0453191L1492218J2818183k5909290l4798705
35520a4611299o775411J7263609J3153174j036857p642206j3383602k0300871
35513c3333463j3988207L857653Q754275l413192l344448K0628857L5026418J2881483
35505B7069376j8982774j8423935J0064473K7616571J8820352K107684p502878
35498D0768869j2431017j3485703o663636J195891j576074r551203o351125P413182
$$ y = [586461, 5068474, -27341693, -53725487, -42402581, -11634924, 5794129, 6497119, 6895437, 11257277, 10216107, 547007, -9730930, -11516853, -1719580, 14510156, 24829220, 20324704, 6922991, -1990940, -2892478, -943951, 4191198, 14439997, 18936141, 6324100, -8666896, 1786295, 33278513, 46096696, 20187406, -14611299, -21386710, -4123101, 9030073, 7993216, 351010, -13032592, -33333463, -47321670, -43464017, -34709742, -38122934, -41467382, -20838525, 14187893, 27069376, 8086602, -10337333, -272860, 27343711, 46164063, 48271747, 40768869, 28337852, 14852149, 8188513, 9384404, 7808330, -1742873, -8093998, -680816]
35490f80816J3910592O789091q80593j12999K511997J478649J705797M627559
35482B9349277J944533p962195j2184087k635410Q575457N577648p440926j2159039
35474C065258k510227P694754N283478m416338o442488K655595J1019296Q605313
35466B4954641k79645n891599p360411r737192j1397397n944066M145619Q322678
35458c187372M547029K172902M172652J106294r207756j1595444L038784J7387920
35450H435009R764382j1880485j9408467m749984J1684367J4274201J0622819
35443A8741842R417831K641140j5176960k7929151j8435470K822967J1021520
35436a6896281L729007J819320J3256849J9213772M960433j4924547j7173140
$$ y = [-680816, 13229776, 20018867, 19138274, 19025275, 21537272, 23015921, 24721718, 29349277, 31293810, 23331615, 11147528, 8512118, 17087575, 22665223, 15224297, 3065258, 555031, 8249785, 13533263, 9116925, 2674437, 5330032, 16349328, 24954641, 24674996, 18783397, 11422986, 1685794, -9711603, -15655669, -11510050, -3187372, 1359657, 3532559, 7705211, 8811505, -396251, -11991695, -8952911, 8435009, 18199391, 6318906, -13089561, -17839545, -6155178, 8119023, 18741842, 28159673, 30800813, 15623853, -12305298, -30740768, -27917801, -16896281, -13167274, -11347954, 1908895, 21122667, 26083100, 11158553, -6014587]
35429f014587k683301Q553239P941746N012478N383978J138045j1269002j9210023
35421a1147427j1054966M188434O895951o702914j8954277j2954374P209027K1999949
35413b0520597J8600304L375667p988874r228831p638904r420084q707875K012823
35405c9516371J6345323K0255666J2557766O440502Q475472R505622K069145o542043
35397B9591082q268122r306974j7662924k4698270j5853695M266004J5064467
35390b6868432R157070J922302O566055J4313466R860288l335186p065448M790498
35382I340613J6482815J1662489m611812j3422764p268981K640278M831936J808848
35374B1463422L23397j358991n956596o591364J247921M559850j0381169k9215567
$$ y = [-6014587, -8697888, -144649, 7797097, 12809575, 18193553, 19331598, 8062596, -11147427, -22202393, -18013959, -11118008, -17820922, -36775199, -49729573, -42520546, -20520597, -1920293, 1455374, -6533500, -15762331, -23401235, -32821319, -41529194, -39516371, -23171048, -2915382, 9642384, 16082886, 24558358, 34063980, 36133125, 29591082, 21322960, 12015986, -5646938, -30345208, -46198903, -41932899, -26868432, -17711362, -15789060, -9223005, 5090461, 14950749, 11615563, 4550115, 9340613, 25823428, 37485917, 32874105, 19451341, 12182360, 14822638, 19654574, 21463422, 21786819, 20427828, 14471232, 7879868, 9127789, 13687639, 3306470, -25909097]
35366b5909097k1833506J2343113L6485412K5032605k594937j3517444o675080
35359C331066m530952j3387365j6965607m746040J4000227K4189920J9317274
35352B1208523M204588o814426r39910J4673906J6339308l519307k2234691k0496149
35344B421842j1682660j5062336j8110935K008257L1011047L0367542k808702
35337A8144055k6527421j3204791J4561622K1352196N028375j1512274j4441808
35330f600046p561841L48054L500419K284655L885903J1078310J2292236k139334
35322A7088356j8062899j4122580K177803L365774j1518607j2922451Q343388
35315b5651216K2616063J0843453l182680M343723J4734575J265384j9880361
$$ y = [-25909097, -47742603, -35399490, 1085922, 26118527, 23523590, 10006146, 3331066, -1199886, -14587251, -31552858, -36298898, -22298671, 1891249, 21208523, 25413111, 18598685, 17658775, 32332681, 48671989, 45152682, 22917991, 2421842, -9260818, -24323154, -42434089, -40425832, -9414785, 20952757, 18144055, -8383366, -21588157, -7026535, 14325661, 19354036, 7841762, -6600046, -14161887, -13813833, -10313414, -8028759, -4142856, 6935454, 19227690, 17088356, -974543, -15097123, -12919320, -9553546, -21072153, -33994604, -25651216, -3035153, 7808300, 4625620, 8969343, 23703918, 24969302, 5088941]
35308E088941j4508582R433335J1338663j6003821l3071681j4218697J5662164
35301c6279678K1601567O819527j418780N131417J1373123Q728088N750837P955769
35293B9661870O149932o418943j7654023j1125682P265944J2901361l448149k0309746
35285b977436j5630517M96922J926458j1762875j4021868N696455K2727426J3414110
35277a31325q985961j3293192N664505K2007977J5519231l107835q853753M435679
35269A3255326J5738053L762302k2410861l0258825o133521K2518525K1942023
35262A8413022j434762j2062769J508963J2613133O63125j8677497k1248357r276866
35254b9502008j47596K745956P809105J4186980J1476588l190219j9603060k3761586
$$ y = [5088941, -9419641, 13694, 11352357, -4651464, -37723145, -51941842, -36279678, -14678111, -7858584, -9277364, -4145947, 7227176, 15955264, 21706101, 29661870, 35811802, 29392859, 11738836, 613154, 7879098, 20780459, 17332310, -2977436, -18607953, -18111031, -16184573, -27947448, -41969316, -36272861, -13545435, -131325, -9117286, -22410478, -16745973, 5262004, 20781235, 17673400, 8819647, 13255326, 28993379, 32755681, 10344820, -19914005, -26047526, -3529001, 18413022, 16978260, 4915491, 6424454, 19037587, 19700712, 1023215, -20225142, -29502008, -29649604, -26903648, -19094543, -4907563, 6569025, 3378806, -16224254, -39985840]
35246c9985840q717879J6776854K9626279J5154714j0297140j6270906O18855
35239a3095063J3684753P953585j477586j405715j408520q030255p786936M023947
35231g541790O655462r244324j6772050M746632K9063353K1513047m147458r232039
35223A5040833O317322R865650m080852q536127K614923M111003j0994988j6721860
35215b384096k465683O516441m250423j0610592O341394K3143537J2318198r533824
35207A9074952q782248Q218288N685236k0125835l0922092o074291K2880584J8524099
35199H478693o125528q245589J7738749K9753611L199955k7289306j8023663J5040306
35191A4527228J8181221j6677566l7419954j1633276K4532280K4627066Q52295
$$ y = [-39985840, -48703719, -31926865, -2300586, 12854128, 2556988, -13713918, -13095063, 589690, 8543275, 7065689, 5659974, 4251454, -3778801, -11565737, -7541790, -886328, -10130652, -26902702, -22156070, 6907283, 28420330, 24272872, 15040833, 21358155, 31223805, 27142953, 18606826, 21221749, 25332752, 14337764, -2384096, -4849779, 1666662, -2583761, -13194353, -6852959, 16290578, 28608776, 19074952, 10292704, 18510992, 24196228, 4070393, -26851699, -32925990, -10045406, 8478693, 2353165, -5892424, 11846325, 41599936, 44799891, 17510585, -513078, 14527228, 32708449, 16030883, -21389071, -33022347, -8490067, 16136999, 16989294]
35184A6989294m479410J0696800J2804493o081044j8248635r507886K948800M976890
35176A0099302J892869l190372j3449241j7464763N46604K5148031K2192804n349479
35168B0425755j5077733P624290K3527968M124044j9867306r714394J6055080
35161B7097704J2447089j7184995k6092149J479594K6531613J4825487j5860335
35154B3244008k5977191q234924J0160423Q664461l474910o509019J407017M769599
35146D049464m704686j6249939j6832710q687506o14239Q239584K1258020K8670174
35138A5128162J8032392k944887j4122484j2287209j1630680j5440497j2189137
35131c5454340k740943l576596j4498639j1593353J3331425L2877093K2880377
$$ y = [16989294, 12509884, 23206684, 36011177, 29930133, 11681498, 2173612, 5122412, 10099302, 11992171, 8801799, -4647442, -22112205, -21565601, 3582430, 25775234, 20425755, 5348022, 12972312, 36500280, 40624324, 20757018, 11042624, 27097704, 39544793, 22359798, -3732351, -2252757, 24278856, 39104343, 23244008, -2733183, -10968107, -807684, 7856777, 4381867, -2127152, -720135, 4049464, -655222, -16905161, -33737871, -42425377, -43039616, -34800032, -13542012, 15128162, 33160554, 30215667, 16093183, 3805974, -7824706, -23265203, -35454340, -38195283, -41771879, -56270518, -67863871, -54532446, -21655353, 1225024]
35124A225024j218125q499485M597963J7046244J4732277j81632j8526932k6033375
35116a6858041j0840367J4553509J7125343j1567452l4722735j9610987J2860835
35109d9059895J9855189J536104m182125J5772221L2752219K4766210N359016
35102D6798939n052245o441669n976468k615837K427957J82522r537751j3398086
35094F387362n972109P62256j732122m944479l35759N848342N591213K974193
35086H578897M006609M676281p2788n564723n301187j176250J751237K567655
35078I465731J473915j275867l24177Q916504J7069999R469169q198708j2885427
35070B3711139l24330N025628j0125807k2393492q146776J5581460J5947309m076852
$$ y = [1225024, 6899, -8492586, -3894623, 13151621, 27883898, 27702266, 9175334, -16858041, -27698408, -13144899, 3980444, -7587008, -42309743, -61920730, -49059895, -29204706, -27668602, -31850727, -16078506, 16673713, 41439923, 46798939, 41746694, 35305025, 29328557, 26712720, 29140677, 29323199, 19785448, 6387362, 415253, 1177509, -554613, -5499092, -5834851, 13491, 5604704, 8578897, 12585506, 17261787, 17188999, 11624276, 6323089, 5146839, 6898076, 9465731, 10939646, 9663779, 9339602, 18256106, 35326105, 44795274, 36596566, 23711139, 23386809, 28412437, 18286630, -4106862, -12253638, 3327822, 19275131, 15198279]
35062A5198279j2311554N19898R796813M6121j3711113j6087826j3560967j3787855
35054d3898204q690505N295713J2402219K160889r650026n120311O954826Q585863
35046c1959536M144538Q136217J2844531m67902k2128338j9622657J1820561L5522956
35038a709630K3847709l534573j0867942L738909J2287028l93170k0456386k8437694
35030b5525749k0645896n727753P326698J4241549J5325065J2814024P208586
35023E016524j251074p629587n983682N15365K246397j843331k912900J508299
35015a0333989M036454M116752J0198205J8162387R756716j4028350k2223031
35008c14856J630997K6497599J5097254j8920165l0631300j0632087P021623K094867
$$ y = [15198279, 2886725, 3406623, 13203436, 13249557, -461556, -16549382, -30110349, -43898204, -52588709, -47292996, -34890777, -32729888, -42379914, -47500225, -40545399, -31959536, -27814998, -19678781, -6834250, -7302152, -29430490, -49053147, -37232586, -1709630, 22138079, 18603506, 7735564, 11474473, 23761501, 23368331, 2911945, -25525749, -46171645, -51899398, -44572700, -30331151, -15006086, -2192062, 5016524, 3765450, -3864137, -9847819, -9332454, -7086057, -8929388, -11842288, -10333989, -6297535, -2180783, 8017422, 26179809, 35936525, 21908175, -314856, 1316141, 27813740, 42910994, 23990829, -6640471, -17272558, -10250935, -8156068]
35000h156068o364101P45299J3712047J7644054J5081106J0488395j644332j8631336
34992B2875064k3654534j2326471k097521j874352K441837J6750369K0691284
34985B2805676J753415j8164850j5178807J19681N346457M085397J0301290J3765265
34977B4833524l077296k5740052k2977320K963657J7251002M680122j2066218
34970a4132581j1434174k92242O439830P804935P723250M136378k898945p816667
34962a0470216r853763j1968101q608495O428458J9800632J0742266j2666074
34955a6595293j7065925O401414K4405811J0696812j3436113j3124700N977045
34948a2740949R301096j0455585k2105487m125144K3591074K8283217O689327
$$ y = [-8156068, -14520169, -13774870, -62823, 17581231, 32662337, 43150732, 41506400, 22875064, -779470, -13105941, -15203462, -17077814, -14635977, 2114392, 22805676, 24559091, 6394241, -8784566, -8664885, -3318428, 766969, 11068259, 24833524, 21756228, -3983824, -26961144, -23997487, -6746485, -2066363, -14132581, -25566755, -25858997, -19419167, -11614232, -3890982, 245396, -2653549, -10470216, -20323979, -32292080, -40900575, -34472117, -14671485, -3929219, -16595293, -33661218, -27259804, -2853993, 7842819, -5593294, -18717994, -12740949, -3439853, -13895438, -36000925, -40126069, -16534995, 11748222, 18437549]
34941A8437549j6250129k1648927j4079396o072389P12017J1292342K1688030
34934e920903J9817405M061855r615934o670640O819806J3365869P510415j149102
34926B8218771n428308q205635j2343989j5002882j3912745r121911J654568J7467109
34918a6675022K4528203Q698747j9033141k7897415o874082J8098670J8998220
34911a55820K706918l517309P558382J6956925R287830r355894k3633834k4956085
34903b5108887j3680245L207480J4407856J3068654M747547J07089P93522L7494
34895b419490m696793q690324q586890n210439J077667Q661552J0160650Q91246
34887h812821r144048n245130Q682926J2170203j514159j3473125p804895L241106
$$ y = [18437549, 2187420, -19461507, -33540903, -39613292, -38901275, -27608933, -5920903, 13896502, 17958357, 8342423, 1671783, 8491589, 21857458, 29367873, 28218771, 22790463, 14584828, 2240839, -12762043, -26674788, -35796699, -34142131, -16675022, 7853181, 16551928, -2481213, -30378628, -37252710, -19154040, -155820, 2551098, -966211, 6592171, 23549096, 32836926, 23481032, -152802, -25108887, -38789132, -35581652, -21173796, -8105142, -3357595, -3250506, -2456984, -2419490, -7116283, -15806607, -24393497, -29603936, -28526269, -19864717, -9704067, -8812821, -17956869, -23201999, -14519073, -2348870, -3863029, -17336154, -25141049, -21899943]
34879b1899943q07433j4586283j4694201J577625R653619l084520j3462306M453182
34871e2850260L6032134M0179939O115733k7684508k2651521R062584K2602516
34864A0806617J722160k1842121j5142863J1595602K3370820R494887p832924
34857A2172178j0319970n380847n110474m681707L502433R159352k053936k0946691
34849b3659662k2582602k017055J7861642J9305182J1297283Q285882N857254
34842A4347924n344221j5541814q704143P086951P641042q021796j2621001O138927
34834a5018131K2494591J0925000j2713457j4153671P243968J9697748R474099
34827B7950147j961045J511211M237275r143549k1596213j0944794Q619028N556566
$$ y = [-21899943, -22707376, -37293659, -51987860, -50410235, -40756616, -43841136, -57303442, -52850260, -16818126, 23361813, 29477546, 1793038, -20858483, -11795899, 10806617, 12528777, -9313344, -24456207, -12860605, 10510215, 20005102, 12172178, 1852208, -3528639, -8639113, -13320820, -9818387, -659035, -2712971, -23659662, -46242264, -48259319, -30397677, -11092495, 204788, 8490670, 14347924, 9003703, -6538111, -15242254, -8155303, -514261, -8536057, -21157058, -15018131, 7476460, 18401460, 5688003, -8465668, -1221700, 18476048, 27950147, 25989102, 27500313, 31737588, 22594039, 997826, -9946968, -1327940, 4228626]
34819D228626j6343030k0595864L705854K2510727R751887j2993277j3709481
34812b3444558m47533k255857j6612318j3911581J0346247K5763533J5068667
34805e493400k220227o341072o040241j1977595r923051J2096764L0993714J6568775
34797A7663667j8064700k8575699j580354K7317105K5078642K546804j0222009
34790A4163456p237726m509986q345567q735333j258633M232232J194518j617910
34782a2114949N520357J5728689J4190809K047932k238283R054123J6713937P70569
34774D9673184k5795243l1114040j1125747L963176k304375p383047P978290K0462511
34766D354709Q04135k9865529k4318599J5596983L5614427R873565k0725530j3510050
$$ y = [4228626, -12114404, -32710268, -29004414, -6493687, 3258200, -9735077, -23444558, -23892091, -26147948, -42760266, -56671847, -46325600, -20562067, -5493400, -7713627, -14054699, -20094940, -32072535, -41995586, -29898822, 1094892, 17663667, -401033, -28976732, -30557086, -3239981, 21838661, 24385465, 14163456, 6925730, 2415744, -5929823, -14665156, -15923789, -11691557, -10497039, -12114949, -6594592, 9134097, 23324906, 25372838, 23134555, 32188678, 48902615, 49673184, 23877941, -7236099, -18361846, -14398670, -16703045, -24086092, -16107802, 4354709, 5158844, -24706685, -49025284, -33428301, 2186126, 12059691, -8665839, -22175889]
34758b2175889J2421268J2545147j1265518j8029136N128357K5213532J5932471
34751A9770232o135235j0385347N744155J8990223J2504701p017713k0220252
34744A3250764j5873389j389534O403200J459892m954865j696417N328809K404877
34736D933337j0766589k0098475j6054539l778863O050934Q455314N375016K187509
34728b3696356M040475J0832254J5339603J0061737l614928j4890483j2226993
34721a4154691N893156K5733124K7196334N449325j9341539k4587914j4275784
34714h087989r821911j4557899j0501742N944592J3342769K851465k414940J3136823
34706a0108832K6120826J1867504j0051291o028938J2783630P178461k1517994
$$ y = [-22175889, -9754621, 2790526, -8474992, -26504128, -21375771, 3837761, 19770232, 13634997, 3249650, 8993805, 27984028, 40488729, 33471016, 13250764, -2622625, -4012159, 2391041, 3850933, -1103932, -2800349, 2528460, 4933337, -5833252, -25931727, -41986266, -45765129, -39714195, -31258881, -25883865, -23696356, -19655881, -8823627, 6515976, 16577713, 12962785, -1927698, -14154691, -8261535, 17471589, 44667923, 50117248, 30775709, 6187795, -8087989, -17909900, -32467799, -42969541, -37024949, -23682180, -20830715, -23245655, -10108832, 16011994, 27879498, 17828207, 11799269, 24582899, 31761360, 10243366]
34699A0243366k9195534j247980K1525203P557420j7788488j6579269M394648
34692b1090634J3983597Q273048N182870M893373o134486k0039577j3866292R084482
34684a9713619J8467356L621301j0122292l888598M369842p924153k6784107j9642311
34676f1616581J4884288M2139438L7326670J3769325j620012k257583R81182K224141
34668D5830868L342827J855816o315133j4600075j2662739m523793k767742n092619
34660E067410K317903J5153023J0779481j1737651j9541663N495137L1602873
34653C9136513J9915786j6902625l4096662k0279202m135106j207145L324948
34646a4243493J4994464J5678535J197015n515175M236773P058541q270472j5540675
$$ y = [10243366, -18952168, -20200148, 1325055, 8882475, -8906013, -25485282, -21090634, -7107037, 1166011, 6348881, 11242254, 5107768, -14931809, -28798101, -19713619, -1246263, 2375038, -7747254, -11635852, -7266010, -15190163, -41974270, -61616581, -46732293, -4592855, 32733815, 46503140, 44883128, 42625545, 43606727, 45830868, 49173695, 51029511, 44714378, 30114303, 17451564, 12927771, 10160029, 5067410, 7385313, 22538336, 33317817, 21580166, 2038503, 7533640, 39136513, 59052299, 42149674, 8053012, -12226190, -16361296, -17568441, -14243493, 750971, 16429506, 17626521, 12111346, 16348119, 23406660, 15136188, -404487]
34638d04487K069734J4996817n950738l4442962k4644801J5777099L5729537J6440290
34630A9570489q197960q424050N453906J1805315P272722l045371j5809583k0272516
34622a1647048n583115J5087530J5297624k633962p297715J0181201J8978116
34615C2382631J57044j9614706j1585663Q772780J0910000p45359k417276K650818
34607B0510269o023752k1576540j7281976M477540J1871643l753129j3593059
34600b5369004K89413J7653689J6031739L225562l863656o025587q125243l076217
34592i259304R476842J0708688p802005k2208643j0275385J0648610R508684q286213
34584a7488726j0614124P952678J8032601L285353j5700974j4825366J492852
$$ y = [-404487, 1665247, 16662064, 10711326, -23731636, -48376437, -32599338, 3130199, 19570489, 11372529, 2948479, 8402385, 20207700, 27480422, 24435051, 8625468, -11647048, -17230163, -2142633, 13154991, 10521029, 3223314, 13404515, 32382631, 32539675, 12924969, 1339306, 10112086, 21022086, 20276727, 17859451, 20510269, 14486517, -7090023, -24371999, -19894459, -8022816, -11775945, -25369004, -25079591, -7425902, 8605837, 11831399, 7967743, 1942156, -6183087, -9259304, 217538, 10926226, 3124221, -19084422, -29359807, -18711197, -9202513, -17488726, -28102850, -20150172, -2117571, 1167782, -14533192, -29358558, -27865706]
34577b7865706J3403935J1974491K111947o375451l788596J0016667J8105581
34570A7582868M254882j9875493k5050425n731422J1281952O721621o164669q023436
34562b5004122j851448P92405J871601O839927R178900L305060j734693J334071
34554e268299L441973j397283l13945J2967720J6412055p306685l2260661k0314799
34546c4039924J7617097L1834118O772231j7325061p694524J3924842J0940858
34539B2029637j0306728j4018930Q080122K4952474J1618828j7436506k9025087
34532d106190j2610516J0312698J5554564N035571p04844N377874O558560r153801
34524A6263916k4807450j6079507J0649648K3790858J0463256p237747p018470
$$ y = [-27865706, -14461771, -2487280, -375333, -6750784, -10539380, -522713, 17582868, 21837750, 1962257, -23088168, -28819590, -17537638, -10816017, -16980686, -25004122, -26855570, -26063165, -24191564, -17351637, -8172737, -4867677, -6602370, -5268299, -1826326, -3223609, -3537554, 9430166, 25842221, 18535536, -13725125, -34039924, -16422827, 15411291, 22183522, 4858461, -2836063, 11088779, 22029637, 11722909, -2296021, 5784101, 30736575, 42355403, 24918897, -4106190, -16716706, -6404008, 9150556, 14186127, 13481283, 18859157, 25417717, 16263916, -8543534, -24623041, -13973393, 9817465, 20280721, 13042974, 6024504]
34517F024504K889163J857747r095500j0741178J939260R797679k660731k1790462
34509b1779518j9165425J0060325L5421625K6635094o265345k3864877q700944
34502g659065J3367652J1917358o787633j4845692n172337M046971J327498m410032
34494h215280k303536O521211J4982480J6183198N178475j2227793j7841360l817948
34486a540553J0893768O502633m900369J001337J6475062J1563931j2903574k1200724
34478E891511k25945J7640409O679385j2547896j0566913L641609L004411j1260862
34470B255709j5627211l752731R379034J5293550J8098468J7081578O261141r744592
34462C9244946j7653174j3134814l543574L925352N833487Q3755r023768j0402606
$$ y = [6024504, 8913667, 10771414, 1675914, -9065264, -7126004, 2671675, 10944, -21779518, -40944943, -30884618, 4537007, 31172101, 24906756, 1041879, -7659065, 5708587, 17625945, 10838312, -4007380, -9179717, -5132746, -3805248, -8215280, -10518816, -3997605, 10984875, 27168073, 32346548, 20118755, 2277395, -1540553, 9353215, 15855848, 10955479, 11956816, 28431878, 39995809, 27092235, 5891511, 5665566, 23305975, 29985360, 17437464, 6870551, 10512160, 13516571, 2255709, -13371502, -17124233, -7745199, 7548351, 25646819, 42728397, 48989538, 39244946, 21591772, 8456958, 4913384, 8838736, 14672223, 14755978, 5732210, -4670396]
34454d670396j532896M761843K0015m700457K903031J4729337J5444408O718083
34446C3672968k9884n715386j7756046k8678934k2743159k364278J2061073J0161531
34438b1392115K847561L257646J0252225J4149646R406254k80971m513416L046652
34430A6773482J2845686P749535j0567336j7625131l04314K0387016J8239921
34423D7498859n87247j1412156j0967627j5820515k6308264k2608496m37098J6726831
34415b3915713J1183161m263644p360437L302574J1959433R616849J986712k671420
34407a62485m380993q156954j2752431q111460R607259K4232522J5334179j0325778
34399E283859k2255092r009527N088797R25644l007876J5280999L7334893K9844854
$$ y = [-4670396, -6203292, -1441449, -1421434, -6121891, -3218860, 11510477, 26954885, 33672968, 33643084, 27927698, 10171652, -18507282, -41250441, -43614719, -31553646, -21392115, -18544554, -15286908, -5034683, 9114963, 18521217, 18240246, 13726830, 16773482, 29619168, 37368703, 26801367, 9176236, 8871922, 29258938, 47498859, 46911612, 35499456, 24531829, 8711314, -17596950, -40205446, -40642544, -23915713, -12732552, -16996196, -24356633, -21054059, -9094626, 522223, 2508935, -162485, -4543478, -12700432, -25452863, -33564323, -23957064, 275458, 15609637, 5283859, -16971233, -25980760, -20891963, -19966319, -22974195, -7693196, 29641697, 59486551]
34391E9486551k08972j5944316r200035o345771j5542035j3476631N420845J0965137
34383A5154773j1458733l0392068j6431684J0634329J4299543l124603j1283568
34376c2602011j786316O679126M708428J988309L193403J719432j320268M227618
34368a3192279J6370115J9213254P713696l547905k814221K933682K166506m208020
34360B4634828r312586j3284248j8709661j9771614q298726J0744574K0891579
34353a3105854J4292182J801634k745527j794625p927843k0795618k2941159l840095
34345e7056905K2139116L1640035K0515448N404973r7361P91753p08173m562401
34337A8066485m472609N89606L441679k547470j4070785k0031080j5150677p738682
$$ y = [59486551, 59277579, 43333263, 34133228, 27787457, 12245422, -1231209, 4189636, 15154773, 3696040, -26696028, -43127712, -32493383, -18193840, -21318443, -32602011, -34388327, -27709201, -23000773, -21012464, -17819061, -16099629, -17419897, -13192279, 3177836, 22391090, 30104786, 26556881, 23742660, 26676342, 28842848, 24634828, 15322242, 2037994, -16671667, -36443281, -44742007, -33997433, -13105854, 1186328, 2987962, 242435, -1552190, -9480033, -30275651, -53216810, -57056905, -34917789, -3277754, 17237694, 22642667, 22545306, 23337059, 22628886, 18066485, 13593876, 14183482, 17625161, 15077691, 1006906, -19024174, -34174851, -41913533]
34329d1913533p046185o589177O378675K4532322K2954871l507773k5221305j6317563
34321d6729668Q513829J6845737M558780o187939n685657m573190o008396P44389
34313c8522115J5437353K1672200J3383538M337921M455911P060092N914764M661825
34305C8401489K940458o197123j8044906j6773588k461920M221865n517864j3358711
34297a6790300l689508J1998438J5217382O786107j692232o168988o343427J25495
34289e57033P138849J852205j0920322p508826J6063507K8566668Q249285k0032727
34281B2851606k0020590K588481J3688121L894567o259597o967601r980340j8529508
34273a8734861j8042429k755398J3521040J9275652J7052536R692435m066166
$$ y = [-41913533, -48959718, -55548895, -49170220, -24637898, -1683027, -5190800, -30412105, -46729668, -38215839, -21370102, -16811322, -22999261, -28684918, -33258108, -39266504, -38522115, -23084762, -1412562, 11970976, 16308897, 20764808, 27824900, 33739664, 38401489, 41341947, 35144824, 17099918, 326330, -2135590, 2086275, -3431589, -16790300, -20479808, -8481370, 6736012, 13522119, 11829887, 5660899, -682528, -557033, 6581816, 8434021, -2486301, -9995127, 6068380, 34635048, 42884333, 22851606, 2831016, 5419497, 19107618, 23002185, 16742588, 9774987, -205353, -18734861, -36777290, -39532688, -26011648, -6735996, 10316540, 20008975, 15942809]
34266A5942809j6182416j2798723K832809J0421740K056638p066189m039064M303303
34258d529093P440620O386424K991676q160281k4515999k8105516q869221J6204236
34250d1157154K2771999R430483n841897j1311269q101382J856596J6062183K2114288
34242E823847P697876j6777677k3513584l385563J8828164J7360687L76201n355684
34234A054267M319626Q390340j264470n766670O197506J4139267k600744k6401596
34226a932474k2962798O620840K6253949J7661953J450205k530645m391763j6276669
34218C892598k2588126m585558K2938046K8462787Q432935j1573172j5999628
34211H979882j3591929j2332437n855042P840075J5219235O867652n720833n917587
$$ y = [15942809, -239607, -13038330, -10205521, 216219, 2272857, -4793332, -8832396, -4529093, 2911527, 9297951, 12289627, 4129346, -20386653, -48492169, -57361390, -41157154, -18385155, -8954672, -14796569, -26107838, -34209220, -32352624, -16290441, 5823847, 13521723, -3255954, -26769538, -30155101, -11326937, 6033750, 6409951, 1054267, 5373893, 13764233, 12499763, 6733093, 12930599, 27069866, 24469122, -1932474, -24895272, -18274432, 7979517, 25641470, 27091675, 24561030, 20169267, 3892598, -18695528, -23281086, -343040, 28119747, 36552682, 24979510, 8979882, -4612047, -16944484, -22799526, -14959451, 259784, 7127436, 1406603, -4510984]
34203d510984L669631N304708p433484j8278757q812657J3958199K0844267k323697
34195B417226k9237424k1257818J9306635M5100529K3115504k0808175l5225110
34188a6588633q000903K4160251K5579083o23746k5337743k6796217p695851R880337
34180b5423422O032096j2760978j7009572P143853L2839139K5385286p019134
34173I187268k1459158k75962K4305720J6260712j5444297l1393286j2727952
34166c1546955J9729283L3799142K0559860j674852j2058087j0433187j2070932
34159F304272k1664464k4424967r199809J2446549K2746458K1661068J7817140
34152B5686247P372012j4813043l1272872j8823245J1067931J9613634m759175
$$ y = [-4510984, -841353, 4463355, -2970129, -21248886, -30061543, -16103344, 4740923, 2417226, -26820198, -48078016, -28771381, 16329148, 39444652, 18636477, -16588633, -24589536, -429285, 25149798, 24526052, -811691, -27607908, -35303759, -25423422, -19391326, -32152304, -49161876, -42018023, -9178884, 16206402, 9187268, -12271890, -12547852, 11757868, 28018580, 12574283, -18819003, -31546955, -11817672, 21981470, 42541330, 40866478, 28808391, 18375204, 6304272, -15360192, -39785159, -48984968, -36538419, -13791961, 7869107, 25686247, 33058259, 18245216, -13027656, -31850901, -20782970, -1169336, -5928511]
34145e928511k8355924k0882599M633644J7697156J3037509O177872L666174P90017
34137i164662j581524J081806M228175N25723n707913m442266M307874J2449757
34129A696970J5913056J4253571N613829o758292j1325138l957469J775975o279641
34121A0932861j8026293j5014792K363218J8649073K7304799L1127960K4135279
34114H1472105k332076l4205555m1074360j7109520O490754L903370r560167l775219
34106a6190668J8224907K4994167N921372j2307384p140701O060345P34014j6595147
34098C700905j5590754Q711372K4991976J1712956j1387011j4456836m58054N542816
34090A2767370k893239r130463m246383K654442M621014M954912L541490l944806
$$ y = [-5928511, -34284435, -55167034, -50533390, -32836234, -19798725, -13620853, -9954679, -9164662, -10746186, -9664380, -5436205, -4910482, -10618395, -15060661, -10752787, 1696970, 17610026, 31863597, 37477426, 30719134, 19393996, 15436527, 17212502, 10932861, -7093432, -22108224, -19745006, -1095933, 26208866, 57336826, 81472105, 79140029, 44934474, 3860114, -13249406, -6758652, -2855282, -12415449, -16190668, 2034239, 27028406, 32949778, 20642394, 13501693, 19562038, 20296052, 3700905, -11889849, -3178477, 21813499, 33526455, 22139444, 7682608, 7224554, 12767370, 9874131, 743668, -3502715, -848273, 3772741, 8727653, 12269143, 8324337]
34082H324337j1224748p119793J647071l401946j9633174k2200904l040268J5997056
34074d0652369J9726152K0870717K8832566K6072503p85335k9967137l1900165
34067g803068j0509145Q106383J2892454R275161p43624j3407565j2537058Q399251
34059f327211K6742965K0601919L386756j606311l273202k1280337l8488535k2228419
34051d2472375J4581050K5827561O699682O38238K1684797K7916103l861560l2149556
34043A8863940j6903702J4393205J3270725j2024178j7232263K435772J1489592
34036A4293091j627124j1230396n124261j610536q522209p254968R040396J7857839
34028E821832N651592p363996j882517P415991j185898j6663015j1899994J1059601
$$ y = [8324337, -2900411, -10020204, -8373133, -11775079, -31408253, -53609157, -56649425, -40652369, -20926217, -55500, 28777066, 54849569, 54064234, 24097097, -7803068, -18312213, -10205830, 2686624, 11961785, 11218161, -2189404, -14726462, -6327211, 20415754, 41017673, 44404429, 42798118, 39524916, 18244579, -20243956, -42472375, -27891325, -2063764, 4635918, 5274156, 26958953, 54875056, 51013496, 18863940, 1960238, 16353443, 29624168, 17599990, 367727, 2803499, 14293091, 12665967, 1435571, -3688690, -5299226, -13821435, -21076403, -12036007, 5821832, 11473424, 4109428, 2226911, 9642902, 8457004, -8206011, -20106005, -9046404]
34020i046404K2669474J0794432m160734m733990j698699r923754j8743125q057641
34012b2900441J6036068K5985776J2458010l838755n550510j296954l047860k919571
34004A4925763P522085J3136090k644365k3742413k0865654J028969R122847l583510
33996e100188q785186N364926J2830967k543308j5853044m284987J1694019L783482
33988b893319j4578276j2765291L001992K528539j3369957j4289834O620018K1951335
33980b3794793J5506591J929900m721978q367722r827242p71665J1968760O834202
33972a1243947j6340031k9214019j6149786M820388J4713467J9034255K5099702
$$ y = [-9046404, 13623070, 24417502, 20256768, 15522778, 13824079, 3900325, -14842800, -22900441, -6864373, 19121403, 31579413, 27740658, 22190148, 20893194, 17845334, 14925763, 22447848, 35583938, 32939573, 9197160, -11668494, -10639525, -1516678, -5100188, -13885374, -8520448, 4310519, 1767211, -14085833, -18370820, -6676801, -2893319, -17471595, -30236886, -27234894, -24706355, -38076312, -52366146, -45746128, -23794793, -8288202, -6358302, -11080280, -19448002, -29275244, -30046909, -18078149, -11243947, -27583978, -56797997, -72947783, -68127395, -53413928, -34379673, -9279971]
$$ [...]
##END NTUPLES=NMR SPECTRUM
##END=
