##TITLE=31Pdec_SR120_5
 , 24 sc
 6.4.2022
##JCAMPDX= 6.0         $$ Bruker NMR JCAMP-DX V2.0
##DATA TYPE= NMR SPECTRUM
##DATA CLASS= NTUPLES
##ORIGIN= UXNMR, Bruker Analytische Messtechnik GmbH
##OWNER= root
$$ XWIN-NMR		Version 3.5
$$ Fri Apr  8 11:31:22 2022 Russian Standard Time (UT+4h)  she@DPX200
##.OBSERVE FREQUENCY= 81.013821
##.OBSERVE NUCLEUS= ^31P
##.ACQUISITION MODE= SIMULTANEOUS
##.ACQUISITION SCHEME= undefined
##.AVERAGES= 24
##.DIGITISER RES= 16
##SPECTROMETER/DATA SYSTEM= spect
##.PULSE SEQUENCE= zgpg30
##.SOLVENT NAME= CDCl3
##.SHIFT REFERENCE= (INTERNAL, CDCl3, 0, 248.564)
##AUDIT TRAIL= $$ (NUMBER, WHEN, WHO, WHERE, WHAT)
$$ ##TITLE= Audit trail, XWIN-NMR		Version 3.5
$$ ##JCAMPDX= 5.01
$$ ##ORIGIN= Bruker BioSpin GmbH
$$ ##OWNER= she
$$ F:/spectra/data/she/nmr/P31/1/pdata/1/auditp.txt
$$ ##AUDIT TRAIL=  $$ (NUMBER, WHEN, WHO, WHERE, WHAT)
(   1,<2022-04-08 11:29:18.42 +0400>,<she>,<DPX200>,
      <created by zg, POWCHK disabled, PULCHK disabled
       configuration hash MD5:
       00 E9 B6 7A A2 85 ED C7 34 08 36 98 17 FE 4E 26
       data hash MD5: 32K
       16 33 5C D4 CD 24 63 BB 10 B4 3B C8 4B B2 65 03>)
(   2,<2022-04-08 11:29:21.45 +0400>,<she>,<DPX200>,
      <Start of raw data processing
       efp BC_mod = 2 LB = 1 FT_mod = 6 PKNL = 1 PHC0 = -9663.372 PHC1 = 380.8757 SI = 64K 
       data hash MD5: 64K
       CB C8 C3 D6 D2 11 04 80 EB 8C D9 5C D3 5B 30 80>)
(   3,<2022-04-08 11:29:39.81 +0400>,<she>,<DPX200>,
      <pk PHC0 = -36.55454 PHC1 = 92.99999 
       data hash MD5: 64K
       22 4F F2 22 9F 40 39 85 34 D8 49 AA 48 04 27 AB>)
$$ ##END=
$$ 
$$ hash MD5
$$ 39 B8 5B BA 44 27 F5 31 C6 3F 50 81 D0 67 D6 25
##$RELAX= 
##$RELAX= 
##$RELAX= 
##$RELAX= 
##$RELAX= 
##$RELAX= 
##$RELAX= 
##$RELAX= 
$$ Bruker specific parameters
$$ --------------------------
##$DU= <F:/spectra>
##$EXPNO= 1
##$NAME= <P31>
##$PROCNO= 1
##$TYPE= <nmr>
##$USER= <she>
##$AMP= (0..31)
100 100 100 100 100 100 100 100 100 100 100 100 100 100 100 100 100 100 
100 100 100 100 100 100 100 100 100 100 100 100 100 100 
##$AQSEQ= 0
##$AQ_mod= 1
##$AUNM= <au_zg>
##$AUTOPOS= <>
##$BF1= 81.014009
##$BF2= 200.13
##$BF3= 200.13
##$BF4= 200.13
##$BF5= 200.13
##$BF6= 200.13
##$BF7= 200.13
##$BF8= 200.13
##$BYTORDA= 1
##$CFDGTYP= 0
##$CFRGTYP= 5
##$CHEMSTR= <none>
##$CNST= (0..31)
1 1 145 1 1 1 1 1 1 1 1 1 1 1 1 1 1 1 1 1 1 1 1 1 1 1 1 1 1 1 1 1 
##$CPDPRG= <waltz16>
##$CPDPRG1= <>
##$CPDPRG2= <waltz16>
##$CPDPRG3= <>
##$CPDPRG4= <mlev>
##$CPDPRG5= <mlev>
##$CPDPRG6= <mlev>
##$CPDPRG7= <mlev>
##$CPDPRG8= <mlev>
##$CPDPRGB= <>
##$CPDPRGT= <>
##$D= (0..31)
0 1 0 0 0 0 0 0 0 0 0 0.03 2e-05 3e-06 0 0 0 0 0 0 0 0 0 0 0 0 0 0 0 0 
0 0 
##$DATE= 1649402957
##$DBL= (0..7)
120 120 120 11 120 120 24 19 
##$DBP= (0..7)
150 150 150 150 150 150 150 150 
##$DBP07= 0
##$DBPNAM0= <>
##$DBPNAM1= <>
##$DBPNAM2= <>
##$DBPNAM3= <>
##$DBPNAM4= <>
##$DBPNAM5= <>
##$DBPNAM6= <>
##$DBPNAM7= <>
##$DBPOAL= (0..7)
0.5 0.5 0.5 0.5 0.5 0.5 0.5 0.5 
##$DBPOFFS= (0..7)
0 0 0 0 0 0 0 0 
$$ [...]
##$SUBNAM2= <"">
##$SUBNAM3= <"">
##$SUBNAM4= <"">
##$SUBNAM5= <"">
##$SUBNAM6= <"">
##$SUBNAM7= <"">
##$SUBNAM8= <"">
##$SUBNAM9= <"">
##$SW= 501.771253377433
##$SWIBOX= (0..15)
0 1 3 0 0 0 0 0 0 0 0 0 0 0 0 0 
##$SW_h= 40650.406504065
##$TD= 32768
##$TD0= 1
##$TE= 0
##$TE2= 300
##$TE3= 300
##$TEG= 300
##$TL= (0..7)
0 120 53 12 22 120 120 120 
##$TP= (0..7)
150 150 150 150 150 150 150 150 
##$TP07= 0
##$TPNAME0= <>
##$TPNAME1= <>
##$TPNAME2= <>
##$TPNAME3= <>
##$TPNAME4= <>
##$TPNAME5= <>
##$TPNAME6= <>
##$TPNAME7= <>
##$TPOAL= (0..7)
0.5 0.5 0.5 0.5 0.5 0.5 0.5 0.5 
##$TPOFFS= (0..7)
0 0 0 0 0 0 0 0 
##$TUNHIN= 0
##$TUNHOUT= 0
##$TUNXOUT= 0
##$USERA1= <user>
##$USERA2= <user>
##$USERA3= <user>
##$USERA4= <user>
##$USERA5= <user>
##$V9= 5
##$VALIST= <valist>
##$VCLIST= <CCCCCCCCCCCCCCC>
##$VD= 0
##$VDLIST= <DDDDDDDDDDDDDDD>
##$VPLIST= <PPPPPPPPPPPPPPP>
##$VTLIST= <TTTTTTTTTTTTTTT>
##$WBST= 1024
##$WBSW= 4
##$XGAIN= (0..3)
0 0 0 0 
##$XL= 0
##$YL= 0
##$YMAX_a= 12613
##$YMIN_a= -16424
##$ZGOPTNS= <>
##$ZL1= 120
##$ZL2= 120
##$ZL3= 120
##$ZL4= 120
##$ABSF1= 0
##$ABSF2= 0
##$ABSG= 0
##$ABSL= 0
##$ALPHA= 0
##$AQORDER= 0
##$ASSFAC= 0
##$ASSFACI= 0
##$ASSFACX= 0
##$ASSWID= 0
##$AUNMP= <proc_1d>
##$AZFE= 0.1
##$AZFW= 0.5
##$BCFW= 0
##$BC_mod= 2
##$BYTORDP= 0
##$COROFFS= 0
##$CY= -3
##$DATMOD= 1
##$DC= 0
##$DFILT= <>
##$DTYPP= 0
##$F1P= 0
##$F2P= 0
##$FCOR= 1
##$FTSIZE= 65536
##$FT_mod= 6
##$GAMMA= 0
##$GB= 0
##$INTBC= 1
##$INTSCL= 5.30512e-09
##$ISEN= 30
##$LB= 1
##$LEV0= 0
##$LPBIN= 0
##$MAXI= 10000
##$MC2= 0
##$MEAN= 0
##$ME_mod= 0
##$MI= 50
##$NCOEF= 0
##$NC_proc= -6
##$NLEV= 6
##$NOISF1= 182.463
##$NOISF2= 159.3651
##$NSP= 0
##$NTH_PI= 0
##$NZP= 0
##$OFFSET= 248.5645
##$PC= 4
##$PHC0= -9699.927
##$PHC1= 473.8757
##$PH_mod= 1
##$PKNL= yes
##$PPARMOD= 0
##$PSCAL= 0
##$PSIGN= 0
##$REVERSE= no
##$SF= 81.014009
##$SI= 65536
##$SIGF1= 159.3651
##$SIGF2= -187.1042
##$SINO= 113.3802
##$SIOLD= 16384
##$SREGLST= <1H.CDCl3>
##$SSB= 0
##$STSI= 65536
##$STSR= 0
##$SW_p= 40650.406504065
##$SYMM= 0
##$S_DEV= 0
##$TDeff= 32768
##$TDoff= 0
##$TI= <>
##$TILT= no
##$TM1= 0
##$TM2= 0
##$TOPLEV= 0
##$USERP1= <user>
##$USERP2= <user>
##$USERP3= <user>
##$USERP4= <user>
##$USERP5= <user>
##$WDW= 1
##$XDIM= 65536
##$YMAX_p= 312066480
##$YMIN_p= -15492934
$$ End of Bruker specific parameters
$$ ---------------------------------
##NTUPLES= NMR SPECTRUM
##VAR_NAME=  FREQUENCY,     SPECTRUM/REAL,   SPECTRUM/IMAG
##SYMBOL=    X,             R,               I
##VAR_TYPE=  INDEPENDENT,   DEPENDENT,       DEPENDENT
##VAR_FORM=  AFFN,          ASDF,            ASDF
##VAR_DIM=   65536,         65536,           65536
##UNITS=     HZ,            ARBITRARY UNITS, ARBITRARY UNITS
##FACTOR=    0.620285442955139, 1,           1
##FIRST=     20137.2065510759, 0,            0
##LAST=      -20513.1999529892, 0,           0
##MIN=       -20513.1999529892, -15492934,   0
##MAX=       20137.2065510759, 312066480,    0
$$ Real data points
##PAGE= N=1
##DATA TABLE= (X++(R..R)), XYDATA
$$ [...]
43081 -394971 -1678700 -1887545 -472299 535711 -265306 -1535153 -1295032 385315 1949116
43072 1949116 2511992 2325065 1810726 1173933 580413 -6100 -832070 -1753688 -2149962
43063 -2149962 -1860051 -1526979 -1458966 -925654 586634 2080427 2096473 755899 -325547
43054 -325547 -145521 645061 1002207 893194 959148 1398479 1845954 2117891 2438568 2837314
43044 2837314 2805579 1895415 456962 -597796 -758658 -323588 185951 623661 1072129
43035 1072129 1480218 1708999 1648287 1126803 149223 -601330 -211329 1053462 1585516
43026 1585516 453320 -1180493 -1689077 -1288713 -1310452 -1732157 -1279837 82426 778848
43017 778848 221177 -136471 727605 1587102 947464 -519558 -1073629 -489072 63210
43008 63210 120860 327762 939340 1319518 996703 204487 -657015 -1282387 -1279047 -520863
42998 -520863 399487 762724 626072 546101 718976 1047382 1623832 2352866 2561925 1935125
42988 1935125 1397761 1982039 3167840 3567440 3022383 2678825 3020841 3229433 2701699
42979 2701699 1873217 1146732 253895 -764350 -1068705 -237074 895669 1317087 1057277
42970 1057277 699217 335856 -272985 -971119 -1292794 -1018790 -239435 817047 1713985
42961 1713985 1985232 1730080 1625872 2011583 2370399 2097898 1417464 1107808 1524069
42952 1524069 2205624 2357103 1607224 432679 -210193 89918 690537 755468 359262
42943 359262 178133 353042 450132 412833 638432 1090957 1282274 1246203 1551862 2160490
42933 2160490 2315628 1883200 1708276 2148765 2308353 1383168 -139027 -1288420 -1763027
42924 -1763027 -1627429 -808253 300935 632282 -182685 -971140 -562173 478882 752162
42915 752162 154392 -56485 892797 2371597 3188290 2645112 984761 -571301 -605334
42906 -605334 957997 2478187 2465714 1336593 520051 411231 264190 -301806 -829873
42897 -829873 -850705 -209535 1132047 2624045 2882270 1178932 -1078812 -1721132 -562463
42888 -562463 610584 734832 545426 747661 877754 687678 1055807 2387982 3340067
42879 3340067 2492156 535554 -558159 -164815 450864 160925 -580627 -642599 190999
42870 190999 1075445 1285625 1056225 1100357 1557065 1852634 1671023 1494312 1747861 1935710
42860 1935710 1374976 433944 80152 331155 234944 -499679 -980823 -612344 -30102 41408
42850 41408 -55801 332684 1016047 1444065 1809957 2684126 3769428 3946759 2695769 891003
42840 891003 -29114 546964 1890032 2689316 2359140 1558093 1247059 1448854 1446745 1057530
42830 1057530 886861 1187879 1370990 1052266 738752 881597 1013134 568819 -61820
42821 -61820 -126401 343843 808863 1210122 1802239 2334777 2337031 2010194 1925869 1998153 1704207
42810 1704207 1221600 1284176 1827214 1876575 1102614 452196 706726 1310959 1339768 909008
42800 909008 773003 986454 884638 241233 -357793 -342990 251855 1106660 1965558 2541870
42790 2541870 2603886 2409700 2624773 3460362 4187207 3884759 2537973 1094476 525616
42781 525616 1038545 2033346 2552595 1966850 609794 -382647 -271936 382047 523310
42772 523310 130846 172578 1009344 1824018 2004843 2076589 2520732 2598614 1479239 -61010
42762 -61010 -394304 694302 1757942 1734484 1049281 503379 261340 333693 940630 1799774
42752 1799774 1997722 1246777 487862 587869 1166863 1383100 1150061 829257 432219
42743 432219 7735 187301 1322922 2536161 2687853 1995741 1621295 1845075 1810511
42734 1810511 1127212 588854 946019 1858392 2516232 2632164 2379415 1894799 1314080
42725 1314080 938289 954473 1185096 1337851 1304040 1111931 877393 882146 1331932 1924413
42715 1924413 2095181 1883591 2040416 2885677 3533719 2908204 1327018 334828 838842
42706 838842 2066263 2711925 2546589 2290763 2294513 2207361 1913408 1838031 2000692 1695072
42696 1695072 808419 655607 2382738 4924086 5820556 4168175 1650110 339123 491796
42687 491796 1029406 1274903 1361136 1407781 1173818 563163 37675 344765 1727001 3308733
42677 3308733 3676103 2578574 1587413 2154062 3431319 3388763 1943188 1208424 2256874
42668 2256874 3543620 3496263 2847705 2916465 3110424 2076121 326578 -347582 375542
42659 375542 1077661 888285 365658 158730 310195 857430 1709007 2010928 1083213 -120614
42649 -120614 -40602 1075630 1495208 796260 439724 1173379 1835384 1543026 1265101 2067338
42639 2067338 3263884 3607614 3173956 2751100 2257961 1112782 -382798 -1209036 -872965
42630 -872965 329228 1873764 3108198 3325057 2571639 1975061 2473437 3554113 3946227
42621 3946227 3232679 2101674 1288565 908645 640930 72777 -933670 -1858213 -1821948
42612 -1821948 -620384 873822 1620808 1364611 548845 -141560 -14338 1086175 2214543
42603 2214543 2159622 1152603 725076 1428456 1922140 1102049 -120525 -295875 423324
42594 423324 1017124 1539755 2630431 3665217 3275066 1635120 493296 661897 1042012
42585 1042012 622815 28989 304326 1262673 1976816 2159441 2122031 1811557 821472 -694191
42575 -694191 -1818136 -1790995 -828974 128382 345739 -133815 -739764 -981411 -705531 12611
42565 12611 884986 1406316 1281365 901365 953299 1502853 1967409 2030443 1916200 1658097
42555 1658097 949809 14814 -323161 61878 197380 -402465 -732598 181442 1626006
42546 1626006 2184528 1690582 1038404 675887 540491 913150 1916775 2607691 2093138
42537 2093138 1236091 1599828 2886382 3283154 2446361 2103234 3131050 4039516 3419937
42528 3419937 2183236 1919640 2323364 1903775 486958 -617648 -624840 -31376 580394
42519 580394 1263545 2018930 2344188 1880492 977557 309771 231480 652037 1260483 1679676
42509 1679676 1533837 613300 -818168 -1898068 -1758013 -583712 283908 -118552 -1039459
42500 -1039459 -972517 286968 1578191 2290141 2997308 3844206 3772176 2285403 775895
42491 775895 776973 1685690 1663584 379812 -631664 -306131 671397 1222140 1292985 1333850
42481 1333850 1281821 838311 226471 -56974 3852 29214 -28722 236447 1026313 1940398
42471 1940398 2394352 2207010 1610365 863712 128746 -335071 -226984 354094 810218
42462 810218 710974 385568 465680 947463 1182807 820583 255735 -4187 42908 140387
42452 140387 237304 417753 659180 903397 1120395 1157271 853211 436527 377133 655701
42442 655701 692446 295332 102281 610387 1315428 1473805 1284888 1490437 2017333 1942067
42432 1942067 918074 -166685 -317110 343296 926591 1027022 1101109 1627303 2300320
42423 2300320 2338015 1499396 473076 62324 217220 244086 -141698 -470795 -266149 398699
42413 398699 1230513 2031789 2441818 2005926 941435 247035 488158 997776 926370 567724
42403 567724 818442 1696109 2312191 2119586 1312107 173084 -992766 -1388108 -340187
42394 -340187 1431482 2273961 1704424 1036039 1416161 2269545 2438979 1977877 1804476
42385 1804476 2143616 2366898 2124786 1690564 1245413 639344 -67306 -469081 -340282
42376 -340282 135439 635599 820540 409319 -303283 -260221 1210341 3135809 3758466
42367 3758466 2845014 2096677 2716746 3582604 2874116 877074 -229562 605484 1853682
42358 1853682 1609180 229924 -323602 651871 1697449 1381915 269548 -84773 611796
42349 611796 1233454 1086623 719020 660128 519155 17418 -46316 1061263 2471344 2568402
42339 2568402 1231450 26135 66020 836769 1418717 1672871 1646409 966802 -249839
42330 -249839 -815126 77548 1455712 1790578 1113890 627233 556728 -60750 -1390887
42321 -1390887 -2183879 -1687360 -849504 -791099 -1121776 -769949 257980 1029207 1171708
42312 1171708 1154230 1187366 770366 -454504 -1952932 -2659971 -1902552 42042 2146917
42303 2146917 3456125 3795845 3579797 3066473 2271018 1539399 1439015 1831611 1838510 1170678
42293 1170678 722228 1225021 2047477 2129678 1490808 898018 570184 258912 242292 1073820
42283 1073820 2428716 3234839 2989454 2104579 1038078 -26 -589948 -423603 -118580
42274 -118580 -613381 -1595509 -1654974 -315743 1182145 1606043 1246869 1124914 1537594
42265 1537594 2071356 2400417 2429248 2115798 1631866 1278038 983633 466414 43096 427167
42255 427167 1415117 1779384 1020816 236317 505345 1358673 1764485 1757612 1953592 2139466
42245 2139466 1664684 848487 673809 1188632 1435789 1042746 733634 988565 1207327
42236 1207327 693850 -253709 -768868 -487573 238744 913677 1330367 1566484 1744880
42227 1744880 1766847 1319049 306472 -784329 -1203126 -661018 406391 1315066 1771012
42218 1771012 2001461 2253382 2250433 1473793 162411 -475447 327239 1651871 1962677
42209 1962677 1195254 622270 679596 427681 -414239 -548605 786124 2212220 2121362
42200 2121362 1109825 937861 1839289 2543975 2493299 2328320 2374336 2257086 1997545 1974183
42190 1974183 1783407 697742 -607688 -440770 1363184 2821223 2381447 789829 -340475
42181 -340475 -579955 -425531 -66916 540511 1060576 1150216 1002782 900396 737163 497375
42171 497375 587702 1139216 1592634 1528499 1264952 1053067 418842 -884501 -1880595 -1344425
42161 -1344425 442373 1779571 1422895 -201371 -1669254 -1995336 -1331663 -532054 -191319
42152 -191319 -194750 -229218 -359150 -664063 -678535 18464 831862 722252 -238456 -900236
42142 -900236 -736742 -384365 -243404 162973 921384 1153681 513896 25692 431049 866324
42132 866324 396415 -188589 409391 1773315 2393491 2032207 1791519 1993389 1664543
42123 1664543 355848 -954801 -1232625 -592454 260846 880615 995570 417975 -514906
42114 -514906 -1019065 -748622 -162449 153301 65472 -262167 -592295 -649956 -437300 -446793
42104 -446793 -981510 -1397064 -778546 654594 1647981 1521917 876070 503711 414792 264205
42094 264205 15063 -296053 -927895 -2079941 -3429417 -4307439 -4192030 -3048601 -1494311
42085 -1494311 -506910 -489590 -711332 -212075 859241 1467414 1150886 478005 53046
42076 53046 -79558 52195 523464 991490 911994 566128 906951 1954467 2373737 1367523
42066 1367523 78701 119604 1312401 2005909 1419660 615896 956102 2345434 3438159
42057 3438159 3277959 2319287 1715829 1812592 1801229 1083406 412544 945052 2445510 3433975
42047 3433975 3196940 2641929 2801741 3422636 3617934 3186264 2605338 2211344 1972386
42038 1972386 1740012 1360657 912034 966207 1957723 3135807 3096083 1740237 628239
42029 628239 749399 1107878 504918 -382629 -95361 1205463 2004480 1741020 1303008
42020 1303008 1257495 1043323 211077 -704721 -991331 -652377 -219850 -274723 -1177568 -2587699
42010 -2587699 -3310874 -2435815 -620360 559399 510271 7582 -261011 -481096 -877507
42001 -877507 -1130174 -996106 -701267 -387938 103290 667270 903325 855727 999990 1310616
41991 1310616 1218146 718913 556968 946985 1099336 495563 -310820 -734318 -1073538 -1687542
41981 -1687542 -2072853 -1564375 -358513 847998 1682543 1995289 1626980 942507 893635
41972 893635 1773002 2535416 2181099 1224851 889458 1337399 1664488 1303149 518581 -234383
41962 -234383 -620060 -345744 414814 761645 24150 -1236053 -1911498 -1757476 -1337597
41953 -1337597 -902427 -284427 273208 212367 -355942 -633587 -249585 283304 323295 -228801
41943 -228801 -976710 -1250832 -486448 1033203 2089390 1868521 1073160 903571 1294052
41934 1294052 1171887 245972 -583976 -587041 62046 917911 1625013 1639145 679178 -425008
41924 -425008 -394766 808485 1926354 2114600 1662777 984524 153530 -384738 -4314
41915 -4314 843402 904291 72879 -331835 260160 779028 540183 511656 1436203 2232484
41905 2232484 1764754 963645 1459053 2936386 3589437 2727560 1356852 453861 73103
41896 73103 1827 91170 104451 206390 1130597 2781709 3409314 1717379 -765181 -1269718
41886 -1269718 476470 2032541 1803149 765104 243880 103104 97102 1083988 3398298
41877 3398298 5403362 5330699 3723321 2533909 2417471 2450149 2150749 2144887 2737055 3285151
41867 3285151 3424944 3713080 4397957 4540298 3298065 1475437 691247 1168545 1448046
41858 1448046 543588 -646784 -768334 -47890 199937 -248353 -183992 958717 1955748
41849 1955748 1484097 44278 -808226 -593045 -181759 -177022 -96778 656329 1796718 2463720
41839 2463720 2160304 1234454 593312 816560 1393457 1201131 -337 -1114368 -1201889
41830 -1201889 -723252 -535770 -376528 524661 1814870 2354541 2012387 1753511 1891620
41821 1891620 1666781 894282 664533 1712532 3144230 3593551 2919391 2013587 1461357
41812 1461357 1097209 619666 139077 155017 1037260 2333388 2864455 2083781 1058372
41803 1058372 1227006 2349298 2791127 1905038 904981 1011450 1858742 2328626 2063556
41794 2063556 1534168 1275787 1524189 2039274 2073658 1191891 146568 14553 501388
41785 501388 365156 -399425 -396798 750256 1575064 1168412 680031 1256986 2069408 1860485
41775 1860485 1112855 995701 1234008 830186 136345 377793 1547803 2435723 2478544
41766 2478544 2126973 1669342 1116709 977923 1725994 2713012 2983820 2912781 3597241 4855301
41756 4855301 5390535 4883631 4323767 4134189 3536746 2137160 751286 162426 175070
41747 175070 316803 492357 616276 519281 472943 955344 1784397 2352376 2662784 3097147
41737 3097147 3280370 2487958 1206863 821355 1475102 1728765 833016 -95124 122847
41728 122847 1019812 1434897 1127408 572294 15033 -413331 -329532 373781 1142319 1441869
41718 1441869 1289163 763095 -238554 -1313553 -1489665 -485492 671804 938365 563284
41709 563284 498012 1032260 1623318 1708725 1234898 659790 617179 1197025 1580591 991273
41699 991273 -99368 -551562 -223845 36067 27206 439072 1235259 1319848 385465 -346277
41689 -346277 23870 822736 1193134 1336735 1448520 903745 -259167 -481549 1108400
41680 1108400 2812440 2492719 742217 35377 1227820 2799828 3391791 3236192 2882763
41671 2882763 2154110 924559 -227270 -725398 -642866 -331027 16933 288480 443421
41662 443421 615676 834252 821745 477087 223411 401961 731488 847663 835641 720619
41652 720619 173404 -612590 -631809 461694 1507731 1530238 1314635 2002392 3078406
41643 3078406 3341623 3006001 2993582 2903272 1851926 804915 1559240 3482802 3913139
41634 3913139 2205720 753143 1151374 1953203 1565202 954176 1586323 2630317 2439489
41625 2439489 1461077 1400046 2351938 2934391 2749901 2665581 2898251 2772314 2365327 2541963
41615 2541963 3146235 2925401 1704439 983334 1640610 2515928 2288898 1546334 1669057
41606 1669057 2461454 2389751 967395 -487253 -757247 -303256 -318801 -911797 -1042813
41597 -1042813 -76234 1306438 1885626 1200798 -92698 -915230 -688637 222419 870305
41588 870305 655264 -83601 -570704 -567961 -438812 -279210 358610 1572590 2543966 2433049
41578 2433049 1498445 764831 788222 1251602 1619849 1721638 1760105 2047865 2562385 2630845
41568 2630845 1573707 -49145 -605625 555981 2002132 2086520 1182588 796389 1055030
41559 1055030 715230 -487394 -1237298 -680963 485721 1454660 2349756 3151081 3010203
41550 3010203 1671908 471533 759623 2080452 2943527 2774565 2117507 1454530 864368
41541 864368 526345 640320 1001697 1320451 1723998 2371832 2906556 2889291 2472595 2108630
41531 2108630 1945992 1994638 2397266 2975831 3057814 2412006 1794716 1836933 2023197 1691053
41521 1691053 1392440 2019253 2993616 2803419 1339077 241632 556257 1350425 1342267
41512 1342267 799334 827544 1493911 1829171 1480244 1244989 1724800 2335731 2248688 1744142
41502 1744142 1794878 2460327 2622753 1587485 114980 -685087 -739853 -516191 118505
41493 118505 1335818 2137021 1275141 -595504 -1278439 69602 1886851 2614202 2627990
41484 2627990 2905720 3251312 3069082 2657483 2366885 1581533 62981 -724496 526559
41475 526559 2485595 2573260 551994 -1218998 -1112386 75751 1014707 1576750 2063340
41466 2063340 2246382 2017793 1857180 1912279 1554531 481986 -597645 -975303 -857888
41457 -857888 -746325 -619354 -255023 240216 636362 792768 492220 -258126 -672355 138584
41447 138584 1688619 2321575 1341239 14415 -79248 1145298 2661579 3667404 3862321
41438 3862321 3135152 1792893 688495 475464 955908 1466593 1557343 1143050 505854
41429 505854 264033 741871 1350612 1334019 1028219 1330163 1964390 1683574 433051 -256986
41419 -256986 407615 1377248 1751247 2170813 3070026 3234651 1743611 -29132 -225285
41410 -225285 749887 1241918 1181707 1683180 2413905 1850098 141982 -666299 257296 1327406
41400 1327406 1183947 657204 1088056 2244558 3057719 3204407 2811564 1628202 -255332
41391 -255332 -1615306 -1321169 -4115 600200 -147289 -1136056 -1062686 84027 1263348
41382 1263348 1636622 1320930 1024957 1118470 1246255 950826 374453 -29622 -229061 -498293
41372 -498293 -734429 -560434 -62179 297587 516526 1015552 1670189 1762469 1180410 812842
41362 812842 1319234 2248356 2839910 2992147 2920933 2553208 1882558 1339487 1158502 889759
41352 889759 187261 -435335 -394682 -150522 -633738 -1752133 -2349549 -1722726 -465348
41343 -465348 401956 610692 668346 1031611 1598030 2000552 2184337 2449744 2875069 3038974
41333 3038974 2646207 2100155 1881073 1628792 676989 -614826 -1111335 -617323 -195371
41324 -195371 -399064 -414786 384048 1269402 1509485 1729365 2649869 3431753 2803103 1178833
41314 1178833 64547 -184336 -344155 -421169 321335 1428056 1351235 -51796 -981267
41305 -981267 -416222 342413 -109546 -1053786 -987183 7630 718764 805713 874373 1118324
41295 1118324 1301207 1710583 2722340 3594584 3084091 1346345 -17461 -46423 534790
41286 534790 675148 375812 189375 168366 -4662 -317230 -468087 -378257 -221003 -56440
41276 -56440 260793 827353 1478224 1864546 1836408 1767884 2190418 2905136 2922831 1785371
41266 1785371 509416 427760 1359521 1934107 1707304 1747655 2684335 3343226 2330772
41257 2330772 309007 -514955 872465 3015573 3729130 2470338 565376 -503500
41249 -503500 -425340 290949 1297709 2427603 2988456 1999213 -401937 -2491521 -2714347
41240 -2714347 -1510536 -509458 -235686 189435 1106758 1537408 851309 -96304 -362025
41231 -362025 -349125 -763933 -1082048 -422498 688984 975625 548296 790982 2032657
41222 2032657 2901615 2442840 1468093 1081768 1085914 802570 482458 720760 1138883 917169
41212 917169 309565 366186 1189303 1694800 1359703 1040667 1466606 1925564 1405974 381397
41202 381397 251466 1195717 1842706 1349143 644725 914140 1783147 2045900 1564811 1195591
41192 1195591 1136003 775525 242161 557982 1743202 2247040 1196659 -82568 -33931
41183 -33931 744478 643089 -221380 -239662 1044480 2359071 2811265 2833038 2768773 2216347
41173 2216347 1270562 836569 1069881 1022716 544958 894668 2460760 3542599 2802474
41164 2802474 1458521 1319088 1899258 1578985 744412 1338605 3467136 4829169 3996646
41155 3996646 2291745 1626223 2056438 2417066 2150584 1495211 701186 -24428 -323954
41146 -323954 -88547 371526 892233 1592618 2195024 2047618 1260734 936563 1624605 2349956
41136 2349956 1985634 942859 560688 1216299 1983255 2019616 1465700 911559 606747
41127 606747 369727 -73798 -775787 -1450342 -1744367 -1689034 -1620893 -1552993 -1047564 32534
41117 32534 1094979 1523120 1414476 1180620 805889 81345 -691260 -895311 -477354 -98091
41107 -98091 -317582 -986555 -1521653 -1524745 -1058107 -452498 106534 764340 1634663 2352647
41097 2352647 2375421 1763872 1200694 1117787 1333361 1674584 2204274 2501697 1660691 -235996
41087 -235996 -1465646 -599886 1424005 2411273 1818882 1171554 1528568 2047685 1653161
41078 1653161 828748 722046 1277882 1407320 691915 -47818 159408 1457567 3213870
41069 3213870 4471189 4463122 3313659 2181955 2050866 2368473 1683340 -186706 -1547147
41060 -1547147 -977706 701340 1564696 1183940 869734 1402311 1922466 1588948 1066595
41051 1066595 1332490 1901383 1584277 556377 203220 946302 1677825 1667685 1622784 2190132
41041 2190132 2692867 2372782 1880564 2267374 3138712 3153432 2067697 1010440 773820
41032 773820 997265 1163734 1307707 1428672 1160249 485293 57205 343463 982720 1359284
41022 1359284 1342861 1155482 957352 843185 856037 831844 643889 628084 1150947 1723195
41012 1723195 1413938 393866 56566 1036340 2078173 1736439 356007 -735392 -1313529
41003 -1313529 -2111604 -2916950 -2484103 -671726 804434 542672 -678928 -1135261 -449560
40994 -449560 426885 986339 1623630 2401479 2631662 2086689 1624108 1951159 2501769 2323636
40984 2323636 1543479 1022333 874675 420643 -389644 -682415 -197614 -24857 -992807
40975 -992807 -2158953 -2004531 -664571 252252 -41758 -613627 -408136 390808 1080522
40966 1080522 1522954 1781868 1475847 424031 -568268 -574073 30823 7056 -856700 -1265741
40956 -1265741 -197243 1593006 2433223 1715927 439157 -97894 370714 1143889 1578418
40947 1578418 1718821 1944330 2306868 2490737 2338372 2052251 1770973 1322388 676838
40938 676838 300927 591294 1154954 1217974 714046 371781 612179 974102 928931 714603
40928 714603 900799 1527077 2184765 2657040 2942538 2900307 2496575 2230002 2578808 3059128
40918 3059128 2660720 1389735 504781 789982 1431213 1323028 784379 940813 1771871
40909 1771871 1994966 1029123 -206 270106 1685270 2891532 2986171 2271598 1568929
40900 1568929 1292598 1238453 1006266 504483 7836 -302880 -652814 -1271296 -1882062 -2008123
40890 -2008123 -1613359 -920405 190549 1818396 3190849 3234857 2192681 1543996 1884208
40881 1884208 2094483 1369318 793913 1650139 3154342 3479044 2451264 1546694 1447825
40872 1447825 1358299 842676 595591 886948 831153 18532 -439282 504820 2192727 3218103
40862 3218103 3249582 2908562 2480454 1816162 1117936 821043 877678 944556 1053629 1323748
40852 1323748 1253583 227893 -1266269 -1803345 -685429 1126572 2056333 1552329 475342
40843 475342 88091 841654 2057620 2682563 2293153 1317552 430146 18980 148424
40834 148424 579412 800062 566711 471261 1276173 2516776 2685871 1324144 -11057
40825 -11057 249327 1472543 1792807 836715 107840 656934 1689086 1908175 1229719
40816 1229719 555662 530996 1094776 1787380 2025626 1460483 459609 -132238 -44854 67825
40806 67825 -251703 -352548 573575 1985516 2430874 1559730 710322 1002951 1685575 1264964
40796 1264964 -187878 -1013014 -289324 936519 1236686 674121 283602 396779 553081
40787 553081 700654 1298189 2228477 2711968 2527985 2375438 2722168 3165710 3258944 3102714
40777 3102714 2760597 2004996 1095125 839697 1305002 1454716 801675 384028 1130572
40768 1130572 2223547 2305965 1539378 1091848 1157631 972280 470286 409823 898884 1189221
40758 1189221 1023548 935963 1120555 1217602 1307656 1849610 2508043 2406060 1771940 1857103
40748 1857103 2784945 3027830 1758401 252788 -46204 453922 619587 555997 949033
40739 949033 1293977 510984 -976770 -1413773 -116046 1591427 2183923 1674787 1122661
40730 1122661 1190143 1701139 2135786 2099488 1536131 763944 182469 -137170 -395697 -590074
40720 -590074 -365949 519585 1738569 2559202 2530070 1999458 1814795 2305321 2683661 1874720
40710 1874720 6240 -1406273 -1053640 721102 2380359 2826084 2257601 1628019 1623438
40701 1623438 2133165 2508977 2351077 2019430 2153489 2739179 3095952 2879769 2547654
40692 2547654 2543732 2572426 2155200 1480024 1111666 1118695 1084049 861653 755831 937840
40682 937840 1166846 1197833 1105938 1060608 1022773 826153 448408 88192 -15610 196502
40672 196502 584766 966659 1166957 947023 229708 -460907 -292957 689229 1200573 318215
40662 318215 -956760 -827310 770873 2074647 2083424 1784423 2198762 2651364 2098263
40653 2098263 1079249 965368 1892203 2759906 2922271 2674874 2303600 1783209 1320285
40644 1320285 1214918 1275010 1191668 1205273 1482919 1287162 -363 -1378187 -1254554 105701
40634 105701 799918 148143 -397841 238839 1086513 984710 623519 1332392 2894993
40625 2894993 4071582 4589017 5074159 5399993 4666356 2867569 1231903 589184 449540
40616 449540 97071 -266967 6805 966983 1967233 2358092 2042716 1555504 1611927 2294449
40606 2294449 2789083 2347373 1338531 746401 804846 1009403 1433068 2782911 4686918
40597 4686918 5243415 3407639 928611 432360 1957478 2965050 1867361 -21324
40589 -21324 -599041 354087 1559526 2206283 2335711 1999105 1359646 1245161 2263488
40580 2263488 3494119 3381151 2015217 1199734 1921910 3071823 3281888 2804375 2632363
40571 2632363 2751440 2428072 1617323 944845 653079 574190 839592 1604804 2295966 2161114
40561 2161114 1464842 1154502 1422611 1610468 1478474 1446983 1519028 1190056 658483 824816
40551 824816 1639360 1807565 878861 282224 1178242 2486482 2537115 1773255 1974383 3217918
40541 3217918 3644944 2461014 1243456 1465004 2276831 1921823 260874 -1379256 -2133203
40532 -2133203 -2081289 -1321707 45177 1177803 1126151 368537 463762 1794218 2827722
40523 2827722 2249764 798946 122392 612062 1389496 1871028 2217601 2482639 2408475
40514 2408475 2089713 1932325 1879639 1504968 957169 950399 1600862 2090199 1807704 1116914
40504 1116914 651835 522834 587132 874985 1345274 1756389 2086071 2507860 2757552 2322582
40494 2322582 1556689 1623244 2798031 3857474 3891608 3631855 3929526 4003282 2728579
40485 2728579 939690 628033 2036438 3314607 3271964 2865462 3439581 4862629 6128896
40476 6128896 6734422 6696580 6060725 5134357 4554849 4480530 4300620 3714942 3468734 4322930
40466 4322930 5777149 6544236 6046413 4883284 4001895 3828515 4057062 3993879 3267791
40457 3267791 2306738 1813364 1794160 1686452 1484906 1888557 3010383 3865385 3761189
40448 3761189 3363449 3543183 3883428 3414111 2382815 2062604 2836092 3577667 3194380
40439 3194380 1938243 853545 562724 938784 1477805 1664458 1331558 897989 931986
40430 931986 1349210 1474234 1082024 856946 1433963 2429686 2968643 2875070 2691345 2639622
40420 2639622 2335471 1700529 1398375 1869227 2514447 2543842 2248091 2557829 3487073 4009236
40410 4009236 3626175 3057104 2972824 3031952 2812107 2739530 3158909 3308056 2433639 1337537
40400 1337537 1404480 2397277 2736700 1959499 1325041 1664631 2154661 1872962 1249369 1123323
40390 1123323 1424050 1645964 1714543 1561430 767939 -473851 -965083 -82688 1112690
40381 1112690 1486509 1672399 2877046 4534308 4896737 3755316 2811415 3104867 3655298
40372 3655298 3238493 2203367 1694253 1980241 2420588 2528501 2328988 2011995 1828343
40363 1828343 2098014 2844410 3567440 3733007 3374204 2950313 2727159 2535395 2103579
40354 2103579 1463726 968006 902634 1148437 1388324 1635289 2216303 3097293 3660342 3502618
40344 3502618 3077927 3070206 3418096 3479420 2941685 2057369 1204529 755831 1107603 2150677
40334 2150677 2906393 2471649 1272744 611634 964111 1526527 1521289 1089343 666667 333197
40324 333197 169345 483484 1163528 1453264 992870 589283 1270577 2854970 4100369
40315 4100369 4177862 3463315 2844040 2683462 2681288 2567662 2641077 3397405 4645436 5375254
40305 5375254 4836862 3486259 2406639 2021071 2001036 2281635 3253416 4726701 5594529
40296 5594529 5125195 4034992 3616281 4092168 4445762 3796272 2450873 1491939 1566177
40287 1566177 2216297 2434881 1861612 1194084 1189164 1599380 1674884 1510000 2025682 3460265
40277 3460265 4731014 4748682 3738179 2765550 2461296 2679908 2957187 2839226 2196492
40268 2196492 1638582 2110767 3610363 4894612 5053282 4706264 4816750 4978021 4087909
40259 4087909 2385540 1397955 1720493 2185768 1755573 1088189 1373082 2430255 3051296
40250 3051296 2878485 2857078 3686345 4664538 4565503 3269812 1973000 1761516 2407399
40241 2407399 2890099 2905609 3274617 4610244 6130658 6486710 5576547 4682767 4628148
40232 4628148 4676444 3868161 2752857 2799608 4302275 5912621 6447491 6229230 6136580
40223 6136580 6122354 5522285 4406709 3642562 3637272 3897792 4021891 4311325 5004192 5607728
40213 5607728 5575802 5114206 4665752 4063821 3010162 2081884 2270283 3484124 4428790
40204 4428790 4231604 3416357 2925126 2905544 2969594 3032626 3221011 3320753 3018959 2588180
40194 2588180 2771975 3924608 5556931 6742663 6855591 6084791 5370279 5573490 6538640
40185 6538640 7286084 7290610 7087075 7315058 7766503 7955232 8105055 8760660 9717431 10232551
40175 10232551 10238965 10516002 11581472 13168586 14917116 16835076 18909828 21066442 23818429
40166 23818429 28107634 33864031 39264936 42057314 41326944 37639512 32086847 25915651
40158 25915651 20594073 17155898 15315934 13876456 12152764 10512821 9473132 8887208
40150 8887208 8313675 7732492 7520526 7962899 9098970 10867805 13055099 15123338 16431874
40141 16431874 16847621 17062481 18076506 20253935 23044951 25820348 28782767 32676008
40133 32676008 37772186 43826387 51008505 59685468 68468113 73505822 71410059 62949607
40125 62949607 52549550 43864030 37077337 30916992 25612292 22427091 21272054 20602173
40117 20602173 19552527 18653307 18223704 17452296 15679494 13529953 11952638 10836345
40109 10836345 9439809 7785371 6753021 6852291 7573734 8080808 8110078 8028046 8262691
40100 8262691 8853196 9490174 9917953 10240908 10755717 11539968 12408372 13309291 14566159
40091 14566159 16640866 19752186 23649702 27522675 30186591 30714837 29024550 25745176
40083 25745176 21675253 17625976 14446423 12503465 11168947 9511688 7573424 6291278
40075 6291278 6114443 6527549 7078132 7870095 8701177 8855493 8428375 8763230 10597971
40066 10597971 12685292 13367291 12732242 11975779 11382006 10483334 9724701 10199956 11802262
40057 11802262 13319367 14490340 16248973 18542730 19673603 18621897 16524231 14841059
40049 14841059 13380417 11337238 9144738 7804234 7096500 5993385 4529113 3832101
40041 3832101 4293702 4961648 5017621 4834867 5095931 5578301 5440020 4454761 3462744 3463714
40031 3463714 4413986 5188292 4914147 4089725 3933839 4829999 6144975 7541714 9426687
40022 9426687 11708660 13162404 12825315 11287347 9772839 8613876 7539574 6793423
40014 6793423 6750662 6816233 6006534 4555619 3728897 3921253 4073541 3286226 2028533
40005 2028533 1307038 1419971 2004774 2706021 3339185 3815834 4221161 4635149 4799826
39996 4799826 4448405 3980193 4118820 4741347 4790912 3672147 2059910 955117 598003
39987 598003 749010 1356755 2303394 2983337 2835062 2048642 1258075 829614 878837 1546879
39977 1546879 2650934 3424333 3309360 2785372 2732795 3192162 3526158 3658663 4191147
39968 4191147 5146978 5560263 4792810 3553269 3022594 3459429 4241938 4865795 5236290
39959 5236290 5257493 4884584 4544329 4834485 5695733 6405472 6493955 6172711 5777909 5374472
39949 5374472 5094937 5249283 5782887 6225308 6558444 7441393 8959516 9844013 8899885
39940 8899885 6810704 5459107 5603678 6283768 6493870 6282175 5969882 5456617 4824201
39931 4824201 4653985 5121636 5595664 5740557 6204876 7545735 9286433 10808343 12345236
39922 12345236 14141561 15396595 15228654 14167457 13479641 13362711 12983887 12022464 10958615
39913 10958615 10041972 9245402 9125749 10368607 12396285 13733893 13929611 13861603 14020228
39904 14020228 13923084 13511207 13541559 14032962 13913030 13008278 12764191 13838783 14518556
39895 14518556 13095880 10607624 9391345 9768906 10127957 9797785 9717026 10213755 10195296
39886 10195296 9155809 8313849 8843464 10186921 11058621 11211373 11287523 11611664 12055670
39877 12055670 12666136 13610831 14768803 16017485 17637946 19774524 21729715 22530954
39869 22530954 22147461 21475752 21092054 20721550 20125248 19742849 19913265 20043802 19390140
39860 19390140 18413905 18403071 19679600 21254454 22686209 25080384 29210278 33702900
39852 33702900 36797206 39325705 43637809 49214930 51839563 48648293 42210468 37583436
39844 37583436 36531866 36918678 37014287 37665094 40050105 43892168 48793794 55216903 62868370
39835 62868370 69852978 75019554 79951299 87000264 96046587 104506736 109799293 110465830
39827 110465830 105758907 96151124 84243751 73433722 65156063 58419858 52104781 46426900
39819 46426900 41844352 37874291 33826811 29938591 27048890 25577808 25223183 25190460
39811 25190460 24454048 22427393 19771763 17967239 17671096 18054279 18166374 18285688 19245728
39802 19245728 20921395 22231849 22527760 22280310 22306627 22804185 23362739 23688788 24045269
39793 24045269 24841071 25864945 26353723 26151917 26351004 28056674 30818913 33276075 35206607
39784 35206607 37586798 40402312 42098631 42158109 42679602 45789766 50482975 53884363
39776 53884363 55163026 56326068 59278690 64029014 70079157 77639230 86468047 94763826
39768 94763826 100205743 101442193 98230736 91260178 82395589 73853119 66252956 58482157
39760 58482157 50218573 43295344 39386407 37505516 35344469 32283807 29451728 27435544
39752 27435544 25812894 24721347 24920586 26004979 26299560 25128757 23739916 23307394
39744 23307394 23368680 23054524 22586303 22446943 22092539 20813528 19250035 18715180 19289097
39735 19289097 19819190 19785828 20007108 21181199 22622736 23010895 22005744 20739552 20838519
39726 20838519 23026490 26459053 29402346 30834220 31422015 32686244 35194155 37861574
39718 37861574 39116770 38541801 37296151 37087898 38769617 41793472 44975608 47787114
39710 47787114 50697495 54072549 57077521 58383956 58208362 58994859 63132709 69739709
39702 69739709 74395216 72961443 65841902 57842717 53391686 52351324 51152908 47572924
39694 47572924 43153975 40695442 40712655 41550205 42386449 44641564 50028287 58088846 66289561
39685 66289561 72223488 75273030 76270071 76002513 74353646 70947163 66387922 62335031
39677 62335031 59998311 58822494 57085915 53680083 48934018 43927483 39617386 36568622
39669 36568622 34765382 33408745 31481866 28870715 26527640 25315745 25190362 25730391
39661 25730391 26766560 27984332 28576645 28073848 27133877 26769938 27123049 27759800 28799246
39652 28799246 30686423 32957219 34377030 34515451 34144562 33729879 32580603 30132887
39644 30132887 27209658 25186104 24462913 24491519 24796997 25182144 25305155 24922261 24464674
39635 24464674 24752073 26142482 28251079 30248830 31294559 31349345 31861683 34553923 38726327
39626 38726327 40976249 39027200 34913326 32576469 32972235 33707627 33173683 32397166 32438298
39617 32438298 32773765 33462678 36226188 41225505 44737017 42718207 35806118 28510970
39609 28510970 24098189 22417957 22147146 22518452 22634255 21471699 19393738 18002079
39601 18002079 17856318 17801654 17035358 16248306 16068973 15962016 15551150 15586359 16571459 17758833
39591 17758833 18667407 20332563 23561661 26855077 27696207 25529967 22143893 19407566
39583 19407566 17849848 17166838 16786318 15902187 14105171 12157431 11264260 11533573 12032810
39574 12032810 12347428 13016497 14211334 15061068 14855990 14175978 14202339 15336615 16945470
39565 16945470 18116009 18316611 17671175 16941097 16964610 17811017 18704040 18982616 18879642
39556 18879642 19165129 20276647 21925941 23236248 23190793 21484813 19214098 18142503
39548 18142503 18776587 19624109 18958673 16881215 14847735 13535513 12313876 10825845
39540 10825845 9791346 9707172 9872972 9586277 9405300 10079360 10888492 10492339 9190208
39531 9190208 8769464 9874858 11019883 10838307 10009853 10001885 10906262 11633849 11571586 10970846
39521 10970846 10204648 9661571 9915113 10945998 11600163 10927206 9722987 9579112 10688685
39512 10688685 11868751 12530148 13122985 13591670 13022564 11304690 9729023 9263366 9382133
39503 9382133 9249609 8959211 8882882 8808498 8494809 8188898 7887254 7018789 5617172 4830594
39493 4830594 5355720 6244983 6241007 5495707 4981588 5003713 5371337 6250118 7605866 8480738
39483 8480738 8166220 7553646 7912114 8768917 8551250 7105967 5961323 6032735 6642604
39474 6642604 7111168 7814144 9054322 10106494 10139002 9254556 8074657 7081370 6796047
39465 6796047 7655991 9068290 9474916 8241296 6845140 7193829 9088433 10368192 9605946
39456 9605946 7800177 7047575 8111504 9844042 10797721 10807391 10785054 11378764 12279639
39447 12279639 12697602 12074178 10394940 8277888 6711257 6145188 5874104 4996885 3914347
39438 3914347 3855794 4779444 5065691 3915586 2741717 3135549 4567581 5407781 5336453
39429 5336453 5262803 5505218 5637648 5747231 6273719 6809238 6545732 5754030 5352170 5209545
39419 5209545 4511568 3680713 4060325 5504574 6205814 5417200 4517653 4679812 5271493
39410 5271493 5498427 5880457 6798044 7065663 5571031 3367763 2557780 3634515 5261143
39401 5261143 6282346 6719101 6942154 6933843 6500385 5635164 4629257 4022217 4154784
39392 4154784 4626214 4677538 4234715 3938017 4045735 4138910 4057324 4133271 4249620 3770886
39382 3770886 2764596 2120713 2039438 1674716 775456 250891 443761 403922 -218377 -191775
39372 -191775 1179522 2533955 2518116 1942271 2220952 2961481 2940228 2368380 2238940 2344666
39362 2344666 1937353 1555769 2140981 3016197 2870240 2189689 2527558 3797825 4546251
39353 4546251 4568622 4909783 5473184 5119036 4159877 4238000 5501677 6412031 6668600 7674620
39343 7674620 9552539 10484560 9960249 10004053 12020391 15039671 18358996 23009798 28692576
39334 28692576 32044987 30606645 26486283 23541407 22791851 23283886 25420496 29727018
39326 29727018 33394520 32121486 25728725 18757102 14880888 13454452 12249025 10826405
39318 10826405 9868100 9344437 8994763 9254082 10338403 11385546 11536212 11007368 10287826
39309 10287826 9189186 7538848 6008129 5397731 5670902 6306534 6995983 7465697 7308285
39300 7308285 6587446 6001121 5915403 5861493 5482449 5240651 5536461 5831718 5500351 5063099
39290 5063099 5631067 7254079 8603345 8428398 6912546 5468277 5329009 6315767 7022398
39281 7022398 6417385 5105918 4524064 4990601 5320448 4544571 3221765 2609700 3160650
39272 3160650 4353831 5548717 6474684 7132854 7569346 7617112 6906234 5537840 4518604
39263 4518604 4671576 5212917 4607364 3005968 2365620 3555913 4915730 4762017 3863044
39254 3863044 3894992 4663314 4758918 4157565 4082861 4703712 5086421 5286110 6257144 7502606
39244 7502606 7163565 5124068 3754484 4418180 5309648 4348490 2472467 2080529 3437430
39235 3437430 4747193 5066912 5048606 5096176 4775383 4132450 3889598 4092910 4030296 3701697
39225 3701697 3917795 4647765 4747558 3810400 2878624 2692941 2601187 2021056 1693004 2405241
39215 2405241 3521865 3954675 3769475 3646314 3491433 2888076 2318236 2474404 2716953
39206 2716953 1772541 -85587 -1103073 -536473 363183 344390 -190611 -236655 271103
39197 271103 873262 1586116 2425581 2676780 1840836 842060 1021502 2113962 2519959
39188 2519959 1693681 946860 1361743 2076718 1638827 350727 31621 1518672 3497576
39179 3497576 4189817 3401696 2265457 1491568 809513 60647 -200409 295241 728045
39170 728045 292673 -315355 348954 2215223 3374113 2515049 675631 -242746 99171
39161 99171 567986 505019 345767 481576 715848 946778 1321090 1545776 1109372 418740
39151 418740 555538 1483787 1741119 636411 -453565 -58243 1117381 1262126 145423
39142 145423 -759898 -569500 66791 374442 480696 699431 849235 705397 353072 -183612
39132 -183612 -924147 -1382066 -905829 162762 566637 -211253 -1158116 -1059873 67733
39123 67733 1306704 1921534 1688646 836793 154773 515443 1772273 2706998 2533205
39114 2533205 1826231 1507499 1641320 1828373 2066747 2507633 2968622 3371170 4033376
39105 4033376 4853464 4948371 3942149 2872253 2825738 3363401 3403719 2998653 2921223 3050926
39095 3050926 2697430 2211638 2631378 3748031 4151762 3410683 2643164 2555898 2485425 2004152
39085 2004152 1945135 2868525 3786980 3597923 2847078 2825341 3541275 3828987 3163143 2260809
39075 2260809 1936540 2238576 2766966 3143537 3051710 2368002 1455939 986034 1253777 1797256
39065 1797256 1819478 1029779 34973 -284223 141047 456285 133440 -163798 396053 1337955
39055 1337955 1398276 396769 -477838 -409147 56066 126180 -55741 113354 736972 1431986
39045 1431986 1790968 1556548 898435 630338 1401121 2593794 2987159 2614899 2728050
39036 2728050 3607096 3889528 2770175 1394794 1019361 1130673 710389 185765 554836
39027 554836 1475222 1922131 2127603 3120134 4690521 5559451 5495235 5654410 6758175
39018 6758175 8481217 10815797 14381562 18743271 21737346 21378747 17796082 12844622
39010 12844622 8504301 5958171 5350230 5780687 5951664 5233237 3909960 2484975 1314142
39001 1314142 836606 1341558 2329006 2815578 2502952 2028581 1880770 1712549 1001911
38992 1001911 -143478 -1134969 -1515409 -1284979 -863327 -660949 -467643 362300 1710821
38983 1710821 2299403 1308164 -160837 -365603 696875 1514071 1482440 1558616 2270839
38974 2270839 2654793 1870472 646372 235713 781947 1497610 1807079 1653750 1231004
38965 1231004 942738 1123623 1436327 1158891 367046 45127 614855 1208399 977796
38956 977796 327564 152574 542636 1001154 1374062 1767460 1989978 1882243 1902908 2606579
38946 2606579 3653251 4009456 3199665 1920709 1311392 1848904 3056482 4199220 5075381
38937 5075381 5895422 6592968 7062853 8287527 11936072 17687721 21976236 21240718 16126322
38928 16126322 10680414 7546580 5978340 4636553 3749800 3533983 2871075 1228938
38920 1228938 101586 743148 1927145 1842629 986408 1125252 2297794 2979099 2685231
38911 2685231 2364951 2466695 2525643 2586665 3260257 4308118 4775647 4594635 4522860 4450846
38901 4450846 3399951 1442331 45212 55953 696853 1017215 1095819 1304734 1494339
38892 1494339 1425549 1122952 517781 -339524 -644086 369303 1823365 1812404 87989
38883 87989 -1259499 -498110 1639113 3372994 4199234 4717469 5087534 4895853 4089521
38874 4089521 3052882 2038261 1207796 861351 992521 1011502 498491 -149109 -333467
38865 -333467 -81168 250032 598034 976651 1112388 899093 769819 991799 1009225 183708
38855 183708 -1105810 -1790562 -1396528 -458518 228122 329392 65663 -85233 93583
38846 93583 208539 -216907 -773619 -399459 1069975 2341777 2292132 1499396 1344259 2084096
38836 2084096 2742779 2601643 1863179 989347 291642 153370 796217 1718592 2083269
38827 2083269 1746622 1241395 765427 48736 -656726 -474224 717917 1668072 1266348
38818 1266348 86827 -439896 -26004 285672 -106802 -441772 119128 1076968 1262949
38809 1262949 549398 -23720 110329 167362 -727996 -2038676 -2363147 -1271621 184277
38800 184277 857245 714834 444943 477126 821817 1440171 2222368 2757892 2600386 1811039
38790 1811039 987323 686299 900390 1098052 786645 88551 -360032 -249661 -110062
38781 -110062 -585819 -1395923 -1649187 -1177970 -792604 -995913 -1216339 -720262 429058
38772 429058 1816428 3316819 4586045 4645138 3010803 824750 -242164 -42978 142642
38763 142642 -316694 -607957 14928 1060814 1700067 1931159 2123363 2054740 1258285 19490
38753 19490 -731204 -479333 419542 1292756 1744322 1740510 1486001 1270687 1227084 1238079
38743 1238079 1176127 1063571 847383 293816 -579681 -1197912 -980258 -111981 624434 720215
38733 720215 246240 -592191 -1593009 -2165696 -1539659 160480 1588067 1610918 791932
38724 791932 668382 1639767 2472661 2169293 1429625 1549290 2474998 2948463 2418118 1779407
38714 1779407 1942745 2502660 2409234 1472810 560331 469541 1114620 1794593 1900135 1344723
38704 1344723 555419 50174 -110593 -351272 -937051 -1534697 -1673337 -1413857 -1183965
38695 -1183965 -1102255 -917856 -578394 -374373 -417782 -409684 -142898 93854 -94933 -590609
38685 -590609 -798492 -280452 798236 1850879 2410094 2442404 2131064 1486850 444488
38676 444488 -632311 -992243 -397992 372842 501749 394231 1207421 3057719 4550496
38667 4550496 4523039 3548439 3006019 3122920 2857163 1666843 455749 318439 946972
38658 946972 1002988 -32358 -1075122 -851382 350116 1024853 542988 67246 837560
38649 837560 2199808 2396444 1151051 207512 886068 2242801 2519525 1558234 602483
38640 602483 208963 -257509 -1066713 -1403838 -656598 569960 1302910 1346897 1047372 557387
38630 557387 -56573 -479083 -500410 -311899 11886 797398 1966217 2538861 1783431 459496
38620 459496 -11097 617556 1347508 1542121 1515887 1480487 1099674 498258 616568 1835638
38610 1835638 3074684 3120392 2292939 1886650 2292110 2590963 1940277 567278 -689775
38601 -689775 -1195161 -763057 317207 1274022 1320341 436078 -515777 -616812 279912 1534384
38591 1534384 2319719 2268187 1767458 1601667 2091327 2687375 2661279 1996048 1219617 624437
38581 624437 256465 445375 1425727 2391157 2043549 541907 -202645 964599 2608460
38572 2608460 2614043 1190187 319532 526380 216198 -1329547 -2352225 -1276896 647373
38563 647373 1190251 564952 842302 2387187 3270470 2536152 1713187 2058779 2374903
38554 2374903 1234805 -193872 305816 2487881 3913394 3500247 2675756 2759646 3188572
38545 3188572 3011807 2444017 1988912 1426536 735325 806750 2030930 3160974 2891032
38536 2891032 1792382 1344007 1691143 1834149 1577945 1655142 2020324 1663846 388095
38527 388095 -681094 -818571 -666669 -917808 -1214577 -1099211 -1017972 -1457940 -1862642 -1376636
38517 -1376636 -146793 986959 1658936 2003947 1937491 1348519 766844 886395 1473112
38508 1473112 1608853 1059301 572753 681280 1010093 1066001 996170 1145224 1419012 1538723
38498 1538723 1479289 1217948 486307 -681595 -1491747 -1125013 201174 1477805 2133909
38489 2133909 2441259 2721492 2839154 2674175 2462069 2315741 1941083 1232941 629876
38480 629876 351373 -184962 -1414972 -2494419 -2134588 -502773 785694 800416 369603
38471 369603 529943 928958 662070 -41986 -132540 550817 1006573 601155 -55138 -58509
38461 -58509 635108 1347708 1493570 965011 94901 -482359 -223913 807430 1973655
38452 1973655 2691591 2835854 2538480 1970311 1457242 1467629 2204726 3300260 4017019
38443 4017019 3733768 2375794 595157 -597604 -690289 -89975 558179 1221238 2179612
38434 2179612 3124971 3310049 2651610 1954075 1803641 1883707 1694564 1330849 1102103 893940
38424 893940 447441 -46140 -135267 259373 738626 825471 328804 -409811 -536659 557476
38414 557476 2271919 3162563 2654236 1783972 1709288 2132329 2026716 1393655 1165083 1532566
38404 1532566 1595649 913372 303026 531530 1082661 1013321 472572 482496 1427839 2570671
38394 2570671 3079936 2879434 2365276 1885625 1717296 2002901 2365298 2066974 1022383
38385 1022383 245940 657528 1684808 1814276 517631 -1152262 -2038360 -2114444 -1861407
38376 -1861407 -1278929 -281477 548797 573906 153151 142332 532036 602351 391240 841681
38366 841681 2178039 3233851 3014760 2064812 1541138 1647117 1851205 2086969 2654759
38357 2654759 3172270 2785442 1625189 1056712 1910860 3125817 2930238 1160031 -386956
38348 -386956 -103869 1536799 2770266 2843671 2704310 3302157 4125579 4076252 3182285 2515899
38338 2515899 2662004 3212769 3724776 4188156 4408168 3949887 3093034 2907207 3809642
38329 3809642 4852089 5077604 4816682 4866498 5110694 4953901 4605826 4782404 5342726
38320 5342726 5352792 4548281 3720237 3462718 3492187 3559027 4115676 5417665 6607045 6561335
38310 6561335 5460249 4726754 5287712 6507922 7190768 7154831 7172340 7502614 7368304
38301 7368304 6296626 5235736 5462275 6715091 7432205 6852747 5876701 5608038 6061769
38292 6061769 6768911 7645086 8516320 8669690 7851259 7051239 7228265 7755593 7327960
38283 7327960 6111192 5656109 6607834 7760648 7780775 6841420 5995393 5736266 5856870
38274 5856870 6188200 6751672 7368351 7641100 7316421 6450751 5359198 4569664 4592637
38265 4592637 5435182 6423901 6765336 6324518 5726161 5640792 6058693 6388571 6251313 5919781
38255 5919781 5780724 5651031 5106062 4352770 4116726 4556301 4976003 4901036 4760323 5076602
38245 5076602 5640050 6070060 6592292 7504957 8332178 8367379 7814317 7560410 7901420 8230627
38235 8230627 8020969 7511205 7330552 7838296 8816983 9548218 9396602 8601920 8147406
38226 8147406 8509519 9020954 8926953 8501608 8478217 8894326 9232498 9263419 9051489 8621760
38216 8621760 8335591 8976097 10600052 11952359 11998790 11362152 11146717 11127912 10502030
38207 10502030 9708335 9802799 10473643 10480857 9863372 9953308 11270947 13053446 14744872
38198 14744872 16312316 17364063 17756047 18685115 21190264 24181698 26360425 29229172
38190 29229172 34996989 42368093 48739315 56194491 69869209 90144049 113786205 144764265
38182 144764265 193579764 257296896 307592398 312066480 268007689 205384301 155134058
38175 155134058 123821354 101552057 82647032 69142663 60710884 52607204 43276860
38168 43276860 36067924 32392410 29156899 24387198 20404731 19400377 19744494 18921749
38160 18921749 17148352 15858785 14931112 13617242 12496557 12408618 12631649 11939332 10607147
38151 10607147 9836389 9902255 10215912 10561440 10980409 10982511 10145559 9152414 9092825 9929517
38141 9929517 10587692 10399145 9694532 9159962 9231390 9858764 10383350 10104884 9423659 9706529
38131 9706529 11428286 13382169 14636927 16267248 19805126 24703545 28795345 30747715
38123 30747715 30641519 28724422 25346547 21852991 19798558 19329223 19742267 21113479
38115 21113479 23590461 25865569 26872513 28478886 33483175 41239736 48919184 57149446
38107 57149446 69938485 88527182 111332358 141869796 188174889 246791972 293180965
38100 293180965 299610492 263652017 210921851 168163113 141223778 121373088 103200784
38093 103200784 88392233 77478381 67431567 57178458 49011963 43770892 39301753
38086 39301753 34488123 30845287 29076925 27391653 24522146 21727748 20453276 20106560
38078 20106560 19402537 18226120 17067758 15982513 15018210 14523443 14326815 13641920 12295823
38069 12295823 11069174 10495807 10333375 10355234 10483573 10070106 8478141 6595291 6216272
38060 6216272 7504693 8603733 8287815 7409597 7030998 6793264 6174847 5832549 6352563
38051 6352563 6868387 6342053 5307882 4949943 5177371 5020873 4422372 4251018 4810409
38042 4810409 5541449 6047117 6346016 6246785 5492763 4480742 3917708 3780215 3457061
38033 3457061 2899338 2755017 3264391 3836757 3951376 3807779 3794998 3846539 3663139 3247939
38023 3247939 2916222 2898489 3097129 3231315 3216554 3318408 3722967 4040867 3698675 2905193
38013 2905193 2645974 3426812 4575699 5171132 5101403 4749693 4257348 3739747 3649028 4113771
38003 4113771 4371834 3739745 2791626 2634347 3271836 3695332 3461164 3141017 3212004 3524789
37993 3524789 3962297 4616930 5156374 5030689 4539933 4653550 5439177 5733197 4831131
37984 4831131 3471715 2604366 2235011 2138282 2583275 3461271 3757710 2974510 2104448
37975 2104448 1979876 1677126 156379 -1385621 -863013 1361442 2710052 2119746 1319112
37966 1319112 1757372 2440603 2032036 1222751 1337176 1977879 1960526 1654021 2359820 3816061
37956 3816061 4344399 3505194 2755457 3092966 3692727 3550194 3077371 3134381 3514917 3449937
37946 3449937 2981662 2843835 3282666 3786203 3829251 3290393 2283609 1147957 550072
37937 550072 1046285 2358810 3373450 3100472 1663553 262951 32408 906513 1829235
37928 1829235 2152155 2384725 3200240 4197574 4392439 3687567 2973263 2777118 2711654 2443896
37918 2443896 2345718 2802634 3559013 4123398 4260101 3849542 2949194 2246718 2635402 3928751
37908 3928751 4799617 4480787 3697133 3343899 3178964 2672571 2289474 2777509 3726687
37899 3726687 4037800 3558312 3130799 3129219 3043078 2617395 2428420 3000037 4008736 4681174
37889 4681174 4596942 3976846 3484293 3719951 4636923 5601168 6255077 6916864 7733184 8014197
37879 8014197 7165638 5884978 5538232 6508366 7954766 9051113 9625557 9679493 9186881
37870 9186881 8466205 7982632 7672403 7132510 6506593 6454589 7149440 7970443 8277241 7888099
37860 7888099 6828902 5330927 4096165 3822393 4392343 5178511 6023443 7039310 7557611
37851 7557611 6516441 4219955 2577825 2954649 4568296 5602339 5245745 4105932
37843 4105932 3225222 3239052 4010075 4637019 4276234 3254443 2762683 3136108 3240327
37834 3240327 2141196 627509 235528 1229689 2408168 2691568 2163037 1608281 1619513
37825 1619513 2164974 2653468 2483298 1805607 1536046 2265134 3398545 3820094 3242271
37816 3242271 2423363 2118079 2311792 2578012 2740928 2886880 2949390 2669240 2025596 1408684
37806 1408684 1126878 949827 535144 191525 609774 1713321 2472552 2243064 1626952
37797 1626952 1457966 1587185 1421064 1071890 1044468 1239633 1279188 1424135 2053519 2586106
37787 2586106 2220512 1525579 1827294 3028870 3619344 3083363 2667278 3215020 3820652
37778 3820652 3462887 2598287 2117824 1854103 1201711 339553 -167666 -281791 -196136 144843
37768 144843 541373 399701 -213495 -339664 295913 565098 -274373 -1186201 -881811 304547
37758 304547 1310672 2078733 2946666 3270099 2369404 1182307 1187730 2096467 2341019 1543859
37748 1543859 722448 262025 -370158 -833335 115711 2331081 3770917 3114332 1440829
37739 1440829 453712 337789 361124 459299 989306 1591702 1498152 772645 403101 1146613
37729 1146613 2705138 3980679 3974276 2657202 1059718 243904 241361 379335 425540 695273
37719 695273 1133192 1223224 970991 1053476 1658268 2039178 1686553 1143449 1076732 1227614
37709 1227614 981127 467082 364718 917969 1780209 2613739 3250066 3408608 2877713
37700 2877713 2032720 1685521 2205269 3037001 3292191 2707665 1835820 1314222 1219963 1330106
37690 1330106 1701159 2433527 2963629 2429074 1057726 359589 1270132 2780860 3270761
37681 3270761 2628981 1985661 1736444 1153348 -43970 -1030495 -1147005 -784911 -534766
37672 -534766 -315793 117994 513145 548752 464079 738052 1383832 1848304 1465083 46842
37662 46842 -1661299 -2327047 -1373628 222183 1104330 1181704 1222198 1217781 533705 -369111
37652 -369111 -3000 1864126 3469873 3380411 2297918 1673653 1700314 1745947 1741274 1881921
37642 1881921 1734827 938703 230764 504936 1260717 1248883 388952 -218735 -88420 104295
37632 104295 -77147 -16617 926068 2318878 3045151 2433125 834532 -637656 -970490
37623 -970490 -144883 934513 1580524 1976217 2355751 2207175 1064715 -393939 -1000488
37614 -1000488 -614421 -106108 -16074 -127342 -212705 -256192 -12926 702047 1362075 1359647
37604 1359647 1162897 1627757 2184039 1245497 -1156765 -2730007 -1827081 294144 1296025
37595 1296025 828622 394369 861119 1683062 2354042 3064507 3664801 3320009 1835123
37586 1835123 397245 227320 1036311 1568925 1388104 1325949 2070985 2986678 2869785
37577 2869785 1659671 707907 1037997 1851858 1471508 -388679 -2165339 -2492216 -1829264
37568 -1829264 -1455140 -1585864 -1437670 -717116 82426 801422 1885352 3235854 3785856
37559 3785856 2824056 1086688 -94738 -307803 -196781 -454708 -1180350 -1938381 -2018329
37550 -2018329 -971597 642974 1444845 771971 -310768 -296780 702269 1095327 25234
37541 25234 -1519914 -2130969 -1658926 -897807 -255705 437452 1089366 1180867 588923 -29786
37531 -29786 -26250 377522 389346 -280987 -1024803 -1125086 -620116 -69817 295938 665034
37521 665034 942590 692981 48468 -80099 711943 1484513 1237167 506694 585066 1433427
37511 1433427 1689635 839137 32089 284853 1084556 1496004 1609337 1963631 2341165
37502 2341165 2180003 1669752 1447253 1537160 1489107 1313083 1420714 1778374 1881441 1503383
37492 1503383 870322 237526 -161805 -1049 699495 1285094 1242603 949695 983129 1095121
37482 1095121 756421 363426 798968 1879368 2370458 1725266 806879 563332 833496
37473 833496 887887 502302 51345 -66321 183595 397167 38547 -838263 -1325477 -625064
37463 -625064 882366 2114907 2647005 2902292 3171484 3253339 3020438 2570071 1871407
37454 1871407 1007497 586360 1019710 1586751 1260810 317751 -55269 363551 721069
37445 721069 847507 1493341 2500262 2479120 1048940 -188673 93629 1088404 1350064
37436 1350064 900678 581705 381710 -162053 -649432 -298465 725755 1606104 2042067
37427 2042067 2138621 1720755 813998 205908 413797 695490 273964 -98109 782513 2404611
37417 2404611 3027592 2142505 928471 273685 -161835 -736276 -1098266 -1042083 -903503
37408 -903503 -747774 -258028 269223 6963 -882065 -1014864 226151 1520054 1302247
37399 1302247 -148769 -1266059 -1298788 -870181 -653677 -442961 251988 1278230 1921053
37390 1921053 1792138 1344207 1323757 1814199 2174456 2015020 1742408 1787793 1830926 1446874
37380 1446874 1111814 1644299 2743429 3045743 1874670 192997 -525854 134696 1352685
37371 1352685 2025393 1690382 808349 253484 345097 564966 519594 690311 1506895 2137688
37361 2137688 1367620 -396944 -1285156 -420467 958845 1337372 763730 147317 -246181
37352 -246181 -601323 -621724 57537 922636 1110228 710911 617738 1166042 1808056 2135016
37342 2135016 2315827 2342959 1721047 343843 -992513 -1530551 -1570207 -1933976 -2675179
37333 -2675179 -3002890 -2482895 -1636210 -1084190 -683244 -32988 548436 318716 -648609
37324 -648609 -1287603 -891240 -15029 423389 442148 774107 1632573 2345035 2173337 1045594
37314 1045594 -455069 -1455491 -1321613 -265403 738450 1047046 1067934 1392175 1691162
37305 1691162 1340241 752731 859410 1303843 605237 -1411304 -2735498 -1704177 602269
37296 602269 1735615 1045523 123256 284205 1005807 1234026 1111824 1571887 2739893
37287 2739893 3627962 3427240 2467755 1611324 1113203 604625 69944 135192 1059728 2037544
37277 2037544 2165966 1744974 1753069 2177613 1946007 767248 -76753 500139 1685133
37268 1685133 1834820 748484 -225110 -189754 288364 349816 52601 -63562 59013 77979
37258 77979 -62957 -77454 190241 654043 1251755 1952200 2525659 2637133 2231441 1617739
37248 1617739 1142727 944684 984002 1063338 830059 96321 -745846 -988341 -493308 51764
37238 51764 106730 136795 918341 2181822 2695425 1834427 409820 -375526 -259844 181105
37228 181105 514251 808524 1245968 1800721 2188880 1930819 770318 -713947 -1351838
37219 -1351838 -670722 441620 859779 620349 590622 1100813 1686062 1982978 2014431 1610150
37209 1610150 465892 -979831 -1538675 -616804 934743 1760809 1498401 996751 1236519
37200 1236519 2287818 3287909 3371893 2598853 1753916 1186305 386800 -856015 -1532318
37191 -1532318 -612278 1121100 1627651 167115 -1751050 -2350425 -1572819 -550509 16970
37182 16970 152774 -112008 -776117 -1375543 -1271489 -541852 -53555 -425633 -1175743 -1139516
37172 -1139516 200577 1886889 2274536 868122 -929422 -1355952 -334270 670023
37164 670023 685802 247508 232166 649022 1105155 1691771 2620808 3413669 3285012 2277937
37154 2277937 1380962 1352089 1788202 1611015 410994 -911961 -1089723 -43211 940886
37145 940886 830181 116125 -55284 501165 1063655 1262897 1283426 1075616 528631 283399
37135 283399 1013170 1853990 1146593 -860532 -1765450 -354332 1397265 994077 -1137584
37126 -1137584 -2437427 -1608637 369027 2092454 2982623 2873555 1888597 881883 781028
37117 781028 1264819 1119529 127094 -393038 676032 2715924 4037587 3661112 2162707
37108 2162707 1027719 1253576 2375787 2947747 2168260 755165 -36342 234294 1252759
37099 1252759 2701467 4134125 4604228 3523105 1800560 1143319 2093929 3530405 4192445
37090 4192445 3952652 3437348 3124682 3129049 3368373 3626065 3693314 3572161 3400104 3279163
37080 3279163 3326971 3595958 3733042 3227870 2381955 2377600 3712477 5168974 5218104 3974952
37070 3974952 2793383 2333822 2156723 1979562 2100963 2543618 2878059 3051283 3464563
37061 3464563 4124778 4587329 4782092 5014592 5154752 4778499 4132573 3962540 4317056
37052 4317056 4497284 4227391 3887479 3653434 3543427 4193114 6148844 8335677 8854351
37043 8854351 7637061 6672180 7097819 7819141 7767346 7686234 8442251 9170291 8662530 7423061
37033 7423061 6805281 7051188 7617187 8493186 9653895 10079575 9056842 7831669 8216752
37024 8216752 9969546 11239964 11264592 10864169 10534087 9970738 9525810 10179024 11701085
37015 11701085 12622807 12515552 12572044 13314586 13564369 12705247 12255245 13682946 15891221
37006 15891221 16561336 15305975 13899328 13720941 14449203 15263888 16010540 16805771 17379895
36997 17379895 17292180 16441268 15217903 14370816 14526513 15440307 15962002 15254060 13827676
36988 13827676 12824675 12545140 12411057 12189266 12303088 12815719 13042205 12600445 12119037
36979 12119037 12316271 12870306 12847747 12005659 11076706 10810863 11182582 11586853 11508858 10941150
36969 10941150 10339579 10201322 10564017 10939810 10823606 10173680 9298973 8436866 7634741
36960 7634741 6941342 6498277 6448050 6835074 7512181 8107867 8297061 8186805 8131266 8041253
36950 8041253 7370049 6149990 5474485 6202773 7543593 7903995 7079964 6510428 7086552
36941 7086552 7819307 7359963 5953460 4933726 4836135 5033047 4975647 4796014 4685482
36932 4685482 4543310 4373733 4320196 4172371 3524853 2609575 2284623 2887767 3706691 3973708
36922 3973708 3845838 3904359 4119419 3958861 3365418 2989854 3298782 3857658 3817632 3015782
36912 3015782 2282547 2465558 3301527 3647554 2928184 1897554 1610783 2055199 2406252
36903 2406252 2372306 2463850 2896319 3091973 2645652 2101077 2198430 2770894 2987183 2503757
36893 2503757 1855465 1720579 2177464 2750212 2952301 2705442 2346076 2307659 2790229 3652081
36883 3652081 4465015 4681293 4053535 3050167 2504165 2577816 2506077 1792599 1117482 1308285
36873 1308285 1882581 1694247 826856 591092 1509895 2549735 2727445 2312785 1926774
36864 1926774 1596277 1365506 1720834 2579471 2912623 2316108 1920397 2653930 3641512
36855 3641512 3649067 3144638 3315294 3829750 3466810 2497997 2389891 3214121 3421415 2468399
36845 2468399 1680569 1938885 2384936 2236214 2144402 2713233 3224182 3008514 2680705 2752601
36835 2752601 2396936 1071185 101017 859750 2350869 2579385 1673807 1532364 2646468
36826 2646468 3460994 3071797 2482198 2587633 2748835 2271566 1795386 2134367 2891065
36817 2891065 3296545 3496244 3929179 4191679 3637305 2605657 2032905 2165221 2518279
36808 2518279 2808316 3107207 3322915 3285412 3138650 2984140 2452892 1394806 664367
36799 664367 1257581 2781496 3772340 3616546 3185478 3275979 3356917 2515726 1088413 556577
36789 556577 1831421 4105178 5622282 5488723 4486613 3930386 3985391 3732931 2884947
36780 2884947 2417092 2898151 3184799 1971246 14541 -706420 117245 728563 94018
36771 94018 -576075 76779 1355151 1637733 759526 -111227 -411458 -593154 -776920 -350260
36761 -350260 822912 1815816 1760755 975501 547688 1098618 2193280 2763852 2031006
36752 2031006 244434 -1412840 -1845000 -1027045 115600 728619 784243 890614 1492468
36743 1492468 2274861 2433077 1667040 699489 415165 686481 701528 349753 359528 913882
36733 913882 1209524 854478 600660 938510 1057422 299518 -305362 590408 2327244
36724 2327244 2871306 1617056 98368 -164329 795652 2156297 3310532 3774216 3285329
36715 3285329 2477153 2462645 3295216 3775250 3240614 2581495 2845196 3662441 3829468 2919262
36705 2919262 1634192 886321 1019484 1695723 2232081 2236887 1980453 1883069 1847284 1625180
36695 1625180 1521053 1861253 2029771 1199791 -43618 -174065 1016400 2088296 2242393
36686 2242393 2313337 2798991 2640687 1184102 -171121 96133 1176329 1210643 255892
36677 255892 34705 1055529 1926199 1711771 1258094 1594277 2341984 2505725 1992121
36668 1992121 1547225 1595452 1761104 1481925 805468 454356 985843 1961546 2394632 2132174
36658 2132174 2145268 3083106 4254537 4653597 4330689 3970140 3693057 3187266 2572046
36649 2572046 2197366 1955947 1710329 1985090 3179135 4428605 4431108 3257205 2226295
36640 2226295 2086564 2446655 2925103 3593999 4152042 3898239 2871700 1991763 1746027
36631 1746027 1672097 1391106 1191096 1314531 1618874 2171879 3136792 3818360 3061997 1110553
36621 1110553 -153479 448462 1878206 2526371 2339331 2293717 2627717 2805243 2694739
36612 2694739 2596091 2373095 1609620 499061 -316887 -703646 -1022222 -1257274 -980936
36603 -980936 -203814 521361 990033 1657316 2808493 3944713 4308854 3717641 2652385
36594 2652385 1727644 1207995 925179 628244 447421 802574 1645937 2105563 1395157
36585 1395157 -17047 -763033 -272709 432416 52501 -1258115 -2064766 -1479463 -175086
36576 -175086 673423 895566 1159764 1567813 1285568 -127845 -1694710 -1957463 -677370
36567 -677370 983082 1867493 1857405 1478980 1058092 572382 38334 -325783 -360044 -244698
36557 -244698 -366878 -795499 -1020356 -521352 456820 1164597 1408619 1673123 1961243 1435146
36547 1435146 -101516 -1216217 -479682 1398134 2349532 1698068 789883 772825 1141728
36538 1141728 1021285 679446 882593 1531874 1845802 1466982 685206 -84281 -441122
36529 -441122 16473 1180109 2119994 1941721 934137 350288 963867 2205624 2868620
36520 2868620 2442180 1537689 1016984 951641 761470 313207 277022 1039238 1838248 1681470
36510 1681470 760681 108451 23981 -204477 -950059 -1577325 -1442583 -811661 -380237 -403202
36500 -403202 -596207 -494337 205957 1230812 1708788 1136230 224543 46767 519427
36491 519427 696402 434946 530479 1110734 1290663 790516 479754 707548 505456 -672403
36481 -672403 -1719066 -1492481 -581178 -256681 -561784 -668736 -366825 72225 850624
36472 850624 2149565 3179296 3024489 2092899 1537496 1584771 1609319 1487379 1575243 1610155
36462 1610155 1009912 176646 152922 946220 1507944 1482967 1608407 2088621 1986233 848777
36452 848777 -285380 -376310 37720 -265168 -1295975 -1865441 -1280225 -131128 734521
36443 734521 1332321 2196036 3244667 3622117 2850470 1638753 1022713 1027120 937241 700223
36433 700223 969316 1634311 1632165 806410 605376 1873444 3138253 2557429 705990
36424 705990 -269503 230720 788161 462101 -67677 -107010 -27765 -172283 -61357 572329
36414 572329 1027007 646859 -188723 -688316 -622588 -246974 132686 195943 -180179 -540182
36404 -540182 -336245 131470 92255 -309916 -52163 1112070 2159286 2371298 2257228
36395 2257228 2295953 1899679 546941 -930633 -1243104 -303095 903510 1715262 2252070
36386 2252070 2742674 3123825 3245012 3050127 2654510 2386233 2425035 2354472 1641168 619246
36376 619246 204976 483567 595732 356231 728933 1969572 2601186 1467549 -212753
36367 -212753 -377970 921407 1746558 1175853 283827 99629 255131 223204 438906 1247722
36357 1247722 1843221 1425512 710358 998257 2069933 2390630 1550295 1123187 2364443
36348 2364443 4137626 4361817 2936281 1730393 1728486 1858662 1230191 860326 1856194
36339 1856194 3175103 3064553 2002103 2022102 3245495 3445039 1666600 11132 481581
36330 481581 1911109 1873489 363413 -568107 -201483 59384 -659238 -1267978 -608287
36321 -608287 707441 1297136 921774 471905 569258 985754 1235698 1155429 955861 1057504
36311 1057504 1783840 2909300 3569368 2953520 1238079 -315008 -422449 944176 2438930
36302 2438930 2652676 1506138 189972 -172199 486093 1445756 2035111 2083843 1902151
36293 1902151 1951648 2275233 2267855 1439487 387665 351236 1571152 2763215 2658039 1523236
36283 1523236 637424 697483 1342312 1954868 2302176 2436475 2418674 2213808 1734318 1090209
36273 1090209 762134 1127770 1745833 1641181 513913 -848187 -1574032 -1555513 -1095046
36264 -1095046 -444611 -24646 -278128 -815669 -550585 697203 1622009 1246167 405019
36255 405019 398828 1014782 1179758 896702 990340 1308846 875624 -131263 -201522 1254008
36245 1254008 2828134 2945634 1734148 410698 -351323 -719203 -938746 -955413 -578819
36236 -578819 280669 1337256 1920334 1687131 1243492 1410801 1978154 2033176 1507812 1309432
36226 1309432 1686297 1675043 790338 155877 971193 2608722 3341057 2565528 1265122
36217 1265122 429304 25703 -348546 -664680 -707710 -597790 -623629 -779851 -814511 -664103
36207 -664103 -547080 -538494 -281833 582766 1724505 2226369 1592950 352633 -646720 -1223785
36197 -1223785 -1671377 -1851149 -1212378 224563 1572635 2049078 1797035 1488766 1493390
36188 1493390 1694172 1806266 1609005 1092103 562733 396923 558143 601063 257072 -250223
36178 -250223 -575532 -648179 -573397 -424913 -286345 -238069 -137890 365561 1429267 2747493
36168 2747493 3744021 3910321 3042005 1455549 -6687 -532899 -76417 622935 818448
36159 818448 441360 49803 248964 1081935 1862283 1800669 967103 304905 402072 703229
36149 703229 469466 52779 368082 1331577 1820495 1260869 323202 -215690 -442177 -722709
36139 -722709 -897493 -634059 -88000 359244 721536 1271744 1923779 2125249 1400887 -70687
36129 -70687 -1394595 -1635829 -806232 13797 -85009 -689593 -650338 396271 1734029 2639628
36119 2639628 2977302 2761586 1989338 1080227 724818 1037953 1454670 1592201 1591724 1548823
36109 1548823 1322455 996338 815741 647936 286729 201785 974627 2031119 2149594
36100 2149594 1320981 752348 824921 617649 -101857 -163907 896846 1739880 1386306 884411
36090 884411 1378720 2012075 1518064 658517 1034208 2327484 2844673 2266119 1744616
36081 1744616 1569560 887208 -259865 -730405 -386953 -397419 -992207 -903389 250502
36072 250502 961035 285980 -426744 305440 1601711 1554265 158666 -845807 -639259
36063 -639259 -125217 -38473 208623 1259401 2512181 2887477 2288140 1513542 1015339
36054 1015339 533452 -18622 -116852 500188 1141054 1066263 705779 1035596 1875397 1979313
36044 1979313 1057838 407225 828698 1188656 249234 -1062162 -809989 1017347 2426495
36035 2426495 2254167 1497959 1446007 1824311 1493379 114373 -1534796 -2428721 -2130491
36026 -2130491 -1130567 -430606 -414258 -342718 466433 1377814 1285232 395708 4750 611525
36016 611525 1457370 1896181 1955994 1546650 540195 -233049 356549 1741346 1952642
36007 1952642 480097 -808087 -397272 831394 1314739 1042318 837824 775764 709354
35998 709354 1163889 2186378 2379918 757278 -1288101 -1583046 -104491 1370216 1935967
35989 1935967 2044822 1763334 627557 -725006 -777535 553024 1497110 931255 -141839
35980 -141839 -305608 345669 838598 885912 895088 1016506 955478 425038 -631100 -1919876
35970 -1919876 -2677562 -2170328 -616551 815524 1203945 766682 470872 1085176 2585921
35961 2585921 4083651 4428308 3369573 1967746 1310735 1103229 313063 -1016667 -1649175
35952 -1649175 -923452 346983 1017534 860378 415916 292882 816450 1758992 2356142
35943 2356142 2197387 1936217 2305748 2746366 2213249 1130371 961298 1729063 1773800
35934 1773800 532089 -295176 614223 2052282 2171249 1193589 645864 895680 1128558
35925 1128558 1097358 1255879 1569787 1682115 1923575 2746340 3482361 3123224 2083009
35916 2083009 1677005 2001011 1903720 1047865 343395 138308 -339700 -1282131 -1640432 -862367
35906 -862367 116981 410928 427044 712028 790085 227069 -206009 326613 1190001 1128756
35896 1128756 132595 -702214 -796052 -487038 -81013 468797 1059669 1478017 1809205 2093081
35886 2093081 1884784 998064 322277 829254 1948495 2088586 819749 -567351 -847781
35877 -847781 -144974 822153 1674529 2089370 1591701 311416 -778745 -989708 -642600
35868 -642600 -182484 610560 1814591 2583808 2179099 1234116 921332 1218367 1142681 534278
35858 534278 364830 1114624 1987668 2173285 1951849 1971538 2158076 2005840 1466117 935872
35848 935872 678351 711742 946193 1042958 565130 -255948 -375064 780789 2220443 2355966
35838 2355966 923307 -798435 -1629883 -1577941 -1180978 -561707 452209 1720379 2700571
35829 2700571 2829841 1974436 774086 381281 1299447 2549951 2704904 1769173 1153000
35820 1153000 1587709 2149603 1904064 1409716 1582988 1934019 1287997 -148777 -877897
35811 -877897 -310050 390125 24733 -1041907 -1492512 -608804 1169319 2746417 3205324
35802 3205324 2595021 1979173 2224742 2833687 2648625 1552862 506417 -39853 -526065
35793 -526065 -911859 -380754 1003953 1790083 1222889 541874 1018967 1903119 1786022
35784 1786022 995026 863188 1323994 1191999 508371 570210 1554402 2076323 1495768 833485
35774 833485 817447 786694 346823 408642 1453557 2249973 1641199 411806 -31457 205049
35764 205049 202181 157377 865060 1830174 1747732 723308 273819 959645 1628558 1433127
35754 1433127 1134625 1678955 2617479 2830473 2112880 1272613 1078437 1625570 2362572
35745 2362572 2410707 1328909 -135445 -619885 162930 918774 460804 -684316 -1069133
35736 -1069133 -312562 569595 729206 523141 706465 1217926 1327678 789681 286200
35727 286200 546559 1373813 1919519 1797859 1460681 1379705 1359173 991247 391144 1699
35717 1699 -73435 -35220 110211 445660 643452 184992 -871102 -1836205 -2135383 -1658415
35707 -1658415 -472205 1162871 2451062 2474940 1257440 -93614 -550743 -59632 831921
35698 831921 1658231 2129158 2106275 1805434 1606851 1477385 1055775 423080 147806 366813
35688 366813 540154 404876 381758 642469 654056 237580 175614 936876 1610033 1140792
35678 1140792 -28152 -714711 -846478 -1187907 -1556383 -923431 558402 1203463 86282
35669 86282 -1559850 -2054705 -1410749 -830973 -814818 -854073 -642231 -514255 -694116 -964054
35659 -964054 -1218915 -1628667 -2007157 -1685135 -481365 672950 727743 -54938 -376739
35650 -376739 297949 970123 585244 -373089 -603460 64018 525915 233265 -37134 313200
35640 313200 583020 22946 -714506 -526035 370093 897720 963353 1401299 2181358 2212869
35630 2212869 1243696 495333 747065 1055120 325504 -813649 -850604 457235 1850106
35621 1850106 2259942 1868536 1530789 1772380 2361714 2527801 1741933 459391 -315434
35612 -315434 -369234 -481912 -928162 -731551 764305 2429069 2622162 1393164 155543
35603 155543 -443858 -912884 -1340384 -1044099 -97045 266826 -566413 -1539280 -1366552 -117718
35593 -117718 1282119 2235311 2483288 1850861 797597 406174 936086 1169746 186982
35584 186982 -990680 -757650 701082 1836279 2160132 2621064 3550529 3931204 3234775
35575 3234775 2530583 2876710 3677295 3660752 2754427 1905143 1449704 776530 -366403
35566 -366403 -1144523 -642838 828273 1920313 1760213 944968 709847 1266516 1605824
35557 1605824 1140239 690073 1125659 1813018 1592082 776098 656948 1218602 1131818 243073
35547 243073 96879 1222464 1852923 661082 -913177 -756473 834092 2018217 2255363
35538 2255363 2228561 1825794 540610 -602454 11907 1789694 2464960 1598916 1089736
35529 1089736 1761862 2051148 1022611 164068 729000 1548177 1289057 946457 1976658
35520 1976658 3507709 3697998 2739244 2202179 2237800 1778198 953603 896377 1370964 997463
35510 997463 -86655 -166300 1031107 1570970 426800 -695322 127694 2322891 3980850
35501 3980850 4461733 4409159 4069702 3089781 1607907 364718 -181640 -126160 267770
35492 267770 644079 574984 76592 -208821 156045 741746 897469 662771 514153 572436
35482 572436 618808 600339 574186 377852 -147048 -774634 -1142912 -1201783 -1091198 -823925
35472 -823925 -416247 -64358 122761 280056 423293 337513 120133 293312 924984 1235726
35462 1235726 752308 301107 923998 2152246 2484277 1577284 788469 1124619 1688800
35453 1688800 1007480 -702999 -1628886 -668803 1215575 2280938 2037895 1452288 1400554
35444 1400554 1641967 1508485 1038046 881156 1274774 1672832 1507146 930558 594173
35435 594173 881672 1513574 1809413 1319572 341470 -224100 250192 1398227 2258370
35426 2258370 2368493 2161667 2255295 2705903 3100944 3087082 2609374 1814871 908720 68679
35416 68679 -532633 -640499 -76350 845856 1353478 1031493 388206 193497 490175 781646
35406 781646 956294 1327903 1875828 2220734 2367592 2685002 3051498 2833906 1914806 978578
35396 978578 568619 628321 1121483 2120193 2955336 2418743 507449 -998686 -580742
35387 -580742 1129262 2363630 2434839 1950378 1376044 560159 -450918 -1109815 -1023849
35378 -1023849 -401335 116242 -190461 -1498206 -2794807 -2520822 -519368 1327565 1294584
35369 1294584 49786 -365968 673979 1864794 2040877 1487104 1086874 1270002 2023121
35360 2023121 2996086 3367189 2481974 906806 76214 615966 1690079 2207292 1960155
35351 1960155 1333301 604199 -102565 -690793 -1192926 -1578516 -1418511 -328354 1189500
35342 1189500 2032614 1805457 1209236 966655 1025769 1048469 1020066 1067557 1220688 1587083
35332 1587083 2232244 2742075 2536331 1782473 1301269 1355942 1299934 722394 122400 -14240
35322 -14240 -42954 -475886 -1093132 -1347050 -1144265 -662074 114035 1063201 1572552 1162306
35312 1162306 224084 -356022 -96049 844724 1900391 2254909 1365472 -158226 -786927
35303 -786927 160075 1493288 1627863 600018 -244365 -187593 233807 376227 262139
35294 262139 171019 336228 1104786 2499204 3515599 2907696 1060455 54986 1148561
35285 1148561 3018818 3475461 2347614 1481708 2021450 2954725 2750169 1416375 181137
35276 181137 -237052 -139332 75767 406965 766267 821604 614436 693273 1254129 1685954
35266 1685954 1418000 756043 359154 278857 113098 -183706 -295208 -167334 -5634 232499
35256 232499 726290 1271882 1510350 1590793 1918320 2298959 2123816 1452350 1052097 1150452
35246 1150452 1015149 180429 -678578 -647064 221316 1132510 1550603 1497581 1231186 1035799
35236 1035799 1015989 828149 37727 -1039229 -1459519 -969069 -503320 -818210 -1283070
35227 -1283070 -809567 505118 1552292 1773174 1666099 1777266 1984723 1944026 1639692
35218 1639692 1242402 791387 244103 -318095 -627651 -372341 434383 1174166 1069173
35209 1069173 127789 -726186 -779691 -382528 -244678 -307063 11367 643218 730535 -179040
35199 -179040 -1346264 -1598434 -674793 448075 616893 -205613 -927233 -771934 -422456
35190 -422456 -1139705 -2846827 -3941277 -3309975 -1718594 -629838 -347860 -137761 322336
35181 322336 597661 445746 178033 -60497 -643545 -1785217 -2957991 -3339811 -2715031
35172 -2715031 -1738987 -1253228 -1344671 -1263026 -484231 420926 526667 -28837 -200815 365969
35162 365969 926934 1081791 1427910 2149465 2189809 889527 -573900 -733848 -99940
35153 -99940 -358963 -1675692 -2355826 -1288056 577357 1516059 908236 -409063 -1055187
35144 -1055187 -356557 840761 917193 -434736 -1530702 -944258 396282 648918 -167232
35135 -167232 -551204 -192913 -250853 -991289 -1209535 -378034 539211 981174 1663914 2818618
35125 2818618 3333343 2631701 1808943 1806712 1922471 1304883 558281 587158 1085078 1452388
35115 1452388 1975961 2712297 2480498 665494 -1046763 -638094 1293208 2468608 2233642
35106 2233642 1892190 2054331 1826666 837822 68236 69473 -1933 -800308 -1523245 -1070420
35096 -1070420 392734 1684344 1800832 538698 -1349778 -2356643 -1385474 909133
35088 909133 2609286 2621593 1646746 966852 1086044 1758247 2466136 2552979 1734280 837506
35078 837506 1159960 2651859 3635176 2919942 1344287 445727 361857 65056 -758451
35069 -758451 -1185337 -451026 968457 1939471 1854425 997125 43699 -528887 -633848 -415512
35059 -415512 -53857 301309 597243 953781 1443097 1700674 1170157 36708 -578949
35050 -578949 63814 1221120 1611232 1110590 564281 168546 -701681 -1946653 -2376918
35041 -2376918 -1440106 -151756 457123 782710 1532363 2037479 1065060 -981012 -2023024
35032 -2023024 -753380 1763551 3320072 2863589 1241437 24520 -27611 599080 981939
35023 981939 749947 176451 -436761 -1030831 -1498471 -1655681 -1642268 -1849968 -2235279 -2184582
35013 -2184582 -1339172 -131906 737218 928553 422005 -518643 -1083540 -387528 1298660
35004 1298660 2487138 2242811 1351294 1050880 1325389 1371799 1135669 1206083 1495911 1236757
34994 1236757 286068 -601031 -911555 -875902 -694323 -142460 780533 1529245 1649981 1242793
34984 1242793 632736 51387 -293663 -305124 -156017 48053 557281 1381793 1768661 1108699
34974 1108699 77409 -146710 383090 578981 130983 -244062 -418898 -1115428 -2140378
34965 -2140378 -2075013 -593369 522501 -36372 -892727 -7281 2070837 2898215 1666764
34956 1666764 151297 28543 892739 1416498 1203556 795758 667116 855930 1127528
34947 1127528 1094066 518751 -293018 -764024 -803564 -873344 -1187589 -1293635 -686579 404986
34937 404986 1055022 499228 -926305 -1793989 -1011355 695696 1485184 883244 513712
34928 513712 1578957 2782775 2203807 381310 -394523 444231 1106122 509080 -172598
34919 -172598 163686 657357 231464 -387986 -33259 720440 530161 -336499 -444722 388685
34909 388685 932492 735077 762812 1581470 2403013 2408869 1767352 857222 -322388 -1392358
34899 -1392358 -1418464 -290288 708824 598464 125121 515919 1547067 2002255 1558204
34890 1558204 995159 783251 669344 607699 902485 1309190 1169001 690427 882118 1761580
34880 1761580 1926901 726986 -365959 215800 1670379 1920153 636245 -497489 -396197
34871 -396197 265924 728614 1256240 1932285 1932891 1032270 511843 1302898 2296775 1957936
34861 1957936 766995 374843 864870 755661 -336975 -981988 -334674 493693 359658
34852 359658 -40100 574983 1934584 2707024 2606653 2635107 3228761 3365213 2025683
34843 2025683 -123414 -1211971 -295201 1464877 2078195 1033149 -207166 -176486 812684
34834 812684 1471448 1494593 1630152 2049841 1986044 1228524 723217 1100412 1650790 1481652
34824 1481652 793955 217694 -278795 -853624 -886246 201197 1574494 1627980 36169
34815 36169 -1699432 -1878763 -216357 2126688 3586391 3370549 2126593 1371133 1853649
34806 1853649 2707227 2639582 1575576 501880 60501 98839 381156 847864 1180921
34797 1180921 942966 292787 -88659 101231 531106 906719 1248051 1412224 1050210
34788 1050210 312113 -356 613993 1624288 2062062 1652351 1060569 1061508 1640933 2029608
34778 2029608 1669295 953325 653936 733874 422289 -336079 -376318 1083290 3002491
34769 3002491 3594585 2493169 979212 271821 442135 889320 1039242 572848 -289619
34760 -289619 -717880 -156964 760246 887081 125006 -397082 263028 1882993 3466991
34751 3466991 4008296 3013791 992785 -680321 -1083993 -731769 -518524 -160117 1122159
34742 1122159 2668975 2746801 1109158 -321151 24496 1404361 2121511 1766722 1165679
34733 1165679 901629 924932 1171311 1637388 2003726 1835453 1113680 238309 -359928 -471966
34723 -471966 -258889 -212261 -600570 -989516 -787009 -110339 564161 1380726 2724554 3961325
34713 3961325 3839163 2371472 1012435 554313 231475 -462092 -567324 643708 2039664
34704 2039664 2088972 1063992 369053 316228 58286 -608008 -854090 -273055 484246 731730
34694 731730 499437 80960 -403382 -771473 -696058 -90337 751158 1447134 1725715 1458117
34684 1458117 807201 241830 183799 745028 1795708 2906233 3267318 2363198 879597
34675 879597 177075 628941 1335319 1713204 2197564 2838716 2560985 853188 -925420
34666 -925420 -1188262 -219936 600229 833472 880414 663093 29071 -128590 1073744 2682327
34656 2682327 2951117 2052787 1822662 2699021 2958157 1542258 -267914 -932007 -764656
34647 -764656 -818082 -1019868 -794292 -529302 -937439 -1549641 -1278054 -217444 435961 269347
34637 269347 238526 1051288 1986041 1959331 1116122 549568 669970 682184 -111169 -1165130
34627 -1165130 -1413583 -762244 -118130 13813 159899 854234 1712346 2009850 1654237
34618 1654237 1061463 498841 77942 24046 423875 1007143 1576355 2221831 2735413 2493184
34608 2493184 1548559 1105761 1985646 3223917 3293971 2280597 1597825 1774708 1859546
34599 1859546 1124686 128871 -297768 -193813 -161087 -547182 -1204435 -1596283 -1120968 157655
34589 157655 1239884 1274490 686403 473200 693228 653918 365024 559008 1227007 1409596
34579 1409596 741746 60945 66355 400461 534315 629775 980762 1372283 1503261 1417053
34569 1417053 1161371 664161 179915 103201 127121 -513509 -1656672 -2077068 -1254289 -330022
34559 -330022 -583170 -1685717 -2239309 -1532494 -93255 1115431 1491232 1103927 648352
34550 648352 818347 1478870 1814777 1436694 820467 475786 292514 4447 -263400 -262494
34540 -262494 -5958 381540 850237 1336420 1810363 2343370 2740152 2403739 1198041
34531 1198041 79972 16964 633375 944618 990093 1390662 1666760 743054 -918892
34522 -918892 -1591969 -933037 -398868 -565481 -189293 1182617 1857991 660359 -954178
34513 -954178 -1149108 -517860 -790747 -1988309 -2790836 -2792233 -2494046 -1817667 -517956 475942
34503 475942 12572 -1283234 -1668712 -764647 173300 324527 148010 164258 218341 35847
34493 35847 -490903 -1426232 -2316877 -2079846 -446461 1081253 1001848 -78697 -551748
34484 -551748 -305452 -319315 -365768 639624 2123704 2091691 311941 -959889 -261578
34475 -261578 1032435 1031963 22112 -462388 34150 844983 1582947 2329018 2948078 3190203
34465 3190203 3113246 2790035 2095611 1285441 1127192 1862511 2639245 2556688 1725672 797199
34455 797199 69018 -384682 -314836 334273 1125263 1703230 2171752 2455886 1953519 476846
34445 476846 -999775 -1288682 -389814 652869 1020589 716304 167204 -221188 -242696
34436 -242696 -4679 228396 424661 697897 792232 303320 -343946 16747 1606532 2868324
34426 2868324 2282041 539420 -230051 704479 1788967 1448714 208577 -194902 794222
34417 794222 1995496 2211324 1588220 944077 492568 -32816 -390515 31451 988131
34408 988131 1246936 185561 -1205704 -1561081 -781296 283512 1181223 1896947 2011334
34399 2011334 1101695 -90135 -187637 874397 1602700 1055596 92750 -84688 378583
34390 378583 595030 412400 300784 279215 -34103 -512633 -542873 48118 735593 1000202
34380 1000202 818464 480670 312518 488551 762528 551804 -305326 -1092702 -1031031 -363010
34370 -363010 26941 10573 430045 1675996 2828468 2813306 1906447 1299683 1370885 1292712
34360 1292712 557796 2360 622798 1921605 2396043 1594613 731789 965392 1879455
34351 1879455 2242144 1676674 861147 404133 276073 280607 430505 730541 1014875 1133392
34341 1133392 1073679 908207 800186 927871 1193737 1211913 828342 406489 339450 591674
34331 591674 994661 1552136 2068486 2019151 1366990 965216 1394617 1899495 1431135 383565
34321 383565 169911 1177792 2254399 2313645 1456370 363893 -426948 -444376 497175
34312 497175 1633459 1741616 758686 93626 819244 2274253 3005637 2494601 1421614
34303 1421614 742944 1005852 2117148 3286491 3532076 2654303 1489043 1020032 1555760
34294 1555760 2786542 4050776 4422429 3315029 1430227 478576 1387800 3144736 3855801
34285 3855801 2688416 457625 -1398334 -2076465 -1809746 -1266297 -632866 462328 1972876
34276 1972876 2951710 2680200 1809739 1484183 1687681 1560759 1095240 1164325 1868156 2282148
34266 2282148 2061620 1841358 1711280 891974 -490738 -986850 -102113 604758 -83422
34257 -83422 -1046911 -755539 113838 -125247 -1232317 -1382696 -141656 870684 472671
34248 472671 -536842 -775938 -18172 954097 1395640 1127621 616500 690649 1677658 2853588
34238 2853588 3276927 3005529 2845516 3063638 3095808 2512301 1625036 1083545 1263671 1909224
34228 1909224 2088081 988368 -771360 -1318125 204673 2236694 2731444 1860731 1412150
34219 1412150 1884195 1877261 539286 -986595 -1192407 -99390 1191808 1940218 2040627
34210 2040627 1572391 814776 289338 215360 218226 -45349 -312865 -113203 563364 1293005
34200 1293005 1678985 1600760 1271457 1169046 1586252 2128495 2023149 1097240 104442 -137934
34190 -137934 325074 731321 491816 -238015 -785414 -657074 -13903 571978 772241 693599
34180 693599 449685 -6109 -462641 -412099 199654 698615 648927 574040 1063384 1654720
34170 1654720 1493570 812114 728760 1564285 2326683 2143928 1423021 1146121 1544716 1969471
34160 1969471 1848558 1364750 1129999 1370855 1669016 1635254 1538057 1778985 1985381 1490053
34150 1490053 711611 890774 2071763 2657690 1783599 805020 1156700 1926523 1321514
34141 1321514 -243468 -582190 966760 2693100 3157265 2840073 2674549 2575648 2170583
34132 2170583 1701692 1447335 1229494 1040259 1198734 1469646 1078682 35455 -663786
34123 -663786 -616036 -614253 -1107268 -1298861 -567278 346201 483763 58571 -200786 -218960
34113 -218960 -185250 176258 998613 1648190 1618245 1387674 1546982 1772905 1541155 1127834
34103 1127834 978804 833767 472428 533417 1422308 2169363 1755967 955883 1281752 2481885
34093 2481885 2799171 1687104 575362 632610 1310029 1653916 1705229 1836616 1804076 1344515
34083 1344515 919025 1002164 1208915 914285 300797 49127 289468 524028 393780 -31415
34073 -31415 -534170 -802604 -411657 658983 1605010 1524728 589356 -114373 -18812 289200
34063 289200 141389 -189489 -153314 -103774 -886015 -2302748 -2931112 -1818946 324446
34054 324446 2066262 2761369 2579074 1660733 164931 -1137054 -1319703 -470441 350325
34045 350325 445824 96739 -269197 -707346 -1198799 -1186288 -257989 1109230 2021425 2176667
34035 2176667 2025644 2072775 2300368 2229473 1460087 226305 -701202 -890318 -789290 -991868
34025 -991868 -1296740 -1184235 -913421 -1118302 -1414236 -705995 830247 1458136 314207
34016 314207 -1091325 -897900 497406 1156392 392706 -503383 -235113 957381 1920303
34007 1920303 1957901 1337710 894030 1230313 2047487 2403590 1888122 1180001 1073410 1423924
33997 1423924 1589764 1423993 1153170 745176 234035 288846 1457000 2986787 3399343
33988 3399343 2304873 818258 91656 253519 941574 2012142 3286934 4181530 4083929
33979 4083929 2921226 1215970 -203180 -624111 -18032 786834 897511 358718 17762
33970 17762 428429 1290867 1965519 2136355 1928286 1688917 1678115 1800914 1804980 1860419
33960 1860419 2464642 3422290 3578210 2309610 737020 420556 1165597 1329133 288279
33951 288279 -687544 -403751 571044 910042 442932 216489 982947 2327395 3264501
33942 3264501 3289491 2744995 2258571 1934096 1354868 478688 26148 511184 1349116 1641953
33932 1641953 1489308 1648635 2170948 2415973 2287943 2290753 2342619 1828123 1030430 1089819
33922 1089819 2044133 2373210 1328869 316654 743037 1680291 1265694 -325897 -1061347
33913 -1061347 25710 1712057 2529390 2426686 2113243 1930865 1950775 2294348 2741371
33904 2741371 2677440 1990558 1470118 1760558 2397091 2505487 2105186 1980912 2354957 2452940
33894 2452940 1680634 690568 688256 1790325 2706507 2366907 1370238 1121480 1717898 1695506
33884 1695506 244391 -1332063 -1326689 -120594 395313 -298240 -655320 282495 1123573
33875 1123573 213895 -1642628 -2197646 -970673 327554 559419 491094 834864 791308
33866 791308 -267845 -1140819 -486700 791690 743829 -567998 -1235956 -641338 -244711
33857 -244711 -781081 -834548 680967 2456332 2729663 1890199 1444188 1489186 1106968 480022
33847 480022 541869 903081 266085 -1059066 -1156986 520144 2083417 1865585 513988
33838 513988 -454092 -688455 -525113 203373 1550023 2579495 2430087 1643322 1318963
33829 1318963 1500278 1457235 1032389 588486 65700 -736553 -1240468 -649775 668349
33820 668349 1454468 1219441 652696 366991 276734 359882 941740 1793160 1899153 820442
33810 820442 -344295 -160221 1222371 2087290 1213950 -613181 -1585947 -1177755 -821044
33801 -821044 -1922590 -3772322 -4351589 -3100121 -1691653 -1637118 -2286186 -2120164 -1080099
33792 -1080099 -318880 -197458 18463 610767 975789 907501 1020261 1500594 1596640 924633
33782 924633 294113 538686 1332730 1896267 2151244 2340503 2113280 1040624 -223887
33773 -223887 -358691 912544 2304696 2466898 1493101 648158 926914 2172067 3424765
33764 3424765 3873954 3486738 2863076 2527698 2372879 1842577 671557 -665752 -1377454
33755 -1377454 -1211467 -691839 -386459 -199928 254606 781070 737107 130045 -180224 196577
33745 196577 373212 -535521 -1849175 -2065377 -982567 13756 -79611 -666792 -714084 -237855
33735 -237855 1076 -327640 -932301 -1503570 -1905524 -1990367 -1710113 -1257517 -761201 -83158
33725 -83158 753283 1260732 1077965 646512 805107 1773799 2914957 3452402 3128379 2229763
33715 2229763 1272984 657586 438052 445326 636474 1081587 1561772 1619822 1259617 1151890
33705 1151890 1740736 2517126 2664525 2117778 1434251 870630 239443 -426588 -748693
33696 -748693 -623417 -422981 -448546 -631624 -880334 -1272524 -1738451 -1920930 -1542700 -698418
33686 -698418 245444 803568 555486 -386866 -1179644 -1066358 -377477 -58738 -161052 331133
33676 331133 1824942 3173593 3103275 1895901 784719 195998 -369777 -1010859 -1184220
33667 -1184220 -843618 -651034 -742410 -394443 553934 1064458 541518 103941 968850 2276560
33657 2276560 2104847 427213 -629634 231833 1820924 2438907 2070238 1598615 1128725
33648 1128725 480122 385466 1508455 2780299 2485092 892275 68953 876542 1876400
33639 1876400 1743107 1102488 1079442 1474935 1559515 1513595 1769688 1837523 1165749 460906
33629 460906 701933 1356356 1075210 -139514 -949653 -706034 29781 924339 2201293
33620 2201293 3329686 3088286 1550631 490606 962076 1794171 1493719 449035 -802
33611 -802 248358 240802 -228541 -399658 45536 613325 1051203 1671444 2433234 2621278
33601 2621278 1806914 572536 15241 811228 2677169 4359899 4429701 2731706 853132
33592 853132 403092 1016803 1013566 -47498 -714818 109571 1532925 2104253 1882660 1924338
33582 1924338 2343271 2261802 1554872 1252389 1823649 2222907 1415850 69686 -260517
33573 -260517 735077 1806089 1953440 1625893 1791475 2554666 3226747 3278935 2647553 1458089
33563 1458089 125632 -467719 321132 1902042 2799984 2234816 878274 -145660 -466018
33554 -466018 -365865 -54637 388522 678584 573495 386571 703773 1506923 2008304 1571601
33544 1571601 565284 56288 652440 1760138 2117380 1130852 -449608 -1370462 -1227815
33535 -1227815 -626042 -113203 411607 1046817 1318491 831509 139463 324643 1712466
33526 1712466 3392816 4080288 3316975 1933330 1392810 2400679 4030856 4606864 3628310
33517 3628310 2321807 1982130 2401517 2518028 2032642 1531540 1343205 1205130 975824
33508 975824 831851 739472 496154 326742 648857 1153087 956359 -76887 -951054 -855364
33498 -855364 -190501 169311 76748 66530 509005 1264654 1895516 1890150 1017120 -198760
33488 -198760 -701633 -30268 1029250 1339283 795601 388417 890612 1833350 1972667
33479 1972667 731766 -959927 -1503385 -422277 993736 1201836 275417 -352382 110551
33470 110551 868599 783250 -179886 -1193099 -1729185 -1950831 -2191891 -2454647 -2352744 -1478847
33460 -1478847 -61063 844193 383937 -817449 -1162723 -132861 976325 887366 112067
33451 112067 52959 919504 1610608 1474753 1120231 1314377 1948897 2454391 2583023 2322548
33441 2322548 1513960 126619 -1287265 -1949513 -1698570 -1086339 -557899 43009 902934
33432 902934 1620102 1730304 1603148 2001476 2712036 2601551 1445378 646250 1269826
33423 1269826 2290485 2048979 778573 109229 413775 491441 1693 242092 1792409
33414 1792409 3127491 2698195 1068545 -176233 -500279 -195383 811123 2495735 3882566
33405 3882566 4065125 3502936 3062390 2492589 1278984 296628 850890 2413697 3090876
33396 3090876 2292764 1282448 1003908 1021284 873788 896427 1240949 1472842 1598946 2187867
33386 2187867 3052586 3180253 2447699 1962627 2098211 1743565 391092 -588720 -26146
33377 -26146 1001843 726933 -654546 -1474253 -1117200 -481742 -257029 -225329 -177739 -204682
33367 -204682 -58551 603739 1316446 1276015 767862 930259 1885202 2309163 1323919 -238044
33357 -238044 -1053968 -911622 -433239 14654 359024 393059 174653 422222 1616849 2946392
33347 2946392 3033092 1665156 -3724 -997836 -1403831 -1534297 -1144959 -65722 1045031
33338 1045031 1320278 748613 21094 -399230 -426933 151434 1503079 3057638 3764900
33329 3764900 3252419 2142399 1088518 170738 -550229 -674517 -156632 261071 -101234
33320 -101234 -992166 -1680824 -1827922 -1461153 -658841 135595 77903 -977539 -1799504 -1137494
33310 -1137494 523806 1511111 1092584 126280 -307997 46635 916312 1827070 2074393
33301 2074393 1372500 663186 1206829 2641803 3133559 1917456 487237 482105 1463017
33292 1463017 1832908 1144687 251779 -354939 -1020085 -1779807 -1957878 -1250515 -344458
33283 -344458 31463 82023 433646 1017238 1107050 467391 -119416 170832 1012073 1272970
33273 1272970 571137 -121372 248756 1446563 2381886 2540900 2339219 2285442 2506951
33264 2506951 3002681 3651184 3982243 3604915 2825076 2174284 1498840 423785 -410987
33255 -410987 178907 1972708 3133089 2536077 1226385 812068 1385918 1938840 2006127
33246 2006127 1845967 1557441 1096778 834013 1107673 1414380 932662 -213157 -978622
33237 -978622 -713283 133972 641195 319088 -553750 -1185558 -1019359 -450103 -455572 -1273572
33227 -1273572 -1978704 -1760449 -988672 -424202 -18406 658373 1261998 953981 -269302
33218 -269302 -1348724 -1342817 -354495 665156 739159 -213247 -1010875 -335212 1409473 2213985
33208 2213985 1129695 -169302 379317 2290273 3337831 2738129 1782831 1476980 1383902
33199 1383902 1071109 970345 1221183 1172832 746081 886352 1813051 2176081 1065783
33190 1065783 -321121 -370234 520269 736981 90984 -32578 935354 1846275 1727882
33181 1727882 1243181 1501579 2308828 2492547 1542436 158105 -688400 -643922 36995
33172 36995 866530 1329137 1071113 181681 -771528 -1152428 -766223 7549 549059 512319
33162 512319 116578 -82353 177703 507347 345779 -216250 -443690 63491 783798 987411
33152 987411 683967 397661 300485 182357 84093 227019 376845 79717 -409509 -289772
33142 -289772 522432 1187422 1252513 1152321 1002557 109260 -1521004 -2374031 -1377029 231656
33132 231656 456478 -602113 -1057448 -147971 876037 955282 669660 879284 1284252
33123 1284252 1238821 1025972 1313366 1905894 1965007 1231634 330147 -56594 179518 717710
33113 717710 1206262 1447120 1359740 895403 134543 -498530 -464315 148996 474182 -38619
33103 -38619 -698083 -430246 668982 1477976 1467318 1234071 1301921 1360461 1050248 619334
33093 619334 282229 -312118 -1329832 -2070855 -1769629 -715733 90579 178872 -82573
33084 -82573 -260325 -343605 -440431 -479984 -395963 -316515 -355161 -333885 55113 762640 1282552
33073 1282552 1289402 1211194 1685224 2447418 2459750 1448980 568937 898951 1926415 2382571
33063 2382571 2084348 1891400 2126097 2218045 1917148 1729430 1932106 2129385 2079412 2132496
33053 2132496 2554217 3098539 3424411 3310434 2521901 1276258 667366 1517158 2866150
33044 2866150 2894042 1401167 -57554 -622629 -947603 -1175069 -223594 1814691 2609407
33035 2609407 688155 -1951967 -2372630 -719570 469043 211419 -78528 505964 1072508
33026 1072508 1001116 1168218 2142603 2803796 1994280 476021 -28277 790402 1509994
$$ [...]
##END NTUPLES=NMR SPECTRUM
##END=
