##TITLE=31Pdec_SR120_4
 , 24 sc
 6.4.2022
##JCAMPDX= 6.0         $$ Bruker NMR JCAMP-DX V2.0
##DATA TYPE= NMR SPECTRUM
##DATA CLASS= NTUPLES
##ORIGIN= UXNMR, Bruker Analytische Messtechnik GmbH
##OWNER= root
$$ XWIN-NMR		Version 3.5
$$ Thu Apr  7 14:05:13 2022 Russian Standard Time (UT+4h)  she@DPX200
##.OBSERVE FREQUENCY= 81.013821
##.OBSERVE NUCLEUS= ^31P
##.ACQUISITION MODE= SIMULTANEOUS
##.ACQUISITION SCHEME= undefined
##.AVERAGES= 24
##.DIGITISER RES= 16
##SPECTROMETER/DATA SYSTEM= spect
##.PULSE SEQUENCE= zgpg30
##.SOLVENT NAME= CD2Cl2
##.SHIFT REFERENCE= (INTERNAL, CD2Cl2, 0, 248.564)
##AUDIT TRAIL= $$ (NUMBER, WHEN, WHO, WHERE, WHAT)
$$ ##TITLE= Audit trail, XWIN-NMR		Version 3.5
$$ ##JCAMPDX= 5.01
$$ ##ORIGIN= Bruker BioSpin GmbH
$$ ##OWNER= she
$$ F:/spectra/data/she/nmr/P31/1/pdata/1/auditp.txt
$$ ##AUDIT TRAIL=  $$ (NUMBER, WHEN, WHO, WHERE, WHAT)
(   1,<2022-04-07 14:04:24.17 +0400>,<she>,<DPX200>,
      <created by zg, POWCHK disabled, PULCHK disabled
       configuration hash MD5:
       00 E9 B6 7A A2 85 ED C7 34 08 36 98 17 FE 4E 26
       data hash MD5: 32K
       2A E5 F6 F3 C5 5D 4D 5F D2 20 6A 65 BE 61 D8 05>)
(   2,<2022-04-07 14:04:26.64 +0400>,<she>,<DPX200>,
      <Start of raw data processing
       efp BC_mod = 2 LB = 1 FT_mod = 6 PKNL = 1 PHC0 = -9663.65 PHC1 = 380.8757 SI = 64K 
       data hash MD5: 64K
       0B 3D 19 6F BE B4 B1 43 E2 EF E8 2A CB C5 37 13>)
(   3,<2022-04-07 14:04:41.75 +0400>,<she>,<DPX200>,
      <pk PHC0 = 0.2784014 PHC1 = 0 
       data hash MD5: 64K
       1C CD B8 B1 1E 76 E5 0C 1D C6 BD 59 AC 60 25 C0>)
$$ ##END=
$$ 
$$ hash MD5
$$ 73 9F 12 AF 37 9B D6 83 F4 AD 94 11 AB FD DB 29
##$RELAX= 
##$RELAX= 
##$RELAX= 
##$RELAX= 
##$RELAX= 
##$RELAX= 
##$RELAX= 
##$RELAX= 
$$ Bruker specific parameters
$$ --------------------------
##$DU= <F:/spectra>
##$EXPNO= 1
##$NAME= <P31>
##$PROCNO= 1
##$TYPE= <nmr>
##$USER= <she>
##$AMP= (0..31)
100 100 100 100 100 100 100 100 100 100 100 100 100 100 100 100 100 100 
100 100 100 100 100 100 100 100 100 100 100 100 100 100 
##$AQSEQ= 0
##$AQ_mod= 1
##$AUNM= <au_zg>
##$AUTOPOS= <>
##$BF1= 81.014009
##$BF2= 200.13
##$BF3= 200.13
##$BF4= 200.13
##$BF5= 200.13
##$BF6= 200.13
##$BF7= 200.13
##$BF8= 200.13
##$BYTORDA= 1
##$CFDGTYP= 0
##$CFRGTYP= 5
##$CHEMSTR= <none>
##$CNST= (0..31)
1 1 145 1 1 1 1 1 1 1 1 1 1 1 1 1 1 1 1 1 1 1 1 1 1 1 1 1 1 1 1 1 
##$CPDPRG= <waltz16>
##$CPDPRG1= <>
##$CPDPRG2= <waltz16>
##$CPDPRG3= <>
##$CPDPRG4= <mlev>
##$CPDPRG5= <mlev>
##$CPDPRG6= <mlev>
##$CPDPRG7= <mlev>
##$CPDPRG8= <mlev>
##$CPDPRGB= <>
##$CPDPRGT= <>
##$D= (0..31)
0 1 0 0 0 0 0 0 0 0 0 0.03 2e-05 3e-06 0 0 0 0 0 0 0 0 0 0 0 0 0 0 0 0 
0 0 
##$DATE= 1649325863
##$DBL= (0..7)
120 120 120 11 120 120 24 19 
##$DBP= (0..7)
150 150 150 150 150 150 150 150 
##$DBP07= 0
##$DBPNAM0= <>
##$DBPNAM1= <>
##$DBPNAM2= <>
##$DBPNAM3= <>
##$DBPNAM4= <>
##$DBPNAM5= <>
##$DBPNAM6= <>
##$DBPNAM7= <>
##$DBPOAL= (0..7)
0.5 0.5 0.5 0.5 0.5 0.5 0.5 0.5 
##$DBPOFFS= (0..7)
0 0 0 0 0 0 0 0 
$$ [...]
##$SUBNAM2= <"">
##$SUBNAM3= <"">
##$SUBNAM4= <"">
##$SUBNAM5= <"">
##$SUBNAM6= <"">
##$SUBNAM7= <"">
##$SUBNAM8= <"">
##$SUBNAM9= <"">
##$SW= 501.771253377433
##$SWIBOX= (0..15)
0 1 3 0 0 0 0 0 0 0 0 0 0 0 0 0 
##$SW_h= 40650.406504065
##$TD= 32768
##$TD0= 1
##$TE= 0
##$TE2= 300
##$TE3= 300
##$TEG= 300
##$TL= (0..7)
0 120 53 12 22 120 120 120 
##$TP= (0..7)
150 150 150 150 150 150 150 150 
##$TP07= 0
##$TPNAME0= <>
##$TPNAME1= <>
##$TPNAME2= <>
##$TPNAME3= <>
##$TPNAME4= <>
##$TPNAME5= <>
##$TPNAME6= <>
##$TPNAME7= <>
##$TPOAL= (0..7)
0.5 0.5 0.5 0.5 0.5 0.5 0.5 0.5 
##$TPOFFS= (0..7)
0 0 0 0 0 0 0 0 
##$TUNHIN= 0
##$TUNHOUT= 0
##$TUNXOUT= 0
##$USERA1= <user>
##$USERA2= <user>
##$USERA3= <user>
##$USERA4= <user>
##$USERA5= <user>
##$V9= 5
##$VALIST= <valist>
##$VCLIST= <CCCCCCCCCCCCCCC>
##$VD= 0
##$VDLIST= <DDDDDDDDDDDDDDD>
##$VPLIST= <PPPPPPPPPPPPPPP>
##$VTLIST= <TTTTTTTTTTTTTTT>
##$WBST= 1024
##$WBSW= 4
##$XGAIN= (0..3)
0 0 0 0 
##$XL= 0
##$YL= 0
##$YMAX_a= 11130
##$YMIN_a= -14915
##$ZGOPTNS= <>
##$ZL1= 120
##$ZL2= 120
##$ZL3= 120
##$ZL4= 120
##$ABSF1= 0
##$ABSF2= 0
##$ABSG= 0
##$ABSL= 0
##$ALPHA= 0
##$AQORDER= 0
##$ASSFAC= 0
##$ASSFACI= 0
##$ASSFACX= 0
##$ASSWID= 0
##$AUNMP= <proc_1d>
##$AZFE= 0.1
##$AZFW= 0.5
##$BCFW= 0
##$BC_mod= 2
##$BYTORDP= 0
##$COROFFS= 0
##$CY= -3
##$DATMOD= 1
##$DC= 0
##$DFILT= <>
##$DTYPP= 0
##$F1P= 0
##$F2P= 0
##$FCOR= 1
##$FTSIZE= 65536
##$FT_mod= 6
##$GAMMA= 0
##$GB= 0
##$INTBC= 1
##$INTSCL= 5.30512e-09
##$ISEN= 30
##$LB= 1
##$LEV0= 0
##$LPBIN= 0
##$MAXI= 10000
##$MC2= 0
##$MEAN= 0
##$ME_mod= 0
##$MI= 50
##$NCOEF= 0
##$NC_proc= -6
##$NLEV= 6
##$NOISF1= 182.463
##$NOISF2= 159.3651
##$NSP= 0
##$NTH_PI= 0
##$NZP= 0
##$OFFSET= 248.5645
##$PC= 4
##$PHC0= -9663.372
##$PHC1= 380.8757
##$PH_mod= 1
##$PKNL= yes
##$PPARMOD= 0
##$PSCAL= 0
##$PSIGN= 0
##$REVERSE= no
##$SF= 81.014009
##$SI= 65536
##$SIGF1= 159.3651
##$SIGF2= -187.1042
##$SINO= 113.3802
##$SIOLD= 16384
##$SREGLST= <1H.CDCl3>
##$SSB= 0
##$STSI= 65536
##$STSR= 0
##$SW_p= 40650.406504065
##$SYMM= 0
##$S_DEV= 0
##$TDeff= 32768
##$TDoff= 0
##$TI= <>
##$TILT= no
##$TM1= 0
##$TM2= 0
##$TOPLEV= 0
##$USERP1= <user>
##$USERP2= <user>
##$USERP3= <user>
##$USERP4= <user>
##$USERP5= <user>
##$WDW= 1
##$XDIM= 65536
##$YMAX_p= 295281903
##$YMIN_p= -25177738
$$ End of Bruker specific parameters
$$ ---------------------------------
##NTUPLES= NMR SPECTRUM
##VAR_NAME=  FREQUENCY,     SPECTRUM/REAL,   SPECTRUM/IMAG
##SYMBOL=    X,             R,               I
##VAR_TYPE=  INDEPENDENT,   DEPENDENT,       DEPENDENT
##VAR_FORM=  AFFN,          ASDF,            ASDF
##VAR_DIM=   65536,         65536,           65536
##UNITS=     HZ,            ARBITRARY UNITS, ARBITRARY UNITS
##FACTOR=    0.620285442955139, 1,           1
##FIRST=     20137.2065510759, 0,            0
##LAST=      -20513.1999529892, 0,           0
##MIN=       -20513.1999529892, -25177738,   0
##MAX=       20137.2065510759, 295281903,    0
$$ Real data points
##PAGE= N=1
##DATA TABLE= (X++(R..R)), XYDATA
$$ [...]
43183 355887 729393 20604 -284410 950905 2438611 2249787 635487 -465116 -146615
43174 -146615 769835 1496147 2122188 2509102 1851014 72664 -1384839 -1120474 419013
43165 419013 1518483 1309270 555491 378404 872049 1232308 874160 94841 -280784
43156 -280784 257765 1374057 2109453 1752117 628549 -93234 359542 1419068 1865934
43147 1865934 1443280 1131928 1521763 1708557 655438 -904968 -1189149 66771 1101170
43138 1101170 619131 -438576 -423847 717058 1748256 2071669 2124813 2170121 1909018
43129 1909018 1336207 941367 847494 590887 31715 -241829 218613 985132 1242925 681831
43119 681831 -296460 -950290 -695685 391635 1488189 1794548 1418193 1101755 1149034
43110 1149034 1195367 1057641 1095653 1470011 1674345 1225863 398797 -105591 80652 798070
43100 798070 1576818 1859853 1442792 913411 1159268 2143375 2708364 2024215 730170
43091 730170 102271 503493 1260967 1734205 1809164 1536127 1023353 700311 1038735 1867280
43081 1867280 2438842 2308979 1759931 1272824 983272 787126 612094 393283 57683
43072 57683 -270741 -242156 357882 1297845 2058735 2300632 2171838 2116408 2266606 2142295
43062 2142295 1319774 358112 381579 1437770 2051273 1124957 -381245 -717285 170359
43053 170359 782088 607049 922892 2524605 4092566 3876813 2076811 436205 77300
43044 77300 764307 1804912 2583528 2516900 1569980 682932 728695 1203044 936795 -62997
43034 -62997 -639232 -325963 103107 114610 126819 321370 86755 -628970 -674531 564606
43024 564606 1848577 1764930 884415 761070 1348049 1133897 -219879 -1140804 -539381
43015 -539381 543173 562100 -339570 -827142 -363632 406561 898197 1113242 1003740 390324
43005 390324 -200754 414352 2502628 4490912 4524013 2779053 1302208 1353029 1845629
42996 1845629 1088573 -657808 -1488807 -530330 923450 1290120 650972 125333 128413
42987 128413 231647 279636 560345 947433 826253 37609 -802871 -1091204 -788176 -129620
42977 -129620 619201 1057441 946731 746339 1196515 2188083 2725627 2272639 1439125 978201
42967 978201 807752 545281 381142 733526 1433310 1893373 1826344 1294177 395328 -531725
42957 -531725 -762986 35818 1109127 1419011 1025385 902700 1422712 1868785 1644167
42948 1644167 1144241 989668 1033192 739757 186227 34495 579372 1329635 1635881 1414545
42938 1414545 1096117 1031280 1135167 1125849 991342 1049200 1464146 1867866 1714600 1011407
42928 1011407 420887 508340 1089123 1507877 1426793 1108884 971255 1105959 1318520 1454191
42918 1454191 1512795 1499046 1347093 1066826 846854 865912 1018102 977863 618507 269844
42908 269844 424931 1186467 2093177 2527078 2252841 1569265 1033034 1073709 1728538 2555537
42898 2555537 2848409 2220582 1111756 473930 719228 1205100 1132522 746789 1009471
42889 1009471 2027142 2588760 1737933 190090 -546042 -91615 605821 847484 978721
42880 978721 1404757 1734989 1489574 1046121 1155506 1773885 2022033 1282201 -110577
42871 -110577 -1270227 -1510512 -743405 475669 1239888 1000017 190087 -73357 834626
42862 834626 2242934 2786229 1877623 403981 -232712 324896 1089046 1043033 371866
42853 371866 51480 472436 981213 797059 -56966 -884522 -1070297 -548095 271056 906016
42843 906016 1247903 1590703 2112724 2512466 2455649 2188764 2239455 2606453 2805866 2727408
42833 2727408 2821361 3273798 3584030 3254941 2465702 1792656 1591770 1773502 1810909 991181
42823 991181 -762748 -2320919 -2348282 -979720 352477 886549 1230413 1791588 1898915
42814 1898915 1280427 1032877 1853953 2486124 1561327 116823 302344 2000468 2870142
42805 2870142 1859474 552979 406943 624113 -60506 -1056212 -931273 197222 868245
42796 868245 480155 -68500 115612 882849 1667924 2286794 2752170 2824019 2180673 953136
42786 953136 -118928 -227187 658395 1582510 1550301 631949 -263368 -622973 -718500 -723675
42776 -723675 -279863 670556 1367951 1187290 603564 556831 1195777 1857471 2056608 1962454
42766 1962454 2068299 2786561 4121743 5388392 5618264 4676020 3570612 3179662 3138489
42757 3138489 2619360 1728232 1279082 1487105 1822537 2056993 2526404 3280618 3825904
42748 3825904 3939628 4048354 4516546 5065638 5108475 4296337 2736795 1104747 405540
42739 405540 1010147 2005547 2177075 1539031 1106810 1268198 1403010 1169071 987298 947747
42729 947747 452310 -502842 -866298 -117264 769484 861191 747809 1377019 2329689 2579691
42719 2579691 2246066 2130745 2069298 1364663 549308 960195 2518294 3616877 3463867
42710 3463867 2888716 2455429 1577992 263475 -68135 1239669 2559089 2156239 757148
42701 757148 276890 859723 1047006 397874 -39808 161834 167943 -254232 -11555 1336511
42691 1336511 2323574 1465866 -514738 -1509272 -527770 1584814 3510234 4546647 4560080
42682 4560080 3833684 3077893 2897985 3099978 3011711 2508604 2155590 2259969 2431428 2355147
42672 2355147 2400330 2973987 3703826 3877163 3447194 2932570 2436587 1588295 597689 441260
42662 441260 1450845 2523481 2598996 2294902 2892890 4041283 3951430 2077273 126826
42653 126826 -262717 401224 658047 285443 81455 226462 237650 159011 490791 1116042
42643 1116042 1479979 1698314 2311795 3052179 3128528 2751863 3005056 3973288 4388673 3599084
42633 3599084 2599203 2455442 2860101 3024535 2996428 3203772 3484209 3432532 3101080 2652767
42623 2652767 1963221 1213981 1124208 1825064 2243842 1490107 209224 -358734 -71098
42614 -71098 322125 494652 575581 337688 -434507 -998226 -284172 1487191 2841350 2860111
42604 2860111 2166594 1982001 2847299 4316093 5335311 4995514 3487261 2173555 2102372
42595 2102372 2676977 2533227 1485652 672611 844027 1502562 1909462 2041642 2197344
42586 2197344 2330407 2188021 1720907 1117579 699262 808300 1482572 2276068 2691209
42577 2691209 2647559 2281113 1664853 1124073 1296112 2230012 2920472 2524536 1595699 1238257
42567 1238257 1497123 1614835 1469867 1565407 1881596 2010062 2210269 2965006 3651924 3204271
42557 3204271 2083848 1890622 2780272 3073386 1954450 747811 689782 1166691 1244836
42548 1244836 1313663 1853045 2028813 1127170 203320 547035 1425344 1214384 129071
42539 129071 -139767 789220 1525682 1295461 960897 1278620 1758498 1870537 2022360 2573932
42529 2573932 2975563 2709194 2242316 2237245 2468891 2312655 1811053 1500190 1515786 1561910
42519 1561910 1543015 1596849 1634512 1442535 1215064 1430309 2081305 2475918 2033543 1004160
42509 1004160 153544 -99375 15804 95744 51115 39084 119251 156533 -6778 -408049
42499 -408049 -917101 -1213028 -936975 -86353 819182 1229066 1202184 1264507 1569368 1517238
42489 1517238 457224 -1343629 -2675604 -2473539 -949703 506424 777675 255882 192275
42480 192275 842630 1060006 150220 -763798 -225864 1273762 1809822 695789 -693228
42471 -693228 -1001748 -521890 -217873 -246329 -187833 115397 676610 1525650 2054999 1118097
42461 1118097 -1258610 -3089104 -2585687 -554193 680480 375568 -75749 371606 987122
42452 987122 793431 126705 -181726 -136935 -75542 368811 1541141 2447541 1629740 -517722
42442 -517722 -1730542 -846580 422558 -124729 -1881828 -2202841 -267881 1735408 1867084
42433 1867084 1044207 1101207 1742529 1386591 201770 -12856 1073100 1597557 476164
42424 476164 -874095 -802511 218203 808338 963377 1579883 2528382 2783052 2152633
42415 2152633 1563273 1675259 2194953 2519073 2323862 1648181 1000583 1118957 2037909
42406 2037909 2756924 2428873 1420187 565385 -8418 -472295 -370264 725369 2002338
42397 2002338 2104266 1003297 109724 427670 1490287 2220260 2071639 1237168 394489
42388 394489 285442 988889 1694325 1685625 1246049 1014199 961435 857980 1182469 2344913
42378 2344913 3340201 2610018 310318 -1589267 -1722225 -705213 148172 338999 14328
42369 14328 -621468 -1138443 -942830 -51350 799481 1133241 1179415 1158172 924403 572122
42359 572122 538056 778401 680162 127387 -216112 -55522 34441 -287373 -486349 -173773
42349 -173773 216212 470746 1290544 2952319 4167004 3541760 1653411 347686 201506
42340 201506 13667 -1060978 -2138008 -1944121 -668165 336637 350114 29209 288864
42331 288864 1002150 1223173 499194 -567314 -1188216 -1288689 -1131067 -540930 709893
42322 709893 1948740 1993428 719321 -564161 -693231 42495 612243 663532 646289 948272
42312 948272 1542823 2275806 2938783 3153049 2660771 1744337 1021807 796209 827817 746959
42302 746959 496974 305042 290543 218956 -178993 -605574 -261391 1134377 2637827 2932050
42292 2932050 1848521 543663 136296 641332 1286528 1372809 710911 -316539 -969033
42283 -969033 -795959 -132981 398718 761641 1294740 1746677 1350661 52026 -1120483
42274 -1120483 -1272437 -612191 136934 678528 1091138 1388219 1601390 1898227 2227247
42265 2227247 2214807 1745524 1276325 1270016 1654569 2058607 2198578 1887267 1159551 558337
42255 558337 698507 1292896 1240556 29488 -1537651 -2368215 -2217826 -1433376 -264640
42246 -264640 991211 1735811 1634774 1105076 752502 669228 664794 721619 787683 610872
42236 610872 250574 251820 808812 1276510 1081401 615288 591907 964935 1162050 1027269
42226 1027269 860787 823860 938740 1406072 2294902 3122170 3298695 2832650 2173970 1613062
42216 1613062 1199579 906028 513352 -226865 -977768 -967887 -171289 426220 327091 404432
42206 404432 1418716 2528023 2471910 1576605 1201254 1601268 1807052 1455584 1238709
42197 1238709 1427698 1388503 906688 717797 1230762 1804037 1797690 1381947 831072 13878
42187 13878 -831938 -812521 337762 1481904 1472166 721050 504151 1172399 1993100 2454660
42177 2454660 2717660 2807247 2339724 1358756 718279 1140890 2276972 3134625 3219461 2831432
42167 2831432 2354610 1765072 1008605 453758 557953 1212436 1798233 1881835 1535024 1001454
42157 1001454 456356 122230 138864 201361 -150518 -705374 -654215 201862 991957 1009974
42147 1009974 731444 912477 1296311 1119599 456061 33668 -22310 -199698 -476197 -292170
42137 -292170 318858 691334 788827 1335483 2306952 2469460 1121917 -676439 -1474294
42128 -1474294 -1257516 -984254 -925207 -565428 163482 667452 706768 697529 870804 960015
42118 960015 964042 1439009 2570340 3529374 3347432 2166840 1126231 1110788 1982204 2941906
42108 2941906 3287682 2860780 2122448 1829667 2311263 3016536 3120324 2623936 2381794
42099 2381794 2821256 3189956 2606007 1465421 1051569 1821547 2828460 3005661 2373177
42090 2373177 1670388 1351803 1374560 1571638 1746716 1615841 1064428 346617 -236419 -669139
42080 -669139 -962453 -798149 161437 1658190 2863040 3105671 2472590 1657213 1215805
42071 1215805 948535 175479 -1193862 -2144628 -1606902 89220 1430914 1465260 719272
42062 719272 243426 370488 665893 543712 -287162 -1430920 -1765024 -571441 1138334
42053 1138334 1433808 -27406 -1418586 -1276578 -404889 -281634 -720146 -494817 523057
42044 523057 1422369 1987376 2800871 3764223 4003090 3354023 2667827 2469095 2455858 2458034
42034 2458034 2716804 2995459 2589613 1582816 1009062 1320546 1680267 1287936 527905
42025 527905 246013 639674 1395390 2242284 2850520 2816556 2277970 1979400 2233810 2387397
42015 2387397 1865868 1208030 1351397 2207161 2681963 2108037 1088069 700404 1139332
42006 1139332 1471110 826247 -430989 -1133134 -828281 -202795 195766 768853 1776748
41997 1776748 2323700 1539326 228854 54911 1266434 2473705 2648426 2148110 1680264
41988 1680264 1441768 1488138 1839598 1975474 1284839 234323 -22113 574582 798842
41979 798842 57972 -756248 -788809 -328721 189357 1028137 2230593 2999851 2833902 2284714
41969 2284714 1835806 1107685 15588 -456723 261477 1103527 867143 99434 173969
41960 173969 1145900 1874344 1856151 1664436 1778685 2055392 2239438 2189902 1813728 1383310
41950 1383310 1451754 1878092 1716744 833593 605341 1857128 3132452 2588232 824345
41941 824345 -8031 572638 1056306 703012 531917 1224117 1964234 2015419 1776466 1508234
41931 1508234 570485 -1102737 -2146807 -1552797 -236889 357412 325363 708828 1537431
41922 1537431 1849941 1362581 834067 771952 831371 645969 400252 342559 388117 445962
41912 445962 619691 867706 919823 761796 789853 1178518 1415948 872915 -278450 -1087819
41902 -1087819 -835359 224839 1231241 1602214 1365535 819834 273604 101875 550620
41893 550620 1219717 1177167 69828 -1143457 -1164664 -6964 935594 599046 -524770
41884 -524770 -1152894 -733777 204596 892634 989646 551868 -133206 -582394 -412757 142896
41874 142896 281370 -467499 -1462213 -1444639 36223 1945467 2786337 2210479 1284381
41865 1284381 1112552 1575099 1720638 1151366 512529 543932 1114103 1537005 1582529 1689526
41855 1689526 2170846 2669785 2641969 2075219 1440127 1132589 1256180 1749018 2360422 2673419
41845 2673419 2569610 2508156 2853267 3134665 2682227 1867979 1763863 2430789 2610116 1556880
41835 1556880 162240 -405513 -227322 16867 305323 834841 1101366 634620 85872
41826 85872 362297 1164062 1627270 1902312 2645152 3357595 2903017 1534653 735817 1011545
41816 1011545 1482973 1739819 2304389 3002927 2750836 1467260 418336 89552 -429721
41807 -429721 -1282906 -1139717 322507 1317023 754626 217320 1364720 3086010 3327214
41798 3327214 2394989 2123690 2653327 2428929 1062716 27416 401525 1589351 2438634
41789 2438634 2393074 1571714 725309 834722 1815621 2189355 1064644 -372358 -608859
41780 -608859 -85172 -94960 -294669 668133 2530343 3494924 2825350 1553780 722243 624685
41770 624685 1549899 3398324 4698909 3943924 1884149 630503 602648 425250 -280209
41761 -280209 -426580 26496 -329011 -1621206 -2062078 -958789 -9755 -461021 -1188955
41752 -1188955 -938452 -384164 -457527 -539893 29549 382223 -208999 -676763 8660 834398
41742 834398 525879 -18460 736637 2036043 1800878 -37167 -1414132 -1173474 -244149
41733 -244149 261442 395242 609509 1033819 1730225 2650918 3400327 3924825 4976887
41724 4976887 6731275 7554712 5798166 2529652 664161 1248887 2350554 2030324 745719
41715 745719 30717 216765 560054 694840 819427 904399 686912 321932 329661 819962
41705 819962 1192350 793441 -237326 -944728 -543032 607446 1315742 929838 -16850
41696 -16850 -671454 -792717 -492398 254380 1230355 1737441 1529824 1447883 2183981 2880550
41686 2880550 2133732 205200 -1030239 -501407 820790 1450733 1165343 723843 592362
41677 592362 627674 618163 569441 587154 744814 952484 943581 667982 612882 1242542 2127669
41666 2127669 2271295 1484141 780265 1016745 1711902 1797016 1149835 637207 723732 836336
41656 836336 427893 33135 562917 1774585 2303230 1469425 299905 135389 773403
41647 773403 868603 -96879 -1249319 -1711029 -1490354 -771046 560098 2115763 2733046
41638 2733046 1822643 306877 -570310 -752269 -889311 -984610 -543203 293744 777758
41629 777758 597252 113189 -294849 -453231 -248715 47852 -289635 -1363766 -1967430
41620 -1967430 -1048321 511807 891384 -36037 -526802 382153 1559396 1715654 1280455
41611 1280455 1339393 1714229 1377492 305774 -321644 201333 1175527 1540321 1256688
41602 1256688 1217847 1993230 3052775 3371041 2628791 1524991 861207 691771 636633
41593 636633 633795 843032 1045930 858378 556220 945029 2112049 2923509 2296451 666717
41583 666717 -360826 174312 1514179 2096202 1345800 261874 156688 1141821 2231822
41574 2231822 2742120 2948658 3289854 3650654 3811833 3937912 4055969 3656309 2556123
41565 2556123 1661823 1949101 2972101 3369100 2757014 2140985 2361537 3077997 3529364
41556 3529364 3436848 2798634 1612166 360872 130360 1472916 3378612 4020939 2618642
41547 2618642 237126 -1345753 -1341535 -340149 824294 2039839 3376348 4137735 3495570
41538 3495570 2044513 1473807 2232456 2804975 2140820 1434470 2093490 3159002 2750744
41529 2750744 1334129 1154365 2520939 3168965 1880218 366536 428415 1297742 1323990
41520 1323990 620985 248644 43829 -761840 -1590116 -1194570 75784 555206 -245554
41511 -245554 -1101019 -1165650 -1032005 -1307377 -1538109 -1194886 -640209 -400474 -300998 -27021
41501 -27021 109957 -297910 -882998 -850055 -7214 1066513 1777189 2029885 2019076 1831884
41491 1831884 1377393 646339 -32731 -178230 221957 458083 -143988 -1263220 -1835282
41482 -1835282 -1326127 -265711 653931 1442371 2345713 2994241 2731962 1703759 928026
41473 928026 1090225 1776402 2214931 2349133 2671937 3214553 3326557 2592575 1491309
41464 1491309 835765 828260 981600 801298 217645 -561172 -1259150 -1554522 -1215816 -401714
41454 -401714 328920 498273 203388 36746 447367 1179829 1459775 868513 -54647 -332802
41444 -332802 327051 1233967 1591182 1296452 706777 60585 -487039 -610499 -114333 668318
41434 668318 1238459 1590625 2058511 2555188 2466358 1464714 145853 -352518 600424
41425 600424 2360332 3326289 2382535 166351 -1482838 -1512297 -606834 43199 158632
41416 158632 33406 -381475 -1097295 -1360437 -442341 1103477 2034572 2082918 1958405 1870836
41406 1870836 1294819 252467 -440792 -484147 -511018 -890341 -1197472 -1196856 -1206026 -1092281
41396 -1092281 -149823 1438376 2257351 1580725 519036 346490 743772 767158 571890
41387 571890 850853 1279042 961755 62755 -386826 -182661 -189556 -801492 -1268695 -858511
41377 -858511 149673 995516 1405437 1695617 2183808 2671027 2482945 1241132 -307934
41368 -307934 -732058 434980 1950562 2275358 1307264 174403 -240221 85777 760249
41359 760249 1293002 1254526 811504 804698 1588136 2156371 1323486 -444545 -1365405 -565688
41349 -565688 864355 1227281 23535 -1729507 -2516583 -1648552 29034 875007 287753
41340 287753 -537484 -245726 759092 958997 6597 -783234 -337539 826252 1533255
41331 1533255 1429165 1056849 1005018 1412953 2000749 2314508 2123466 1610237 989573 189667
41321 189667 -669889 -832509 307504 2088280 3060019 2655782 1683614 1095307 1026617
41312 1026617 1218045 1589164 2011825 2111065 1724001 1196782 946375 1024218 1260917 1514790
41302 1514790 1658644 1608939 1419483 1123868 613143 -51789 -497109 -620965 -918809 -1621927
41292 -1621927 -1980704 -1269597 -92187 420701 436253 1115691 2519763 3283726 2685285
41283 2685285 1622120 1008392 577417 22119 -30861 722302 1149201 170823 -1356704
41274 -1356704 -1629339 -392114 836272 920608 324458 43331 308114 707571 937689
41265 937689 986899 866652 499087 -91676 -538021 -274395 773793 1758093 1695398 736862
41255 736862 22292 124319 402446 228044 -16850 214145 554883 350535 -151690 -116188
41245 -116188 666152 1623640 2208650 2189965 1454920 255313 -591646 -464303 302864 1036693
41235 1036693 1722100 2578533 3050156 2347923 920756 242849 935587 2086866 2691824
41226 2691824 2763828 2582076 1847255 386499 -979647 -1218077 -475582 100090 -119582
41217 -119582 -566033 -402291 458383 1541742 2570109 3528838 4130582 3820804 2572979
41208 2572979 1251922 722377 815852 697227 103429 -436456 -564509 -438380 48844
41199 48844 1394131 3297501 4312227 3580178 2193089 1755625 2142399 1947418 854148
41190 854148 91708 398991 954466 895888 760094 1561046 3131153 4201713 3810554
41181 3810554 2109089 87316 -1115980 -1010610 -263914 -70703 -687853 -1030068 -135316
41172 -135316 1417029 2132410 1395282 78052 -552857 -79603 923616 1638098 1763613
41163 1763613 1612400 1497530 1240696 593795 -51210 -17646 541726 668119 58980 -314166
41153 -314166 296164 1000062 349225 -1479854 -2638983 -1850765 134137 1594881 1719706
41144 1719706 1068825 626483 853133 1522882 2146493 2459699 2539136 2511158 2328892 1933468
41134 1933468 1423254 887278 314577 -91278 171635 1242338 2380841 2654602 2075068
41125 2075068 1539353 1636133 2015183 2041719 1626576 1217708 1248629 1703984 2050246 1673273
41115 1673273 635143 -205349 -211094 175628 176789 -18046 425694 1459553 2016556 1612934
41105 1612934 1016209 882536 788809 305960 57319 758081 1925638 2552462 2507924 2286019
41095 2286019 1905806 1183899 654018 956357 1588313 1585756 1277053 1866245 3201776 3600576
41085 3600576 2378439 1008361 935138 1580145 1585715 940119 613571 871091 1234823 1595059
41075 1595059 2118452 2417725 2025079 1454039 1581974 2099055 1840191 745618 191422
41066 191422 957454 2012654 2003658 1080927 412303 442317 545307 243440 -34473 368536
41056 368536 1343921 2073022 2043087 1720416 1924052 2596141 2688326 1554269 4786 -565946
41046 -565946 168157 1308334 2043441 2374705 2533061 2488508 2317496 2383890 2718278 2683743
41036 2683743 1721987 165631 -1053993 -1331537 -786087 43519 649578 862952 933509
41027 933509 1231567 1787045 2256529 2386336 2314511 2334515 2520819 2679487 2604298 2362635
41017 2362635 2281608 2473739 2462825 1783751 1050079 1624106 3676803 5360529 4866509
41008 4866509 2759004 1135207 875757 1094889 1125489 1405603 2102324 2444383 2092185
40999 2092185 1819287 2048436 1977573 1085581 290087 475632 967807 799029 546475 1357905
40989 1357905 2812146 3421770 2935285 2499518 2628340 2636372 2257564 2262725 3004289 3689446
40979 3689446 3706547 3525374 3600970 3426806 2530438 1599584 1649904 2531980 3122244 2759709
40969 2759709 1804115 915646 381200 144200 71033 117995 407207 1065691 1892047 2390825
40959 2390825 2293911 1840737 1391316 991247 500352 -49211 -418642 -389245 23564 448845
40949 448845 361919 -247453 -505426 463158 2157982 2875939 1677736 -355136 -1404892
40940 -1404892 -1051915 -393351 -246524 -158187 557687 1581080 2005844 1635614 1212482
40931 1212482 1397376 2050405 2637130 2913633 2964077 2856459 2556769 2047482 1354218 624465
40921 624465 280738 738528 1725818 2317616 2079251 1733462 2077182 2691184 2634360 2095820
40911 2095820 2141713 2820816 2900493 1893810 998087 1246860 1920383 1814894 1080721 582949
40901 582949 255817 -507587 -1376113 -1460826 -898263 -640628 -788624 -531513 241917 696549
40891 696549 607570 767580 1457825 1835411 1391989 808809 691751 577484 -2312 -469835
40881 -469835 -146372 547416 781634 566662 405917 291611 8997 -60001 516451 1207579
40871 1207579 1119750 432133 175847 609540 881932 483661 7638 63668 338934 333323
40861 333323 292018 634989 980847 665898 9597 63728 988592 1646153 1250404 559796
40851 559796 651850 1162681 840554 -407410 -1240066 -804928 211628 890156 1355400
40842 1355400 2019223 2455989 2021594 1030975 361138 254954 355212 520430 723012
40833 723012 549817 -183437 -637517 138633 1689798 2643922 2594775 2362705 2444918 2444732
40823 2444732 2153463 1963989 1939850 1630458 1135002 1191647 1775182 1747944 520095 -915119
40813 -915119 -1275073 -541442 370358 823954 848033 900751 1572993 2906329 3871770 3346456
40803 3346456 1709852 472515 223007 177986 -36282 325073 1526025 2582107 2881382
40794 2881382 3099418 3566876 3254446 1633692 149035 305501 1390713 1682545 1006794
40785 1006794 459563 342689 95343 -212708 20999 622726 903019 963216 1351005 1700682
40775 1700682 1162759 5106 -634682 -489953 -292878 -266351 80550 625530 557250 -117254
40765 -117254 -284899 659862 1964027 2648934 2618142 2329206 2112541 2074302 2107330 1914476
40755 1914476 1471211 1265081 1558436 1831889 1628961 1390247 1591158 1710058 1158456
40746 1158456 592125 960639 1792984 1922662 1483822 1540104 2026031 1872657 1142773 1174104
40736 1174104 2318476 3244222 2938018 1930634 1112964 688749 669454 1118635 1590991
40727 1590991 1510298 1189112 1227103 1123063 142531 -697921 315343 2491757 3139133
40718 3139133 1549462 61217 334738 1177791 1270768 1371270 2077681 1956658 198742
40709 198742 -1012318 536847 3376424 4396907 3396839 2709742 3130985 3265115 2667173
40700 2667173 2615382 3384843 3446292 2199765 1234364 1755538 2591590 2089343 686962
40691 686962 200402 1245218 2545380 2583950 1188926 -492409 -1228897 -886590 -386094
40682 -386094 -447820 -717740 -466459 261202 775634 727138 350538 -37294 -206028 59032
40672 59032 619158 868176 527243 188326 460593 1029134 1276475 1353019 1779604 2428416
40662 2428416 2836314 3133188 3634505 3852955 3062066 1671455 895205 1081612 1443894
40653 1443894 1464522 1500155 1876272 2370906 2758755 2976538 2661846 1496365 157017
40644 157017 -105800 832054 1631385 1291759 448812 300757 913992 1315672 956950 427169
40634 427169 637998 1620700 2395746 2135711 1234009 767949 986750 1111758 825720 926116
40624 926116 1863193 2663315 2355183 1638950 1853357 2878971 3464964 3228005 2842084
40615 2842084 2480827 1645597 538661 44749 156643 -84076 -788716 -882485 -19256
40606 -19256 689985 572541 587136 1628506 2811296 2645471 1185280 -100821 -166932
40597 -166932 784554 1960412 2685570 2675961 2214240 1945489 2171858 2554695 2659723 2405182
40587 2405182 1877078 1284193 1235615 2273636 3744925 3935781 2021519 -623067 -1767282
40578 -1767282 -733782 1088191 1971100 1576612 930229 1031083 1756344 2235224 2103428
40569 2103428 1854451 1807137 1503814 757004 526964 1645333 3121499 3098761 1479859
40560 1479859 267389 1001360 2992813 4483852 4558367 3489615 2110906 1306432 1392691
40551 1392691 1679887 1316083 631255 721897 1627539 2082269 1387239 391008 184063 878436
40541 878436 2069670 3369272 4033311 3290875 1647442 690229 960375 1217411 502313
40532 502313 -389246 -399118 129433 430646 822422 1903510 3098755 3341747 2630531 1763142
40522 1763142 1067496 444598 132743 383185 811415 972837 1131689 1682945 2370348
40513 2370348 2816600 3164447 3455335 3164229 2163234 1288584 1086289 946140 419351
40504 419351 285243 1130663 2002555 1901743 1563739 2121563 2947543 2698522 1796769 1836179
40494 1836179 2873698 3299122 2356732 1043943 450139 732030 1704293 2961083 3490051
40485 3490051 2652641 1462488 1448500 2450641 3069764 2989114 3070516 3392388 3219881 2915059
40475 2915059 3743441 5527929 6598478 6477476 6485014 7100735 6938957 5285275 3597428
40466 3597428 3273099 3673797 3616298 3265679 3278145 3466879 3563750 4008565 4788007 4780733
40456 4780733 3491570 2192607 2065664 2411342 2031315 1225355 979554 1210431 1292306
40447 1292306 1414435 1947126 2291247 1815938 1180856 1308271 1800809 1812979 1703267 2265927
40437 2265927 3039587 3021086 2447699 2200682 2020505 1108286 20014 23236 843501 1044642
40427 1044642 561076 775854 1894160 2339948 1348201 283009 528036 1574666 2066563
40418 2066563 1507152 210700 -1255480 -1914147 -882761 1206959 2404842 1803023 635308
40409 635308 318555 592492 521617 191651 234717 550204 701896 902611 1448142 1783118
40399 1783118 1330015 744214 1072762 2002419 2276537 1744357 1639159 2601928 3650916
40390 3650916 3647434 2880512 2508453 2947316 3460155 3153028 1927582 478952 -379586
40381 -379586 -337068 337647 1166033 1754721 1808231 1218030 319690 -215529 16688 822834
40371 822834 1759532 2487276 2694545 2194592 1377244 1020628 1245733 1214348 398807 -430427
40361 -430427 -218075 867146 1803158 2188163 2331015 2170268 1347982 387898 514381
40352 514381 1907079 3220038 3366207 2838478 2652366 2859695 2891226 2677631 2561909
40343 2561909 2557364 2495698 2583169 3086551 3728352 4038764 4058147 4103472 4135277 3959136 3717957
40332 3717957 3522095 2964516 1799772 766620 772644 1448057 1568811 910514 559885
40323 559885 1149501 1885337 1847526 1332697 1175585 1371987 1180275 325570 -522005 -436441
40313 -436441 864816 2678065 3781186 3550899 2687380 2425075 2987723 3407438 3000572
40304 3000572 2282503 2047188 2231045 2240585 1875257 1351407 849726 606417 1052790 2258465
40294 2258465 3536563 4149471 4119403 3850836 3359593 2530731 1792635 1734558 2190024 2449834
40284 2449834 2351022 2432228 2931913 3311657 3004393 2130354 1225261 649743 514086 865547
40274 865547 1613837 2370123 2651995 2387345 2117747 2447246 3197554 3463943 2841353 2167188
40264 2167188 2355306 2843512 2309212 916825 479485 1880520 3648490 3992600 3140159
40255 3140159 2538428 2690913 3096415 3560772 4079223 3946661 2575167 941086 656677
40246 656677 1672497 2414392 2216222 2021869 2451779 2810224 2559377 2323575 2697710
40237 2697710 3266902 3533517 3716103 3919394 3617284 2766996 2366335 2957977 3560040
40228 3560040 3177191 2532892 3028270 4541825 5595879 5469490 4891751 4618578 4481461
40219 4481461 4184246 4140310 4912407 6221832 7017819 6489429 4826706 3034670 2096105
40210 2096105 2258770 2981461 3455706 3256983 2709784 2599781 3219587 3758201 3245188
40201 3245188 2191342 2328205 4168304 5870617 5565855 3904674 2908094 3039505 3203860
40192 3203860 3197746 3968720 5289931 5426303 3874554 2482816 2804788 4050557 4847795
40183 4847795 5396213 6349445 6920949 5934902 3973767 2782682 2956950 3619447 4026855
40174 4026855 4188484 4141165 3815316 3545971 3797945 4492389 5262886 6025527 6655678 6656589
40164 6656589 5943616 5410431 5870666 6951856 7839890 8510300 9355473 10272801 11140071
40155 11140071 12566468 15057422 17971073 20472532 23107553 27229228 33002007 38820141
40147 38820141 42456529 42258095 38019727 31636077 26175638 23270766 21990885 20948970
40139 20948970 20270388 20331105 20044397 18303855 16098043 15159663 15305364 15190872 14952133
40130 14952133 15755577 17233352 17856319 17639211 17991074 18963807 19237412 18921786 19624759
40121 19624759 21370755 22307574 22201411 23387834 27229343 32446985 38211180 45751831
40113 45751831 54724223 60678491 59136698 50800204 40346538 31345944 24579608 19923857
40105 19923857 17001392 14470996 11195575 8067506 6762533 6954765 6706237 5418348
40097 5418348 4409640 4534239 5133611 5593103 6152442 6717713 6480055 5379886 4633775
40088 4633775 5062498 5915624 6053335 5458137 4901245 4795089 5074678 5753982 6926932
40079 6926932 8397799 9805023 11120249 12787845 15328228 18821476 22695278 25942129
40071 25942129 27530873 26733319 23477576 18776167 14503325 12034035 11059912 10317534
40063 10317534 9369337 8823166 8835064 8575517 7559443 6408183 5726818 5240647 4692826
40054 4692826 4578216 5190700 5888101 6168284 6572615 7618742 8762253 9398616 9918556
40045 9918556 10646630 10773353 9746526 8785508 9367068 10958411 12071774 12978985 15260718
40036 15260718 18792080 21323626 21397114 19777679 17485220 14302352 10203384 6695241
40028 6695241 5367084 5901150 6586858 6316377 5303828 4269317 3639518 3420100 3457817
40019 3457817 3798591 4635058 5643798 5834281 4782979 3609032 3675133 4582353 4749449
40010 4749449 3922571 3584036 4566828 5854319 6472490 7115824 8774550 10827995 11773539
40001 11773539 11187308 9809743 8178483 6330786 4622486 3749216 3835615 4183541 4010922
39992 4010922 3056557 1646274 634154 1010461 2889652 4915274 5298689 3670837 1573384
39983 1573384 915469 2080619 3676537 4112497 3295595 2586448 3080822 4343757 5152635
39974 5152635 5046896 4511829 3957314 3409399 3133603 3549227 4326351 4546807 4134900
39965 4134900 4177011 5268569 6435684 6454823 5527458 4783147 4645105 4590764 4214956 3671582
39955 3671582 3183486 2805828 2621153 2671337 2828299 3098060 3695739 4358604 4128737 2627322
39945 2627322 1161907 1528781 3719952 5742563 5904660 4531196 3193073 2951399 3734736
39936 3734736 4882080 5788129 6234599 6412825 6556022 6535671 6082780 5424500 5323510
39927 5323510 6305280 8050447 9625884 10159868 9414975 8063039 7332527 7936038 9342024
39918 9342024 10556996 11534203 13057389 15085065 16149409 15056017 12545460 10447318
39910 10447318 9561060 9242036 8872638 8726422 9214565 10182337 11370526 12861054 14518065
39901 14518065 15558643 15389520 14561297 14172413 14432695 14506375 13837218 12954688 12644922
39892 12644922 12785630 12471768 11176490 9451353 8397650 8530126 9233095 9444604 8910388
39883 8910388 8509768 9084806 10188945 10498957 9462664 8021044 7507970 8238898 9448673
39874 9448673 10316269 10728889 11161859 12043170 13262575 14338947 15154819 16319826 18456859
39865 18456859 21234438 23529482 24495842 24049240 22475907 20271827 18361867 17621742
39857 17621742 17894198 18163964 17964908 17921955 18700402 20277969 22524811 25449375 28426646
39848 28426646 30455694 31998916 35191979 40801541 45969970 46750466 42518102 36380675
39840 36380675 31563017 28948729 27940995 27876616 28216444 28823123 30493580 33942100 37928805
39831 37928805 39850371 38842620 37052624 37093526 39352974 42624716 46328861 51023789
39823 51023789 57375449 65588900 75459666 86218727 96531770 104998826 110278939 110752778
39815 110752778 105210355 94532414 81790521 69882959 59715998 51178970 44641879
39808 44641879 40256719 36749974 32632680 28365999 25783880 25291229 25095197 23672566
39800 23672566 21750377 21007212 21643660 22283007 21973144 21258379 21053720 21266470 21197349
39791 21197349 20922601 21342082 22666558 23746145 23579659 22885192 23250588 25057283 27280294
39782 27280294 29206909 31151543 33263626 34838827 35444529 35885261 37348717 40041408
39774 40041408 43026630 44925329 44691884 42561229 40525664 40972703 44427525 49436547
39766 49436547 54890380 61287618 69248948 78119701 86811049 94671194 100471683 101907217
39758 101907217 97703323 89453630 79986510 70641803 61504966 53374230 47508649 43687937
39750 43687937 40341153 36711753 33451119 31049936 29189346 27858840 27673350 28592690
39742 28592690 29432886 29152916 27855947 26262496 24923267 24072189 23532859 22728223 21419472
39733 21419472 20220283 19630150 19016746 17647955 16274505 16258864 17397606 18234516 18475834
39724 18475834 19279563 20895723 21947751 21754006 21570195 22473713 23542534 23435791 22613792
39715 22613792 22601764 23855685 25689268 27820404 30806483 35143906 40694237 46667823
39707 46667823 51596516 53963777 53771138 53125968 54481904 58529067 64331513 70888491
39699 70888491 77465263 82566721 83869212 80007855 72307222 64269212 58979857 56916583
39691 56916583 56440224 56196973 56147405 56065766 54676013 51761247 49853245 51498047 55499555
39682 55499555 58756165 61758065 68533244 79615125 88555916 88468681 79930157 69251611
39674 69251611 60488035 52806168 45049644 38722363 35313887 33691433 31886177 29652066
39666 29652066 27826774 26556089 25487559 24698867 24238076 23486217 22017024 20557827
39658 20557827 20184387 20838697 21302400 20527364 18689186 17064615 16867595 17917996 18696486
39649 18696486 18246432 17615538 18487719 20723756 22555245 23175408 23665950 25058669 26968495
39640 26968495 28735591 30460729 31988439 32150133 30237368 27361989 25228836 24267083
39632 24267083 23988490 24377358 25639986 27134620 27889419 27922113 27942851 28126818 28386322
39623 28386322 29401485 31728061 33894681 33205898 29106984 24340591 21874068 21796484
39615 21796484 22227807 22224756 22390920 23278601 24887837 27723267 32585488 38488561 42032524
39606 42032524 40236281 33751100 26320623 21170281 18741775 17766458 17239267 16785670
39598 16785670 16152970 15400021 15165730 15856992 16828894 17175352 17052475 17274776 17806813
39589 17806813 17836122 17419244 17763113 19429236 21476590 23081669 24795871 27071193 28511720
39580 28511720 27159891 23228492 19140656 16785083 15889995 15249019 14350061 13305017
39572 13305017 12142586 10909962 9953045 9508191 9352683 9255195 9378343 9802276 10021176
39563 10021176 9469602 8394305 7704567 7950595 8823287 9741442 10615592 11768952 13181321
39554 13181321 14164776 14117648 13494504 13496903 14580285 15820856 16263096 16347356 17105966 18236877
39544 18236877 18185652 16364955 14143905 13023895 12786346 12323802 11578108 11509579 12415275
39535 12415275 13370531 13431783 12576528 11309697 10056337 9161711 8864949 8958264 8919897
39526 8919897 8634098 8568926 9006240 9503720 9408810 8575658 7312351 5970750 4937244
39517 4937244 4739431 5683333 7378120 8883104 9392888 8780216 7631270 6807880 6753534
39508 6753534 7119434 7252328 7023842 6796512 6575336 5879655 4798503 4431637 5511202
39499 5511202 7073265 7504825 6744984 6346735 7204226 8362056 8621707 8296471 8434081
39490 8434081 9022012 9158555 8680948 8339436 8297057 7754023 6530308 5823079 6490972
39481 6490972 7495581 7263637 6063268 5598139 6329860 6748408 5780352 4509323 4499224
39472 4499224 5452973 5875118 5454893 5264683 5706301 5819975 5046844 4327457 4644812
39463 4644812 5479986 5704115 5319676 5239920 5717138 6064983 5854742 5432852 5157567 4946227
39453 4946227 4795464 5056990 5874996 6837661 7482147 7822409 8209898 8945838 10070773
39444 10070773 11235606 11834131 11611006 10979522 10311126 9257875 7517615 5915695 5584981
39435 5584981 6143536 6031675 4885106 4082566 4364637 4521121 3537685 2568892 3196350
39426 3196350 4826600 5649194 5439350 5440512 5892977 5787851 5027722 4700429 4912229 4456839
39416 4456839 3241513 2944164 4260688 5446748 4941703 3742028 3576656 4169031 4106590
39407 4106590 3295294 2673686 2364140 1995616 2132354 3409740 4816934 4899021 4253729
39398 4253729 4651666 5941201 6251670 5321938 4984771 5796598 5876247 4210278 2594451
39389 2594451 2668822 3213051 2389185 893390 633230 1608986 2442984 3017575 4153905
39380 4153905 5289690 4999210 3697224 3425596 4652407 5423415 4287358 2252160 1107267
39371 1107267 1297246 2164902 2995120 3138927 2266436 1127186 1027629 2082009 3046780
39362 3046780 3222569 3215810 3377236 3006213 1885815 1159511 1666265 2666228 3249770 3714870
39352 3714870 4365504 4321846 3105610 2224449 3248807 5097600 5321588 3712733 2502715
39343 2502715 2924255 3688704 3440147 2845878 3205345 4323369 4986199 4801099 4496451
39334 4496451 4739102 5432844 6064732 6297704 6307425 6687745 7819659 9371021 10865232
39325 10865232 12733670 16143281 21464119 27296285 31292993 31871698 29409062 26320100
39317 26320100 25705496 28850496 33598056 35818023 33032221 26463838 19539972 14871483
39309 14871483 12722981 11685646 10350887 8577779 7341929 7245918 7480580 6828048 5406635
39300 5406635 4461768 4431930 4362750 3597753 2918926 3269865 4218147 4610864 4218106 3836038
39290 3836038 4074179 4817213 5678416 6289720 6278979 5597860 4825520 4614592 4850813 4803732
39280 4803732 4087090 3056774 2244166 1785009 1535972 1492576 1858571 2687255 3595829
39271 3595829 4070920 4117313 4262322 4664661 4657802 3718037 2489311 2032521 2276359 2175910
39261 2175910 1365466 602790 453031 633165 912495 1488741 2062233 1795488 847862
39252 847862 711801 2122028 3740664 3972317 3106864 2523809 2675471 3114853 3709088
39243 3709088 4425803 4554901 3589255 2388143 2050351 2124057 1473518 479690 596358
39234 596358 1879580 2824576 2803583 2818603 3399117 3549139 2602785 1622517 1877520 2962552
39224 2962552 3442551 2705910 1416229 619450 887847 1872077 2474325 2039699 1351784
39215 1351784 1579067 2355278 2220254 1100612 750867 2122468 3838329 4250170 3665569
39206 3665569 3320232 3237789 2523863 1105510 -153624 -716986 -725764 -426278 -95588 -121777
39196 -121777 -361787 87254 1630165 3174818 3297176 2030545 670035 172534 533327
39187 533327 1331939 2062708 2257783 2010919 2008604 2439958 2484317 1604778 612343 525739
39177 525739 1121468 1667585 2267240 3126873 3267846 1712290 -436493 -953993 461022
39168 461022 1850718 1923138 1587369 2039250 2889891 3070994 2460499 1716416 1257967 1111445
39158 1111445 1210093 1396023 1590393 2060915 2862124 3124321 1952707 61114 -762808
39149 -762808 -74752 682104 457100 -42496 46161 268266 58768 118807 1192253 2411216
39139 2411216 2379940 1350953 862584 1486408 2297069 2551230 2661358 3243661 4090230
39130 4090230 4439773 3805655 2423258 1173862 905387 1497105 1914324 1560198 1056127
39121 1056127 1123154 1330049 862798 64429 75623 1096666 2108677 2365116 2121213
39112 2121213 1716388 981909 -19612 -556371 -146970 652685 940796 550203 -20757
39103 -20757 -385928 -475384 -210185 486831 1365893 1920048 1879001 1446098 1004144 750525
39093 750525 693395 853086 1268526 1811309 2208462 2346028 2327233 2086679 1323334 222024
39083 222024 -161957 972556 2791527 3525405 2719784 1800075 1994951 2749582 2946060
39074 2946060 2729069 2993308 3683701 3883145 3363211 2876969 2901555 3089158 3075851 2988337
39064 2988337 3009055 3126295 3353261 3559795 3220159 2110760 1087070 1185459 2022465
39055 2022465 2215233 1478063 1028889 1539057 1970504 1197219 -262774 -1060643 -814380
39046 -814380 -173243 364772 795182 1112020 1264548 1399006 1545464 1343785 655965 126839
39036 126839 484634 1511186 2319181 2460796 2185886 1808937 1451303 1284368 1403112
39027 1403112 1499211 1216452 797928 840629 1425032 2036700 2371050 2635472 2930837 2906167
39017 2906167 2315769 1509171 1049360 1111166 1522136 2177620 3147539 4504187 6227781
39008 6227781 8121572 9684462 10426748 10737114 12108428 15617804 19954358 21859205
39000 21859205 19348440 14048122 9428544 7056889 5771690 4382268 3398028 3379906
38992 3379906 3309036 2135625 815209 962144 2117466 2314463 1103362 -27985 -330926
38983 -330926 -749170 -1666957 -1815341 -463088 1096035 1507446 1275043 1380754 1450479
38974 1450479 872795 447226 1077469 1809702 1139642 -398421 -945901 -225734 246071
38965 246071 -278869 -913305 -919647 -598943 -174971 566233 1243393 1081632 485244 800929
38955 800929 2042046 2474033 1177751 -477973 -838771 -167362 165156 -315210 -976951
38946 -976951 -1134689 -505378 746475 1832028 1901831 1237308 1062621 1793411 2492332
38937 2492332 2497444 2366465 2576609 2628867 2335843 2639849 3947018 4869632 4081290 2464702
38927 2464702 1884863 2597033 3450440 4048147 5068244 6871758 9372588 12828255 16955310
38918 16955310 19567967 18252345 13718758 9552531 8001614 7738629 6587604 4702224
38910 4702224 3687012 3873274 4137085 3803679 3222200 2659564 1937151 1256673 1289561
38901 1289561 2095927 2748153 2498541 1808814 1709731 2406524 3036416 2792428 1850874 1013534
38891 1013534 752365 904098 1100816 1113798 843320 351002 -117093 -479057 -1037755 -1843336
38881 -1843336 -2073389 -953169 709351 1086864 -164034 -1174248 -385772 1368567 2375825
38872 2375825 2519633 2771188 3075842 2602572 1704432 1636646 2228877 1796306 -70819
38863 -70819 -1384199 -393324 1948434 3201739 2237349 -49197 -2028613 -2528992 -1421459
38854 -1421459 206685 967371 754196 746188 1461048 1850699 1049400 -75344 -210021
38845 -210021 438820 734784 526727 575350 912767 707877 -225059 -1037784 -1154517 -907682
38835 -907682 -632192 -114433 679046 1168733 960295 481402 354578 560694 634389 392924
38825 392924 120205 170452 583031 1016800 1066847 766532 632047 992565 1535124 1899964
38815 1899964 2408516 3518252 4681086 4616395 2998797 1181630 750805 1756448 2835896
38806 2835896 2845825 1939380 1104772 984865 1248267 1035202 -11157 -1223479 -1557352
38797 -1557352 -749241 352093 665453 -43481 -1008195 -1284796 -690044 50105 122974
38788 122974 -410551 -658986 17155 1205627 1914819 1635276 697838 -239743 -801700
38779 -801700 -1111917 -1567762 -2217702 -2336421 -1124723 936315 2128014 1498377 212659
38770 212659 33572 927240 1300291 401750 -779484 -1110888 -543036 588764 2192696
38761 2192696 3683095 3798947 2176479 281175 -275925 286082 672014 607404 856882
38752 856882 1489538 1625310 1041141 663448 1020494 1381787 1092851 773385 1317726 2405584
38742 2405584 2956701 2646506 2057269 1568185 1005038 342387 -111075 -360689 -799799
38733 -799799 -1396774 -1499958 -817781 2539 240442 65219 119218 553095 1080573 1663846
38723 1663846 2419904 3019367 2972992 2506429 2308619 2262344 1382750 -484728 -1807722
38714 -1807722 -1127288 841250 1932110 1228411 7684 -191536 512570 897484 416628
38705 416628 -343284 -713967 -710539 -660688 -610608 -394397 -38695 211721 226726 116082
38695 116082 -22751 -259858 -550743 -461375 461434 1968791 3086103 3051484 2108933 1164736
38685 1164736 811843 903216 932885 584386 -13299 -384958 -168489 397775 652003 305788
38675 305788 -256142 -653331 -1001593 -1357718 -1232386 -292211 910594 1660480 2083479
38666 2083479 2514098 2350140 878361 -958636 -1258718 92220 1029725 359204 -438810
38657 -438810 384624 2064801 2567687 1635444 752269 579609 330833 -320656 -505146
38648 -505146 268006 1267797 1828733 2242842 2752029 2787154 1995745 1111426 958201 1314733
38638 1314733 1592242 1964522 2843965 3707083 3554067 2448058 1619489 1880778 2718143
38629 2718143 3233813 3314984 3389942 3487758 3207088 2536078 2071385 2189772 2487835 2468580
38619 2468580 2385930 2726784 3084455 2515642 1138231 273042 506094 766377 226805
38610 226805 -35812 1267278 3134800 3355203 1782239 523440 716312 1181838 911060
38601 911060 865903 2086548 3604463 3754693 2533619 1292812 882490 1257269 2113723
38592 2113723 2793219 2387374 1066424 392596 1143849 1922870 1352721 426897 779692
38583 779692 1723631 1408519 231734 352951 1944909 2772473 1935167 1245000 1932807
38574 1932807 2603313 1925629 1070632 1582466 2597901 2288123 878611 189423 886294
38565 886294 1988988 2647836 2836932 2599402 1960802 1367077 1140454 860957 217033
38556 217033 -141928 343021 953353 800353 419065 828263 1618879 1616999 1039370 1210187
38546 1210187 2239542 2746539 2062095 1085895 635842 452890 284877 560415 1399069
38537 1399069 2109893 2218441 2005382 1677131 1085147 575223 873130 1693302 1759506 769503
38527 769503 -1243 248574 621960 329533 297252 1578552 3301711 3875761 3519003
38518 3519003 3817959 5074385 5820111 5062500 3468895 1970810 594206 -663771 -965909
38509 -965909 322798 2300255 3221879 2457435 1120488 699018 1500461 2580182 2888939
38500 2888939 2234474 1216578 511554 374018 688709 1232942 1806258 2239367 2386252
38491 2386252 2153309 1647780 1304374 1552320 2120130 2023638 747804 -770124 -993398
38482 -993398 357552 1911624 2235567 1268564 47651 -392259 370884 1990434 3396584
38473 3396584 3479245 2173563 584020 -219549 -158024 291462 916699 1717534 2460660
38464 2460660 2819985 2785924 2589502 2373986 2152478 1886946 1474775 900202 430651 323144
38454 323144 391997 355937 484820 1154674 1828403 1515753 450280 159829 1363054 2883020
38444 2883020 3327460 2799034 2123902 1466331 796817 756414 1688255 2501959 1955744 631217
38434 631217 187071 906099 1436615 931763 71111 -193072 281912 1170280 2040391 2254718
38424 2254718 1524391 631344 579285 1067485 1001449 480386 787292 2147986 3083350 2598438
38414 2598438 1552225 1047200 855719 488203 519403 1467194 2323925 1769707 299412
38405 299412 -376145 206026 835486 645205 165844 73854 107864 -165887 -386943 55257
38395 55257 980729 1578220 1411254 783038 186072 -187761 -307288 -2599 869401 1957356
38385 1957356 2445811 1886134 901374 651195 1519002 2735666 3446022 3638062 3670097
38376 3670097 3414910 2552128 1436693 869084 963508 993495 594967 403879 1012481 1880022
38366 1880022 2017152 1436307 1065369 1259802 1331975 857706 548049 1139953 2093637 2324311
38356 2324311 1851525 1680515 2158092 2541164 2340254 1994266 1819598 1331626 243858
38347 243858 -741854 -898346 -500537 -130680 338658 1215730 2094709 2426144 2403976 2331851
38337 2331851 1756293 377908 -808723 -706365 2775 -229360 -1245550 -1292870 201000
38328 201000 1783781 2361282 2668636 3570379 4460266 4440276 3877186 3642191 3725568 3660398
38318 3660398 3526625 3535882 3337714 2703357 2233813 2452007 2848500 2790802 2726079 3407919
38308 3407919 4462411 4836981 4291948 3407530 2492073 1591037 1286019 2271334 4137054
38299 4137054 5590427 5959362 5653929 5201824 4752528 4570104 5053394 6000414 6596661
38290 6596661 6436378 6030636 6120047 6928725 8153725 9202813 9396481 8449621 6884166
38281 6884166 5593544 4950793 4655873 4375853 4128691 4068569 4258365 4648165 5053188
38272 5053188 5283519 5453030 5841762 6267368 6119591 5366757 4887888 5245158 5770736
38263 5770736 5608316 5047901 4922232 5220486 5369513 5478553 6095011 6913757 6950692 6028147
38253 6028147 5019492 4573635 4589277 4916428 5480438 5711927 5071885 4264698 4641597
38244 4641597 6129995 7090494 6673764 5946206 5985099 6204478 5609685 4621366 4391917
38235 4391917 5014709 5654115 6023954 6554566 7275263 7598620 7268622 6716546 6393522
38226 6393522 6383066 6688934 7258367 7629618 7204204 6151645 5546895 6175898 7451254
38217 7451254 7985972 7245908 6187240 6017652 6721096 7331467 7427147 7544278 8019949
38208 8019949 8356655 8181808 7965528 8108835 8123160 7559528 7004051 7180792 7789840 8278006
38198 8278006 8910447 9821431 10029176 9109205 8855880 11074756 14487083 16405374 16936920
38189 16936920 18559405 21865205 25228094 28726322 34308510 41490551 47620500 53774113
38181 53774113 65056483 82957247 104146709 130885646 173728345 233449799 285256023
38174 285256023 295281903 255873626 194610869 144538253 114470228 93446104 73805661
38167 73805661 58447442 49809178 43937189 37234597 31170955 27644672 25149285 22091837
38159 22091837 19717423 19213798 19049885 17440571 15020160 13170794 11769608 10275222
38151 10275222 9219258 9031715 8900122 8154083 7437437 7385970 7475568 7174126 6894571
38142 6894571 6919031 6785675 6549541 7048256 8007525 7678570 5599563 3979459 4788769
38133 4788769 6963862 8160045 7979554 7704142 7927019 8302603 8861689 9829736 10702825
38124 10702825 11028977 11577392 13357488 16010927 18376415 19971789 20799447 20607522 19606726
38115 19606726 18945558 19201354 19521053 19510018 20440851 23015839 25764652 27733192 30808786
38106 30808786 36826639 44451940 52058100 61493255 75308997 93197801 116599659 153184627
38098 153184627 206488502 259978801 282784612 258922674 205177899 153427294 120065293
38091 120065293 99693061 83230171 70266327 62871968 57905953 51012172 42852457
38084 42852457 36658665 32835905 29637227 26673328 24470939 22333422 19440625 16737206
38076 16737206 15403144 14641558 13052291 11069271 10026772 9786397 9264692 8543185 8539881
38067 8539881 9116907 9279342 8892733 8617511 8441401 7784706 6849341 6424584 6463944 6199680
38057 6199680 5601009 5378083 5506158 5115288 4099188 3535334 4006298 4617492 4373694
38048 4373694 3647937 3427926 3683605 3454520 2413268 1475422 1621055 2687057 3727737
38039 3727737 4223799 4405750 4500035 4311490 3781560 3377956 3454971 3661918 3567286 3475662
38029 3475662 3854788 4242303 3726701 2509534 1912607 2519327 3285674 3042891 2092356
38020 2092356 1629065 2136521 3040930 3618270 3641778 3288542 2824394 2344745 1748265 1151660
38010 1151660 1141900 2043083 3072337 3096545 2271841 1877146 2284635 2357612 1464129 771828
38000 771828 1466853 2748899 2967500 2054764 1363880 1453976 1499877 878863 47471 -346301
37990 -346301 -175157 526051 1691183 2818418 3320284 3444621 3962795 4784793 4891229
37981 4891229 3963584 3028379 2902595 2958195 2256977 1178841 940384 1914204 3356372
37972 3356372 4530198 5161724 4951222 3742386 2362378 2211939 3457203 4488142 3959562
37963 3959562 2707666 2610541 3902238 4816006 3955870 1884797 20602 -962544 -1038414
37954 -1038414 -171944 1282984 2241442 1996923 1232290 990113 1144298 978603 757938
37945 757938 1298809 2225312 2253875 1316738 805008 1337799 1874192 1662646 1524982 2275652
37935 2275652 3238392 3475444 3337026 3536963 3674872 3058533 2229377 2207298 2712967 2566054
37925 2566054 1575323 699550 437292 268299 -273052 -976536 -1431538 -1287591 -170215
37916 -170215 1773798 3386101 3488392 2316042 1153976 733603 886173 1507066 2686010
37907 2686010 3914776 4374987 4207591 4411254 5211849 5576028 4749003 3360598 2506867
37898 2506867 2447552 2664462 2617454 2067814 1185696 642320 1087943 2287487 3261291 3447652
37888 3447652 3174372 2849268 2387850 1748849 1354978 1482518 1709674 1510885 1138890
37879 1138890 1423985 2723364 4371629 5280960 5034066 4283735 3977157 4354755 5049270
37870 5049270 5931634 7050044 7712383 6823856 4701831 3344145 3891264 4929827 4663333
37861 4663333 3737958 4080968 5621041 6392405 5808111 5526170 6563673 7667995 7498792
37852 7498792 6640599 6266200 6291180 6209513 6562017 8027502 9762867 10108358 8687146
37843 8687146 6726818 5465503 5082282 5077545 5033771 5002989 5426210 6476017 7460616 7475878
37833 7475878 6759068 6584595 7544207 8786277 9266465 8777190 7388795 5092777 2639195
37824 2639195 1454227 1787140 2101429 1369086 744935 1555394 2761978 2319936 421551
37815 421551 -681487 -11912 952055 822225 262050 533507 1393503 1618087 967522
37806 967522 492017 938007 1672514 1559363 567181 -48450 630530 1853188 2134885
37797 2134885 1280071 519033 571791 743377 377426 -23748 76940 193266 -25301 307851
37787 307851 1818401 3191733 2757868 1201556 781152 2034284 3203539 3062925 2345741
37778 2345741 1874771 1195927 5556 -697932 -118339 898048 1170213 958988 1183906
37769 1183906 1697001 1735044 1535838 2009361 2970999 3129297 2027699 793368 530361
37760 530361 945878 1160362 1106372 1326096 1807069 1890632 1316225 633485 360412 303914
37750 303914 82322 -169572 -194099 -343223 -1076277 -1808991 -1308614 396512 1521824
37741 1521824 748407 -827425 -1042556 504692 2199343 2790671 2657726 2487227 2064745
37732 2064745 1089467 134153 -168625 -214298 -701232 -1251643 -821218 623298 1850242
37723 1850242 1990691 1578295 1534132 1762862 1424278 297617 -861564 -1387298 -1481109
37714 -1481109 -1578502 -1443263 -550251 783310 1407762 733275 -445841 -906245 -368958
37705 -368958 493247 1046575 1175938 1040683 918040 1154531 1771202 2254395 2223893 2081787
37695 2081787 2365560 2689036 2220440 1213726 1022817 2202380 3510026 3476465 2313907
37686 2313907 1448049 1534831 1825194 1463915 643677 187173 435299 912224 963954 488289
37676 488289 -13235 -29150 426263 935866 1219999 1341019 1406334 1366679 1199229 1000969
37666 1000969 730049 143342 -713828 -1180949 -606926 665055 1374899 704380 -666089
37657 -666089 -1252108 -497526 607619 823091 168412 -277079 187199 1218866 2117625
37648 2117625 2526799 2375318 1807785 1410177 1811460 2684304 2851288 1918488 1069183
37639 1069183 1453589 2450020 2590648 1798606 1446572 2221660 3150528 3059579 2026999
37630 2026999 939285 348489 212910 202152 -100768 -816124 -1356098 -951463 186227
37621 186227 856545 357104 -590353 -785157 51139 1179676 1759199 1564661 1122739
37612 1122739 1270149 2193937 2929825 2401309 916102 -176097 -339468 -332868 -642052
37603 -642052 -681266 -116803 250426 -207010 -834635 -887655 -771652 -897694 -362504 1620296
37593 1620296 3743822 3951792 2431923 1362240 1696155 2149399 1682452 987862 761542
37584 761542 369694 -594610 -1028603 -76069 1093820 960755 201647 693886 2445192
37575 2445192 3458663 2684530 1318046 780061 990516 1262772 1488539 1582084 976209
37566 976209 -267683 -841189 111724 1429736 1378627 122783 -670837 -379092 34366
37557 34366 72120 567221 1873935 2740705 2115780 976540 988890 1980435 2201761 943049
37547 943049 -468499 -554428 481728 1300071 1104965 248777 -438537 -455821 68330 585347
37537 585347 679291 494146 540628 1107705 1976643 2630024 2637512 2025771 1398127 1373412
37527 1373412 1710785 1458555 322105 -712300 -725121 -214153 -196284 -504223 -222116
37518 -222116 465591 374700 -572048 -882199 264767 1682179 1986794 1599567 1770329
37509 1770329 2418369 2288581 949382 -540135 -986473 -275525 806241 1369604 1064280
37500 1064280 396648 323188 1156449 2079897 2108536 1224517 170339 -475828 -527865 33514
37490 33514 843175 1081949 386656 -396786 -116521 1147189 2113002 1777239 285534
37481 285534 -1490301 -2600192 -2421369 -1163097 63694 325845 -32983 21276 684669
37472 684669 1157945 990409 709925 870312 1174818 940399 52181 -807470 -718915 622805
37462 622805 2373733 3119733 2395859 1291497 1012598 1306478 1126824 428457 165409
37453 165409 667743 1265245 1614454 2121320 2694418 2324966 593496 -1341843 -2012587
37444 -2012587 -1268121 -88120 615550 528906 -96036 -515303 -105746 732835 949226
37435 949226 403166 167974 848288 1643765 1776368 1775775 2351085 2930480 2579636 1684403
37425 1684403 1324811 1376136 697645 -814249 -1700162 -790409 1321625 2932396 2737186
37416 2737186 700525 -1855830 -3063709 -2184841 -519280 25697 -846039 -1817547 -1958567
37407 -1958567 -1610485 -1230593 -612351 286827 812771 593946 276330 586507 1234922
37398 1234922 1388441 793395 -112846 -810704 -952130 -433667 301394 448442 -158825
37389 -158825 -611700 -28396 1235621 2042974 1870627 1161681 483267 -13797 -311864
37380 -311864 -312210 -114953 -164208 -861912 -2072348 -3039548 -2869070 -1350007 622288 1774043
37370 1774043 1791028 1575402 1919104 2387637 2040957 934850 198441 611598 1676362
37361 1676362 2261974 1797155 682573 -195652 -243703 331222 710808 335940 -403747
37352 -403747 -559584 281659 1523905 2244436 2134909 1633358 1269821 1091841 784257
37343 784257 217332 -340515 -607793 -628392 -495416 -7196 938784 1774630 1757222 1095832
37333 1095832 827856 1286793 1511136 767279 -89234 289533 1713416 2593891 2080593
37324 2080593 1094464 980851 1857798 2685889 2561344 1631108 898065 1171829 2080472
37315 2080472 2352643 1385342 143489 -79887 590931 988462 798992 937439 1838654
37306 1838654 2502729 1844787 214086 -1101999 -1385139 -938029 -435236 -319117 -540613
37297 -540613 -539846 206455 1374524 1958177 1508482 715144 430653 647211 860177 938657
37287 938657 1103959 1391468 1617248 1661534 1495758 1198674 1083986 1381231 1714194 1527284
37277 1527284 1111352 1319112 2040331 2085692 1098569 350046 787435 1519164 1430048 1181841
37267 1181841 2047626 3563497 4088326 3257453 2173193 1456358 892162 858294 2106654
37258 2106654 3870027 4174323 2701455 1551515 2229647 3493229 3415452 2248143 1732119
37249 1732119 2409740 3154067 3041361 2405440 1989844 1923699 1728487 968031 -123634
37240 -123634 -623424 128402 1558452 2429238 2371743 2018634 1588566 548937 -951419
37231 -951419 -1680909 -1124868 -415909 -463182 -394172 804022 2188390 2117439 909065 386410
37221 386410 1060948 1641448 1428793 1341318 2009439 2476732 1754114 501716 61023 524948
37211 524948 853636 592822 486475 1253464 2406717 2714933 1737129 543268 568350
37202 568350 1796148 2624536 1836900 150187 -796257 -522685 91554 436854 906655
37193 906655 1809481 2535496 2381328 1622905 1174358 1445747 1974155 2065919 1527982 826398
37183 826398 655969 1287561 2290016 2929446 2760023 1790496 375455 -809983 -1028758
37174 -1028758 -188599 877239 1290723 1157118 1256146 1863351 2456814 2570822 2342471
37165 2342471 2072636 1749992 1280635 897071 1058576 1945079 3074413 3510927 2736187
37156 2736187 1362723 581051 767203 1168113 1175605 1165845 1591218 2037086 1966053 1730016
37146 1730016 1897442 2111365 1646570 684320 -4192 -248142 -298581 46041 884702 1267812
37136 1267812 318683 -1008266 -938130 521207 1734476 2073624 2362340 2619130 1769976
37127 1769976 201162 50100 1757687 2752912 1270012 -718509 -520739 1201637 1910442
37118 1910442 1283864 969106 1151247 444844 -983140 -1142868 514954 2144918 2486224
37109 2486224 2454980 2896541 2997751 2189172 1671320 2479346 3541904 3326887 2273997
37100 2273997 1911639 2398413 2653264 2433776 2611993 3479326 4216764 4229428 3913524 3861200
37090 3861200 4111418 4341510 4158955 3208342 1647189 443673 476057 1391228 2115852
37081 2115852 2411500 2972942 3910509 4244019 3370781 2110780 1617028 1918016 2246434
37072 2246434 2289154 2357165 2661666 3138291 3766451 4444516 4793127 4700812 4750145 5341355
37062 5341355 5714740 4882973 3433712 3158717 4578554 6018889 5783832 4253225 3016880
37053 3016880 2797169 3229935 3997666 4952810 5487628 5034973 4137359 3929294 4538764
37044 4538764 5044041 5075184 5325992 6203350 7058870 7248660 7043494 6944102 6894440 6753421
37034 6753421 6831692 7339458 7893822 8144855 8344101 8784994 9267468 9624848 10135705 10855817
37024 10855817 11236747 11043650 10913094 11263095 11459847 11007114 10745432 11639778 13037139
37015 13037139 13593360 13513147 14222087 15892494 17022649 16819056 16401939 16970411 18124655
37006 18124655 18875583 19186298 19472966 19427366 18487299 17026942 16080957 16088617 16631386 17170767
36996 17170767 17395011 17101840 16415897 15944360 16104890 16460597 16300796 15717852 15508381
36987 15508381 16114107 17217941 18253753 18714011 18103935 16366341 14419171 13529176 13918888
36978 13918888 14582782 14657513 14296436 13911020 13334393 12342717 11406425 11147661 11393781
36969 11393781 11522335 11491809 11711585 12046077 11908995 11413520 11392866 11931433 11914107 10716705
36959 10716705 9436409 9438114 10294739 10362855 9138992 7821284 7477677 7799041 7960282
36950 7960282 7697993 7076382 6082405 5059022 4808128 5566625 6411910 6360214 5653693
36941 5653693 5318818 5749271 6321710 6241149 5340420 4225466 3866291 4667958 5748225
36932 5748225 5751742 4689832 4138939 5045979 6287573 6345372 5525136 5194984 5447946 5125539
36922 5125539 3970251 3114340 3221909 3626072 3729501 3891228 4310487 4288305 3439238
36913 3439238 2621192 2729277 3356934 3580356 3396367 3401030 3587589 3543513 3523986 4210118
36903 4210118 5400184 5924217 5116718 3674528 2749858 2700293 3042254 3243958 3166215
36894 3166215 2881293 2460300 2097202 2250183 3292122 4846213 5783704 5345456 4176416
36885 4176416 3706137 4428645 5360729 5398006 4589581 3681431 2998494 2429578 2131323 2451055
36875 2451055 3200962 3671749 3463409 2789192 1883111 698757 -541420 -1070219 -412794
36866 -412794 774656 1334974 1050320 816411 1230646 1758945 1834043 2044827 3173350
36857 3173350 4430444 4118578 2300381 1273751 2508458 4421131 4549816 2963957
36849 2963957 1805815 1995799 2348150 1963734 1546181 1798543 2203295 2241770 2427462
36840 2427462 3140823 3607691 3122422 2355224 2356989 3015378 3521690 3686147 3774265 3664500
36830 3664500 3195649 2806814 2869268 2957713 2726467 2777261 3508990 3877231 2775775 1086047
36820 1086047 664896 1576896 2120582 1600794 1197268 1695757 2176924 1763234 1132494
36811 1132494 1241604 1728306 1705398 1264591 1098945 1282604 1434632 1578114 1887219 2002068
36801 2002068 1525372 905573 947684 1624188 2160458 2177126 2006387 1935046 1841846 1635597
36791 1635597 1460003 1373580 1297914 1323921 1605372 1889179 1623289 712304 -170844 -246578
36781 -246578 540799 1458379 1690754 1128158 483353 504882 1087557 1489038 1494168 1785024
36771 1785024 2739960 3447308 2738194 961219 -207924 175797 1312679 1979000 2023725
36762 2023725 1991634 1952520 1560429 959746 743735 993382 1110002 798235 571960 933839
36752 933839 1560161 1778839 1540141 1395924 1647762 1984591 1948804 1376256 384210 -674227
36742 -674227 -1209446 -808810 169828 822846 779307 681897 1225428 2052821 2181893 1431253
36732 1431253 768310 1000200 1627567 1506534 453768 -414951 -142147 751005 920874
36723 920874 22779 -791340 -443844 589314 959841 272608 -539269 -635483 -269626 -119311
36713 -119311 -315464 -581136 -767980 -682064 182498 2011759 3949532 4706139 3961177
36704 3961177 2669663 1890118 1728709 1580737 1081251 584243 771934 1847386 3139332
36695 3139332 3680927 3250283 2572021 2352185 2483732 2470544 2209763 1918055 1669681 1557874
36685 1557874 1953799 2894852 3471252 2689555 932755 -290383 -206702 400447 489388
36676 489388 94077 -109604 62267 234138 199463 142364 256739 550996 970576 1432570
36666 1432570 1776961 1859913 1668807 1313560 1027833 1144561 1799971 2604519 2877178 2320592
36656 2320592 1286479 358029 -102212 -9205 523935 1240454 1910585 2445847 2725402
36647 2725402 2557412 2117786 2087979 2807064 3548358 3332805 2299057 1490443 1383492
36638 1383492 1506415 1480180 1408801 1132319 256221 -759049 -777395 180211 540773 -522769
36628 -522769 -1579614 -899985 1025525 2291890 2213471 1682754 1357155 1075815 966136
36619 966136 1565185 2609453 3047312 2606328 2149937 2095306 1713916 616036 -222891
36610 -222891 182727 1283477 1768268 1328090 741494 604042 884123 1513564 2480840
36601 2480840 3269709 2996576 1437463 -507007 -1652817 -1640173 -1079104 -763226 -842707
36592 -842707 -722418 191105 1610525 2447764 1990458 802661 89583 271069 680235
36583 680235 752548 906799 1780571 2989313 3374253 2492828 1197847 509642 520575 801882
36573 801882 1259656 1881651 2108954 1434451 462112 316357 925718 1025053 187379 -373457
36563 -373457 255369 1084702 689766 -554116 -1057335 -381367 376697 417551 117421 -3606
36553 -3606 67235 452641 1470243 2724485 3202641 2737130 2342823 2589628 2726213 2132860
36543 2132860 1577484 2011787 2936927 3122886 2417342 1689036 1329074 980755 611765
36534 611765 703792 1285727 1768141 1901671 1994901 2003420 1398000 347384 68046 1254049
36524 1254049 2817059 3054148 1737845 233706 -311102 -80481 173611 200622 167591
36515 167591 101667 17552 293969 1248505 2371799 2643678 1817342 826740 566355 777499
36505 777499 676262 257696 213271 738503 1284368 1575055 2023374 2807189 3272510 2775025
36495 2775025 1609512 619838 304895 710920 1673537 2621980 2680325 1695843 764468
36486 764468 922454 1632536 1512558 403983 -369306 69346 1038148 1532494 1606050 1808846
36476 1808846 1960070 1411305 246398 -657794 -823895 -759432 -1101529 -1609671 -1388381
36467 -1388381 -13994 1843730 3047724 3153804 2757236 2624388 2730536 2448172 1531187
36458 1531187 444057 -351842 -954322 -1582476 -1971319 -1686149 -929835 -552081 -1065822
36449 -1065822 -1899643 -1913174 -680028 945774 1729046 1416280 865899 768263 744868 145903
36439 145903 -672207 -640531 484345 1660810 1896568 1391953 975692 983148 1213699 1531134
36429 1531134 1855549 1835491 1199024 337630 -42414 171559 440295 371011 28240 -530327
36419 -530327 -1370061 -2163215 -2191015 -1234959 -17143 649917 810287 1051696 1537840 1861774
36409 1861774 1767478 1547597 1637505 2100153 2608375 2785583 2535385 2120873 1861778 1698603
36399 1698603 1254363 466532 -150642 -205620 -102737 -491629 -1211194 -1457029 -1021542 -597701
36389 -597701 -594075 -459472 255942 900155 650096 -48389 -44379 697290 997609 313355
36379 313355 -472349 -527312 -237519 -204421 -79068 610378 1261108 1053183 490199 718338
36369 718338 1551803 1668787 862713 539972 1481581 2583073 2684959 2356484 2656445
36360 2656445 3151784 2672324 1427130 755218 960110 975668 342228 -2220 589564
36351 589564 1341925 1419146 1318231 1851355 2537115 2257352 1150314 577087 1125649 1757427
36341 1757427 1379213 444876 294198 1296767 2398382 2527142 1853073 1350687 1501419
36332 1501419 1945552 2291786 2584659 2713316 2068730 529555 -643534 16588 2036231
36323 2036231 3111789 1863747 -421684 -1539944 -1081634 -354490 -104388 310821 1373457
36314 1373457 2321639 2262621 1535225 1143544 1277380 1239049 740383 478258 1128956 2267566
36304 2267566 2776193 2200872 1240425 756446 718293 555141 298996 656643 1785505
36295 1785505 2724609 2592295 1855736 1686862 2323396 2870338 2675558 2076332 1599651
36286 1599651 1175725 546910 -76433 -228556 231712 1059741 1901655 2432702 2477497 2143333
36276 2143333 1621787 912528 134063 -63394 849371 2172834 2454681 1412152 471568
36267 471568 871274 2119790 3017508 3280560 3200557 2564998 1223139 165804 572785
36258 572785 1966423 2694617 2237412 1673658 1732041 1795467 1232476 395806 -277325 -954614
36248 -954614 -1516113 -1130885 382713 1750202 1802821 1083160 894635 1432961 1939336
36239 1939336 2142346 2346656 2413059 1850387 859677 258622 333218 632834 902133 1345925
36229 1345925 1914666 2182937 2098694 2108547 2367498 2497737 2287215 1979275 1710323 1289791
36219 1289791 710923 283269 101427 -22388 29158 651821 1684481 2289475 2020988
36210 2020988 1440131 1290508 1543050 1613368 1111294 81119 -1090824 -1761958 -1478882
36201 -1478882 -585148 72935 237779 460215 1011662 1359522 1216389 1299889 2187372 2989473
36191 2989473 2306533 402824 -719220 174089 1809815 1949932 321462 -919934 67737
36182 67737 2357440 3379273 2217942 603218 280239 702940 437429 -194880 342554
36173 342554 2003391 2933249 2351202 1695933 2068622 2371506 1369549 99552 386489
36164 386489 1873361 2489208 1519548 359690 147035 310881 -70242 -778858 -1008734
36155 -1008734 -595927 -95759 -24373 -321686 -376539 315128 1284177 1349202 260013 -564752
36145 -564752 166152 1677583 2184942 1471353 976960 1452351 2063013 2037643 1751017 1700162
36135 1700162 1647956 1340781 1051568 942931 833919 897996 1508660 2128856 1674395 414227
36125 414227 41260 1164805 2255751 2065249 1568332 2121945 3002983 2523111 754085
36116 754085 -629790 -752022 -128029 814896 2118958 3207998 3014564 1531184 21356
36107 21356 -622110 -680098 -557539 -68581 804411 1440182 1461513 1363613 1701574 2224733
36097 2224733 2367319 2154712 2035017 2032572 1632724 601875 -410411 -408609 736431 1887913
36087 1887913 1835961 767795 -24448 77184 314450 -70614 -618951 -463933 319474
36078 319474 955378 1073121 846073 480162 258928 588262 1270293 1340697 477624 -123985
36068 -123985 629414 1903534 2068667 1141832 537610 654533 444682 -483985 -1012006
36059 -1012006 -247985 1230267 2419550 3033570 3113192 2577163 1684906 1020256 620888
36050 620888 50312 -418649 143620 1677106 2746713 2415529 1435518 938757 968504
36041 968504 995557 925215 840965 569372 171533 113086 418121 479918 155244 79044 445393
36030 445393 585953 258156 97727 209601 -245035 -1278663 -1492861 -339041 672214
36021 672214 395789 27107 874497 1712851 656061 -1433359 -1963062 -481490 980967
36012 980967 1237572 1134939 1284015 1036031 290185 155051 969067 1502188 1046649 657499
36002 657499 1286919 2137985 2038740 1285208 906916 966421 770279 234701 34729 640511
35992 640511 1819319 2833769 2830932 1547082 -46877 -393249 949292 2726866 3420672
35983 3420672 2790190 1771397 1318419 1529251 1564548 532406 -1121788 -1582624 122020
35974 122020 2408556 2918264 1595064 366392 36808 -394446 -1140092 -789563 996437
35965 996437 2217953 1445301 116548 190735 1101974 1030969 -42120 -681786 -506628
35956 -506628 -225381 221503 1405753 2612794 2410843 1014481 148265 409887 605966
35947 605966 -325 -570439 -338181 223443 548534 921932 1570888 1984264 1821794 1505003
35937 1505003 1357339 1157454 1006967 1493487 2409740 2527705 1447124 521016 947834
35928 947834 1945605 1965161 898129 -159646 -687504 -929437 -758609 131200 961796
35919 961796 332280 -1616640 -2760409 -1515913 1000448 2244530 1255177 -502023 -1216394
35910 -1216394 -792440 -483411 -1048097 -1912614 -2074813 -1291493 -156965 679538 1087445
35901 1087445 1354220 1709321 1980540 1811161 1352508 1450085 2577047 3738088 3385047
35892 3385047 1672895 695478 1739489 3342635 3267631 1608466 386223 478043 740377
35883 740377 284455 -160154 243956 1049154 1465314 1534085 1561170 1438418 1346301 2062720
35873 2062720 3600430 4507748 3629787 1767455 498157 147890 132914 499270 1601022
35864 1601022 2752610 2813437 1945924 1332478 1262489 1004560 550781 802774 1712780 1916631
35854 1916631 889194 -37861 256540 890713 430102 -853533 -1512403 -1141045 -742472
35845 -742472 -1044241 -1554774 -1392499 -279828 1381212 2834403 3337768 2741552 1760928
35836 1760928 1271657 1374199 1573564 1769560 2432992 3627709 4418271 3742561 1762661
35827 1762661 -39622 -309838 723942 1474764 782525 -757129 -1533572 -792204 708510
35818 708510 1827258 2184345 2028449 1643367 1309601 1349653 1725894 1970481 1933194 2134702
35808 2134702 2834455 3241060 2447806 870730 -138661 -64504 263843 62573 -350765
35799 -350765 -250837 421854 1165738 1634359 1768551 1537835 1011447 484893 133259 -321619
35789 -321619 -1233433 -2408810 -3193155 -3145054 -2366325 -1243724 -194346 363493 220958
35780 220958 -259663 -361894 72343 222333 -706672 -2146888 -2518181 -1188588 549615
35771 549615 1057271 425852 115441 759960 1470525 1528311 1566668 2334491 3232575 3150444
35761 3150444 2191702 1413355 1150649 821268 359691 566581 1675664 2668970 2620023
35752 2620023 1890107 1338102 1047879 629928 286683 652101 1667323 2374880 2015684
35743 2015684 911978 61794 32858 408627 368892 -233793 -669442 -439129 -175759 -761292
35733 -761292 -1773050 -1809821 -519667 761997 885006 388575 377665 798239 875011 618485
35723 618485 686311 1062756 1049773 479459 -114218 -491182 -839710 -918488 -183585 1056990
35713 1056990 1731207 1568395 1476446 1884678 1854743 645278 -808457 -1057860 -168084
35704 -168084 543770 455135 178499 219187 231236 -66467 -149216 533554 1586261 2144087
35694 2144087 2080174 2077578 2464186 2603298 1822109 526464 -251295 -321223 -582653 -1523049
35684 -1523049 -2241254 -1688428 -376271 133597 -691654 -1783465 -2074913 -1662039 -1015726
35675 -1015726 -35584 1407420 2702412 3102974 2714966 2223122 1995574 2069857 2593399
35666 2593399 3505070 4090350 3696704 2730210 2111277 1849079 1105110 -228535 -1028652
35657 -1028652 -490551 596796 820222 -20963 -741353 -346942 771309 1391219 903702
35648 903702 -97097 -676088 -704720 -766467 -986455 -621258 736977 2082998 1980507
35639 1980507 530960 -523010 56313 1466590 1990098 1175442 223627 319483 1224357
35630 1224357 1788847 1484310 921822 803118 858894 322937 -760761 -1442666 -1220472
35621 -1220472 -708904 -522259 -270123 574098 1502928 1772377 1875133 2789044 3882824
35612 3882824 3265408 709325 -1394842 -1064275 555236 901269 -428514 -1498986 -1138018
35603 -1138018 -426154 -672342 -1388274 -1259979 -259582 378713 20425 -600161 -668646
35594 -668646 -482247 -745169 -1186220 -794945 534133 1498999 1009472 -395936 -1459793
35585 -1459793 -1923992 -2328545 -2524631 -1768171 -331181 433796 88920 -177518 478711
35576 478711 1195058 974079 357780 245118 155660 -695763 -1434534 -568772 1387848 2322004
35566 2322004 1571095 678436 829839 1385700 1512749 1502649 1632017 1310163 389791 -100542
35556 -100542 309883 382332 -905525 -2424746 -2419308 -1084897 -7781 309482 637338
35547 637338 1128710 1066159 538969 689632 1890355 3032307 3147762 2654392 2458590
35538 2458590 2701639 2898097 2642539 1824763 737656 129018 454460 1014905 699771
35529 699771 -334101 -799845 -327602 -99834 -839494 -1425743 -557474 1138983 1907682
35520 1907682 1219184 113301 -512346 -751134 -847349 -627804 -71235 354772 291256 -89929
35510 -89929 -483123 -792681 -891399 -525303 254624 942928 1166597 1147260 1296223 1589666
35500 1589666 1684843 1509823 1329597 1187414 689734 -355440 -1331736 -1337904 -369374 523353
35490 523353 546668 178691 361440 1055761 1399769 1205840 1337557 2289772 3257881 3244402
35480 3244402 2489656 2047434 2268825 2457372 1930849 791215 -384273 -1116941 -1228993
35471 -1228993 -871962 -450589 -281225 -329462 -436910 -592752 -686193 -284086 798338 1827460
35461 1827460 1710867 396476 -803367 -601928 855573 2277974 2710441 2377007 2076259
35452 2076259 2107056 2071205 1622658 1005375 657226 624736 751395 1146416 1863209 2303389
35442 2303389 1793616 827746 751873 1825368 2581569 1796335 176920 -836724 -1100654
35433 -1100654 -1333943 -1315278 -174113 1641378 2428668 1682732 939095 1405390 2127664
35424 2127664 1678778 623874 755698 2282865 3343130 2537151 699504 -446312 -509007
35415 -509007 -456834 -878600 -1201779 -766353 86696 489254 215154 -183423 -246024 -24331
35405 -24331 373157 1025535 1757984 2010940 1529547 769653 248899 -92785 -478258 -692383
35395 -692383 -449927 -12027 168589 170638 400595 876410 1244083 1291304 970594 234877
35385 234877 -625996 -887517 -240095 695243 1323762 1933011 2771153 3036517 2017195
35376 2017195 625516 313828 878142 961885 417585 274850 476209 -154801 -1385634
35367 -1385634 -1356758 314049 1495906 834977 -81938 512480 1608817 1302115 64150
35358 64150 -247586 391726 404369 -508333 -1096410 -986388 -1134903 -1737028 -1732501 -761342
35348 -761342 188576 528369 807655 1208239 919598 -252690 -1070871 -542713 690234
35339 690234 1476335 1705438 1884123 1964739 1538987 761391 319696 635672 1433745 1893675
35329 1893675 1203853 -560179 -2114362 -2161384 -928007 201650 534930 604165 813680
35320 813680 763820 320010 167557 606040 803204 100236 -791477 -876633 -485113 -671808
35310 -671808 -1383493 -1402479 -156785 1396395 2030145 1735613 1491962 1875568 2392135
35301 2392135 2239220 1381231 543495 250289 327829 459874 671720 932807 905811 677194
35291 677194 1091276 2453049 3441461 2549099 363804 -958194 -545882 277783 248257
35282 248257 -147805 58729 625549 686814 185495 -256763 -331194 -111522 367637 932921
35272 932921 1159132 991190 928155 1096236 852114 -85686 -883696 -728614 8782 579108
35262 579108 1096655 1975641 2755313 2661845 1959560 1569986 1545987 1070191 -45859 -928400
35252 -928400 -872603 -138863 692197 1427577 2056932 2402781 2290963 1811696 1294301 1132306
35242 1132306 1482492 1989824 2112852 1883047 1859723 2122649 2035517 1422876 1082947 1401903
35232 1401903 1396275 228462 -1125333 -1123339 -47683 437996 -83865 -280772 609608 1562277
35222 1562277 1471022 777023 570068 938308 1007650 137361 -1419235 -2684019 -2644562 -1307255
35212 -1307255 -29461 -24640 -605588 -7546 1940731 3333869 2880959 1708167 1548501
35203 1548501 2278699 2489651 1737599 875897 480553 177728 -448656 -1198855 -1620038
35194 -1620038 -1412934 -479291 918459 2109352 2578444 2467222 2157085 1657810 884952
35185 884952 185373 -59136 -103604 -439842 -899871 -843398 -134200 723505 1314087 1505360
35175 1505360 1068520 -52822 -1099198 -1055150 -80663 486532 -67400 -844776 -687442
35166 -687442 203854 724960 446004 -60044 -204239 67385 642017 1475806 2349201 2864499
35156 2864499 2803349 2180427 1021729 -454683 -1497015 -1305731 -90454 899078 790413
35147 790413 171169 316023 1554219 2877260 3140577 2271123 1190149 797927 1201436
35138 1201436 1855080 2280850 2475916 2566736 2350199 1587544 663518 354996 736986 905029
35128 905029 216004 -716312 -896326 -428289 -320680 -967507 -1668403 -1722698 -1221598 -574516
35118 -574516 22509 391354 358953 286011 913439 2217564 3062520 2582171 1375368 671405
35108 671405 746110 895820 672032 345359 232987 275870 361635 551664 877973 1218322
35098 1218322 1367708 1080677 311416 -377809 -158525 862566 1379236 557128 -582603
35089 -582603 -467611 728457 1356420 747769 -18318 -53708 82827 -274334 -602346 -228018
35079 -228018 359923 401672 282559 747790 1266081 692283 -615211 -917980 405894
35070 405894 1941537 2385011 2274290 2645807 3095223 2527367 1206489 562893 1050208
35061 1050208 1556222 1201457 537772 450235 855512 1178290 1348596 1554630 1609022 1384511
35051 1384511 1404944 2119673 2918425 2761416 1578215 198362 -853503 -1527813 -1472555
35042 -1472555 -340548 1073788 1319695 274340 -548857 -148937 692466 922977 798300
35033 798300 1031944 1404007 1329922 1039309 1073071 1241860 1174906 1303979 2148215 3147862
35023 3147862 3401802 3066496 2754632 2084178 397635 -1403038 -1574266 -213276 560992
35014 560992 -393143 -1678845 -1573873 -392816 400971 370389 216277 359702 500517
35005 500517 323345 -134463 -673532 -1003578 -830625 -220527 369751 645977 746161 829302
34995 829302 816296 658015 421212 82120 -262112 -117871 711413 1325858 706616 -511535
34985 -511535 -592816 676435 1417211 410144 -1058962 -1217257 -391638 -120856 -595155
34976 -595155 -637971 179754 974819 1057545 710161 358605 26415 -237731 -252568 -143879
34966 -143879 -191830 -256356 -35034 238147 118027 -188890 -161051 -29104 -492690 -1368433
34956 -1368433 -1632257 -1025568 -498171 -620236 -666291 -17934 508513 -143406 -1327835
34947 -1327835 -1287371 294593 1558215 834614 -1122479 -2166762 -1589373 -811009 -1132724
34938 -1132724 -1923020 -1781699 -706657 39910 -99600 -404208 -344398 -353962 -676464 -605399
34928 -605399 329183 1311972 1313752 567849 58132 68333 182305 267934 442840 379929
34918 379929 -321191 -1245909 -1594229 -1332814 -993452 -555305 367650 1328749 1277703 166740
34908 166740 -799805 -817769 -349413 -13644 303947 709578 668131 -173111 -1268411 -1943663
34898 -1943663 -2231179 -2316414 -1846279 -582464 772437 1247278 819587 270564 93108
34889 93108 204942 486198 867155 999141 542315 -203463 -545526 -322442 -63109 -175685
34879 -175685 -487261 -683864 -709600 -567016 -199014 176132 45978 -699612 -1356931 -1145678
34869 -1145678 -213155 550205 655239 471880 429069 321447 -149217 -541294 -83661 1104037
34859 1104037 1877757 1423068 250958 -515980 -473593 -133135 -64660 -318960 -594932 -592967
34849 -592967 -250224 105861 -26456 -672731 -1142677 -791556 163932 961055 1196401 981718
34839 981718 489068 -26946 29354 1008286 2176441 2351220 1568736 1190016 1887866 2450184
34829 2450184 1450654 -512119 -1377462 -301222 1320502 1804352 1240094 926751 1346148
34820 1346148 1687431 1363499 1010679 1416554 2092874 1833981 580638 -212349 585171
34811 585171 2266170 3160824 2575466 1260337 238571 -158150 -144109 21942 221191
34802 221191 464371 791044 1066727 1038293 770252 721681 1059304 1231785 712354 -105485
34792 -105485 -320568 336430 1312296 2007767 2189891 1817335 1081841 503604 397525 406579
34782 406579 134261 -100396 96006 222214 -351861 -949610 -301963 1308288 2138655
34773 2138655 1542394 892578 1346116 2206508 2433953 2350975 2582991 2505655 1292893 -294671
34763 -294671 -746942 46962 917146 1280299 1460330 1472497 1016815 551989 845048 1444216
34753 1444216 1154616 152471 -58791 837826 1298126 509062 -109659 763457 2010934
34744 2010934 1709243 89036 -934297 -630407 -36490 163543 522083 1274293 1531214
34735 1531214 785596 26435 420445 1651755 2449996 2270163 1681561 1437673 1816171
34726 1816171 2583970 3024237 2326448 620907 -656208 -229303 1290946 1992690 1066303
34717 1066303 -224525 -307101 740544 1618209 1674082 1519346 1844215 2355999 2233713
34708 2233713 1303770 358218 260079 937144 1460464 1128374 246696 -360616 -430071 -464080
34698 -464080 -865018 -1315950 -1257592 -655156 44281 531265 851181 1066828 1070894 848097
34688 848097 668278 782190 1000098 845872 250014 -162528 174738 841737 794815 -207755
34678 -207755 -1144747 -1061696 -244955 519262 1208513 2146148 2824644 2430155 1396321 1038207
34668 1038207 1486227 1452136 498065 2358 992740 2391386 2606570 1764952 1026049
34659 1026049 595140 -78264 -787701 -857294 -585167 -867795 -1541295 -1530539 -602938 376402
34649 376402 922898 1325245 1547874 1152430 474838 484373 1177965 1444440 873568 379620
34639 379620 603231 1017884 1155259 1406351 1938573 2061354 1445223 830726 709580 407729
34629 407729 -609665 -1561780 -1499793 -734073 -81976 485875 1349612 2103261 2083150 1535123
34619 1535123 1178747 1018641 610731 160895 327452 1089796 1672006 1524028 797968
34610 797968 60308 -25224 848947 2039632 2386280 1730152 1239952 1599553 1832854 907710
34600 907710 -401642 -554390 487912 1412277 1567313 1450342 1420972 1286172 1128733
34591 1128733 1342183 1817620 2131538 2434453 3083167 3593203 3212290 2412674 2404438 3106758
34581 3106758 3103539 1933490 936798 1201945 1958935 1822163 625416 -783446 -1743082
34572 -1743082 -1998985 -1447400 -451423 136562 -20361 -167107 504762 1692540 2466271
34563 2466271 2498224 2151275 1651228 876459 -102364 -854088 -1076018 -945006 -870129 -1003811
34553 -1003811 -1059340 -674739 18927 421612 255530 27200 307523 849561 981094 633515
34543 633515 301131 166921 86726 339054 1385731 2732215 3061097 1951378 618487
34534 618487 391963 1146431 1811368 1813809 1362122 791563 349611 355402 910024 1530312
34524 1530312 1563670 974318 424867 596495 1564062 2704839 3102535 2235397 448702
34515 448702 -1302289 -2187940 -1972903 -1052459 -299106 -491807 -1355154 -1505142 -111597
34506 -111597 1635660 1709741 -128089 -1974983 -2270078 -1508641 -1006531 -1042590 -1032259 -743231
34496 -743231 -398021 -17941 504142 913694 830630 363106 72896 435499 1457986 2501002
34486 2501002 2493237 1006585 -756488 -944845 624963 2112152 2144673 1575981 1884199
34477 1884199 2872894 3238650 2696728 2091169 1762364 1260057 597815 402497 650932
34468 650932 524922 -126310 -311556 600957 1854732 2397663 2247884 2086443 2071146 1834470
34458 1834470 1357256 1070478 1058830 756439 -261963 -1428804 -1505608 61308 2256420
34449 2256420 3320415 2572520 1091774 382180 727829 1244840 1231882 892725 803611
34440 803611 1186770 1790252 2161614 2010888 1514194 1171550 1201712 1328229 1351756 1461638
34430 1461638 1600528 1153324 5963 -661733 269476 2013535 2644198 1671220 501619
34421 501619 129310 -92962 -710927 -772003 516895 1913963 1669522 323732 55660
34412 55660 1258523 1746887 75353 -2077302 -2184388 -389980 947967 763661 489780
34403 489780 1447018 2673824 2423062 825819 -296787 37843 916565 1144143 783869
34394 783869 558182 590024 571307 677940 1363191 2359056 2782341 2413307 2108946 2570777
34384 2570777 3329443 3507160 3122693 2897532 2964065 2625915 1595563 710536 874867
34375 874867 1738131 2100607 1491857 695593 600607 1070051 1232571 564537 -589002 -1367399
34365 -1367399 -1102876 78204 1194040 1206231 60186 -1306336 -2059751 -2154240 -1820056
34356 -1820056 -1074996 -204428 -22618 -833565 -1578795 -966227 763037 2107172 2189312
34347 2189312 1403775 307217 -936988 -1867745 -1765486 -865593 -393693 -776815 -930474
34338 -930474 -111644 660602 189248 -819291 -711839 588424 1547129 1376663 930009
34329 930009 987660 1006241 234666 -859781 -1101577 -125245 1225184 1874308 1583835 1118592
34319 1118592 1396771 2357955 2877296 2142274 816140 205718 482977 619370 140579
34310 140579 -75108 784882 2101009 2621224 2111312 1413642 1121252 995023 714228
34301 714228 474853 509051 470186 -180056 -1222302 -1575579 -457193 1497960 2676706
34292 2676706 2169463 700018 -327600 -368506 44002 304640 360608 392038 474873 700322
34282 700322 1144074 1529109 1342189 509205 -405467 -886905 -997743 -974062 -676065 145187
34272 145187 1211670 1750457 1228211 -54432 -1096296 -1000275 130709 1148619 1047912
34263 1047912 175830 -207397 405548 1221600 1493222 1563301 1924767 2016389 1055255 -321508
34253 -321508 -575186 464920 1137397 283671 -1074629 -1273192 -355298 289849 152182
34244 152182 117719 772758 1490743 1624967 1527320 1678615 1620440 646598 -907732 -1951226
34234 -1951226 -2008676 -1561619 -1149661 -855705 -652205 -561385 -395450 50526 455048 210979
34224 210979 -670045 -1480422 -1796124 -1919588 -2106838 -1987187 -1188755 -100913 453717
34215 453717 106898 -737187 -1250063 -770496 556855 1631869 1377849 47805 -937136
34206 -937136 -621078 556496 1594253 1969939 1582574 483202 -834074 -1577135 -1589391
34197 -1589391 -1419396 -1041629 413121 2842461 4271983 3168559 854743 -33968 905128
34188 905128 1586697 687966 -655096 -874718 -122714 444196 368852 -62979 -687899 -1454766
34178 -1454766 -2010854 -2015834 -1584589 -987122 -286759 381371 669815 576862 678279 1354126
34168 1354126 2197622 2631271 2713406 2855003 3060152 2954513 2400860 1685529 1160657 914839
34158 914839 718893 285163 -199055 58052 1507631 3217597 3551046 2156243 540475
34149 540475 213178 939439 1453541 1321386 1257074 1841798 2731278 3199931 2948540 2244760
34139 2244760 1547018 1073979 680718 245046 103498 705899 1765286 2305643 1868730
34130 1868730 1177572 1157678 1700619 1921566 1386952 583514 290085 845475 1911198
34121 1911198 2699757 2631846 1980608 1605445 1891559 2360030 2518753 2527456 2661822 2734443
34111 2734443 2553700 2334339 2021699 895935 -1233034 -3004145 -2860634 -1162474 286522
34102 286522 744923 1202449 2306209 3083858 2543636 1403344 1061568 1508290 1499467 557978
34092 557978 -418090 -673627 -620960 -852211 -1002688 -431182 451940 554373 -209795 -592211
34082 -592211 205923 1249942 1174405 233879 -58295 740351 1266511 424139 -854185
34073 -854185 -847720 560480 1809795 1793771 1040898 628740 810407 1141372 1339614 1435545
34063 1435545 1358434 940414 359795 194370 786109 1641042 1759061 786525 -343046
34054 -343046 -390586 521967 857323 -336982 -1979568 -2246094 -938852 373107 501881
34045 501881 -109573 -543216 -776205 -1200223 -1501954 -971456 326392 1501985 1918803
34036 1918803 1659699 944270 -168857 -1282824 -1561335 -637825 748479 1526811 1503058
34027 1503058 1344777 1521142 1803349 1848497 1743603 1740858 1858990 2055644 2483694 3198081
34017 3198081 3796610 3736928 2936795 1779457 682248 11773 200241 1318845 2509931
34008 2509931 2545430 1310378 214952 608469 2075264 2887182 2091970 597265 -16113
33999 -16113 636162 1447924 1300161 410951 -42913 567996 1657575 2345956 2560777 2824065
33989 2824065 3278608 3519704 3311226 2868433 2341192 1575389 607507 -83569 -134416 229580
33979 229580 560013 737073 885645 988387 865590 418937 -236474 -744974 -648836 119830
33969 119830 914938 1028813 714834 932114 1866229 2427274 1697520 257982 -588623
33960 -588623 -487724 -204470 -378350 -835420 -1095103 -940324 -392073 440494 1357599 2148376
33950 2148376 2670013 2708971 1975203 529438 -941955 -1593213 -1103113 222919 1766887
33941 1766887 2827930 2929336 2291763 1760073 1910340 2445936 2756450 2743099 2691435 2598333
33931 2598333 2085194 903343 -694621 -1939202 -1910312 -418193 1386549 1992357 1391248
33922 1391248 1146920 2164031 3348365 3240178 2062884 1121706 926700 1100455 1536539
33913 1536539 2310151 2822706 2391144 1482486 1097961 1156025 828852 266306 426599 1189352
33903 1189352 1280802 339935 -533539 -699104 -838971 -1310841 -1261626 -289396 479550 129452
33893 129452 -428631 155575 1596800 2563941 2641456 2453763 2325895 2006056 1469592 1035986
33883 1035986 837604 833993 1045538 1234431 896317 201093 270670 1693111 3380994 3846118
33873 3846118 3076982 2177845 1655763 1153379 495435 -124843 -756460 -1444270 -1631236
33864 -1631236 -873005 119522 327855 111032 722481 2160452 2907889 2101919 685421
33855 685421 -41315 136246 849821 1933210 2965651 3023036 1836368 564359 519867
33846 519867 1537063 2360049 2292570 1699770 1116958 653510 292748 154729 284282 530177
33836 530177 764084 1019415 1354637 1701316 1876789 1737860 1390485 1203783 1440995 1911549
33826 1911549 2215857 2265842 2228108 2018734 1357451 402586 -231385 -329172 -399999 -783211
33816 -783211 -974603 -421157 427000 619548 113250 -116308 509994 1362920 1545222 1063818
33806 1063818 561256 314079 182805 345498 1218011 2453182 2838895 1777144 301449
33797 301449 -160594 304181 386426 -323271 -666768 217016 1449848 1708043 1176856 1054874
33787 1054874 1505851 1443298 483521 -138876 752044 2499540 3336687 2520902 1035878
33778 1035878 274431 618189 1414004 1901515 1874095 1599038 1408686 1484035 1868097 2436940
33768 2436940 2844476 2746672 2190298 1574923 1147671 813556 533393 465778 468611 -5536
33758 -5536 -1045907 -1832850 -1730164 -1373154 -1746686 -2471089 -2175021 -636269 676213
33749 676213 636271 -61820 -174123 267182 380343 72712 112352 756349 1385381 1664549
33739 1664549 2168525 3388675 4683928 4826922 3455501 1517570 201254 -217182 -206932
33730 -206932 18726 689880 1564423 1643262 507518 -621504 -246974 1162861 1606314
33721 1606314 475884 -367505 704053 2532568 2703709 921252 -742503 -798649 49295
33712 49295 565010 782423 1315569 1914737 1840868 1193848 796136 861196 708125 -47828
33702 -47828 -805589 -849585 -323542 176557 566044 1173774 1889197 2192317 2111976 2322417
33692 2322417 2909993 2884886 1685864 496006 929584 2706042 3881830 3406985 2145710
33683 2145710 1117098 207503 -665237 -583656 894902 2369525 2238463 1051343 637122
33674 637122 1297323 1591664 867357 223433 547076 1168050 1188160 865368 816215 857713
33664 857713 534385 6412 -402505 -826917 -1242755 -945598 451516 2066304 2709794
33655 2709794 2366065 1855433 1456539 817668 -47706 -653197 -843587 -890907 -838690 -460953
33645 -460953 188507 809711 1289514 1496399 952416 -480091 -1836894 -1930737 -886227
33636 -886227 164755 822340 1697652 2847016 3241789 2367551 1270769 1191348 1880467
33627 1880467 2102097 1329378 195520 -432017 -186300 767934 1863081 2372294 1944102
33618 1944102 912585 -46778 -424722 -55884 819404 1581453 1740057 1508212 1434534
33609 1434534 1509896 1311984 1016047 1295859 2003949 2065915 1185643 494631 736252 994108
33599 994108 358494 -238122 582573 2126171 2298891 601775 -1237391 -1725973 -1146290
33590 -1146290 -368406 352504 852497 687833 36811 -98053 667608 1369686 1098935
33581 1098935 250136 -335310 -558222 -552489 105086 1553156 2654434 2119779 406646
33572 406646 -618577 48035 1472091 2078967 1352371 86365 -593041 -321318 202899
33563 202899 109827 -409365 -276935 820446 1713890 1303800 105238 -642926 -777456
33554 -777456 -970905 -1155111 -617791 378530 549280 -463362 -1343437 -888351 458313
33545 458313 1472091 1643913 1142310 134766 -1016440 -1541467 -1133153 -558313 -585713
33536 -585713 -770913 -207971 922671 1628156 1708158 1896803 2320405 2034582 590191
33527 590191 -934412 -1226042 -426258 248484 167489 -208512 -263078 96679 674326 1217223
33517 1217223 1308481 637639 -385126 -792570 -164502 802461 1142455 689824 -56965
33508 -56965 -771133 -1423876 -1737012 -1191794 201994 1578285 1981637 1324397 408820
33499 408820 75930 423500 841700 817966 632827 981735 1836027 2191525 1393236 228191
33489 228191 -86232 295572 133023 -775839 -1021926 291624 1970680 2272887 1289573
33480 1289573 612874 981937 1467673 1053688 9523 -646796 -391261 449457 1214032
33471 1214032 1575388 1854333 2559445 3436539 3423740 2061409 441375 -83795 259526
33462 259526 215203 -325926 -88103 1405122 2796968 2758099 1805178 1379573 1915130 2748300
33452 2748300 3324839 3509363 3115204 2123391 1173165 941577 1124552 860955 141414
33443 141414 -72315 681553 1556497 1483696 544136 -258780 -348487 -176266 -425182 -1026382
33433 -1026382 -1311210 -999365 -535773 -281650 57080 672819 856045 -116506 -1543433
33424 -1543433 -1934828 -1185120 -807074 -1568036 -2289275 -1850245 -1022082 -986964 -1187689 -393199
33414 -393199 875237 1026302 202319 203204 1381790 1839356 548997 -747558 -157053
33405 -157053 1430932 1759432 503634 -705725 -989842 -1051554 -1353099 -1248153 -387479
33396 -387479 419263 448925 141784 187136 338643 -27834 -740435 -1104162 -1049644 -1123770
33386 -1123770 -1354433 -960098 475219 2081918 2464871 1242174 -517059 -1375900 -825791
33377 -825791 483390 1523844 1716263 1130230 192307 -628285 -976960 -747314 -206915
33368 -206915 128897 -48325 -498292 -710220 -561366 -477943 -787549 -1142922 -927427 -155421
33358 -155421 428325 245461 -433793 -853386 -569597 234632 965981 1022341 288375 -587848
33348 -587848 -716018 61167 1052821 1705382 2143397 2439976 2105177 992935 73139
33339 73139 305375 1128805 1182501 326826 -287149 -159487 -52251 -312184 -24380 1347047
33329 1347047 2662491 2533869 1201834 -112251 -1017696 -1896499 -2572903 -2438101 -1738504
33320 -1738504 -1418484 -1600845 -1425843 -613788 -17005 -188226 -448415 -8516 807481
33311 807481 1167815 941241 594245 363161 253043 511114 1321568 2145291 2077120 969457
33301 969457 -300546 -835653 -620360 -246304 -41379 211655 735585 1245331 1235414 722847
33291 722847 325892 392164 420819 -184647 -1063123 -1288102 -755578 -361180 -588372 -775469
33281 -775469 -279026 426852 593167 528598 1061852 1950447 1961315 686560 -692408 -860731
33271 -860731 129744 1280173 1961362 2215912 2150815 1723393 1068748 526451 256970 111842
33261 111842 -86973 -326665 -429449 -162499 555788 1412532 1887391 1928162 2150063 2927718
33251 2927718 3540015 2894457 1097378 -441733 -704203 -128688 428384 981774 1814804
33242 1814804 2208075 1093018 -1008484 -2015928 -844778 1053840 1536361 445680
33234 445680 -550607 -370488 398596 817770 869178 978727 1081356 803628 173790 -385504
33224 -385504 -580953 -425066 -91330 134262 -8119 -381930 -457647 19272 599924 708844
33214 708844 439575 380731 782240 1312007 1613229 1724744 1885285 2184999 2463552 2386745
33204 2386745 1689155 565000 -281006 -291267 260072 560447 248203 -228088 -305128 -11556
33194 -11556 186207 -23562 -543702 -992844 -916475 -108348 1029570 1627254 1178999 205464
33184 205464 -219048 335612 1204454 1522356 1283006 1135685 1261833 1043699 106887 -851762
33174 -851762 -907405 -296706 -113623 -564728 -505256 781424 2216270 2251531 1013329 -6369
33164 -6369 -170131 -325099 -1017344 -1378720 -539781 788549 1152068 272182 -828527 -1328798
33154 -1328798 -1273282 -839295 20972 941021 1019135 -110063 -1593903 -2266551 -1898380
33145 -1898380 -1101194 -332269 413423 1065363 1285708 969710 480255 156268 -59183
33136 -59183 -218383 83804 1275518 2952999 3926992 3370974 1707846 108606 -763688
33127 -763688 -1213226 -1721165 -2062764 -1529519 48061 1846472 2800154 2632650 1915084
33118 1915084 1238936 721540 367883 401733 846221 1144554 800241 237574 309470 903831
33108 903831 882809 -205022 -1166279 -680742 766940 1444035 649155 -556883 -940597
33099 -940597 -428441 438649 1423066 2332257 2552049 1687498 380795 -241408 129218
$$ [...]
##END NTUPLES=NMR SPECTRUM
##END=
