##TITLE=31Pdec_SR120_3
 , 24 sc
 6.4.2022
##JCAMPDX= 6.0         $$ Bruker NMR JCAMP-DX V2.0
##DATA TYPE= NMR SPECTRUM
##DATA CLASS= NTUPLES
##ORIGIN= UXNMR, Bruker Analytische Messtechnik GmbH
##OWNER= root
$$ XWIN-NMR		Version 3.5
$$ Thu Apr  7 10:35:33 2022 Russian Standard Time (UT+4h)  she@DPX200
##.OBSERVE FREQUENCY= 81.013821
##.OBSERVE NUCLEUS= ^31P
##.ACQUISITION MODE= SIMULTANEOUS
##.ACQUISITION SCHEME= undefined
##.AVERAGES= 24
##.DIGITISER RES= 16
##SPECTROMETER/DATA SYSTEM= spect
##.PULSE SEQUENCE= zgpg30
##.SOLVENT NAME= CDCl3
##.SHIFT REFERENCE= (INTERNAL, CDCl3, 0, 248.564)
##AUDIT TRAIL= $$ (NUMBER, WHEN, WHO, WHERE, WHAT)
$$ ##TITLE= Audit trail, XWIN-NMR		Version 3.5
$$ ##JCAMPDX= 5.01
$$ ##ORIGIN= Bruker BioSpin GmbH
$$ ##OWNER= she
$$ F:/spectra/data/she/nmr/P31/1/pdata/1/auditp.txt
$$ ##AUDIT TRAIL=  $$ (NUMBER, WHEN, WHO, WHERE, WHAT)
(   1,<2022-04-07 10:34:41.17 +0400>,<she>,<DPX200>,
      <created by zg, POWCHK disabled, PULCHK disabled
       configuration hash MD5:
       00 E9 B6 7A A2 85 ED C7 34 08 36 98 17 FE 4E 26
       data hash MD5: 32K
       E1 5B 63 78 FE DA 93 08 99 E4 3A E4 D9 35 3C BA>)
(   2,<2022-04-07 10:34:43.46 +0400>,<she>,<DPX200>,
      <Start of raw data processing
       efp BC_mod = 2 LB = 1 FT_mod = 6 PKNL = 1 PHC0 = -9605.103 PHC1 = 258.4757 SI = 64K 
       data hash MD5: 64K
       BA 93 49 F8 B7 D3 BD 42 20 7D 31 4D 68 77 34 81>)
(   3,<2022-04-07 10:35:01.03 +0400>,<she>,<DPX200>,
      <pk PHC0 = -58.54829 PHC1 = 122.4 
       data hash MD5: 64K
       29 08 D0 4D D7 39 DA 16 09 58 AF 4D 13 3B B6 EC>)
(   4,<2022-04-07 10:35:04.65 +0400>,<she>,<DPX200>,
      <abs ABSG = 5 
       data hash MD5: 64K
       AC 39 C3 A6 8B 82 0A 57 5A F7 C0 A4 A1 2E F9 41>)
$$ ##END=
$$ 
$$ hash MD5
$$ AB CB 38 F3 BF 6A 67 76 A2 06 5E 91 4E FB 01 97
##$RELAX= 
##$RELAX= 
##$RELAX= 
##$RELAX= 
##$RELAX= 
##$RELAX= 
##$RELAX= 
##$RELAX= 
$$ Bruker specific parameters
$$ --------------------------
##$DU= <F:/spectra>
##$EXPNO= 1
##$NAME= <P31>
##$PROCNO= 1
##$TYPE= <nmr>
##$USER= <she>
##$AMP= (0..31)
100 100 100 100 100 100 100 100 100 100 100 100 100 100 100 100 100 100 
100 100 100 100 100 100 100 100 100 100 100 100 100 100 
##$AQSEQ= 0
##$AQ_mod= 1
##$AUNM= <au_zg>
##$AUTOPOS= <>
##$BF1= 81.014009
##$BF2= 200.13
##$BF3= 200.13
##$BF4= 200.13
##$BF5= 200.13
##$BF6= 200.13
##$BF7= 200.13
##$BF8= 200.13
##$BYTORDA= 1
##$CFDGTYP= 0
##$CFRGTYP= 5
##$CHEMSTR= <none>
##$CNST= (0..31)
1 1 145 1 1 1 1 1 1 1 1 1 1 1 1 1 1 1 1 1 1 1 1 1 1 1 1 1 1 1 1 1 
##$CPDPRG= <waltz16>
##$CPDPRG1= <>
##$CPDPRG2= <waltz16>
##$CPDPRG3= <>
##$CPDPRG4= <mlev>
##$CPDPRG5= <mlev>
##$CPDPRG6= <mlev>
##$CPDPRG7= <mlev>
##$CPDPRG8= <mlev>
##$CPDPRGB= <>
##$CPDPRGT= <>
##$D= (0..31)
0 1 0 0 0 0 0 0 0 0 0 0.03 2e-05 3e-06 0 0 0 0 0 0 0 0 0 0 0 0 0 0 0 0 
0 0 
##$DATE= 1649313280
##$DBL= (0..7)
120 120 120 11 120 120 24 19 
##$DBP= (0..7)
150 150 150 150 150 150 150 150 
##$DBP07= 0
##$DBPNAM0= <>
##$DBPNAM1= <>
##$DBPNAM2= <>
$$ [...]
##$SUBNAM3= <"">
##$SUBNAM4= <"">
##$SUBNAM5= <"">
##$SUBNAM6= <"">
##$SUBNAM7= <"">
##$SUBNAM8= <"">
##$SUBNAM9= <"">
##$SW= 501.771253377433
##$SWIBOX= (0..15)
0 1 3 0 0 0 0 0 0 0 0 0 0 0 0 0 
##$SW_h= 40650.406504065
##$TD= 32768
##$TD0= 1
##$TE= 0
##$TE2= 300
##$TE3= 300
##$TEG= 300
##$TL= (0..7)
0 120 53 12 22 120 120 120 
##$TP= (0..7)
150 150 150 150 150 150 150 150 
##$TP07= 0
##$TPNAME0= <>
##$TPNAME1= <>
##$TPNAME2= <>
##$TPNAME3= <>
##$TPNAME4= <>
##$TPNAME5= <>
##$TPNAME6= <>
##$TPNAME7= <>
##$TPOAL= (0..7)
0.5 0.5 0.5 0.5 0.5 0.5 0.5 0.5 
##$TPOFFS= (0..7)
0 0 0 0 0 0 0 0 
##$TUNHIN= 0
##$TUNHOUT= 0
##$TUNXOUT= 0
##$USERA1= <user>
##$USERA2= <user>
##$USERA3= <user>
##$USERA4= <user>
##$USERA5= <user>
##$V9= 5
##$VALIST= <valist>
##$VCLIST= <CCCCCCCCCCCCCCC>
##$VD= 0
##$VDLIST= <DDDDDDDDDDDDDDD>
##$VPLIST= <PPPPPPPPPPPPPPP>
##$VTLIST= <TTTTTTTTTTTTTTT>
##$WBST= 1024
##$WBSW= 4
##$XGAIN= (0..3)
0 0 0 0 
##$XL= 0
##$YL= 0
##$YMAX_a= 15978
##$YMIN_a= -20570
##$ZGOPTNS= <>
##$ZL1= 120
##$ZL2= 120
##$ZL3= 120
##$ZL4= 120
##$ABSF1= 248.5645
##$ABSF2= -253.2056
##$ABSG= 5
##$ABSL= 3
##$ALPHA= 0
##$AQORDER= 0
##$ASSFAC= 0
##$ASSFACI= 0
##$ASSFACX= 0
##$ASSWID= 0
##$AUNMP= <proc_1d>
##$AZFE= 0.1
##$AZFW= 0.5
##$BCFW= 0
##$BC_mod= 2
##$BYTORDP= 0
##$COROFFS= 0
##$CY= -3
##$DATMOD= 1
##$DC= 0
##$DFILT= <>
##$DTYPP= 0
##$F1P= 0
##$F2P= 0
##$FCOR= 1
##$FTSIZE= 65536
##$FT_mod= 6
##$GAMMA= 0
##$GB= 0
##$INTBC= 1
##$INTSCL= 5.30512e-09
##$ISEN= 30
##$LB= 1
##$LEV0= 0
##$LPBIN= 0
##$MAXI= 10000
##$MC2= 0
##$MEAN= 0
##$ME_mod= 0
##$MI= 50
##$NCOEF= 0
##$NC_proc= -6
##$NLEV= 6
##$NOISF1= 182.463
##$NOISF2= 159.3651
##$NSP= 0
##$NTH_PI= 0
##$NZP= 0
##$OFFSET= 248.5645
##$PC= 4
##$PHC0= -9663.65
##$PHC1= 380.8757
##$PH_mod= 1
##$PKNL= yes
##$PPARMOD= 0
##$PSCAL= 0
##$PSIGN= 0
##$REVERSE= no
##$SF= 81.014009
##$SI= 65536
##$SIGF1= 159.3651
##$SIGF2= -187.1042
##$SINO= 113.3802
##$SIOLD= 16384
##$SREGLST= <1H.CDCl3>
##$SSB= 0
##$STSI= 65536
##$STSR= 0
##$SW_p= 40650.406504065
##$SYMM= 0
##$S_DEV= 0
##$TDeff= 32768
##$TDoff= 0
##$TI= <>
##$TILT= no
##$TM1= 0
##$TM2= 0
##$TOPLEV= 0
##$USERP1= <user>
##$USERP2= <user>
##$USERP3= <user>
##$USERP4= <user>
##$USERP5= <user>
##$WDW= 1
##$XDIM= 65536
##$YMAX_p= 343831824
##$YMIN_p= -10529213
$$ End of Bruker specific parameters
$$ ---------------------------------
##NTUPLES= NMR SPECTRUM
##VAR_NAME=  FREQUENCY,     SPECTRUM/REAL,   SPECTRUM/IMAG
##SYMBOL=    X,             R,               I
##VAR_TYPE=  INDEPENDENT,   DEPENDENT,       DEPENDENT
##VAR_FORM=  AFFN,          ASDF,            ASDF
##VAR_DIM=   65536,         65536,           65536
##UNITS=     HZ,            ARBITRARY UNITS, ARBITRARY UNITS
##FACTOR=    0.620285442955139, 1,           1
##FIRST=     20137.2065510759, 0,            0
##LAST=      -20513.1999529892, 0,           0
##MIN=       -20513.1999529892, -10529213,   0
##MAX=       20137.2065510759, 343831824,    0
$$ Real data points
##PAGE= N=1
##DATA TABLE= (X++(R..R)), XYDATA
$$ [...]
$$ plain form
40828 1720740 1474395 926435 561407 474475 638776 904122 832229 102088 -964810 -1659158
40818 -1659158 -1568977 -794095 271389 1125849 1394551 1117681 624020 96376 -398142
40809 -398142 -538953 -50968 553415 276958 -1029510 -2287131 -2470467 -1677448 -631195
40800 -631195 222833 741445 844258 708842 704664 803527 608310 199853 193963 615943
40790 615943 618867 -127151 -683658 -246173 543719 634263 201613 156971 545712 653249
40780 653249 432852 576542 1137446 1237668 449630 -455781 -588473 -106031 186848 -7017
40770 -7017 -193563 191501 1106009 1965516 2229028 1809534 926632 -175337 -1093550 -1149299
40760 -1149299 -47327 1378003 1831226 1154494 494148 600640 871001 604613 249630
$$ packed form
40828A720740k46345n47960l65028q6932J64301K65346p1893p30141j066898o94348
40818a659158R0181P74882J065484Q54460K68702k76870m93661n27644m94518
40809c98142j40811M87985O04383k76457j306468j257621j83336P93019J046253
40800f31195Q54028N18612J02813j35416m178R8863j95217m08457n890M21980
40790F15943K924p46018n56507M37485P89892R0544m32650m4642L88741J07537
40780F53249k20397J43690N60904J00222p88038r05411j32692M82442K92879j93865
40770g017j86546L85064R14508Q59507K63512m19494q82902j101969r18213n5749
40760a149299J101972J425330M53223o76732o60346J06492K70361k66388l54983
$$ plain form
40751 249630 523096 1065625 1062299 687317 768452 1292563 1399901 797655 116945 -181541
40741 -181541 -267189 -194801 317803 1102681 1410508 952272 377523 350860 774748 1290441
40731 1290441 1917493 2668740 2994681 2275577 782014 -354126 -304791 503287 837521
40722 837521 137474 -705060 -430426 869369 1816582 1664610 1245636 1483259 1896684
40713 1896684 1546008 738354 539538 1000438 1227745 1066096 1291461 2010874 2261254
40704 2261254 1573804 686644 236281 -43794 -252933 268668 1591743 2399136 1695938
40695 1695938 512147 648044 2192835 3488683 3356563 2291470 1463754 1431537 1957552
40686 1957552 2422435 2266755 1453383 528850 -22132 -257375 -340657 -99056 473776 787236
$$ packed form
40751B49630K73466N42529l326l74982Q1135N24111J07338o02246o80710k98486
40741a81541q5648P2388N12604P84878L07827m58236n74749k6663M23888N15693
40731A290441O27052P51247L25941p19104j493563j136140M9335Q08078L34234
40722H37521p00047q42534K74634J299795R47213j51972m18974K37623M13425
40713A896684l50676q07654j98816M60900K27307j61649K25365P19413K50380
40704B261254o87450q87160m50363k80075k09139N21601J323075Q07393p03198
40695A695938j183791J35897J544791J295848j32120j065093q27716l2217N26015
40686A957552M64883j55680q13372r24533n50982k35243q3282K41601N72832L13460
$$ plain form
40676 787236 461232 126001 527033 1191201 1070353 331413 228805 1045992 1498617 753505
40666 753505 -139352 224226 1447160 1819631 613381 -1125168 -2018494 -1742793 -842915
40657 -842915 126282 931177 1525777 1924168 2108490 1977904 1508028 955124 725140 1009122
40647 1009122 1636175 2204163 2249100 1508110 314515 -427372 -64436 1048478 1991778
40638 1991778 2413704 2714458 3089619 3074848 2357868 1430587 911771 694276 387434 190177
40628 190177 493454 851742 387887 -660499 -870810 370142 1698346 1436217 -142814
40619 -142814 -1178826 -619569 714710 1519853 1568410 1511696 1762542 2120964 2240614 2009260
40609 2009260 1491220 752199 -161229 -1056852 -1459166 -916605 310954 1168089 910595
$$ packed form
40676G87236l26004l35231M01032O64168j20848p38940j02608Q17187M52625p45112
40666G53505q92857L63578J222934L72471j206250j738549q93326K75701Q99878
40657h42915R69197Q04895N94600L98391J84322j30586m69876n52904k29984K83982
40647A009122O27053N67988M4937p40990j193595p41887L62936J112914R43300
40638A991778M21926L00754L75161j4771p16980r27281n18816k17495l06842j97257
40628A90177L03277L58288m63855j048386k10311J240952J328204k62129j579031
40619a42814j036012N59257J334279Q05143M8557n6714K50846L58422J19650k31354
40609B009260n18040p39021r13428q95623m02314N42561J227559Q57135k57494
$$ plain form
40600 910595 139207 86305 901114 1452996 1055788 483205 689266 1311915 1342082 746687
40590 746687 362494 445695 509480 618575 1540368 3144240 3874251 2759488 1084867
40581 1084867 843676 1958920 2365318 880882 -1248110 -2086134 -1273567 109250 1152198
40572 1152198 1701659 1786498 1432444 1013470 1011088 1278252 1116927 270567 -604934 -649372
40562 -649372 322898 1702257 2515549 2041915 510669 -783898 -656476 551040 1361647
40553 1361647 1146002 876878 1447244 2158994 1830992 788647 519207 1496695 2555753
40544 2555753 2649997 2188133 2138360 2613092 2979858 2855436 2359884 1698025 1064210 816101
40534 816101 1261047 2255331 3264827 3791583 3645187 3008940 2423823 2466930 3145493 3705635
$$ packed form
40600I10595p71388n2902Q14809N51882l97208n72583K06061O22649L0167n95395
40590G46687l84193Q3201O3785J09095R21793J603872P30011j114763j674621
40581A084867k41191J115244M06398j484436k128992q38024Q12567J382817J042948
40572A152198N49461Q4839l54054m18974k382K67164j61325q46360q75501m4438
40562f49372R72270J379359Q13292m73634j531246j294567J27422J207516Q10607
40553A361647k15645k69124N70366P11750l28002j042345k69440R77488J059058
40544B555753R4244m61864m9773M74732L66766j24422m95552o61859o33815k48109
40534H16101M44946R94284J009496N26756j46396o36247n85117M3107O78563N60142
$$ plain form
40524 3705635 3287861 1796283 74020 -743101 -160904 1147465 1859031 1413263 810556
40515 810556 1467145 3287828 4587914 4139798 2565894 1313554 961562 1102877 1269280
40506 1269280 1264803 1047184 947483 1556805 2745796 3371496 2778674 1968300 2182205 2871973
40496 2871973 2476620 939088 -151105 6742 487798 514543 617227 1192039 1433241
40487 1433241 759706 27142 124986 491809 365568 478362 1870523 3742414 4314311
40478 4314311 3535276 3147012 3992297 4915250 4675299 3531066 2463637 2026694 2384068
40469 2384068 3339921 3924634 3134829 1563889 1076403 2268500 3520842 3355618 2431001
40460 2431001 2107089 2234539 1810474 950709 565584 556786 23649 -834046 -657633 915071
$$ packed form
40524C705635m17774j491578j722263q17121N82197J308369P11566m45768o02707
40515H10556O56589J820683J300086m48116j573904j252340l51992J41315J66403
40506A269280m477k17619r9701O09322J188991O25700n92822q10374K13905O89768
40496B871973l95353j537532j090193J57847M81056K6745J02684N74812K41202
40487A433241o73535p32564R7844L66823j26241J12794J392161J871891N71897
40478D314311p79035l88264Q45285R22953k39951j144233j067429m36943L57374
40469B384068R55853N84713p89805j570940m87486J192097J252342j65224r24617
40460B431001l23912J27450m24065q59765l85125q798n33137q57695J76413J572704
$$ plain form
40450 915071 2437796 2622941 2082871 2342673 3767849 5237412 5608608 4916001 4103927
40441 4103927 3891076 4096626 4135299 3951395 3981911 4189386 3918163 3116118 2830749 3669577
40431 3669577 4521089 3956714 2373895 1376272 1319824 1062047 218302 -25909 1087603
40422 1087603 2562330 3167665 3095946 3151901 3293872 3051544 2639778 2569356 2656473 2374155
40412 2374155 1779318 1275194 904966 659749 946053 1875532 2648574 2628490 2476995 3088657
40402 3088657 3926832 3808975 2993248 2850102 3480433 3443426 2292230 1628081 2667942
40393 2667942 4197378 4263071 2920638 1842525 1752866 1768913 1234947 849623 1545467
40384 1545467 3119976 4490586 4847268 4205326 3145929 2315238 2032828 2201608 2556768
$$ packed form
40450I15071J522725J85145n40070K59802J425176J469563L71196o92607q12074
40441D103927k12851K05550L8673j83904L0516K07475k71223q02045k85369Q38828
40431C669577Q51512n64375j582819r97623n6448k57777q43745k44211J113512
40422A087603J474727O05335p1719N5955J41971k42328m11766p0422Q7117k82318
40412B374155n94837n04124l70228k45217K86304R29479P73042k0084j51495O11662
40402C088657Q38175j17857q15727j43146O30331l7007j151196o64149J039861
40393B667942J529436O5693j342433j078113q9659J6047n33966l85324O95844
40384A545467J574509J370610L56682o41942j059397q30691k82410J68780L55160
$$ plain form
40375 2556768 2870558 2863928 2282375 1382298 975543 1441931 1956546 1413120 27910 -790164
40365 -790164 -285516 777340 1420288 1758022 2356409 2995670 3004276 2492498 2309161 2796001
40355 2796001 3387302 3561774 3498192 3565105 3724040 3714664 3432428 2931946 2410577 2282475
40345 2282475 2843778 3755614 4293345 4193681 3794443 3342129 2824579 2561059 3098680 4199206
40335 4199206 4774630 4309588 3548972 3243973 3122789 2847450 3028964 4182541 5418361
40326 5418361 5487620 4687730 4417205 5132675 6083620 6879047 7858741 8876906 9216014
40317 9216014 9029725 9501285 11075532 12745344 13657305 14311023 15509232 17091919 18415716
40308 18415716 19301884 19890144 20232108 20490486 20837772 20848343 19872140 18314198 17463676
$$ packed form
40375B556768L13790o630n81553r00077m06755M66388N14615n43426j385210q18074
40365g90164N04648J062856O42948L37734N98387O39261Q606n11778j83337M86840
40355B796001N91301J74472o3582O6913J58935r376k82236n00482n21369j28102
40345B282475N61303R11836N37731r9664l99238m52314n17550k63520N37621J100526
40335D199206N75424m65042p60616l04999j21184k75339J81514J153577J235820
40326E418361O9259p99890k70525P15470R50945P95427R79694J018165L39108
40317I216014j86289M71560J574247J669812R11961O53718J198209J582687J323797
40308A8415716Q86168N88260L41964K58378L47286J0571r76203j557942q50522
$$ plain form
40299 17463676 17613221 17539218 16470199 15332314 15187438 15593798 15563669 15202514 15337345
40290 15337345 16269621 17771921 19525116 20811863 20765290 19695098 19006250 18994820 18199328
40281 18199328 15996355 14054228 13614998 13162269 10980710 8405462 7781680 8392029 7565278
40272 7565278 5224084 4004137 4850109 5769067 5461151 5054786 5335900 5230093 4314040
40263 4314040 4092094 5207889 5874274 4848887 3679341 3989873 4636233 3855495 2450457
40254 2450457 2267122 2874697 2506348 1449889 1725234 3658477 5316069 5488306 5027855
40245 5027855 4855757 4594381 3815061 3080139 2981984 3213701 3181161 2779018 2260112 2000874
40235 2000874 2442958 3554201 4469198 4493384 4248197 4825060 6022257 6614096 6286892
$$ packed form
40299A7463676J49545p4003j069019j137885j44876M06360l0129l61155J34831
40290A5337345R32276J502300J753195J286747m6573j070192o88848j1430p95492
40281A8199328k202973j942127m39230m52729k181559k575248o23782O10349q26751
40272G565278k341194j219947Q45972R18958l07916m06365K81114j05807r16053
40263D314040k21946J115795O66385j025387j169546L10532O46360p80738j405038
40254B450457j83335O07575l68349j056459K75345J933243J657592J72237m60451
40245E027855j72098k61376p79320p34922r8155K31717l2540m02143n18906k59238
40235B000874M42084J111243R14997K4186k45187N76863J197197N91839l27204
$$ plain form
40226 6286892 5998543 6310278 6712534 6919257 7488268 8591825 9380793 9334282 9257331 10108352
40216 10108352 11646234 13116729 14624860 16905441 20234015 24532220 30164398 37384920
40208 37384920 44775233 49240194 48319563 42336796 33971689 25969085 19600549 15027735
40200 15027735 12256683 11176315 11060811 10830494 9986442 8880915 8028635 7656818 7968276
40191 7968276 9098328 10490619 11069301 10589210 10180444 10912219 12437357 13830712 15130673
40182 15130673 17006503 19381960 21662783 24146308 27896531 33219918 39658839 47620467
40174 47620467 58106419 69656086 77026611 75034669 63860799 49304339 37445481
40167 37445481 29872043 24363212 19036504 14500768 12096575 11458046 10834361 9322894
$$ packed form
40226F286892k88349L11735M02256K06723N69011J103557P88968m6511p6951Q51021
40216A0108352J537882J470495J508131K280581L328574M298205N632178P220522
40208C7384920P390313M464961r20631n982767q365107q002604o368536m572814
40200A5027735k771052j080368j15504k30317q44052j105527q52280l71817L11458
40191G968276J130052J392291N78682m80091m08766P31775J525138J393355J299961
40182A5130673J875830K375457K280823K483525L750223N323387O438921P961628
40174D7620467J0485952J1549667P370525j991942j1173870j4556460j1858858
40167C7445481p573438n508831n326708m535736k404193o38529o23685j511467
$$ plain form
40159 9322894 7638299 6592994 5918177 5121273 4563178 4747564 5117109 4635125 3357855
40150 3357855 2433134 2536184 3173206 3607075 3666252 3499661 3277010 3326398 3930339 4837320
40140 4837320 5559519 6162198 7028616 7846978 7801067 7032640 6958981 8620647 11427151
40131 11427151 14024501 15805407 17214333 19264471 23066910 28841648 34687249 37235214
40123 37235214 34615821 28423328 21994529 17215673 13808089 11091963 9079837 7825038
40115 7825038 6894735 5939531 5115170 4625864 4353957 4144702 3980901 3697525 2999404
40106 2999404 1992457 1279378 1245714 1563509 1684492 1589247 1736451 2358861 3074972 3273634
40096 3273634 2802970 2192947 2135084 2771403 3626564 4240180 4633870 5045469 5464338 5670740
$$ packed form
40159I322894j684595j045305o74817p96904n58095J84386L69545m81984j277270
40150C357855r24721J03050O37022M33869N9177j66591k22651M9388O03941R06981
40140D837320P22199O02679Q66418Q18362m5911p68427p3659J661666K806504
40131A1427151K597350J780906J408926K050138L802439N774738N845601K547965
40123C7235214k619393o192493o428799m778856l407584k716126k012126j254799
40115G825038r30303r55204q24361m89306k71907k09255j63801k83376o98121
40106B999404j006947p13079l3664L17795J20983r5245J47204O22410P16111J98662
40096C273634m70664o10023n7863O36319Q55161O13616L93690M11599M18869K06402
$$ plain form
40086 5670740 5550832 5102411 4288659 3231464 2475528 2641498 3665306 4656912 4777473
40077 4777473 4208817 4048547 5149706 7172361 8952828 9747242 9789475 9564286 9075306
40068 9075306 8294348 7865729 8530073 9978833 11184649 11940482 13053527 14647445 15332818
40059 15332818 13867912 10917692 8279482 6868716 6323057 6118049 6040288 5773604 5027289
40050 5027289 4103007 3571414 3423430 3218496 2888875 2619738 2198220 1477957 1284495
40041 1284495 2609791 4838068 6077637 5574281 4547781 4211677 4315339 4356097 4870255
40032 4870255 6379042 8085847 8910400 9088087 9463582 9788764 9107467 7497192 6057978
40023 6057978 5271547 4630368 3902779 3547567 3716060 3948550 4084991 4466097 5008426
$$ packed form
40086E670740j19908m48421q13752j057195p55936J65970J023808R91606J20561
40077D777473n68656j60270J101159K022655J780467P94414M2233k25189m88980
40068I075306p80958m28619O64344J448760J205816P55833J113045J593918O85373
40059A5332818j464906k950220k638210j410766n45659k05008p7761k66684p46315
40050E027289r24282n31593j47984k04934l29621k69137m21518p20263j93462
40041A284495J325296K228277J239569n03356j026500l36104J03662M0758N14158
40032D870255J508787J706805Q24553J77687L75495L25182o81297j610275j439214
40023F057978p86431o41179p27589l55212J68493K32490J36441L81106N42329
$$ plain form
40014 5008426 5096651 4682201 4483030 4729364 4708729 4027681 3379742 3489563 4132085 4764901
40004 4764901 5297111 5613830 5204049 4042576 3084546 3024802 3230936 2837301 2314522
39995 2314522 2878022 4644122 6350157 6774900 5718911 3876129 2505230 2852648 4918045
39986 4918045 6940500 7024502 5244413 3398412 2838723 3337008 3894626 3773975 2845137
39977 2845137 1787985 1801478 3208487 4604022 4483795 3441310 3345956 4470097 5193798
39968 5193798 4864706 5000186 6684442 8484247 8425830 6839906 5610357 5382960 5216010
39959 5216010 4612794 4201143 4317158 4392259 4156731 4286677 5246271 6308726 6431548
39950 6431548 5675258 5146111 5672798 6962075 8073472 8450017 8327921 8231147 8335193
$$ packed form
40014E008426Q8225m14450j99171K46334k0635o81048o47939J09821O42522O32816
40004D764901N32210L16719m09781j161473r58030n9744K06134l93635n22779
39995B314522N63500J766100J706035M24743j055989j842782j370899L47418K065397
39986D918045K022455Q4002j780089j846001n59689M98285N57618j20651r28838
39977B845137j057152J3493J407009J395535j20227j042485r5354J124141P23701
39968E193798l29092J35480J684256J799805n8417j585924j229549k27397j66950
39959E216010o03216m11651J16015P5101k35528J29946R59594J062455J22822
39950F431548p56290n29147N26687J289277J111397L76545j22096r6774J04046
$$ plain form
39941 8335193 8491865 8635181 8796676 8872164 8840104 9084500 9893579 10737156 10870807 10693697
39931 10693697 11440718 13199253 14453147 14381688 14482825 16651235 20334939 23013135 23262045
39922 23262045 22052964 20985076 20433459 19793888 18669582 17316621 16351315 16276842 17029781
39913 17029781 17995987 18755844 19614221 21008071 22726675 24301634 25845744 27770804
39905 27770804 29916566 31781832 33456589 35412791 37397105 38483893 38391173 37911140
39897 37911140 37857571 38421320 39791243 42467852 46422352 50678262 54440154 58271949
39889 58271949 63565794 71007709 79979988 89352224 98452911 107130119 114998644 120892542
39881 120892542 123382450 121908117 117128343 110154789 101984715 93787616 86788925 81147912
$$ packed form
39941H335193J56672J43316J61495P5488l2060K44396Q09079Q43577J33651j77110
39931A0693697P47021J758535J253894p1459J01137K168410L683704K678196K48910
39922B3262045j209081j067888n51617o39571j124306j352961r65306p4473P52939
39913A7029781R66206P59857Q58377J393850J718604J574959J544110J925060
39905B7770804K145762J865266J674757J956202J984314J086788r2720m80033
39897C7911140n3569N63749J369923K676609L954500M255910L761892L831795
39889E8271949N293845P441915Q972279R372236R100687Q677208P868525N893898
39881A20892542K489908j474333m779774o973554q170074q197099o998691n641013
$$ plain form
39873 81147912 75667722 69493344 63457416 58738208 54904364 50742415 46592485 44107216
39865 44107216 43606465 43360145 41955789 39935709 38535299 38149414 38708202 40299352 42659919
39856 42659919 45229474 48427892 53473870 59801460 63986679 62956499 57689770 52235928
39848 52235928 49349655 48398792 47371936 45521937 43698520 43034638 43771620 44956629
39840 44956629 45116054 43466656 40451094 37077795 34218144 32681620 33069644 34889595
39832 34889595 36599274 37420815 38463533 41091730 44905618 48646906 52534554 57991253
39824 57991253 65100348 72101673 77890916 83444906 89855475 96113432 99922470 99962798
39816 99962798 96381810 89756627 80849521 71190440 62677944 56226642 51373840 47305908
$$ packed form
39873H1147912n480190o174378o035928m719208l833844m161949m149930k485269
39865D4107216n00751k46320j404356k020080j400410l85885N58788J591150K360567
39856D2659919K569555L198418N045978O327590M185219j030180n266729n453842
39848E2235928k886273r50863j026856j849999j823417o63882P36982J185009
39840D4956629J59425j649398l015562l373299k859651j536524L88024J819951
39832C4889595J709679Q21541J042718K628197L813888L741288L887648N456699
39824E7991253P109095P001325N789243N553990O410569O257957L809038M0328
39816I9962798l580988o625183q907106r659081q512496o451302m852802m067932
$$ plain form
39808 47305908 43652299 40176332 36493521 32633818 29403627 27547893 26733648 25944003
39800 25944003 24824553 24018099 24027539 24396676 24454546 24367524 24795307 25806255 26994533
39791 26994533 28688803 32031033 37252251 42581490 45867565 47137162 48501081 51124219
39783 51124219 53148570 51566627 45865496 38734191 32984365 28941968 25608827 23168261
39775 23168261 22619608 23381776 23413626 22239480 21870131 23567769 25510431 25490987 24533343
39766 24533343 25423268 28340298 30581018 30651920 30065333 30439942 31177222 31143466 30675067
39757 30675067 30511957 30328123 29758356 29486576 29819594 29504364 27676894 25860683 26107266
39748 26107266 27970684 29324540 29575531 29881439 30429806 29878985 27930549 26340532 26442155
$$ packed form
39808D7305908l653609l475967l682811l859703l230191j855734q14245p89645
39800B5944003j119450q06454R440L69137N7870q7022M27783J010948J188278
39791B6994533J694270L342230N221218N329239L286075J269597J363919K623138
39783E1124219K024351j581943n701131p131305n749826m042397l333141k440566
39775B3168261n48653P62168L1850j174146l69349J697638J942662j9444r57644
39766B4533343Q89925K917030K240720P0902n86587L74609P37280l3756m68399
39757C0675067j63110j83834n69767k71780L33018l15230j827470j816211K46583
39748B6107266J863418J353856K50991L05908N48367n50821j948436j590017J01623
$$ plain form
39739 26442155 27276662 27277884 26579284 26429144 27129589 27801233 27852854 27633873 27630482 27784031
39729 27784031 27803759 27665987 27491100 27167236 26543162 26115669 27069755 30098455 34426398
39720 34426398 38793096 43344080 49438807 57229313 64625105 69422368 71400137 71490190
39712 71490190 70329203 69205685 71005207 77401624 85142683 87858733 82714479 73575269
39704 73575269 66531009 63777488 63120016 62025778 60150377 58328230 57123046 57093807
39696 57093807 59305100 64304099 70563388 74928756 75635039 74858299 77035163 83671090
39688 83671090 90552493 91539323 85074084 75724233 69273863 67638594 68768086 69748406
39680 69748406 68883984 65965472 62036075 58628422 56296418 54102843 51125476 47980221
$$ packed form
39739B6442155Q34507J222o98600j50140P00445O71644N1621k18981l391J53549
39729B7784031J9728j37772j74887l23864o24074m27493R54086L028700M327943
39720C4426398M366698M550984O094727P790506P395792M797263J977769R0053
39712G1490190j160987j123518J799522O396417P741059K716050n144254r139210
39704G3575269p044260k753521o57472j094238j875401j822147j205184k9239
39696E7093807K211293M998999O259289M365368P06283p76740K176864O635927
39688H3671090O881403R86830o465239r349851o450370j635269J129492R80320
39680F9748406q64422k918512l929397l407653k332004k193575k977367l145255
$$ plain form
39672 47980221 46114647 45954949 46445728 46147158 44259939 41013678 37689579 35825523
39664 35825523 35679091 35853936 35136642 34187969 34484696 36054196 37497062 38090677 38484876
39655 38484876 39084145 39112108 37958127 36377780 35470877 35240665 35079044 34999567 35260428
39646 35260428 35202773 33793267 31310330 29232952 28212916 27383550 26134466 25249172 25373578
39637 25373578 25553962 24671304 23488875 23624980 24975616 26054641 26842696 29151751 33446548
39628 33446548 37188932 37612745 34873804 31257638 28419173 26724277 26329848 27426408
39620 27426408 29984990 34302816 40760578 47695969 50874208 47347060 39259617 31620389
39612 31620389 26703008 23040101 19625460 17930187 18878003 20672836 21315132 21228010 21681414
$$ packed form
39672D7980221j865574j59698M90779k98570j887219l246261l324099j864056
39664C5825523j46432J74845p17294r48673K96727J569500J442866N93615L94199
39655C8484876N99269K7963j153981j580347r06903k30212j61621p9477K60861
39646C5260428n7655j409506k482937k077378j020036q29366j249084q85294J24406
39637B5373578J80384q82658j182429J36105J350636J079025P88055K309055M294797
39628C3446548L742384M23813k738941l616166k838465j694896l94429J096560
39620B7426408K558582M317826O457762O935391L178239l527148q087443p639228
39612C1620389m917381l662907l414641j695273R47816J794833O42296q7122M53404
$$ plain form
39603 21681414 22387285 22583446 23074322 25055915 27844112 29895732 31544637 34582067
39595 34582067 39084502 42453853 42050714 37689212 31403878 25760562 22391874 21091529
39587 21091529 20127728 18198555 16025421 15233628 15941746 16616234 16275571 15551047 15233961
39578 15233961 14938334 13872978 12167921 10716918 10073892 9997151 9888478 9426553 8903175
39569 8903175 8924877 9541279 9885221 9207494 8102310 7938937 9000031 9980251 9642661
39560 9642661 8287383 7129262 6780875 6939247 7227098 7662796 8263125 8657101 8381770
39551 8381770 7496287 6707075 6701131 7365659 7947415 8098452 8336255 9082500 9693591 9197424
39541 9197424 7814928 6838894 6867993 7091431 6751015 6412749 6979987 8076994 8484297
$$ packed form
39603B1681414P05871J96161M90876J981593K788197K051620J648905L037430
39595C4582067M502435L369351m03139m361502o285334n643316l368688j300345
39587B1091529r63801j929173k173134p91793P08118O74488l40663p24524l17086
39578A5233961k95627j065356j705057j451003o43026p6741j08673m61925n23378
39569H903175K1702O16402L43942o77727j105184j63373J061094R80220l37590
39560I642661j355278j158121l48387J58372K87851M35698O00329L93976k75331
39551H381770q85483p89212n944O64528N81756J51037K37803P46245O11091m96167
39541I197424j382496r76034K9099K23438l40416l38266N67238J097007M07303
$$ plain form
39532 8484297 7978258 7658055 8275990 9192076 9426112 8991869 8577002 8452910 8401291 8334089
39522 8334089 8232100 7735259 6618561 5511758 5208129 5295613 4596970 3189935 2711995
39513 2711995 4016817 5752542 6278241 5896395 5827082 5910277 5155625 4072853 4303096
39504 4303096 5783125 6411114 5233665 3993915 4357647 5366144 5279973 4577904 5100988
39495 5100988 7016398 8777910 9818864 11083311 12598003 12659054 10425809 7669560
39487 7669560 6565696 6855426 6716240 5745801 5334044 6133431 6887027 6445644 5674060
39478 5674060 6245872 8228807 10054313 10642276 10391733 9970343 9279190 8135189 7059999
39469 7059999 6635539 6693766 6867108 7340383 8206703 8665131 7981478 6869945 6634799
$$ packed form
39532H484297n06039l20203O17935R16086K34036m34243m14867j24092n1619o7202
39522H334089j01989m96841j116698j106803l03629Q7484o98643j407035m77940
39513B711995J304822J735725N25699l81846o9313Q3195p54652j082772K30243
39504D303096J480029O27989j177449j239750L63732J008497q6171p02069N23084
39495E100988J915410J761512J040954J264447J514692O1051k233245k756249
39487G669560j103864K89730j39186r70439m11757P99387P53596m41383p71584
39478E674060N71812J982935J825506N87963k50543m21390o91153j144001j075190
39469G059999m24460N8227J73342M73275Q66320M58428o83653j111533k35146
$$ plain form
39460 6634799 7095048 6805783 5489195 4688741 5410342 6543949 6605776 5895204 5684740
39451 5684740 6055472 5903787 4775057 3473926 2851938 2902919 3150364 3262468 3198602
39442 3198602 3188304 3512011 3984281 3941877 3173246 2504724 2915326 4358142 5956459
39433 5956459 6979148 7077130 6117896 4634647 3949695 4729087 5665246 4872421 2622919
39424 2622919 1311624 2277286 4019348 4464212 3870286 4121712 5762798 7370134 7933100
39415 7933100 8259160 9261436 10114092 9426305 7596582 6467551 6710658 7081379 6637697
39406 6637697 6158137 6482052 6848791 6261121 5399837 5434257 5671929 4481227 2311781
39397 2311781 1507454 2732980 3812069 3050611 1715804 1818938 3066331 3736215 3435086
$$ packed form
39460F634799M60249k89265j316588q00454P21601J133607O1827p10572k10464
39451E684740L70732j51685j128730j301131o21988N0981K47445J12104o3866
39442C198602j0298L23707M72270m2404p68631o68522M10602J442816J598317
39433E956459J022689R7982r59234j483249o84952P79392R36159p92825k249502
39424B622919j311295R65662J742062M44864n93926K51426J641086J607336N62966
39415G933100L26060J002276Q52656o87787j829723j129031K43107L70721m43682
39406F637697m79560L23915L66739n87670q61284L4420K37672j190702k169446
39397B311781q04327J225526J079089p61458j334807J03134J247393O69884l01129
$$ plain form
39388 3435086 3136436 3146916 2825379 2100362 1739665 2091308 2752372 3487049 4393935 5138411
39378 5138411 5052100 4171924 3361464 3211898 3460923 3624623 3621360 3579041 3442685 3031824
39368 3031824 2409357 2091245 2670821 4000143 5070439 5255604 5309409 6264507 7715142
39359 7715142 8443958 8523942 9228633 10874323 12537863 14042112 16184864 18770925 20845994
39350 20845994 23299162 28335897 35785007 43701477 53702995 70275554 91325127 105196488
39342 105196488 103870027 95527289 95433616 105041841 109080711 95572530 70714234 49489189
39334 49489189 38057144 31625938 25325108 19664036 16196737 14123551 12444686 11546252
39326 11546252 11397357 10835929 9532398 8579936 8492001 8390795 7712478 7121136 7135978
$$ packed form
39388C435086k98650J0480l21537p25017l60697L51643O61064P34677R06886P44476
39378E138411q6311q80176q10460j49566K49025J63700l263m2319j36356m10861
39368C031824o22467l18112N79576J329322J070296J85165N3805R55098J450635
39359G715142P28816P9984P04691J645690J663540J504249K142752K586061K075069
39350B0845994K453168N036735P449110P916470J0001518J6572559K1049573J3871361
39342A05196488j326461q342738r3673R608225M038870j3508181k4858296k1225045
39334D9489189j1432045o431206o300830n661072l467299k073186j678865q98434
39326A1546252j48895n61428j303531r52462q7935j01206o78317n91342J4842
$$ plain form
39317 7135978 7160355 6523648 5573654 5172782 5625021 6391017 6593786 5837435 4693050
39308 4693050 4058590 3951563 3627961 3058420 3180758 4164619 4700463 3969382 3138891
39299 3138891 3634023 4905135 5383804 4911667 4609576 4770622 4530301 3578950 2748268
39290 2748268 2668280 2933889 2863799 2308541 1584147 1218506 1720632 3020670 4247719
39281 4247719 4570686 4075113 3423794 3053800 3127894 3696090 4353744 4376011 3796294 3613879
39271 3613879 4243359 4651023 3955669 2951099 2804308 3044455 2356217 895160 227309
39262 227309 1066607 2471667 3361697 3627061 3607168 3529582 3660103 4156919 4641122 4590515
39252 4590515 4130633 3801248 3714031 3613052 3512324 3551933 3505536 3145282 2750826 2566688
$$ packed form
39317G135978K4377o36707r49994m00872M52239P65996K02769p56351j144385
39308D693050o34460j07027l23602n69541J22338R83861N35844p31081q30491
39299C138891M95132J271112M78669m72137l02091J61046k40321r51351q30682
39290B748268p9988K65609p0090n55258p24394l65641N02126J300038J227049
39281D247719L22967m95573o51319l69994P4094N68196O57654K2267n79717j82415
39271C613879O29480M07664o95354j004570j46791K40147o88238j461057o67851
39262B27309Q39298J405060Q90030K65364j9893p7586J30521M96816M84203n0607
39252D590515m59882l29385q7217j00979j00728L9609m6397l60254l94456j84138
$$ plain form
39242 2566688 2252992 1648377 1441124 2122877 2932942 2948495 2562218 2626636 2798090 2184810
39232 2184810 1077909 476629 393502 282454 595659 1952222 3185471 2528517 679290
39223 679290 213736 1648789 2669315 1971329 1188115 1699423 2089564 760080 -959636
39214 -959636 -682514 1393435 3058624 3427769 3413166 3398736 2762285 1690831 1351153
39205 1351153 1884945 2036489 1313500 866895 1414225 1762887 617952 -1139635 -1415408
39196 -1415408 240034 2054923 2394761 1576752 888201 679503 266126 -669528 -1515469
39187 -1515469 -1655709 -1216999 -601029 113349 861823 1202302 835940 230745 142916 677916
39177 677916 1305156 1595412 1447592 847953 17924 -411461 -61560 484585 328697 -485817
$$ packed form
39242B566688l13696o04615k07253O81753Q10065J5553l86277O4418J71454o13280
39232B184810j106901o01280q3127j11048L13205J356563J233249o56954j849227
39223F79290m65554J435053J020526o97986p83214N11308L90141j329484j719716
39214i59636K77122K075949J665189L69145j4603j4430o36451j071454l39678
39205A351153N33792J51544p22989m46605N47330L48662j144935j757587k75773
39196a415408J655442J814889L39838q18009o88551k08698m13377r35654q45941
39187a515469j40240M38710O15970P14378P48474L40479l66362o05195q7829N35000
39177F77916O27240K90256j47820n99639q30029m29385L49901N46145j55888q14514
$$ plain form
39167 -485817 -1094119 -1108870 -960789 -881613 -429797 669459 1898957 2504460 2204693 1204952
39157 1204952 42356 -474068 201028 1636375 2731870 2889591 2442092 1932906 1573749
39148 1573749 1447236 1587473 1747698 1664493 1551825 1696358 1689392 943526 -69410 -174160
39138 -174160 743271 1457548 1269715 1025086 1647551 2657831 2982331 2516479 2032163
39129 2032163 1986601 2150041 2145409 1859122 1532300 1650339 2352246 2896765 2382305 1116876
39119 1116876 439622 944191 1784769 2050895 1821910 1451005 929786 549202 1008741
39110 1008741 2078629 2329675 1182634 98218 548536 1847326 2344019 1816933 1152652
39101 1152652 529829 -259144 -328737 1358606 3767822 4608531 3546027 2593662 2922113
$$ packed form
39167d85817o08302j4751J48081P9176M51816J099256J229498O05503k99767r99741
39157A204952j162596n16424O75096J435347J095495J57721m47499n09186l59157
39148A573749j26513J40237J60225q3205j12668J44533o966p45866j012936j04750
39138a74160R17431P14277j87833k44629O22465J010280L24500m65852m84316
39129B032163m5562J63440m632k86287l26822J18039P01907N44519n14460j265429
39119A116876o77254N04569Q40578K66126k28985l70905n21219l80584M59539
39110A008741J069888K51046j147041j084416M50318J298790M96693n27086o64281
39101A152652o22823p88973o9593J687343K409216Q40709j062504r52365L28451
$$ plain form
39092 2922113 3342845 2739135 1981827 2141598 2494658 1951088 1208792 1663871 2990330
39083 2990330 3650060 3344999 3111463 3150602 2498877 1117096 421105 999725 1466775
39074 1466775 691900 -213609 413969 2117199 3006218 2569415 2044296 2122653 2059544 1369774
39064 1369774 764667 747611 716372 325580 440612 1634324 2840089 2794421 1962136 1669516
39054 1669516 2046412 2304017 2468243 3183870 4130201 4348627 4042760 4348054 5299456
39045 5299456 5822362 5919789 6959442 9380239 12086197 14698549 18240122 22730736 26681275
39036 26681275 30599108 38176618 50817576 62632384 64805352 55139102 40323925 28334165
39028 28334165 21415420 17368422 14482296 12627429 11220436 9103683 6424494 4636535
$$ packed form
39092B922113M20732o03710p57308J59771L53060n43570p42296M55079J326459
39083B990330O59730l05061k33536L9139o51725j381781o95991N78620M67050
39074A466775p74875r05509O27578J703230Q89019m36803n25119P8357o3109o89770
39064A369774o05107j7056l1239l90792J15032J193712J205765m5668q32285k92620
39054A669516L76896K57605J64226P15627R46331K18426l05867L05294R51402
39045E299456N22906R7427J039653K420797K705958K612352L541573M490614L950539
39036B6681275L917833P577510J2640958J1814808K172968r666250j4815177j1989760
39028B8334165o918745m046998k886126j854867j406993k116753k679189j787959
$$ plain form
39020 4636535 4261274 4064370 2960609 1591265 1218336 1796955 2132968 1690569 1210524
39011 1210524 1297481 1320002 467246 -654739 -556591 1032007 2654224 3064070 2692182
39002 2692182 2526844 2432103 1671518 617641 622698 2057182 3540694 3590190 2346046
38993 2346046 1141020 801423 948201 831443 343184 28067 301539 905818 1207914
38984 1207914 901903 258729 -244727 -333357 -21605 419813 552451 101839 -710577 -1332522
38974 -1332522 -1344914 -614441 748061 2194882 2815503 2239907 1303909 1155041 1894218
38965 1894218 2849365 3831090 4975664 5601545 4776432 3177278 2753631 4085554 5691142
38956 5691142 6533204 7424018 9098198 10826694 12158928 14110465 17229229 20740873
$$ packed form
39020D636535l75261j96904j103761j369344l72929N78619L36013m42399m80045
39011A210524Q6957K2521q52756j121985R8148J588598J622217M09846l71888
39002B692182j65338r4741p60585j053877N057J434484J483512M9496j244144
38993B346046j205026l39597J46778j16758m88259l15117K73472O04279L02096
38984A207914l06011o43174n03456q8630L11752M41418J32638m50612q12416o21945
38974a332522j2392P30473J362502J446821O20621n75596r35998j48868P39177
38965A894218R55147R81725J144574O25881q25113j599154m23647J331923J605588
38956E691142Q42062Q90814J674180J728496J332234J951537L118764L511644
$$ plain form
38948 20740873 25482830 34784366 48822028 60130582 59641918 47257631 32239614 22502972
38940 22502972 17623744 13582579 9760605 8033660 8122337 7844890 6707982 5984763 5820356
38931 5820356 4996377 3363756 2197848 2088246 2338461 2492647 2800506 3130346 2973427
38922 2973427 2626497 2922372 3630013 3502621 2194917 908322 798590 1790972 3222508
38913 3222508 4587997 5333781 4967779 3843561 2973481 2654049 2130283 1063383 403677
38904 403677 1063777 2388164 2825485 1874687 652494 537853 1717304 3141934 3656639
38895 3656639 3067606 2167611 1809633 2117005 2632923 2901480 2631621 1683299 433253
38886 433253 -133169 569038 1708614 1828426 743329 -166356 188908 1280903 1943772
$$ packed form
38948B0740873M741957R301536J4037662J1308554m88664j2384287j5018017r736642
38940B2502972m879228m041165l821974j726945Q8677k77447j136908p23219j64407
38931E820356q23979j632621j165908j09602K50215J54186L07859L29840j56919
38922B973427l46930K95875P07641j27392j307704j286595j09732R92382J431536
38913C222508J365489P45784l66002j124218q70080l19432n23766j066900o59706
38904D03677O60100J324387M37321r50798j222193j14641J179451J424630N14705
38895C656639n89033q99995l57978L07372N15918K68557k69859r48322j250046
38886D33253n66422P02207J139576J19812j085097r09685L55264J091995O62869
$$ plain form
38877 1943772 1905556 1659905 1433866 1169972 1174108 1786603 2447297 2059073 567895 -626210
38867 -626210 -365589 713043 991654 -43617 -1271171 -1537926 -1092919 -983818 -1453695
38858 -1453695 -1654873 -1024004 -268523 -444411 -1370957 -1728864 -867577 230399 333478
38849 333478 -235350 -68183 1205347 2309017 2157553 1341447 1044425 1222930 952857
38840 952857 233622 143844 1015219 1659605 1057346 -68198 -231252 776190 1722898
38831 1722898 1622489 792763 211866 409494 1098219 1515331 1093496 76324 -606258
38822 -606258 -342416 457771 958095 900866 586229 189370 -267250 -490752 -213645 171348
38812 171348 49652 -313983 59487 1373429 2495135 2300535 1043925 -19493 -17631
$$ packed form
38877A943772l8216k45651k26039k63894M136O12495O60694l88224j491178j194105
38867f26210K60621J078632K78611j035271j227554k66755M45007J09101m69877
38858a453695k01178O30869P55481j75888r26546l57907Q61287J097976J03079
38849C33478n68828J67167J273530J103670j51464q16106k97022J78505k70073
38840I52857p19235q9778Q71375O44386o02259j125544j63054J007442R46708
38831A722898j00409q29726n80897J97628O88725M17112m21835j017172o82582
38822f06258K63842Q00187N00324n7229l14637l96859m56620k23502K77107L84993
38812A71348j21696l63635L73470J313942J121706j94600j256610j063418J862
$$ plain form
38803 -17631 811436 1465138 1083200 -193394 -1254914 -1280843 -791619 -808791 -1181446 -790039
38793 -790039 501369 1338646 821264 -209341 -600767 -566147 -913082 -1455011 -1402154 -760531
38783 -760531 -125425 486243 1350886 1945917 1552438 814288 1167885 2520986 3018782
38774 3018782 1672757 -142979 -643729 65273 668199 709870 738812 877629 538407
38765 538407 -436221 -1313011 -1335459 -459745 822737 1895984 2294276 2068531 1815844
38756 1815844 1886759 1771570 886434 -286515 -729255 -468663 -543750 -1207055 -1375928 -470520
38746 -470520 385222 45692 -696124 -231541 1278409 2014523 1187558 90762 75401
38737 75401 830974 1346309 1391768 1148451 379784 -893084 -1643216 -1048775 2138 -55146
$$ packed form
38803a7631Q29067O53702l81938j276594j061520k5929M89224j7172l72655L91407
38793g90039J291408Q37277n17382j030605l91426L4620l46935n41929N2857O41623
38783g60531O35106O11668Q64643N95031l93479p38150L53597J353101M97796
38774C018782j346025j815736n00750P09002O02926M1671K8942J38817l39222
38765E38407r74628q76790k2448Q75714J282482J073247L98292k25745k52687
38756A815844P0915j15189q85136j172949m42740K60592p5087o63305j68873R05408
38746d70520Q55742l39530p41816M64583J509950P36114q26965j096796j5361
38737G5401P55573N15335M5459k43317p68667j272868p50132N94441J050913n7284
$$ plain form
38727 -55146 -1133605 -1588087 -737473 91713 -453247 -1869902 -2656700 -2237359 -1208780
38718 -1208780 -221395 522863 891116 701834 54996 -637289 -1014872 -1008314 -837865 -897293
38708 -897293 -1393414 -1942248 -1841528 -970127 -57742 263436 308297 763191 1529784 1781460
38698 1781460 1175041 381655 133135 227187 14387 -357587 33196 1335710 2142488
38689 2142488 1104699 -999063 -1956326 -1034710 43974 -351162 -1517775 -1869225 -1505417
38680 -1505417 -1620520 -2018011 -1325113 347563 1133405 331810 -427567 111860 838147
38671 838147 306478 -867914 -1310747 -1261054 -1755221 -2420576 -2119014 -1160805 -780319 -755233
38661 -755233 246822 1939829 2320920 807881 -643180 -460396 376147 298601 -333401
$$ packed form
38727e5146j078459m54482Q50614Q29186n44960j416655p86798M19341J028579
38718a208780R87385P44258L68253j89282o46838o92285l77583O558J70449n9428
38708h97293m96121n48834J00720Q71401R12385L21178M4861M54894P66593K51676
38698A781460o06419p93386k48520R4052k12800l71974L90783J302514Q06778
38689B142488j037789k103762r57263R21616J078684l95136j166613l51450L63808
38680a505417j15103l97491O92898J672676P85842q01595p59377N39427P26287
38671H38147n31669j174392m42833M9693m94167o65355L01562R58209L80486K5086
38661g55233J002055J693007L81091j513039j451061J82784Q36543p7546o32002
$$ plain form
38652 -333401 -229026 498876 714752 321723 302360 955323 1542732 1693355 1879718 2298695
38642 2298695 2368268 1709910 805934 296523 258577 473927 769848 763908 -44032 -1394932
38632 -1394932 -2047803 -1130337 611308 1618249 1386016 776469 540261 451371 180429
38623 180429 98997 535774 924133 614799 129678 552186 1808046 2681847 2659787 2554109
38613 2554109 2862351 2734327 1458297 -8024 -209343 654094 1006018 130626 -1038882
38604 -1038882 -1414332 -1000817 -419298 -6941 297183 720973 1452975 2210384 2174451 1089734
38594 1089734 252402 1324918 3992296 5883750 5285315 3010138 1042889 242824 139287
38585 139287 200872 266636 101128 -475559 -1033217 -826765 274114 1614693 2510514 2781446
$$ packed form
38652c33401J04375P27902K15876l93029j9363O52963N87409J50623J86363M18977
38642B298695O9573o58358r03976n09411l7946K15350K95921n940q07940j350900
38632a394932o52871R17466J741645J006941k32233o09547k36208q8890k70942
38623A80429q1432M36777L88359l09334m85121M22508J255860Q73801k2060j05678
38613B554109L08242j28024j276030j466321k01319Q63437L51924q75392j169508
38604a038882l75450M13515N81519M12357L04124M23790P32002P57409l5933j084717
38594A089734q37332J072516K667378J891454n98435k275177j967249q00065j03537
38585A39287O1585O5764j65508n76687n57658K06452J100879J340579Q95821K70932
$$ plain form
38575 2781446 2579932 2103833 1565072 1196304 1178272 1547158 2045710 2099066 1269616 -154651
38565 -154651 -1352263 -1859091 -1878900 -1603330 -821816 408774 1250595 882828 -399434
38556 -399434 -1424671 -1423770 -696644 -61010 65759 29205 466498 1373539 1781749 843885
38546 843885 -779015 -1366256 -251702 1305272 1882224 1721488 1965227 2714789 2971461
38537 2971461 2255922 1196069 478331 152541 122198 485644 1114730 1540436 1523577 1257630
38527 1257630 904083 480951 281181 708236 1459545 1538287 479370 -923681 -1528065
38518 -1528065 -1141906 -575741 -645848 -1376887 -1993980 -1581257 -2637 1756942 2462926
38509 2462926 1876220 800104 -37492 -608575 -1081029 -1380108 -1498693 -1643353 -1757357
$$ packed form
38575B781446k01514m76099n38761l68768j8032L68886M98552N3356q29450j424267
38565a54651j197612n06828j9809K75570P81514J230590Q41821l67767j282262
38556c99434j025237R01P27126O35634J26769l6554M37293R07041M08210r37864
38546H43885j622900n87241J114554J556974N76952j60736K43739P49562K56672
38537B971461p15539j059853p17738l25790l0343L63446O29086M25706j6859k65947
38527A257630l53547m23132j99770M27055P51309P8742j058917j403051o04384
38518a528065L86159N66165p0107p31039o17093M12723J578620J759579P05984
38509B462926n86706j076116q37596n71083m72454k99079j18585j44660j14004
$$ plain form
38500 -1757357 -1441940 -676461 -55129 83855 203289 757770 1354006 1292303 546310 -356767
38490 -356767 -1066223 -1445601 -1245423 -412376 497012 851094 752124 754967 944597 875160
38480 875160 318587 -463976 -1108888 -1362491 -1104004 -627130 -612040 -1259238 -1792741 -1491125
38470 -1491125 -812797 -641680 -808820 -470930 293118 581264 347695 549432 1353687
38461 1353687 1662104 957156 201251 130443 22011 -829232 -1677063 -1611816 -1180135 -1297504
38451 -1297504 -1481919 -771914 327846 561755 70447 -24149 139300 -637084 -2148369
38442 -2148369 -2639520 -1552403 -403392 -199130 43614 1109998 1795126 876436 -570224
38433 -570224 -658793 444635 979075 349048 -336601 -261543 178927 502843 808143 1124918
$$ packed form
38500a757357L15417P65479O21332J38984J19434N54481N96236o1703p45993r03077
38490c56767p09456l79378K00178Q33047R09388L54082r8970K843J89630o9437
38480H75160n56573p82563o44912k53603K58487M76874J5090o47198n33503L01616
38470a491125O78328J71117j67140L37890P64048K88146k33569K01737Q04255
38461A353687L08417p04948p55905p0808j08432q51243q47831O5247M31681j17369
38451a297504j84415P10005J099760K33909m91308r4596J63449p76384j511285
38442b148369m91151J087117J149011K04262K42744J066384O85128r18690j446660
38433e70224q8569J103428N34440o30027o85649P5058M40470L23916L05300L16775
$$ plain form
38423 1124918 1211543 1166120 1319432 1495924 1310425 1125386 1632803 2475495 2470107 1407429
38413 1407429 488859 624532 1344596 1814979 1934727 1904824 1601858 987659 462233 327315
38403 327315 502719 1034991 2065656 3008762 2806059 1535801 725615 1355373 2549175
38394 2549175 3078713 3118366 3393481 3517598 2617347 1090185 301147 710386 1509172
38385 1509172 1972764 2054638 1797791 1306732 1192865 1883881 2584255 2154592 960290
38376 960290 471148 978069 1259804 794435 601335 1235711 1649477 1127309 845330 2055120
38366 2055120 3871581 4501698 3876168 3363227 3395739 3201701 2751841 3125395 4561502
38357 4561502 5703030 5466254 4512297 4137250 4590285 5206495 5504225 5438989 5072164
$$ packed form
38423A124918Q6625m5423J53312J76492j85499j85039N07417Q42692n388j062678
38413A407429r18570J35673P20064M70383J19748k9903l02966o14199n25426j34918
38403C27315J75404N32272J030665R43106k02703j270258q10186O29758J193802
38394B549175N29538L9653K75115J24117r00251j527162p89038M09239P98786
38385A509172M63592Q1874k56847m91059j13867O91016P00374m29663j194302
38376I60290m89142N06921K81735m65369j93100O34376M13766n22168k81979J209790
38366B055120J816461O30117o25530n12941L2512j94038m49860L73554J436107
38357D561502J141528k36776r53957l75047M53035O16210K97730o5236l66825
$$ plain form
38348 5072164 4620800 4480360 4699738 4747235 4191021 3277758 2490197 1908537 1383267 975159
38338 975159 826945 906838 1212615 1875600 2729712 3207036 3087499 2921916 3206741 3593677
38328 3593677 3593252 3662448 4651286 6245423 6970803 6090073 4703566 4376193 5173983 5784878
38318 5784878 5391748 4619831 4396666 4569197 4335902 3760631 3947081 5455894 7317969
38309 7317969 8194095 7943067 7316721 6614660 5658339 4806784 4739634 5146760 4900850 3891436
38299 3891436 3453096 4380852 5700345 6210662 6140840 6267884 6406207 6025627 5587439
38290 5587439 5905762 6726377 7262837 7657355 8497981 9272492 8867100 7480936 6509618
38281 6509618 6456381 6410997 5774566 5089931 4873535 4950947 5282594 6160959 7213015 7459959
$$ packed form
38348E072164m51364j40440K19378M7497n56214r13263p87561n81660n25270m08108
38338I75159j48214P9893L05777O62985Q54112M77324j19537j65583K84825L86936
38328C593677m25O9196R88838J594137P25380q80730j386507l27373P97790O10895
38318E784878l93130p71917k23165J72531k33295n75271J86450J508813J862075
38309G317969Q76126k51028o26346p02061r56321q51555o7150M07126k45910j009414
38299C891436m38340R27756J319493N10317o9822J27044J38323l80580m38188
38290E587439L18323Q20615N36460L94518Q40626P74511m05392j386164r71318
38281F509618n3237m5384o36431o84635k16396P7412L31647Q78365J052056K46944
$$ plain form
38271 7459959 6774415 6078940 5772909 5290950 4579710 4479759 5035926 4995305 3841591 2846482
38261 2846482 3079595 3790708 3957456 4075761 4951121 5846983 5499045 4224800 3435107
38252 3435107 3562511 3951070 4390979 5263127 6321253 6713628 6298156 5842510 5795922
38243 5795922 5746752 5245791 4510655 4179438 4711870 5937020 6985382 7012944 6207487
38234 6207487 5621193 5866643 6587495 7253918 7612710 7339617 6410747 5894235 6931759
38225 6931759 8751515 9411214 8837626 9077347 10920246 12594922 12842554 12912690 14185825
38216 14185825 16197894 18497807 21943332 26513981 30568130 34051651 39356605 47121650
38208 47121650 55102161 63641147 77330510 97843525 121657283 150725915 196991670
$$ packed form
38271G459959o85544o95475l06031m81959p11240r9951N56167m0621j153714r95109
38261B846482K33113P11113J66748J18305Q75360Q95862l47938j274245p89693
38252C435107J27404L88559M39909Q72148J058126L92375m15472m55646m6588
38243E795922m9170n00961p35136l31217N32432J225150J048362K7562q05457
38234F207487n86294K45450P20852O66423L58792k73093r28870n16512J037524
38225F931759J819756O59699n73588K39721J842899J674676K47632P0136J273135
38216A4185825K012069K299913L445525M570649M054149L483521N304954P765045
38208D7121650P980511Q538986J3689363K0513015K3813758K9068632M6265755
$$ plain form
38201 196991670 263631841 325436834 343831824 306141948 239258167 179733222 140580799
38194 140580799 113246763 90213455 72838843 62068590 54311284 47333130 42190506
38187 42190506 38508983 33925169 28639325 25316070 24215207 22989773 21193637 20482364
38179 20482364 20485599 19016819 16494681 15791284 17348975 18520227 18124673 17713874 17859374
38170 17859374 17060375 15014675 13392125 12675452 11579096 10119689 9865557 10600607 10183719
38161 10183719 8395907 7567078 8628266 9770073 9740535 9315767 8880764 7772418 6605605
38152 6605605 6972488 8322933 8519723 7805329 8443183 10109075 9980770 8086414 7837429
38143 7837429 10077258 11566435 11080882 11882771 15776496 19749830 21399348 22849319
$$ packed form
38201A96991670O6640171O1804993J8394990l7689876o6883781n9524945l9152423
38194A40580799k7334036k3033308j7374612j0770253p757306o978154n142624
38187D2190506l681523m583814n285844l323255j100863j225434j796136p11273
38179B0482364L235j468780k522138p03397J557691J171252l95554m10799J45500
38170A7859374p98999k045700j622550p16673j096356j459407k54132P35050m16888
38161A0183719j787812q28829J061188J141807k9538m24768m35003j108346j166813
38152F605605L66883J350445J96790p14394O37854J665892j28305j894356k48985
38143G837429K239829J489177m85553Q01889L893725L973334J649518J449971
$$ plain form
38135 22849319 26107925 29379844 31559143 35545243 43176771 51821587 60269939 72672377
38127 72672377 91888628 115438999 144429894 188143509 247623074 299224038 309920762
38120 309920762 271989868 211681190 160301115 126841121 102967354 82894495 68052278
38113 68052278 58482735 50673277 43227381 37645257 33722268 29422605 24941713 22349683
38105 22349683 21433037 19856763 17278107 15666567 15562708 15343479 14315319 13477988 13003422
38096 13003422 11852010 10278186 9969714 11052136 11443029 10031256 8301155 7819658
38088 7819658 8070913 7937811 7637887 7806014 7921993 7156707 6062363 6018664 7205233
38079 7205233 8205205 7739478 6112822 4722106 4517143 5216490 5908555 6102462 5984433
$$ packed form
38135B2849319L258606L271919K179299L986100P631528Q644816Q448352J2402438
38127G2672377J9216251K3550371K8990895M3713615N9479565N1600964J0696724
38120C09920762l7930894o0308678n1380075l3459994k3873767k0072859j4842217
38113F8052278r569543p809458p445896n582124l922989m299663m480892k592030
38105B2349683r16646j576274k578656j611540j03859k19229j028160q37331m74566
38096A3003422j151412j573824l08472J082422L90893j411773j730101m81497
38088G819658K51255j33102k99924J68127J15979p65286j094344m3699J186569
38079G205233R99972m65727j626656j390716k04963O99347O92065J93907j18029
$$ plain form
38070 5984433 5830729 5607614 5225591 4776545 4339966 3898341 3574643 3549025 3621344 3363756
38060 3363756 2884637 2869930 3606979 4528036 4977652 4832929 4150607 2984749 1906635
38051 1906635 1825791 2738305 3467881 3260538 2779344 2789151 2793403 2019343 1005975 980349
38041 980349 2071452 3270864 3879969 3960073 3606386 2836559 2087324 1873743 2012332
38032 2012332 1973529 1835863 2081362 2647114 3020111 3085923 3075446 2922904 2517483 2268146
38022 2268146 2489011 2600777 2015616 1423526 1913646 3100403 3578779 3132105 2923558
38013 2923558 3424078 3818978 3784460 4123840 5005608 5220583 4124915 2890175 2729830
38004 2729830 3104724 2871338 2174904 1949480 2350736 2884870 3396884 3788883 3449865
$$ packed form
38070E984433j53704k23115l82023m49046m36579m41625l23698k5618P2319k57588
38060C363756m79119j4707P37049R21057M49616j44723o82322j165858j078114
38051A906635q0844R12514P29576k07343m81194R807M252p74060j013368k5626
38041I80349J091103J199412O09105Q0104l53687p69827p49235k13581J38589
38032B012332l8803j37666K45499N65752L72997O5812j0477j52542m05421k49337
38022B268146K20865J11766n85161n92090M90120J186757M78376m46674k08547
38013B923558N00520L94900l4518L39380Q81768K14975j095668j234740j60345
38004B729830L74894k33386o96434k25424M01256N34134N12014L91999l39018
$$ plain form
37995 3449865 2188010 1130503 1405842 2391799 2579058 1812281 1285468 1478151 1519205
37986 1519205 741598 -367087 -1070393 -1249730 -1050496 -480054 310593 928813 1137625
37977 1137625 988021 683921 731545 1767680 3489081 4261292 2890145 470106 -749036
37968 -749036 -150732 905218 1402811 1761301 2383729 2713143 2338817 1713160 1139850
37959 1139850 315198 -482072 -132891 1472483 2624805 2004500 631650 331388 1122637
37950 1122637 1515965 810074 -274268 -893865 -778436 141046 1646242 2836709 2790398
37941 2790398 1689727 682466 706924 1801780 3138540 3406050 1969498 153297 267570
37932 267570 2545286 4362416 3742498 2217048 2389648 3948161 4551593 3887868 3978467
$$ packed form
37995C449865j261855j057507K75339R85957J87259p66777n26813J92683M1054
37986A519205p77607j108685p03306j79337J99234N70442P90647O18220K08812
37977A137625j49604l04100M7624J036135J721401P72211j371147k420039j219142
37968g49036N98304J055950M97593L58490O22428L29414l74326o25657n73310
37959A139850q24652p97270L49181J605374J152322o20305j372850l00262P91249
37950A122637L93328p05891j084342o19597J15429R19482J505196J190467m6311
37941B790398j100671j007261K4458J094856J336760K67510j436552j816201J14273
37932B67570K277716J817130o19918j525450J72600J558513O03432o63725R0599
$$ plain form
37923 3978467 5536599 6965238 7539437 8762975 11382689 13521442 13415419 12086497
37915 12086497 11542541 11829940 11639406 10657755 9565525 8539936 7361889 6417448 6250934
37906 6250934 6636324 7129877 7825371 8593976 8581819 7674045 7400605 8920635 11073501
37897 11073501 12071695 12227731 13096101 14602352 15175446 14432689 13568584 13055031 12065756
37888 12065756 10476578 9395490 9127600 8495962 6970690 5739081 5663738 5736266 4794080
37879 4794080 3507591 3274543 4045827 4652921 4710924 4830102 5197500 5203175 4551052 3760415
37869 3760415 3301781 2927950 2220595 1385056 1088824 1584930 2302066 2488409 2133371
37860 2133371 1901767 2102861 2217944 1757061 1067343 751838 741197 642502 612205 1006663
$$ packed form
37923C978467J558132J428639N74199J223538K619714K138753j06023j328922
37915A2086497n43956K87399j90534r81651j092230j025589j178047r44441j66514
37906F250934L85390M93553O95494P68605j2157r07774k73440J520030K152866
37897A1073501R98194J56036Q68370J506251N73094p42757q64105n13553r89275
37888A2065756j589178j081088k67890o31638j525272j231609p5343P2528r42186
37879D794080j286489k33048P71284O07094N8003J19178L67398N675o52123p90637
37869C760415m58634l73831p07355q35539k96232M96106P17136J86343l55038
37860B133371k31604K01094J15083m60883o89718l15505j0641r8695l0297L94458
$$ plain form
37850 1006663 1428299 1107659 148520 -586803 -816283 -1032963 -1282277 -857212 448143
37841 448143 1728920 2045716 1410050 446544 -223866 -152643 555168 944914 226842 -874372
37831 -874372 -897174 176693 903903 767580 926867 1966121 2651110 2046936 1304367
37822 1304367 1833350 2931027 2942204 1913448 1298741 1540139 1719718 1430089 1306039
37813 1306039 1572579 1543374 916257 377097 466826 755067 596471 81385 -141867 338242
37803 338242 1174211 1343534 71132 -1965319 -2903732 -1834300 -84438 543712 248563
37794 248563 682302 2234248 3352391 2781058 1164194 -93407 -556525 -717040 -900111
37785 -900111 -851721 -168101 1140531 2382218 2619306 1725039 715856 484313 576859
$$ packed form
37850A006663M21636l20640r59139p35323k29480k16680k49314M25065J305355
37841D48143J280777L16796o35666r63506o70410P1223P07811L89746p18072j101214
37831h74372k2802J073867P27210j36323J59287J039254O84989o04174p42569
37822A304367N28983J097677J1177j028756o14707K41398J79579k89629j24050
37813A306039K66540k9205o27117n39160Q9729K88241j58596n15086k23252M80109
37803C38242Q35969J69323j272402k036451r38413J069432J749862O28150k95149
37794B48563M33739J551946J118143n71333j616864j257601m63118j60515j83071
37785i00111M8390O83620J308632J241687K37088q94267j009183k31543R2546
$$ plain form
37776 576859 14369 -1034707 -1444749 -830683 65575 682657 1195013 1638067 1616954 1147795
37766 1147795 751813 477403 -111966 -784385 -722948 -108503 -246881 -1486690 -2338450
37757 -2338450 -1558469 39770 866288 664014 282869 208069 412765 943997 1569936
37748 1569936 1519827 650294 159882 951564 1979756 1619252 141487 -703031 -246887
37739 -246887 532316 868028 968224 819716 -81862 -1356426 -1617893 -411549 994474
37730 994474 1451440 1361942 1487044 1514195 856347 -84583 -603465 -898574 -1433025 -1730932
37720 -1730932 -1099149 -108673 51152 -448320 -181034 1235532 2282226 1577763 -194188
37711 -194188 -1132489 -311438 1483475 2803468 2823654 1900457 1238331 1740219 2957115
$$ packed form
37776E76859n62490j049076m10042O14066Q96258O17082N12356M43054k1113m69159
37766A147795l95982k74410n89369o72419O1437O14445j38378j239809q51760
37757b338450P79981J598239Q26518k02274l81145p4800K04696N31232O25939
37748A569936n0109q69533m90412P91682J028192l60504j477765q44518M56144
37739b46887P79203L35712J00196j48508r01578j274564k61467J206344J406023
37730I94474M56966q9498J25102K7151o57848r40930n18882k95109n34451k97907
37720a730932O31783R90476J59825m99472K67286J416566J046694p04463j771951
37711a94188r38301Q21051J794913J319993K0186r23197o62126N01888J216896
$$ plain form
37702 2957115 3553152 2988053 2139162 1900717 1889863 1244894 136864 -452925 -176631
37693 -176631 426984 1010868 1710813 2228927 1703430 1144 -1683257 -2170742 -1668485
37684 -1668485 -1178472 -1054173 -889430 -508345 -250298 -321970 -528036 -709828 -959708 -1352009
37674 -1352009 -1849069 -2423595 -2854366 -2526779 -1055115 828441 1640354 721680 -925888
37665 -925888 -1648591 -739062 1092764 2492536 2503569 1177450 -521958 -1526983 -1545500
37656 -1545500 -1080279 -649704 -315337 -21394 41812 -292026 -779566 -950419 -604906 -11197
37646 -11197 293977 -96240 -1023526 -1705288 -1422377 -360356 519984 515394 -230330 -1157945
37636 -1157945 -1811922 -1831359 -1053173 55163 637659 530377 526452 1071390 1380492 678396
$$ packed form
37702B957115N96037n65099q48891k38445j0854o44969j108030n89789K76294
37693a76631O03615N83884O99945N18114n25497j702286j684401m87485N02257
37684a668485M90013J24299J64743L81085K58047p1672k06066j81792k49880l92301
37674a352009m97060n74526m30771L27587J471664J883556Q11913r18674j647568
37665i25888p22703R09529J831826J399772J1033j326119j699408j005025j8517
37656a545500M65221M30575L34367K93943O3206l33838m87540j70853L45513N93709
37646a1197L05174l90217r27286o81762K82911J062021Q80340m590p45724r27615
37636a157945o53977j9437P78186J108336N82496j07282l925N44938L09102p02096
$$ plain form
37626 678396 -253709 56311 1529134 2419919 1696423 382550 -37916 419167 731350
37617 731350 629846 781826 1439285 1941684 1750617 1223224 1006804 1160942 1256815 1041208
37607 1041208 658211 388120 434338 823645 1267238 1257608 613926 -111943 -108548 711794
37597 711794 1463875 1237945 174145 -651789 -430252 508893 1174983 1143531 1012429 1522601
37587 1522601 2503739 3073135 2821551 2313320 2205595 2330506 2090643 1435045 834662
37578 834662 435967 -61362 -635829 -781631 -354980 108225 305917 736742 1795477
37569 1795477 2874525 3071612 2376255 1425518 465574 -587512 -1345827 -1238309 -572283
37560 -572283 -299101 -572008 -510721 289527 958836 610205 -326124 -669392 51518 1234406
$$ packed form
37626F78396r32105L10020J472823Q90785p23496j313873m20466M57083L12183
37617G31350j01504J51980O57459N02399j91067n27393k16420J54138R5873k15607
37607A041208l82997k70091M6218L89307M43593r630o43682p25869L395Q20342
37597G11794P52081k25930j063800q25934K21537R39145O66090l1452j31102N10172
37587A522601R81138N69396k51584n08231j07725J24911k39863o55598o00383
37578H34662l98695m97329n74467j45802M26651M63205J97692M30825J058735
37569A795477J079048J97087o95357r50737r59944j053086p58315J07518O66026
37560e72283K73182k72907O1287Q00248O69309l48631r36329l43268P20910J182888
$$ plain form
37550 1234406 2001843 1978246 1491403 1197468 1301616 1254338 662739 200453 713706 1608288
37540 1608288 1418663 125747 -607698 -36934 471425 -176167 -859882 -208488 878308
37531 878308 630874 -590987 -872207 143076 929938 820933 867372 1608230 2028324
37522 2028324 1455272 745508 716019 876456 596331 209786 121223 88835 200764 1177957
37512 1177957 2754085 3215097 1806046 253567 398459 1486592 1539039 483855 -28783
37503 -28783 587006 1225410 1141485 837568 728938 468123 -93569 -551042 -823420 -1253783
37493 -1253783 -1646761 -1320175 -277773 755758 1536610 2341465 2786085 2082146 739252
37484 739252 409368 1434922 2096354 1161146 -280575 -654399 -251926 -301541 -706539
$$ packed form
37550A234406P67437k3597m86843k93935J04148m7278n91599m62286N13253Q94582
37540A608288j89625j292916p33445N70764N08359o47592o83715O51394J086796
37531H78308k47434j221861k81220J015283P86862j09005M6439P40858M20094
37522B028324n73052p09764k9489J60437k80125l86545q8563l2388J11929R77193
37512A177957J576128M61012j409051j552479J44892J088133N2447j055184n12638
37503b8783O15789O38404q3925l03917j08630k60815n61692m57473k72378m30363
37493a253783l92978L26586J042402J033531P80852Q04855M44620p03939j342894
37484G39252l29884J025554O61432r35208j441721l73824M02473m9615m04998
$$ plain form
37475 -706539 -407592 500773 682798 -425267 -1856177 -2543958 -2467232 -2149413 -1889568
37466 -1889568 -1757336 -1696644 -1419360 -697498 144004 495924 255822 -116498 -347937 -693813
37456 -693813 -1465455 -2542605 -3353982 -3177609 -1758294 80541 910626 301723 -531550
37447 -531550 -344367 440029 591628 107330 46180 531844 486903 -365154 -776748 45677
37437 45677 1085907 1138814 686272 925088 1735170 2028213 1675097 1607154 2050380 2072034
37427 2072034 1194139 231222 -40897 -21710 -324300 -511118 182731 1334529 1691069
37418 1691069 993674 361781 567165 916644 497239 -249030 -168402 779733 1437518 1185569
37408 1185569 705759 716778 934993 858917 751717 1086017 1652301 2025099 2342637 2736159
$$ packed form
37475g06539K98947R08365J82025j108065j430910o87781P6726L17819K59845
37466a889568J32232O0692K77284P21862Q41502L51920k40102l72320k31439l45876
37456f93813p71642j077150q11377J76373J419315J838835Q30085o08903q33273
37447e31550J87183P84396J51599m84298o1150M85664m4941q52057m11594Q22425
37437D5677J040230N2907m52542K38816Q10082K93043l53116o7943M43226K1654
37427B072034q77895r62917k72119J9187l02590j86818O93849J151798L56540
37418A691069o97395o31893K05384L49479m19405p46269Q0628R48135O57785k51949
37408A185569m79810J1019K18215p6076j07200L34300N66284L72798L17538L93522
$$ plain form
37398 2736159 2573344 1409835 239321 401170 1421013 1487309 224383 -642051 65410
37389 65410 1211342 1158332 47544 -877940 -1204720 -1318618 -1167572 -382036 738106
37380 738106 1469764 1657213 1604385 1371192 1014709 1010131 1476941 1545463 591347 -452675
37370 -452675 -297409 646146 839067 -48383 -866061 -892553 -483907 98872 868626 1098671
37360 1098671 -50646 -1626962 -1517242 462026 2011239 1680021 827589 1139002 2067979
37351 2067979 2281857 2019920 2181167 2337668 1620550 653526 635458 1178354 998275 235787
37341 235787 114304 631797 612168 -67102 -310217 78984 147552 -61334 809423 2952228
37331 2952228 4505078 4080070 2575939 1466839 769645 -105725 -773497 -539559 192343
$$ packed form
37398B736159j62815j163509j170514J61849J019843O6296j262926q66434P07461
37389F5410J145932n3010j110788r25484l26780j13898J51046P85536J120142
37380G38106P31658J87449n2828k33193l56483m578M66810O8522r54116j044022
37370d52675J55266R43555J92921q87450q17678k6492M08646N82779P69754K30045
37360A098671j149317j576316J09720J979268J549213l31218q52432L11413R28977
37351B067979K13878k61937J61247J56501p17118r67024j8068N42896j80079p62488
37341B35787j21483N17493j9629o79270k43115L89201O8568k08886Q70757K142805
37331B952228J552850m25008j504131j109100o97194q75370o67772K33938P31902
$$ plain form
37322 192343 454393 99506 -345390 -657853 -858730 -727997 -224660 142639 107680 177565
37312 177565 637389 832972 394662 327979 1599714 3250637 3403588 1911355 535787
37303 535787 418206 735598 268413 -808735 -1372696 -971253 -370167 -587496 -1594341
37294 -1594341 -2085884 -888235 1334025 2503213 1713994 505103 664810 1657981 1635030
37285 1635030 410058 -332799 269079 1155018 1273336 926917 552869 -235220 -1408903
37276 -1408903 -1733464 -493163 1043077 1252402 474981 288379 1055574 1736590 1852589
37267 1852589 2012054 2369194 2114073 1021261 202021 498516 1096695 711368 -466773
37258 -466773 -1035627 -324948 884623 1606132 1760912 1751603 1574469 922921 -63785 -698251
$$ packed form
37322A92343K62050l54887m44896l12463k00877J30733N03337L67299l4959O9885
37312A77565M59824J95583m38310o6683J271735J650923J52951j492233j375568
37303E35787j17581L17392m67185j077148n63961M01443O01086k17329j006845
37294a594341m91543J197649K222260J169188p89219j208891J59707R93171k2951
37285A635030j224972p42857O01878Q85939J18318l46419l74048p88089j173683
37276a408903l24561J240301J536240K09325p77421j86602P67195O81016J15999
37267A852589J59465L57140k55121j092812q19240K96495N98179l85327j178141
37258d66773n68854P10679J209571P21509J54780r309j77134o51548r86706o34466
$$ plain form
37248 -698251 -503125 215476 748075 825071 859220 1296601 1940789 2192337 1920526 1708175
37238 1708175 1998881 2348740 2022152 1175116 775679 1227428 1787397 1740439 1455523 1610704
37228 1610704 1980579 1952449 1825992 2370430 3195090 2960683 1508665 383093 591925
37219 591925 1183552 1009366 646710 1204989 2193997 2252379 1459805 1190408 1843466 2411312
37209 2411312 2387359 2448234 2892712 2972887 2377125 1984198 2389637 2890068 2736996 2288368
37199 2288368 2041689 1596764 639980 50239 790498 2278309 3047683 2712368 2250044
37190 2250044 2536756 3463078 4348720 4513714 3626674 2141285 1195049 1498205 2523853
37181 2523853 3232496 3234688 2810122 2311815 2110091 2562010 3403922 3749753 3330537 3043471
$$ packed form
37248f98251J95126P18601N32599P6996L4149M37381O44188K51548k71811k12351
37238A708175K90706L49859l26588q47036l99437M51749N59969m6958k84916J55181
37228A610704L69875k8130j26457N44438Q24660k34407j452018j125572K08832
37219E91925N91627j74186l62656N58279R89008N8382p92574k69397O53058N67846
37209B411312k3953O0875M44478Q0175n95762l92927M05439N00431j53072m48628
37199B288368k46679m44925r56784n89741P40259J487811P69374l35315m62324
37190B250044K86712R26322Q85642J64994q87040j485389r46236L03156J025648
37181B523853P08643K192m24566m98307k01724M51919Q41912L45831m19216k87066
$$ plain form
37171 3043471 3538822 4102125 3913346 3534406 3864528 4394828 4062837 3283262 3357222 4124151
37161 4124151 4093300 3000579 2345775 2941479 3678438 3452584 2777608 2557498 2554865 2156517
37151 2156517 1700588 1972680 2987346 4071522 4649192 4422573 3460877 2618954 3057812
37142 3057812 4713722 6013713 5793481 4754618 4287033 4575414 4740992 4305909 3639427
37133 3639427 3288313 3542387 4344175 5128014 5186463 4629858 4390822 4819399 5046626 4393541
37123 4393541 3601056 3770325 4730949 5419430 5370717 4904014 4293021 3701394 3535839 3919864
37113 3919864 4198607 3903532 3769807 4712900 6172998 6733693 6233440 5974798 6755000
37104 6755000 7900096 8518194 8622617 8596818 8455351 8153323 7980034 8181157 8617187
$$ packed form
37171C043471M95351N63303j88779l78940L30122N30300l31991p79575P3960P66929
37161D124151l0851j092721o54804N95704P36959k25854o74976k20110k633l98348
37151B156517m55929K72092J014666J084176N77670k26619r61696q41923M38858
37142C057812J655910J299991k20232j038863m67585K88381J65578m35083o66482
37133C639427l51114K54074Q01788P83839N8449n56605k39036M28577K27227o53085
37123D393541p92485J69269R60624O88481m8713m66703o10993n91627j65555L84025
37113C919864K78743k95075j33725R43093J460098N60695n00253k58642P80202
37104F755000J145096O18098J04423k5799j41467l02028j73289K01123M36030
$$ plain form
37095 8617187 9052823 9370443 9368958 8843469 8022349 7479702 7477827 7775376 8129243 8577920
37085 8577920 9178925 9802422 10181604 9976998 9068785 8042591 7847226 8491141 8778612
37076 8778612 8105347 7696145 8834079 10544198 10707215 9214251 8179358 8855958 10157625
37067 10157625 10709890 10586675 10243896 9456487 8420717 8371111 9729132 10920592 10538552
37058 10538552 9569734 9788316 10876808 11113226 10353733 10167895 11044177 11585793 10959138
37049 10959138 10243010 10467132 10878652 10331761 9253887 8926877 9530565 10163711 10407024
37040 10407024 10662323 11043862 11021863 10368850 9665172 9574094 10143431 11011789 11811106 12186929
37030 12186929 11937889 11415012 11322674 11770107 11928204 11070551 9619739 8623587 8436909
$$ packed form
37095H617187M35636L17620j485n25489q21120n42647j875K97549L53867M48677
37085H577920O01005O23497L79182k04606r08213j026194j95365O43915K87471
37076H778612o73265m09202J137934J710119J63017j492964j034893O76600J301667
37067A0157625N52265j23215l42779p87409j035770m9606J358021J191460l82040
37058A0538552r68818K18582J088492K36418p59493j85838Q76282N41616o26655
37049A0959138p16128K24122M11520n46891j077874l27010O03688O33146K43313
37040A0407024K55299L81539k1999o53013p03678r1078N69337Q68358P99317L75823
37030A2186929k49040n22877r2338M47433J58097q57653j450812r96152j86678
$$ plain form
37021 8436909 8563908 8680309 9010859 9535418 9636489 9032051 8455764 8755454 9692933
37012 9692933 10328871 10367114 10373380 10718916 11074756 11112663 11019666 10983660 10715086 9931691
37002 9931691 8966610 8426048 8418521 8530367 8490250 8492272 8820191 9426203 9998767 10284356
36992 10284356 10211056 9818293 9299699 9113840 9692115 10740879 11119759 9979445 7969843
36983 7969843 6657915 6638030 7012101 7043514 7292190 8280774 8984256 8051163 6099455
36974 6099455 5223045 6152710 7427436 7773003 7776543 8347938 8849846 8103993 6513882
36965 6513882 5768534 6620345 8091737 8906178 8763111 8056479 7165409 6373446 5935165
36956 5935165 5821702 5657195 5181719 4677969 4788628 5867324 7442880 8385536 7898761
$$ packed form
37021H436909J26999J16401L30550N24559J01071o04438n76287K99690R37479
37012I692933O35938L8243O266L45536L55840L7907r2997l6006k68574p83395
37002I931691r65081n40562p527J11846m0117K022L27919O06012N72564K85589
36992A0284356p3300l92763n18594j85859N78275J048764L78880j140314k009602
36983G969843j311928j9885L74071L1413K48676R88584P03482r33093j951708
36974F099455q76410R29665J274726L45567L540N71395N01908p45853j590111
36965F513882p45348Q51811J471392Q14441j43067p06632q91070p91963m38281
36956E935165j13463j64507m75476n03750J10659J078696J575556R42656m86775
$$ plain form
36947 7898761 6427336 5211504 4792976 4496066 3743695 3209606 3830728 5090024 5447443
36938 5447443 4591602 4114758 5339400 7342970 8072436 6934535 5210353 4044561 3237615
36929 3237615 2386786 2047444 2791928 3831233 3820480 2848116 2418728 3319144 4623440
36920 4623440 5157611 4855047 4127627 3024447 1861846 1654039 2757736 3856916 3566531
36911 3566531 2459998 2160955 2923573 3655878 4036052 4845150 6109925 6657001 5964904
36902 5964904 4954984 4401365 3957348 3366616 3241012 3831311 4266046 3894442 3306890
36893 3306890 3176938 3143343 2729689 2376405 2630662 3200315 3650718 4115696 4537201 4292067
36883 4292067 3476004 3365709 4507406 5553512 5299868 4689956 5222728 6396462 6530301
$$ packed form
36947G898761j471425j215832m18528k96910p52371n34089O21122J259296L57419
36938E447443q55841m76844J224642K003570P29466j137901j724182j165792q06946
36929C237615q50829l39342P44484J039305j0753r72364m29388R00416J304296
36920D623440N34171l02564p27420j103180j162601k07807J103697J099180k90385
36911C566531j106533k99043P62618P32305L80174Q09098J264775N47076o92097
36902E964904j009920n53619m44017n90732j25604N90299M34735l71604n87552
36893C306890j29952l3595m13654l53284K54257N69653M50403M64978M21505k45134
36883D292067q16063j10295J141697J046106k53644o09912N32772J173734J33839
$$ plain form
36874 6530301 5393845 4196042 3482596 2859253 2435845 2707718 3162434 2773309 1865774
36865 1865774 1803411 2718382 3195104 2495256 1629196 1800272 2949056 4171662 4650900
36856 4650900 4064198 2902600 2237818 2364174 2196954 1049076 142747 811810 2080653
36847 2080653 2081447 1207706 1399125 2631857 2918416 1944440 1746027 3069806 3964034 3173666
36837 3173666 2212881 2494151 2907200 2186680 1483411 2329009 3792144 4011583 3213360
36828 3213360 2880479 2996380 2471273 1573767 1620332 2593431 3144698 2836722 2562340 2770266
36818 2770266 2894740 2599152 2212601 1911212 1634755 1697922 2369912 3039234 2868644 2035180
36808 2035180 1335264 976699 796870 1099615 2042499 2756694 2422452 1671152 1488446
$$ packed form
36874F530301j136456j197803p13446o23343m23408K71873M54716l89125r07535
36865A865774o2363R14971M76722o99848q66060J71076J148784J222606M79238
36856D650900n86702j161598o64782J26356j67220j147878r06329O69063J268843
36847B080653P94q73741J91419J232732K86559r73976j98413J323779Q94228p90368
36837C173666r60785K81270M13049p20520p03269Q45598J463135K19439p98223
36828C213360l32881J15901n25107q97506M6565R73099N51267l07976k74382K07926
36818B770266J24474k95588l86551l01389k76457O3167O71990O69322j70590q33464
36808B035180o99916l58565j79829L02745R42884P14195l34242p51300j82706
$$ plain form
36799 1488446 1359535 243587 -1106887 -850828 1001900 2390405 2175177 1414318 1275381
36790 1275381 1510189 1626943 1889618 2357325 2398682 1979711 2076491 2947695 3303474 2198907
36780 2198907 608192 7400 339632 552993 415773 567005 1188363 1761533 2016219
36771 2016219 2228776 2559411 2737047 2510084 2054015 1844410 2182560 2746080 2715109 1685227
36761 1685227 349765 -206892 200969 847702 1213384 1324740 1073682 223042 -730748
36752 -730748 -747211 305131 1317474 1522675 1482602 1912969 2433823 2307769 1741439 1556644
36742 1556644 1960892 2407942 2422755 1971179 1275036 780280 1023158 1998842 2869240 2753098
36732 2753098 1661107 350280 -504262 -708541 -422760 20635 359682 677813 1240671
$$ packed form
36799A488446j28911j115948j350474K56059J852728J388505k15228p60859j38937
36790A275381K34808J16754K62675M67707M1357m18971R6780Q71204L55779j104567
36780B198907j590715o00792L32232K13361j37220J51232O21358N73170K54686
36771B016219K12557L30635J77636k26963m56069k09605L38150N63520l0971j029882
36761A685227j335462n56657M07861O46733L65682J11356k51058q50640r53790
36752g30748j6463J052342J012343K05201m0073M30367N20854j26054n66330j84795
36742A556644M04248M47050J4813m51576o96143m94756K42878R75684Q70398j16142
36732B753098j091991j310827q54542k04279K85781M43395L39047L18131N62858
$$ plain form
36723 1240671 1991554 2544479 2737647 2780407 2796961 2697702 2534068 2421827 2095069 1219293
36713 1219293 211798 -36057 592686 1292221 1613795 1966081 2548903 2786643 2291323
36704 2291323 1483123 789929 153243 -243029 140015 991471 1026760 -127190 -1085749
36695 -1085749 -695020 274181 498783 20174 -461185 -1051892 -1926053 -2178342 -1137487
36686 -1137487 83972 219233 155590 1431467 3136274 2930981 938544 -228728 335660
36677 335660 521945 -953242 -2195714 -1270846 646903 1318851 826876 672812 873749
36668 873749 379664 -462445 -309446 640014 778166 -199748 -780796 -149158 652408 639805
36658 639805 326522 470930 736647 507978 36396 -83682 163467 501667 893247 1226231
$$ packed form
36723A240671P50883N52925J93168M2760J6554r9259j63634j12241l26758q75776
36713A219293j007495k47855O28743O99535L21574L52286N82822K37740m95320
36704B291323q08200o93194o36686l96272L83044Q51456L5289j153950r58559
36695a085749L90729R69201K24602m78609m81359n90707q74161k52289J040855
36686a137487J221459J35261o3643J275877J704807k05293j992437j167272N64388
36677C35660J86285j475187j242472R24868J917749O71948m91975j54064K00937
36668H73749m94085q42109J52999R49460J38152r77914n81048O31638Q01566j2603
36658F39805l13283J44408K65717k28669m71582j20078K47149L38200L91580L32984
$$ plain form
36648 1226231 1187762 963701 1258155 2051196 2257096 1368654 488629 725543 1449988 1412210
36638 1412210 856125 960193 1612736 1543548 693245 595874 1861329 2953685 2433124
36629 2433124 1063724 492544 848570 1003261 566481 243245 473244 911686 1185934
36620 1185934 1190192 722537 -234383 -942222 -545429 722701 1813855 2253913 2327863 2002130
36610 2002130 851473 -777583 -1704052 -1399380 -559281 117600 668157 1050257 826759
36601 826759 240780 349956 1292504 1681353 779956 40000 1045233 2946457 3667046
36592 3667046 2956504 2307225 2172157 1410406 -246512 -1238411 -525565 727780 904326
36583 904326 150135 -309730 -126602 137940 299091 615464 877679 590972 25551 79437
$$ packed form
36648A226231l8469k24061K94454P93041K05900q88442q80025K36914P24445l7778
36638A412210n56085J04068O52543o9188q50303r7371J265455J092356n20561
36629B433124j369400n71180L56026J54691m36780l23236K29999M38442K74248
36620A185934M258m67655r56920p07839L96793J268130J091154M40058P3950l25733
36610B002130j150657j629056r26469L04672Q40099O76881N50557L82100k23498
36601H26759n85979J09176R42548L88849r01397p39956J005233J901224P20589
36592C667046p10542o49279j35068p61751j656918r91899P12846J253345J76546
36583I04326p54191m59865J83128K64542J61151L16373K62215k86707n65421N3886
$$ plain form
36573 79437 937126 1672402 1450018 494332 -438052 -1005816 -1266533 -1082589 -148636 1330930
36563 1330930 2429089 2322489 1300330 666820 1455371 3329437 4903579 5074091 3889080
36554 3889080 2254653 1092858 769996 997634 1116676 652604 -251358 -987139 -1066719
36545 -1066719 -487501 382049 1091008 1344878 1182947 914436 742641 576921 403933
36536 403933 588297 1379692 2270642 2398763 1639129 805784 655179 1139448 1751340 2075644
36526 2075644 1777817 629704 -976740 -1929225 -1385688 243081 1722021 2316808 2281333
36517 2281333 2076828 1656720 826056 -45397 -216190 463133 1243055 1437391 1328477
36508 1328477 1588217 2048691 1860718 927991 227129 298133 394172 -127355 -513636 154325
$$ packed form
36573G9437Q57689P35276k22384r55686r32384n67764k60717J83944R33953J479566
36563A330930J098159j06600j022159o33510P88551J874066J574142J70512j185011
36554C889080j634427j161795l22862K27638J19042m64072r03962p35781p9580
36545a066719N79218Q69550P08959K53870j61931k68511j71795j65720j72988
36536D03933J84364P91395Q90950J28121p59634q33345j50605M84269O11892L24304
36526B075644k97827j148113j606444r52485N43537J628769J478940N94787l5475
36517B281333k04505m20108q30664q71453j70793O79323P79922J94336j08914
36508A328477K59740M60474j87973r32727p00862P1004R6039n21527l86281O67961
$$ plain form
36498 154325 1199348 1293260 722155 955148 1958193 1858988 -114064 -2126788 -2258653
36489 -2258653 -1125901 -629762 -1105157 -1261424 -450178 473870 499109 -402507 -1490048
36480 -1490048 -1846319 -898104 935993 2302767 2289507 1486896 1038079 1062836 893859
36471 893859 483405 468167 935552 1176031 757588 -1091 -672663 -1045957 -845554 20241
36461 20241 955478 1306770 1441684 2176930 3148942 3014165 1543229 208242 106158
36452 106158 523454 412228 179060 789593 1822325 1832859 505145 -787354 -789828 174869
36442 174869 948489 1093687 1144626 1557583 1988019 1817336 1104612 556532 468463 197086
36432 197086 -872534 -2200463 -2613904 -1821397 -661018 161429 734119 1165372 1119691
$$ packed form
36498A54325J045023R3912n71105K32993J003045r9205j973052k012724j31865
36489b258653J132752M96139m75395j56267Q11246R24048K5239r01616j087541
36480a490048l56271R48215J834097J366774j3260q02611m48817K4757j68977
36471H93859m10454j5238M67385K40479m18443p58679o71572l73294K00403Q65795
36461B0241R35237L51292J34914P35246R72012j34777j470936j334987j02084
36452A06158M17296j11226k33168O10533J032732J0534j327714j292499k474R64697
36442A74869P73620J45198N0939M12957M30436j70683p12724n48080q8069k71377
36432A97086j069620j327929m13441P92507J160379Q22447N72690M31253m5681
$$ plain form
36423 1119691 669143 763227 1978825 3283573 3007153 982559 -1053621 -1390061 -203192
36414 -203192 764981 221818 -1195931 -1624044 -226189 1594551 1765100 155579 -1197211
36405 -1197211 -652172 1130275 2334159 2232297 1499297 855748 382624 25874 -72335
36396 -72335 127203 432279 649691 654316 387284 98453 288591 970939 1323725 653121
36386 653121 -560786 -1201236 -874459 -78227 735790 1420636 1553259 602620 -1046106
36377 -1046106 -2070109 -1677227 -514418 323848 666744 1111688 1883518 2490524 2432397
36368 2432397 1733605 707700 -399935 -1337173 -1701077 -1237571 -300631 290194 56851
36359 56851 -622554 -1012585 -874917 -543218 -332749 -322909 -610461 -1195814 -1626099 -1430223
$$ packed form
36423A119691m50548R4084J215598J304748k76420k024594k036180l36440J186869
36414b03192R68173n43163j417749m28113J397855J820740J70549j609521j352790
36405a197211N45039J782447J203884j01862p33000o43549m73124l56750r8209
36396g2335J99538L05076K17412M625k67032k88831J90138O82348L52786o70604
36386F53121j213907o40450L26777P96232Q14017O84846J32623r50639j648726
36377a046106j024003L92882J162809Q38266L42896M44944P71830O07006n8127
36368B432397o98792j025905j107635r37238l63904M63506R36940N90825k33343
36359E6851o79405l90031J37668L31699K10469R840k87552n85353m30285J95876
$$ plain form
36349 -1430223 -1000679 -1254431 -2187892 -2662710 -2056646 -1194914 -1016552 -1255193 -1247208 -1066296
36339 -1066296 -788144 371350 2686296 4432761 3596155 804374 -1249433 -1323979 -772775
36330 -772775 -964764 -1482116 -1536133 -1399040 -1416499 -1057187 -75487 609349 365517 86546
36320 86546 738814 1650397 1616900 929518 840960 1534286 2049656 1918296 1558766 1284832
36310 1284832 1166926 1652699 3009401 4264416 4065717 2646657 1593715 1524445 1439322
36301 1439322 745578 381218 1088970 1892849 1523220 497521 407630 1515594 2394980
36292 2394980 2025903 1083442 694867 778750 377021 -758078 -1747546 -1834161 -1355964 -1056168
36282 -1056168 -900260 -264955 861010 1665898 1654349 1236165 849812 297888 -466767
$$ packed form
36349a430223M29544k53752r33461m74818O06064Q61732J78362k38641P985J80912
36339a066296K78152J159494K314946J746465q36606k791781k053807p4546N51204
36330g72775j91989n17352n4017J37093j7459L59312R81700O84836k43832k78971
36320H6546O52268R11583l3497o87382q8558O93326N15370j31360l59530k73934
36310A284832j17906M85773J356702J255015j98699j419060j052942o9270q5123
36301A439322o93744l64360P07752Q03879l69629j025699q9891J107964Q79386
36292B394980l69077r42461l88575Q3883m01729j135099r89468q6615M78197K99796
36282a056168J55908O35305J125965Q04888j1549m18184l86353n51924p64655
$$ plain form
36273 -466767 -691564 116627 1075157 1008154 296330 362711 1410742 2085795 1615895 836726
36263 836726 515288 98867 -863970 -1335767 -286939 1258931 1373298 69868 -738026
36254 -738026 -203566 297156 -426717 -1424955 -1190871 -35460 532945 120592 -323481
36245 -323481 -276294 -175456 -197403 44805 310639 -316760 -1710424 -2330941 -1481546 -613336
36235 -613336 -1115690 -1997274 -1497475 -141030 -8233 -1242306 -1695174 -484076 465588
36226 465588 -450736 -1910717 -1867406 -776726 -573342 -1422269 -1711516 -909285 -299826
36217 -299826 -734519 -1496464 -1806722 -1852493 -1779190 -1164008 -236284 -229991 -1488816 -2358092
36207 -2358092 -1235656 1040407 2224286 1687451 995103 1405657 2138612 1755058 351252
$$ packed form
36273d66767k24797Q08191R58530o7003p11824O6381J048031O75053m69900p79169
36263H36726l21438m16421r62837m71797J048828J545870J14367j303430q07894
36254g38026N34460N00722p23873r98238K34084J155411N68405m12353m44073
36245c23481M7187J00838k1947K42208K65834o27399j393664o20517Q49395Q68210
36235f13336n02354q81584M99799J356445J32797j234073m52868J211098R49664
36226D65588r16324j459981M3311J090680K03384q48927k89247Q02231O09459
36217b99826m34693p61945l10258m5771P3303O15182R27724O293j258825q69276
36207b358092J122436K276063J183879n36835o92348M10554P32955l83554j403806
$$ plain form
36198 351252 -583535 -208550 679229 885762 354374 -54017 100181 428456 546088 546040
36188 546040 486585 159102 -283195 -198045 525676 1030006 747759 393625 795892 1380753
36178 1380753 989726 -224167 -1043614 -1119441 -1227145 -1578258 -1410224 -604158 -208149
36169 -208149 -684790 -974984 -183395 940323 1191985 621779 11470 -494184 -1070268
36160 -1070268 -1239808 -520176 405265 450236 -196221 -413235 -41845 -106474 -990740 -1670085
36150 -1670085 -1243239 -196989 496132 743097 1038188 1339735 1065388 52982 -1107909
36141 -1107909 -1722128 -1562609 -835916 10443 409386 29946 -780055 -1207581 -896595
36132 -896595 -432003 -586519 -1284747 -1764871 -1661388 -1340781 -1117036 -836166 -501553 -555897
$$ packed form
36198C51252r34787L74985Q87779K06533n31388m08391J54198L28275J17632m8
36188E46040n9455l27483m42297Q5150P23721N04330k82247l54134M02267N84861
36178A380753l91027j213893q19447p5827j07704l51113J68034Q06066L96009
36169b08149m76641k90194P91589J123718K51662n70206o10309n05654n76084
36160a070268j69540P19632R25441M4971o46457k17014L71390o4629q84266o79345
36150a670085M26846J046250O93121K46965K95091L01547k74347j012406j160891
36141a107909o14219J59519P26693Q46359L98943l79440q10001m27526L10986
36132h96595M64592j54516o98228m80124J03483L20607K23745K80870L34613n4344
$$ plain form
36122 -555897 -1028841 -1126864 -409906 266248 -77718 -955594 -1109373 -400511 262547 635933
36112 635933 1298326 2079794 1949073 865866 205012 675624 1239323 926229 364507
36103 364507 451916 738434 405223 -131141 41761 719327 1024153 867728 696086 330959
36093 330959 -589415 -1446451 -1335029 -700047 -908580 -2214456 -3373344 -3343199 -2295645
36084 -2295645 -909187 301466 893511 728942 410373 633964 1105166 957165 181461
36075 181461 -315295 -88503 357551 518872 433040 197118 -221666 -617561 -697010 -546737
36065 -546737 -331371 140355 804356 912598 300728 335439 2022264 3798312 3274960
36056 3274960 929585 -312411 615852 1599208 1054162 289169 695355 1043273 -238283
$$ packed form
36122e55897m72944r8023P16958O76154l43966q77876j53779P08862O63058L73386
36112F35933O62393P81468j30721j083207o60854M70612N63699l13094n61722
36103C64507Q7409K86518l33211n36364J72902O77566L04826j56425j71642l65127
36093C30959r20374q57036J11422O34982k08533j305876j158888L0145J047554
36084b295645J386458J210653N92045j64569l18569K23591M71202j48001p75704
36075A81461m96756K26792M46054J61321q5832k35922m18784l95895p9449J50273
36065e46737K15366M71726O64001J08242o11870L4711J686825J776048n23352
36056C274960k345375j241996R28263R83356n45046p64993M06186L47918j281556
$$ plain form
36047 -238283 -1952919 -1883095 -485460 -174750 -1429953 -2187299 -1184118 393139 1100933
36038 1100933 1153000 1372066 1732038 1815799 1620786 1150591 152119 -1035450 -1287976 -197622
36028 -197622 976089 819866 -253905 -555198 547488 1842401 1995118 1229121 810272
36019 810272 1331779 2098743 2108372 1172205 -8622 -552569 -69495 1078901 2008178 2020482
36009 2020482 1246420 381159 -254392 -937664 -1658342 -1698885 -705740 372751 298848 -785723
35999 -785723 -1624012 -1626707 -1383371 -1372910 -1248158 -706365 -115943 171282 357905 620531
35989 620531 685144 388987 29920 -191218 -444332 -723585 -747072 -646257 -940643 -1578301
35979 -1578301 -1927409 -1959253 -2295163 -2748514 -2266301 -987792 -757204 -2436899 -4193458
$$ packed form
36047b38283j714636O9824J397635L10710j255203p57346J003181J577257P07794
36038A100933N2067K19066L59972Q3761j95013m70195r98472j187569k52526J090354
36028a97622J173711j56223j073771l01293J102686J294913J52717p65997m18849
36019H10272N21507P66964R629r36167j180827n43947M83074J148396R29277J2304
36009B020482p74062q65261o35551o83272p20678m0543R93145J078491p3903j084571
35999g85723q38289k695K43336J0461J24752N41793N90422K87225J86623K62626
35989F20531O4613k96157l59067k21138k53114k79253k3487J00815k94386o37658
35979a578301l49108l1844l35910m53351M82213J278509K30588j679695j756559
$$ plain form
35970 -4193458 -3970988 -2386301 -1380465 -1121327 -432026 464012 182956 -945030 -834887
35961 -834887 947001 2067274 817544 -1291909 -1790108 -668437 145343 -137864 -415725
35952 -415725 168401 916519 836360 171960 -48854 430130 697454 -70215 -1402946 -1970655
35942 -1970655 -1089634 615464 2032640 2542509 2123803 1166963 463350 658021 1288603
35933 1288603 1142512 91806 -400186 568116 1742494 1537167 516849 395333 1206491
35924 1206491 1436981 731098 344148 698701 603457 -467138 -1290297 -1053141 -828491
35915 -828491 -1669934 -2741183 -2753342 -2032111 -1643055 -1457466 -703693 278507 506705 175382
35905 175382 383478 1149202 1218115 62048 -1204885 -1321111 -348552 766963 1377936
$$ packed form
35970d193458K22470J584687J005836K59138O89301Q96038k81056j127986J10143
35961h34887J781888J120273j249730k109453m98199J121671Q13780k83207k77861
35952d15725N84126P48118q0159o64400k20814M78984K67324p67669j332731n67709
35942a970655Q81021J705098J417176N09869m18706r56840p03613J94671O30582
35933A288603j46091j050706m91992R68302J174378k05327j020318j21516Q11158
35924A206491K30490p05883l86950L54553r5244j070595q23159K37156K24650
35915h28491q41443j071249j2159P21231L89056J85589P53773R82200K28198l31323
35905A75382K08096P65724O8913j156067j266933j16226R72559J115515O10973
$$ plain form
35896 1377936 1447970 1192868 836538 525220 285878 141607 207639 535696 1011090 1530251
35886 1530251 2006471 2063264 1199002 -378060 -1509118 -1178407 383434 2008615 2677188
35877 2677188 2049580 483149 -1016306 -1395397 -682783 -75053 -377507 -926021 -713330
35868 -713330 24599 226805 -434530 -1328170 -1857046 -1798225 -1018950 173025 734399 42190
35858 42190 -891992 -557678 823563 1503996 719408 -366853 -558280 -155110 -16212
35849 -16212 -246233 -570616 -1082452 -1783104 -2083851 -1563570 -702060 -210388 -150299 -285015
35839 -285015 -659161 -1121251 -905637 402409 1922342 2439188 2021508 1736402 1944170
35830 1944170 1934707 1331137 790900 877874 1057757 469885 -757830 -1610736 -1438164 -604087
$$ packed form
35896A377936P0034k55102l56330l11318k39342j44271O6032L28057M75394N19161
35886A530251M76220N6793q64262j577062j131058L30711J561841J625181O68573
35877B677188o27608j566431j499455l79091P12614O07730l02454n48514K12691
35868g13330P37929K02206o61335q93640n28876N8821P79275J191975N61374o92209
35858D2190r34182L34314J381241O80433p84588j086261j91427M03170J38898
35849a6212k30021l24383n11836p00652l00747N20281Q61510M91672O0089j34716
35839b85015l74146m62090K15614J308046J519933N16846m17680k85106K07768
35830A944170r463o03570n40237Q6974J79883n87872j227715q52906J72572Q34077
$$ plain form
35820 -604087 67494 88729 -491432 -1313662 -1939718 -2069207 -1759408 -1358045 -1062681 -672687
35810 -672687 -21571 490213 270663 -474997 -683378 270226 1642540 2203053 1740361
35801 1740361 1095372 907494 1038208 1199841 1411687 1670099 1788914 1768728 1788501 1707928
35791 1707928 1202726 534328 421324 859216 910735 170301 -403621 124119 1145499
35782 1145499 1343959 610626 78990 377442 802647 347799 -1131869 -2863110 -3734648
35773 -3734648 -3027646 -1207805 91989 -383798 -1944624 -2627173 -1496501 449738 1757070
35764 1757070 2049139 1821634 1552649 1528704 1907987 2388391 2284276 1431668 577204 390901
35754 390901 564352 447532 116648 88469 285907 102828 -575600 -1169505 -1310333 -1311752
$$ packed form
35820f04087O71581K1235n80161q22230o26056j29489L09799M01363K95364L89994
35810f72687O51116N11784k19550p45660k08381R53604J372314N60513m62692
35801A740361o44989j87878J30714J61633K11846K58412J18815k0186J9773q0573
35791A707928n05202o68398j13004M37892N1519p40434n73922N27740J021380
35782A145499J98460p33333n31636K98452M25205m54848j479668j731241q71538
35773c734648P07002J819841J299794m75787j560826o82549J130672J946239J307332
35764A757070K92069k27505k68985k3945L79283M80404j04115q52608q54464j86303
35754C90901J73451j16820l30884k8179J97438j83079o78428n93905j40828j419
$$ plain form
35744 -1311752 -1550441 -1907903 -2087891 -2081877 -2017457 -1807842 -1249955 -384952 399423 616546
35734 616546 73119 -858693 -1441881 -1254988 -599843 -13501 443134 996548 1412436 1109785
35724 1109785 167578 -484417 -315674 -49866 -619038 -1678547 -2014406 -1302049 -528640
35715 -528640 -469615 -641576 -291108 315667 390968 -54745 -344679 -412075 -901820 -1842973
35705 -1842973 -2260717 -1621621 -769117 -642021 -787028 -186616 906692 1249968 660643
35696 660643 427581 1265744 2084559 1612360 341897 -199720 384499 1001859 698978
35687 698978 -309689 -1272159 -1735342 -1592785 -967999 -269343 131716 391182 875481
35678 875481 1334398 1051928 3640 -815644 -581440 404402 1356290 2072986 2807917
$$ packed form
35744a311752k38689l57462j79988O014O4420K09615N57887Q65003P84375K17123
35734F16546n43427r31812n83188J86893O55145N86342M56635N53414M15888l02651
35724A109785r42207o51995J68743K65808n69172j059509l35859P12357P73409
35715e28640N9025j71961L50468O06775P5301m45713k89934o7396m89745r41153
35705a842973m17744O39096Q52504J27096j45007O00412J093308L43276n89325
35696F60643k33062Q38163Q18815m72199j270463n41617N84219O17360l02881
35687F98978j008667r62470m63183J42557O24786O98656M01059K59466M84299
35678H75481M58917k82470j048288q19284K34204R85842R51888P16696P34931
$$ plain form
35669 2807917 3448909 3494882 2801771 1884549 1406031 1568847 1962597 1885856 978808 -330199
35659 -330199 -1203906 -1309313 -1057718 -861293 -627757 -222460 111685 211577 383571 821782
35649 821782 1074987 688039 -7746 -376625 -359689 -169237 433660 1591814 2443089 1982545
35639 1982545 750369 339036 1053841 1475293 819213 265569 1023576 2349163 2744287
35630 2744287 2172746 1657452 1364586 691121 -76448 126328 1277886 2030985 1659431
35621 1659431 894786 430717 4933 -387319 182425 1935244 3243842 2559647 733927
35612 733927 -106879 404952 584152 -560156 -1890799 -1990722 -1158059 -695039 -1041198
35603 -1041198 -1531988 -1555423 -1126240 -516637 20310 229568 51746 -192209 -161453 59966
$$ packed form
35669B807917O40992M5973o93111r17222m78518J62816L93750p6741r07048j309007
35659c30199q73707j05407K51595J96425K33536M05297L34145R9892J71994M38211
35649H21782K53205l86948o95785l68879J6936J90452O02897J158154Q51275m60544
35639A982545j232176m11333P14805M21452o56080n53644P58007J325587L95124
35630B744287n71541n15294k92866o73465p67569K02776J151558P53099l71554
35621A659431p64645m64069m25784l92252N69744J752819J308598o84195j825720
35612G33927q40806N11831J79200j144308j330643r9923Q32663M63020l46159
35603a041198m90790k3435M29183O09603N36947K09258j77822k43955L0756K21419
$$ plain form
35593 59966 183246 190706 205423 72322 -422867 -972151 -925061 -168339 618099 768307
35583 768307 322335 -299669 -940038 -1648683 -2196284 -2084805 -1104626 359222 1638381
35574 1638381 2251620 2089177 1395594 703277 561366 1044059 1561192 1418674 626374
35565 626374 -88711 -185062 43026 -53249 -588901 -1110575 -1315837 -1348424 -1360605 -1235315
35555 -1235315 -864791 -304662 460818 1438524 2160946 1926051 895152 334340 1109590
35546 1109590 2389819 2623890 1516722 187281 -458734 -540016 -383830 -3863 263698
35537 263698 -337697 -1741230 -2514637 -1470865 633752 1904442 1571275 585710 39329
35528 39329 -98378 -410077 -934070 -1157406 -772774 5386 780180 1317866 1552183 1461667
$$ packed form
35593E9966J23280P460J4717j33101m95189n49284M7090P56722P86438J50208
35583G68307m45972o22004o40369p08645n47601J11479R80179J463848J279159
35574A638381O13239j62443o93583o92317j41911M82693N17133j42518p92300
35565F26374p15085r6351K28088r6275n35652n21674k05262l2587j2181J25290
35555a235315L70524N60129P65480R77706P22422k34895j030899n60812P75250
35546A109590J280229K34071j107168j329441o46015q1282J56186L79967K67561
35537B63698o01395j403533p73407J043772K104617J270690l33167r85565n46381
35528C9329j37707l11699n23993k23336L84632P78160P74794N37686K34317r0516
$$ plain form
35518 1461667 1068842 535304 150203 107402 287619 374373 218090 -26703 -140143 -50661
35508 -50661 220760 620302 982176 1095845 954233 742240 519737 188917 -144484 -155450
35498 -155450 157077 304615 -945 -345649 -186241 389734 916934 1265110 1546879 1536606
35488 1536606 871831 -149678 -607605 5199 1207150 2128137 2296224 1718323 644015
35479 644015 -473936 -1118071 -1141981 -928687 -902659 -1006687 -842340 -234838 522803 992494
35469 992494 1060237 1024695 1221074 1666622 2212493 2894094 3736524 4217400 3533039 1742652
35459 1742652 105795 -287971 165116 279867 -257733 -756899 -855858 -988423 -1371867
35450 -1371867 -1447602 -723900 506475 1673967 2550695 2982558 2632930 1529337 405402
$$ packed form
35518A461667l92825n33538l85101m2801J80217Q6754j56283k44793j13440Q9482
35508e0661K71421L99542L61874J13669j41612k11993k22503l30820l33401j0966
35498a55450L12527J47538l05560l44704J59408N75975N27200L48176K81769j0273
35488A536606o64775j021509m57927O12804J201951R20987J68087n77901j074308
35479F44015j117951o44135k3910K13294K6028j04028J64347O07502P57641M69691
35469I92494O7743l5542J96379M45548N45871O81601Q42430M80876o84361j790387
35459A742652j636857l93766M53087J14751n37600m99166r8959j32565l83444
35450a371867p5735P23702J230375J167492Q76728M31863l49628j103593j123935
$$ plain form
35441 405402 -38567 104974 340134 520613 729927 768799 342673 -404400 -992778 -1109020
35431 -1109020 -705425 103972 870587 896015 14351 -980617 -1233231 -893172 -682866 -675395
35421 -675395 -335435 264874 206574 -953837 -2323461 -2653357 -1784831 -664926 -186656
35412 -186656 -434011 -908008 -1073857 -693944 30957 524481 244075 -765821 -1725650
35403 -1725650 -1677128 -372499 1330241 2098056 1318175 -335193 -1592527 -1774910 -1211628
35394 -1211628 -649976 -526865 -801344 -1183487 -1349027 -1105570 -574475 -164197 -168300 -378898
35384 -378898 -314533 65469 134668 -590122 -1567898 -1700605 -787962 98655 91567 -228828
35374 -228828 203774 1178595 1453279 674673 -108486 -132077 23075 -344274 -815155 -737242
$$ packed form
35441D05402m43969J43541K35160J80479K09314L8872m26126p47073n88378j16242
35431a109020M03595Q09397P66615K5428q81664r94968k52614L40059K10306P471
35421f75395L39960O00309n8300j160411j369624l29896Q68526J119905M78270
35412a86656k47355m73997j65849L79913P24901M93524k80406j009896r59829
35403a725650M8522J304629J702740P67815p79881j653368j257334j82383N63282
35394a211628N61652J23111k74479l82143j65540K43457N31095M10278m103k10598
35384c78898O4365L80002O9199p24790r77776j32707R12643Q86617p088l20395
35374b28828M32602R74821K74684p78606p83159k3591J55152l67349m70881P7913
$$ plain form
35364 -737242 -500420 -773524 -1044878 -257345 1299470 2054463 1249047 -180017 -1079847
35355 -1079847 -1364177 -1384542 -1047087 -283892 315300 152684 -484550 -844624 -764237 -737670
35345 -737670 -1108765 -1683119 -2084270 -2164790 -2086322 -2115348 -2214329 -1867094 -667988 915325
35335 915325 1884642 1897769 1501467 1084124 461381 -161488 137681 1573923 2772003
35326 2772003 2348353 752514 -559185 -1194538 -1742179 -2078085 -1450312 -293330 -215971
35317 -215971 -1637566 -2943533 -2787820 -1904521 -1630510 -1823662 -1544112 -911474 -801060
$$ packed form
35364g37242K36822k73104k71354P87533J556815P54993q05416j429064q99830
35355a079847k84330k0365L37455P63195N99192j62616o37234l60074Q0387K6567
35345g37670l71095n74354m01151q0520P8468k9026r8981L47235J199106J583313
35335I15325R69317J3127l96302m17343o22743o22869K99169J436242J198080
35326B772003m23650j595839j311699o35353n47641l35906O27773J156982P7359
35317b15971j421595j305967J55713Q83299K74011j93152K79550O32638J10414
$$ [...]
##END NTUPLES=NMR SPECTRUM
##END=
