##TITLE=31Pdec_SR120_2
 , 24 sc
 6.4.2022
##JCAMPDX= 6.0         $$ Bruker NMR JCAMP-DX V2.0
##DATA TYPE= NMR SPECTRUM
##DATA CLASS= NTUPLES
##ORIGIN= UXNMR, Bruker Analytische Messtechnik GmbH
##OWNER= root
$$ XWIN-NMR		Version 3.5
$$ Wed Apr  6 13:48:21 2022 Russian Standard Time (UT+4h)  she@DPX200
##.OBSERVE FREQUENCY= 81.013821
##.OBSERVE NUCLEUS= ^31P
##.ACQUISITION MODE= SIMULTANEOUS
##.ACQUISITION SCHEME= undefined
##.AVERAGES= 24
##.DIGITISER RES= 16
##SPECTROMETER/DATA SYSTEM= spect
##.PULSE SEQUENCE= zgpg30
##.SOLVENT NAME= DMSO
##.SHIFT REFERENCE= (INTERNAL, DMSO, 0, 248.564)
##AUDIT TRAIL= $$ (NUMBER, WHEN, WHO, WHERE, WHAT)
$$ ##TITLE= Audit trail, XWIN-NMR		Version 3.5
$$ ##JCAMPDX= 5.01
$$ ##ORIGIN= Bruker BioSpin GmbH
$$ ##OWNER= she
$$ F:/spectra/data/she/nmr/P31/1/pdata/1/auditp.txt
$$ ##AUDIT TRAIL=  $$ (NUMBER, WHEN, WHO, WHERE, WHAT)
(   1,<2022-04-06 13:47:30.14 +0400>,<she>,<DPX200>,
      <created by zg, POWCHK disabled, PULCHK disabled
       configuration hash MD5:
       00 E9 B6 7A A2 85 ED C7 34 08 36 98 17 FE 4E 26
       data hash MD5: 32K
       3E 1C AC C1 D5 64 69 BA 69 52 37 D0 E9 7A 8B 60>)
(   2,<2022-04-06 13:47:39.76 +0400>,<she>,<DPX200>,
      <Start of raw data processing
       efp BC_mod = 2 LB = 1 FT_mod = 6 PKNL = 1 PHC0 = -9543.983 PHC1 = 94.0756 SI = 64K 
       data hash MD5: 64K
       18 2F 13 95 90 0A 87 6C 0C 4E A2 D3 E5 FA F9 09>)
(   3,<2022-04-06 13:48:00.81 +0400>,<she>,<DPX200>,
      <pk PHC0 = -2.775038 PHC1 = -12.8 
       data hash MD5: 64K
       E8 8F 13 AC 3B E5 4F 26 EB F6 99 C1 A1 90 84 23>)
$$ ##END=
$$ 
$$ hash MD5
$$ 75 EA 36 FA 6F D5 56 2E 8A F0 41 A4 EC 76 6F 58
##$RELAX= 
##$RELAX= 
##$RELAX= 
##$RELAX= 
##$RELAX= 
##$RELAX= 
##$RELAX= 
##$RELAX= 
$$ Bruker specific parameters
$$ --------------------------
##$DU= <F:/spectra>
##$EXPNO= 1
##$NAME= <P31>
##$PROCNO= 1
##$TYPE= <nmr>
##$USER= <she>
##$AMP= (0..31)
100 100 100 100 100 100 100 100 100 100 100 100 100 100 100 100 100 100 
100 100 100 100 100 100 100 100 100 100 100 100 100 100 
##$AQSEQ= 0
##$AQ_mod= 1
##$AUNM= <au_zg>
##$AUTOPOS= <>
##$BF1= 81.014009
##$BF2= 200.13
##$BF3= 200.13
##$BF4= 200.13
##$BF5= 200.13
##$BF6= 200.13
##$BF7= 200.13
##$BF8= 200.13
##$BYTORDA= 1
##$CFDGTYP= 0
##$CFRGTYP= 5
##$CHEMSTR= <none>
##$CNST= (0..31)
1 1 145 1 1 1 1 1 1 1 1 1 1 1 1 1 1 1 1 1 1 1 1 1 1 1 1 1 1 1 1 1 
##$CPDPRG= <waltz16>
##$CPDPRG1= <>
##$CPDPRG2= <waltz16>
##$CPDPRG3= <>
##$CPDPRG4= <mlev>
##$CPDPRG5= <mlev>
##$CPDPRG6= <mlev>
##$CPDPRG7= <mlev>
##$CPDPRG8= <mlev>
##$CPDPRGB= <>
##$CPDPRGT= <>
##$D= (0..31)
0 1 0 0 0 0 0 0 0 0 0 0.03 2e-05 3e-06 0 0 0 0 0 0 0 0 0 0 0 0 0 0 0 0 
0 0 
##$DATE= 1649238449
##$DBL= (0..7)
120 120 120 11 120 120 24 19 
##$DBP= (0..7)
150 150 150 150 150 150 150 150 
##$DBP07= 0
##$DBPNAM0= <>
##$DBPNAM1= <>
##$DBPNAM2= <>
##$DBPNAM3= <>
##$DBPNAM4= <>
##$DBPNAM5= <>
##$DBPNAM6= <>
##$DBPNAM7= <>
##$DBPOAL= (0..7)
0.5 0.5 0.5 0.5 0.5 0.5 0.5 0.5 
##$DBPOFFS= (0..7)
0 0 0 0 0 0 0 0 
$$ [...]
##$SUBNAM2= <"">
##$SUBNAM3= <"">
##$SUBNAM4= <"">
##$SUBNAM5= <"">
##$SUBNAM6= <"">
##$SUBNAM7= <"">
##$SUBNAM8= <"">
##$SUBNAM9= <"">
##$SW= 501.771253377433
##$SWIBOX= (0..15)
0 1 3 0 0 0 0 0 0 0 0 0 0 0 0 0 
##$SW_h= 40650.406504065
##$TD= 32768
##$TD0= 1
##$TE= 0
##$TE2= 300
##$TE3= 300
##$TEG= 300
##$TL= (0..7)
0 120 53 12 22 120 120 120 
##$TP= (0..7)
150 150 150 150 150 150 150 150 
##$TP07= 0
##$TPNAME0= <>
##$TPNAME1= <>
##$TPNAME2= <>
##$TPNAME3= <>
##$TPNAME4= <>
##$TPNAME5= <>
##$TPNAME6= <>
##$TPNAME7= <>
##$TPOAL= (0..7)
0.5 0.5 0.5 0.5 0.5 0.5 0.5 0.5 
##$TPOFFS= (0..7)
0 0 0 0 0 0 0 0 
##$TUNHIN= 0
##$TUNHOUT= 0
##$TUNXOUT= 0
##$USERA1= <user>
##$USERA2= <user>
##$USERA3= <user>
##$USERA4= <user>
##$USERA5= <user>
##$V9= 5
##$VALIST= <valist>
##$VCLIST= <CCCCCCCCCCCCCCC>
##$VD= 0
##$VDLIST= <DDDDDDDDDDDDDDD>
##$VPLIST= <PPPPPPPPPPPPPPP>
##$VTLIST= <TTTTTTTTTTTTTTT>
##$WBST= 1024
##$WBSW= 4
##$XGAIN= (0..3)
0 0 0 0 
##$XL= 0
##$YL= 0
##$YMAX_a= 8773
##$YMIN_a= -13468
##$ZGOPTNS= <>
##$ZL1= 120
##$ZL2= 120
##$ZL3= 120
##$ZL4= 120
##$ABSF1= 0
##$ABSF2= 0
##$ABSG= 0
##$ABSL= 0
##$ALPHA= 0
##$AQORDER= 0
##$ASSFAC= 0
##$ASSFACI= 0
##$ASSFACX= 0
##$ASSWID= 0
##$AUNMP= <proc_1d>
##$AZFE= 0.1
##$AZFW= 0.5
##$BCFW= 0
##$BC_mod= 2
##$BYTORDP= 0
##$COROFFS= 0
##$CY= -3
##$DATMOD= 1
##$DC= 0
##$DFILT= <>
##$DTYPP= 0
##$F1P= 0
##$F2P= 0
##$FCOR= 1
##$FTSIZE= 65536
##$FT_mod= 6
##$GAMMA= 0
##$GB= 0
##$INTBC= 1
##$INTSCL= 5.30512e-09
##$ISEN= 30
##$LB= 1
##$LEV0= 0
##$LPBIN= 0
##$MAXI= 10000
##$MC2= 0
##$MEAN= 0
##$ME_mod= 0
##$MI= 50
##$NCOEF= 0
##$NC_proc= -7
##$NLEV= 6
##$NOISF1= 182.463
##$NOISF2= 159.3651
##$NSP= 0
##$NTH_PI= 0
##$NZP= 0
##$OFFSET= 248.5645
##$PC= 4
##$PHC0= -9546.759
##$PHC1= 81.2756
##$PH_mod= 1
##$PKNL= yes
##$PPARMOD= 0
##$PSCAL= 0
##$PSIGN= 0
##$REVERSE= no
##$SF= 81.014009
##$SI= 65536
##$SIGF1= 159.3651
##$SIGF2= -187.1042
##$SINO= 113.3802
##$SIOLD= 16384
##$SREGLST= <1H.CDCl3>
##$SSB= 0
##$STSI= 65536
##$STSR= 0
##$SW_p= 40650.406504065
##$SYMM= 0
##$S_DEV= 0
##$TDeff= 32768
##$TDoff= 0
##$TI= <>
##$TILT= no
##$TM1= 0
##$TM2= 0
##$TOPLEV= 0
##$USERP1= <user>
##$USERP2= <user>
##$USERP3= <user>
##$USERP4= <user>
##$USERP5= <user>
##$WDW= 1
##$XDIM= 65536
##$YMAX_p= 387593007
##$YMIN_p= -56355996
$$ End of Bruker specific parameters
$$ ---------------------------------
##NTUPLES= NMR SPECTRUM
##VAR_NAME=  FREQUENCY,     SPECTRUM/REAL,   SPECTRUM/IMAG
##SYMBOL=    X,             R,               I
##VAR_TYPE=  INDEPENDENT,   DEPENDENT,       DEPENDENT
##VAR_FORM=  AFFN,          ASDF,            ASDF
##VAR_DIM=   65536,         65536,           65536
##UNITS=     HZ,            ARBITRARY UNITS, ARBITRARY UNITS
##FACTOR=    0.620285442955139, 1,           1
##FIRST=     20137.2065510759, 0,            0
##LAST=      -20513.1999529892, 0,           0
##MIN=       -20513.1999529892, -56355996,   0
##MAX=       20137.2065510759, 387593007,    0
$$ Real data points
##PAGE= N=1
##DATA TABLE= (X++(R..R)), XYDATA
$$ [...]
62273 1178074 146297 -716549 -1065143 -1168577 -1330970 -1083140 170907 1689606 1643460
62264 1643460 -527817 -2807306 -2787867 -914725 -166579 -2083598 -4488575 -4357394 -1964924
62255 -1964924 -325291 -810548 -1594495 -1069078 -443580 -1229618 -2042142 -541955 2366236
62246 2366236 3248790 1125049 -1054879 -675296 1246554 2204492 1525033 81539 -1501734
62237 -1501734 -2698219 -2614951 -1372766 -672317 -1345205 -1685626 -78222 2057210 2222382
62228 2222382 699013 -135971 209726 -217998 -2329159 -4439577 -4769397 -3531829 -1968553
62219 -1968553 -933800 -860529 -1623683 -2098792 -1246294 236568 786208 394881 429151
62210 429151 1140610 1450701 1321455 1946307 3053548 2525631 -229448 -2801557 -3045764
62201 -3045764 -1852796 -1180241 -1159536 -871425 -441515 -524551 -878469 -1094673 -1600894 -2356310
62191 -2356310 -1868688 550596 2717818 2072738 -457269 -1496163 144423 2292811
62183 2292811 3039851 3046512 3363835 3160639 1293936 -1182804 -1976574 -613420 1038603
62174 1038603 1338296 554910 -432480 -1719053 -3502973 -4588894 -3567398 -1389463 -789234
62165 -789234 -2431111 -3520131 -1694327 1305999 1967976 -71678 -1997982 -2283655 -2327673
62156 -2327673 -3214169 -3612394 -2220349 -209446 390514 -633167 -2024253 -2975836 -3422732
62147 -3422732 -3308591 -2697917 -1986021 -1309666 -551028 -290624 -1424675 -3277571 -3741722
62138 -3741722 -2225982 -766139 -1000073 -1836746 -1763133 -1668351 -3044184 -4633041 -3634609
62129 -3634609 66819 3367028 3870419 2318323 647770 -539723 -1656732 -2514994
62121 -2514994 -2194949 -285451 2311792 3958323 3767203 2461466 1304391 282923
62113 282923 -1597082 -3939235 -4403870 -1708775 1934716 3018279 943868 -1418675
62105 -1418675 -1305663 996367 2901925 2366645 -205469 -2453073 -2470403 -860534 25655
62096 25655 -1056752 -3002525 -4171566 -4242375 -3643945 -2411169 -645500 846114 1432446
62087 1432446 1427156 1175895 354875 -949020 -1608116 -996822 -61330 278130 558400 1288223
62077 1288223 1374406 -243961 -2479057 -3472495 -3218838 -2965545 -2853336 -2201890 -1467662
62068 -1467662 -1692387 -2330190 -1794176 -111385 969434 615011 -142744 -212650 423667
62059 423667 1430289 2414133 2545859 1441458 313224 649423 1963047 2610228 2557815
62050 2557815 3187618 4355770 4071528 1677813 -889125 -1958443 -2299085 -3269502 -4425111
62041 -4425111 -4360581 -2849113 -894729 616455 1311250 942707 -476075 -2321484 -3605580
62032 -3605580 -3554900 -2104063 -176173 894491 834511 849975 1799202 2661082 2032617
62023 2032617 491378 -129836 536947 1086696 587168 -576724 -2050974 -3899650 -5441296
62014 -5441296 -5393187 -3570190 -1126939 939805 2186480 2019811 527799 -305404 1315954
62005 1315954 3616794 2775403 -1500055 -4859692 -4110149 -1309963 -80775 -326542 615581
61996 615581 3169898 4894698 4158017 1954624 65982 -666202 -185544 928907 1212075
61987 1212075 -612844 -3855801 -6228917 -6394155 -5251983 -4285134 -3482975 -1715666 1129510
61978 1129510 3254505 2697338 -201598 -2711423 -2528833 -365528 943809 -77976
61970 -77976 -1684057 -980243 2466064 5776411 5904664 3293064 1422999 2323099 3822840
61961 3822840 2774042 -99539 -1286970 -225438 -374315 -3321974 -5575455 -4003371
61953 -4003371 -1267932 -1864528 -5000324 -6091401 -4133112 -2516084 -2657443 -2024161 474347
61944 474347 1991883 651797 -1142893 -748657 757311 1193455 916141 1251725 1845709
61935 1845709 2115302 2963590 4493395 4371159 1296429 -2034772 -2520771 -1425983 -2284326
61926 -2284326 -5332006 -7355416 -6387879 -3571384 -796400 814631 462810 -1701358
61918 -1701358 -3713433 -3804699 -2898348 -2908166 -3223382 -1624004 1558139 3154328 1499340
61909 1499340 -1482118 -3258217 -3567080 -3432854 -3227663 -2851174 -2479871 -2096476 -1202417
61900 -1202417 229424 1234914 865930 -760581 -2640939 -3666490 -3332125 -2270722
61892 -2270722 -1851783 -2512512 -2799679 -1025144 2286200 4619354 4252000 2034281 181787
61883 181787 -205891 -142240 -1249875 -3291394 -3868703 -1489635 1701444 2085203 -557386
61874 -557386 -2601959 -1662617 345530 565936 -789188 -1780682 -1996825 -2039167 -1468947
61865 -1468947 33559 766948 -919172 -3590180 -4517609 -3695752 -3253830 -3606950 -3345517
61856 -3345517 -2618583 -3288022 -5417048 -6668340 -5831980 -4240119 -2994538 -1425671 753651
61847 753651 2128813 1568978 -210634 -1784820 -2135142 -521766 2668819 4850381 3520507
61838 3520507 -10226 -1781849 -493385 1278661 1710946 2007624 2731269 1742983 -1682353
61829 -1682353 -4075005 -2452402 775537 1269113 -757263 -1504073 81086 1168380
61821 1168380 174746 -975243 -626615 -64431 -850136 -2043877 -1929304 -764129 -28152
61812 -28152 -85419 -190010 -62396 -74234 -343682 -778816 -1600038 -2786584 -3453189 -2961898
61802 -2961898 -2355971 -3306297 -5584952 -7041251 -6510548 -5253945 -4640773 -3922963 -1901007
61793 -1901007 340313 562379 -1173852 -2536032 -2520993 -2514747 -3077709 -2415855 288026
61784 288026 2406302 1134762 -2403990 -4842391 -5081106 -4438387 -3345249 -1078457 1488199
61775 1488199 2048135 238340 -1774145 -2571067 -2886545 -3291450 -3113518 -2396087 -2288756
61766 -2288756 -2495365 -987136 2414671 4738862 3817833 1238206 -418872 -981859 -1291938
61757 -1291938 -727923 1201536 2617905 1617424 -364374 -529582 771034 591718 -1886805
61748 -1886805 -4291387 -4944071 -4877222 -5168979 -4898573 -3154175 -1111573 -468841 -1081023
61739 -1081023 -1719373 -2332335 -3882798 -6114969 -7019030 -5165293 -1746289 659200 1164501
61730 1164501 1321725 2392976 3132540 1628651 -1491308 -3681085 -4042553 -3926714 -3735586
61721 -3735586 -1994165 1190915 2712292 773597 -1856794 -1808857 -275871 -683991 -2717312
61712 -2717312 -2923500 -786598 326043 -1120694 -2519252 -2000619 -1570266 -3042941 -4379220
61703 -4379220 -3129480 -775242 -212599 -963462 -561346 715160 461715 -1067243 -838562
61694 -838562 1816307 3571202 1923368 -1239877 -2551359 -1451271 145246 768278
61686 768278 300245 -735269 -1266852 -170755 1940619 2567375 450031 -2249196 -2582894
61677 -2582894 -676778 966330 1265641 1404911 2091535 2314993 1326574 -34821 -723275
61668 -723275 -739909 -385339 394745 1275239 1389144 537948 -486097 -1168712 -1669468 -1770823
61658 -1770823 -1091116 -689490 -2326208 -5260685 -6139825 -3591475 -647872 -532377 -2197229
61649 -2197229 -2714327 -2129489 -2447652 -3104216 -1611680 1481044 2517485 451445 -1295458
61640 -1295458 -299175 1105167 -99006 -2694325 -3366282 -1751789 -227304 150710 393491
61631 393491 688268 -325830 -2892969 -4878230 -4096944 -822649 2583434 3918553 2870432
61622 2870432 1043000 285532 775829 1120793 434928 -617857 -1228849 -1661482 -2292674
61613 -2292674 -2689753 -2686689 -3137331 -4313716 -4771928 -3350304 -1194162 -131046 -165991
61604 -165991 -464986 -1502852 -3680815 -4893636 -2791058 798127 1304537 -2076983 -4840825
61595 -4840825 -3568418 -573782 122575 -1343407 -1922891 -848762 -16353 85061 1262026
61586 1262026 3989234 5838998 4791453 2136892 690635 1362943 2706504 2988984
61578 2988984 1633600 -784605 -2998211 -3834279 -3221865 -2114100 -1078365 240492
61570 240492 1619579 1329116 -1811748 -5984707 -7801586 -6385205 -4368647 -4259723 -5457855
61561 -5457855 -5968218 -5571509 -5534008 -6041456 -5925672 -4761549 -3434329 -2513062 -1740358
61552 -1740358 -1361213 -2132811 -3440909 -3294292 -1259038 307612 -590527 -2631958 -3145980
61543 -3145980 -1956766 -1216767 -1984000 -3074001 -3260960 -2712709 -1997665 -1339810 -1195266
61534 -1195266 -1968892 -2716436 -1780848 540452 1551409 -489121 -3825604 -5347176 -4357066
61525 -4357066 -2771935 -2151335 -2092402 -1541387 -364484 748291 1096614 386501 -1037838
61516 -1037838 -2190896 -2260781 -1565853 -1087411 -968031 -355403 884880 1353074 26584
61507 26584 -1703635 -1372785 1203393 3400105 3145839 1468914 668464 1051563 1009638
61498 1009638 -242739 -1748385 -2618416 -3124455 -3618918 -3830375 -3774393 -3960651 -4007655
61489 -4007655 -2550832 407965 2493903 1832634 -113621 -335326 1712803 3666815
61481 3666815 3565859 1895503 250357 -498708 -371380 134420 194597 -719548 -2144316
61472 -2144316 -3216896 -3740117 -3733377 -2442133 608213 3716141 4127922 1607634 -847149
61463 -847149 -723127 1112042 2332979 2532035 3014287 4011605 3962301 1766419 -1457623
61454 -1457623 -3447567 -3183903 -1787116 -1038678 -1268891 -1204787 -89946 882533 191988
61445 191988 -1548207 -2172084 -888060 861799 1606060 1370257 710287 -71795 -175486
61436 -175486 1390280 3755169 4225747 1743238 -1281847 -2155760 -1375787 -1005902 -1061585
61427 -1061585 -102506 1410044 1294451 -707466 -2119070 -1278836 459650 1060015 543142
61418 543142 167559 213341 -30702 -786744 -1470200 -1607331 -1375385 -1349930 -1949146 -2834768
61408 -2834768 -2866574 -1199246 1550473 3780395 4420605 3370811 923580 -2036524 -3576406
61399 -3576406 -2181722 956511 2634791 1209652 -1794188 -4074085 -4975332 -4831875
61391 -4831875 -3680918 -1989012 -1245083 -2200074 -3455581 -3293273 -2048294 -1171503 -844377
61382 -844377 -315233 108261 -504466 -1515149 -1045444 1273334 3653560 4592310 4352902
61373 4352902 3683532 2765751 2019715 2265995 3139051 2752240 91210 -3290821 -5048896
61364 -5048896 -4696498 -3520789 -2651089 -2264703 -2121102 -1856064 -1091275 -17200 526589
61355 526589 181145 -267131 -37068 429916 198069 -751080 -1659270 -2063718 -1913324 -1094218
61345 -1094218 272902 1402026 1478706 429253 -1410209 -3652506 -5262329 -4734375 -2091071
61336 -2091071 266400 254565 -1073734 -1090631 672364 2301778 2550976 1861298 473529
61327 473529 -1971837 -4575220 -5439158 -4593375 -4245055 -5058529 -4743239 -1971192 791156
61318 791156 692252 -1289209 -2291667 -2166816 -2929229 -4506215 -4562835 -2668449 -1344134
61309 -1344134 -2109374 -3314597 -3181246 -2538647 -2843365 -3471492 -3050260 -2165358 -2566681
61300 -2566681 -4251479 -5249216 -4293008 -2320863 -1176345 -1746616 -3446348 -4879606 -5083506
61291 -5083506 -4579148 -4851200 -6330698 -7540673 -6976748 -5114839 -3507028 -2524059 -1346085
61282 -1346085 210423 1446629 2332737 3674187 5380311 6094659 5200185 3877002 3404319
61273 3404319 3615960 3843800 4066646 4001435 2398354 -1096648 -4312793 -4701599 -2645282
61264 -2645282 -741631 -114252 393145 1263964 1039512 -1030409 -3175293 -3437778 -2290509
61255 -2290509 -1368906 -901589 -195076 309045 -484527 -2171172 -3044727 -2413064 -1147833
61246 -1147833 29599 1210911 2148768 2092415 1215019 800336 1468173 2409755 2844164
61237 2844164 2993911 3080377 2649958 1656121 1012833 1155273 1119438 84903 -1159687
61228 -1159687 -1547261 -1724599 -3160207 -5569715 -6859184 -5980510 -4521816 -4566848 -5697082
61219 -5697082 -5349707 -2335169 1057783 1499062 -1222749 -3934723 -4326077 -3741933 -4414267
61210 -4414267 -5492862 -4304294 -951290 1241842 338538 -1797211 -2727778 -2623292 -2650255
61201 -2650255 -2404645 -1159324 -83968 -739594 -2249578 -2354194 -860376 180222 -339614
61192 -339614 -1262636 -1317829 -862460 -915004 -1674220 -2566768 -3052403 -3107950 -3288493 -4072252
61182 -4072252 -4806873 -4144718 -2277643 -1570538 -3538408 -6188359 -6323171 -3969338 -2351803
61173 -2351803 -3432856 -5545318 -5987917 -4308403 -2279397 -1763184 -3126299 -4900738
61165 -4900738 -4867161 -2410647 303210 656947 -1125984 -2481581 -2150503 -1466524 -1719830
61156 -1719830 -2214419 -1855863 -1057183 -813267 -924487 -379688 1008538 2288814 2510035
61147 2510035 1683120 683214 263371 89048 -821602 -2390616 -3089759 -2078541 -716711
61138 -716711 -602973 -1045680 -258826 1651379 2954596 3052213 2732270 2011030 200245
61129 200245 -1923755 -2615095 -2032904 -2038382 -2860827 -2741343 -1288354 -137981 332473
61120 332473 1549952 3071634 2255438 -695815 -1489762 1717090 4458379 2413329 -1566891
61111 -1566891 -1518079 2839133 6411169 6600088 5680516 5504650 4923224 3465465 3093088
61102 3093088 4408563 4687294 2012092 -1264300 -1632887 743748 2613181 2048280 290431
61093 290431 -510721 52501 489617 -656324 -2946489 -4331894 -3534720 -1656478 -854276
61084 -854276 -2032311 -4547394 -7235461 -8578379 -7015512 -2958439 304251 -90083
61076 -90083 -2764473 -3822029 -2093862 -123039 166477 -78216 654546 1728615 1974337
61067 1974337 1710565 1567221 997555 -372312 -1308098 -651705 545278 314757 -1366968
61058 -1366968 -2587049 -2165045 -1003286 -635278 -1298427 -1774722 -879338 1038960 2259570
61049 2259570 1579077 -327280 -1987393 -3059490 -4163525 -5194425 -5222215 -4082828 -2704054
61040 -2704054 -1713859 -1036367 -926825 -1866317 -3181953 -3347925 -2010133 -168621 1817271
61031 1817271 4369864 6363377 5129425 208392 -4879774 -6375365 -4431835 -2045165
61023 -2045165 -1220389 -1820929 -2970307 -3765896 -3409030 -2176559 -1534835 -2052130 -2256654
61014 -2256654 -931187 735363 1006288 384705 513457 1304833 1416722 835399 600473
61005 600473 473833 -586283 -1849372 -1386132 557526 1378741 -54726 -1835829 -2211698
60996 -2211698 -2043477 -2750208 -3786873 -3825216 -2955124 -2026646 -963922 542105 1516671
60987 1516671 670774 -1510355 -3248371 -3869481 -4190332 -4439186 -3452398 -785614 1541481
60978 1541481 883343 -2515692 -5120983 -3975135 -242597 2262083 1811268 439502
60970 439502 480719 1336537 1166980 192683 -69889 29828 -1190766 -3105807 -2892621 -222131
60960 -222131 1310042 -661149 -3433897 -3257059 -1025145 -550768 -2428718 -3497757 -2267081
60951 -2267081 -964043 -1185106 -1068878 1131559 3384062 2549149 -834425 -3207946 -2791794
60942 -2791794 -1225714 -441880 -150678 856972 2431360 3087181 1739348 -1042383 -3256239
60933 -3256239 -3131292 -1144154 3413 -1630459 -4570036 -5514574 -3531650 -1156764
60925 -1156764 -949723 -2521464 -3841392 -4078419 -3792532 -3325227 -2677097 -2516051 -3550818
60916 -3550818 -4828305 -4324706 -1841426 71034 -854964 -3519954 -4682071 -2969342
60908 -2969342 -411274 285192 -1052005 -2301392 -1920103 -587774 40520 -659824 -1991363
60899 -1991363 -3031866 -3281212 -2511553 -881063 694697 1129975 525356 227933 950792
60890 950792 1487285 269018 -2083638 -2995764 -1114688 1715418 2523151 784415 -1119052
60881 -1119052 -1032751 505869 1562917 1588706 1561083 1716291 923075 -1111934 -2690870
60872 -2690870 -2509160 -1906773 -2855644 -4517356 -4202979 -1691747 29767 -866731 -2403911
60863 -2403911 -2038289 -477648 -141734 -1256534 -1914255 -1282171 -361231 213257 880173
60854 880173 1534758 1251638 17346 -1047496 -1600479 -2410967 -3250627 -2415350 567034
60845 567034 3397388 3571953 1354813 -1090825 -2512210 -3111595 -3127334 -2506992 -1702127
60836 -1702127 -1376817 -1345664 -935895 -393702 -797140 -2360091 -3815233 -3900729 -2746970
60827 -2746970 -1379675 -481111 -193647 -665213 -1977920 -3539415 -4285092 -3915759 -3504662
60818 -3504662 -4242402 -5727928 -6282499 -5124951 -3382639 -2415918 -1973607 -986882 375153
60809 375153 789521 -89951 -890212 -385566 852825 1341604 627020 -319843 -411918 281252
60799 281252 535574 -779255 -3262951 -4992125 -4471368 -2473178 -1269776 -1958384 -3219397
60790 -3219397 -3005783 -981179 1092527 1291157 -281433 -1444372 -502365 1371067 1465445
60781 1465445 -535726 -1734076 -262924 1598394 833160 -1288155 -835400 2605609
60773 2605609 4993323 3697253 900914 -283802 -59078 -236007 -797935 -669873 -136124
60764 -136124 -4490 321787 1589664 2639244 1959107 397112 -53603 519619 371380
60755 371380 -675709 -930128 186920 1112631 490519 -1241348 -2959340 -4021818 -4106729
60746 -4106729 -3338291 -2781426 -3491680 -4976449 -5833677 -5770752 -5559733 -5216168 -4008666
60737 -4008666 -2361259 -1895689 -3129340 -4685716 -5215648 -4636164 -3140640 -680568 1898410
60728 1898410 2786629 1288274 -1075214 -2323157 -2041801 -1194530 -874750 -1656144 -3173592
60719 -3173592 -3999532 -3028102 -1279395 -1034231 -2739852 -4195987 -3517330 -1542810 -370491
60710 -370491 -682987 -1615700 -2376025 -2867097 -3200231 -3385108 -3191913 -2127011 -296494
60701 -296494 739054 -555326 -2944622 -2997920 439569 3998037 3718652 56247 -3033594
60692 -3033594 -3300369 -2296780 -2277905 -3091533 -2999706 -1327040 697992 1240995 -551498
60683 -551498 -3870041 -6700538 -7208941 -5122364 -1910804 400885 767385 -153759 -622994
60674 -622994 607114 3128030 5345290 6039372 5234331 3758199 2514326 2070181 2205194
60665 2205194 1813169 84014 -2088410 -2879519 -2053034 -1556559 -2846835 -4670358 -4706550
60656 -4706550 -2788931 -1065220 -979679 -1418075 -472596 1704132 2746170 866964 -2810638
60647 -2810638 -5312249 -5079259 -3393179 -2251376 -1831017 -1067182 39035 342479 -301327
60638 -301327 -522421 432997 1493923 1446606 656515 253547 546660 1098389 1569722 1692042
60628 1692042 1131340 99738 -633673 -950252 -1658828 -2847267 -3115569 -1617466 100906
60619 100906 -207038 -2455992 -4317395 -4167855 -2696123 -1541194 -1442989 -2078213 -2995094
60610 -2995094 -4154921 -5537449 -6412791 -5603935 -3110430 -899237 -734309 -1487683 -539435
60601 -539435 1919904 2455888 -583155 -4081606 -4291243 -1949731 -581945 -1117983 -1353987
60592 -1353987 -163820 990950 959506 402970 -261690 -1799945 -3959780 -4572340 -2348155
60583 -2348155 933086 2407308 1313209 -784376 -2031586 -1698973 -374586 519615
60575 519615 21904 -1169295 -1487789 -599676 289756 323960 -65298 -344003 -625110 -827963
60565 -827963 -480336 131311 2455 -858211 -1206836 -675486 -467372 -1122304 -1340053 -216752
60555 -216752 991518 785963 -355533 -1217421 -1853606 -2566142 -2299859 -325883 1493384
60546 1493384 674104 -2122267 -3799000 -3165395 -2034502 -1776240 -1444961 -228038 667875
60537 667875 88538 -905951 -640716 663665 1602161 1821042 1856998 1443650 -178859
60528 -178859 -2440925 -3657263 -3344371 -2906729 -3483859 -4273957 -3750244 -1709118 742260
60519 742260 2693804 4013644 4635515 4164154 2453045 163752 -1466559 -1379360 500016
60510 500016 2851327 3674671 2110276 -468154 -1797499 -1159093 205819 1006193 1107232
60501 1107232 588540 -953038 -3183610 -4336798 -3230393 -1224107 -523429 -1043730 -893190
60492 -893190 164133 14016 -2376931 -4915028 -5077454 -3162168 -1388902 -877031 -1056086
60483 -1056086 -1286424 -1455257 -1319917 -658492 30229 19650 -636274 -1420007 -2215412 -2904528
60473 -2904528 -2720659 -1273962 242817 272196 -997296 -2143910 -2768448 -3534304 -4134139
60464 -4134139 -3253373 -948183 843316 901578 211015 64919 276385 211335 46663
60455 46663 -140746 -1066388 -2693245 -3388308 -2176665 -573000 -385466 -851411 -111832
60446 -111832 1324024 1141039 -986096 -2746569 -2685390 -1906197 -1520212 -749715 1030135
60437 1030135 2284412 1241188 -1324181 -3027404 -2908376 -1902287 -813001 396106
60429 396106 1317846 849009 -1123490 -2919885 -2815120 -1065594 521893 834839 612972
60420 612972 1176707 2474566 3067462 2141028 696428 -3815 -480234 -2127966 -4425590
60411 -4425590 -4846489 -2221521 1401599 3372955 3542480 3348393 3134177 2383900 1781552
60402 1781552 2592832 4050886 3721466 1019845 -1694579 -2386404 -1851461 -1814704 -2205258
60393 -2205258 -1927865 -1174246 -1141142 -1952429 -2487229 -2208624 -1884297 -2354473 -3517647
60384 -3517647 -4695040 -5330833 -5265869 -4865649 -4877560 -5677604 -6666911 -6797028 -5658089
60375 -5658089 -3798368 -2115623 -1133012 -663891 -74754 838723 1312616 522927 -1061130
60366 -1061130 -2101387 -2135649 -1715992 -752950 1541803 4444417 5453882 3651617 1592455
60357 1592455 1960834 3794618 4293153 3178014 2504137 2807764 2531130 1357093 1068632
60348 1068632 2342852 3400870 2956209 2101566 1953543 1657453 327625 -1005811 -1199955
60339 -1199955 -1073909 -1755555 -2383865 -1551376 42396 545817 -101705 -233283 844962
60330 844962 1984610 1911175 450220 -1680229 -3123598 -2519462 -232543 1219463 -6591
60321 -6591 -2481950 -3433422 -2622700 -2273078 -3440282 -4601586 -4020683 -1721654 1089818
60312 1089818 3070792 3292706 2267314 2035571 3495161 4380730 2302649 -953270 -1427298
60303 -1427298 923109 2036864 273329 -1179688 -108780 873900 -788364 -2716386
60295 -2716386 -1565919 1015433 902300 -1932691 -3942177 -3912507 -3702519 -3665785 -2132293
60286 -2132293 318485 726174 -1190572 -2162651 -885771 -249806 -2253921 -4683142 -5222555
60277 -5222555 -5184110 -6190420 -6415548 -3671653 221893 1825563 1064259 346626 220381
60268 220381 -486551 -1281736 -466704 1500004 2454351 2043065 1652580 1217432 -508375
60259 -508375 -2635752 -2727815 -1037196 -512914 -1846849 -2256247 -524590 493914 -1403874
60250 -1403874 -3793734 -3271785 -734623 154535 -1576643 -3267424 -2627236 -247880 1885820
60241 1885820 2645450 2301213 1794897 1538383 713133 -1582987 -4409508 -5514299 -4172661
60232 -4172661 -1973963 -302871 1094363 2319382 2328343 981122 -63777 21491 -98223
60223 -98223 -979408 -640320 1983185 4308924 3764987 1995675 2004426 2983953 2036860 -182956
60213 -182956 -42630 3080215 5647943 5213126 2947019 370021 -2462535 -4440839 -3061001
60204 -3061001 1444541 4885343 4214110 1279404 -491333 -678525 -970164 -1852021 -2591757
60195 -2591757 -2996841 -3081953 -2183313 -121083 1904008 2954166 3575386 4177575 3850981
60186 3850981 2185485 521846 -178202 -953384 -2644729 -3909501 -3416427 -2325632 -2394557
60177 -2394557 -3106565 -2916588 -1940533 -1113511 -133189 1208806 1085743 -1942627 -5563628
60168 -5563628 -6005984 -3252291 -862027 -818381 -1707419 -2111271 -2509931 -3080515 -2628840
60159 -2628840 -926257 357542 296166 113810 770160 1309981 1063633 1407603 3357471
60150 3357471 4947646 3351128 -970558 -4298724 -3994702 -1380596 168538 -900042
60142 -900042 -3058729 -4013623 -3387479 -2508222 -2138776 -1834540 -1658019 -2611973 -4310158
60133 -4310158 -4193814 -1074464 2169966 2142945 -1501 -376795 1310502 1273855 -1935548
60124 -1935548 -4733840 -4160386 -2515961 -3311630 -5351085 -4641021 -805382 2185345 1532309
60115 1532309 -1238602 -3053692 -2770609 -1218930 305026 774313 -16034 -1094790 -1541319
60106 -1541319 -2087772 -4045308 -6545783 -6811194 -3985521 -864572 -374736 -1769719 -2249443
60097 -2249443 -1423026 -1679750 -4037678 -6164216 -5757676 -3906697 -3053055 -2863750 -797550
60088 -797550 3388982 6525346 6377669 4684335 4111026 4156045 2566534 -395407 -2076683
60079 -2076683 -1627240 -1176447 -2188016 -3209814 -2520826 -923342 -183780 -179212 495771
60070 495771 1927557 2707560 2040264 571204 -734529 -1317559 -800281 667943 1766891
60061 1766891 966901 -1429448 -3174267 -2596934 -539293 886328 892164 437480 309163
60052 309163 34268 -794710 -1244752 -351509 858243 319066 -1994597 -3728713 -3556043
60043 -3556043 -3033994 -3694264 -4105443 -2116575 1160558 2424333 896133 -885317 -1228547
60034 -1228547 -1369279 -2491385 -3423553 -2932226 -2091300 -2380651 -3087958 -2686650 -1553393
60025 -1553393 -1194616 -1645049 -1716592 -1236021 -963898 -617473 910023 3259573 4477185
60016 4477185 3610796 1782350 109726 -1806837 -4329608 -6106455 -5544541 -3405442
60008 -3405442 -2270912 -3158566 -4037829 -2612446 342595 1851297 698344 -1153259
60000 -1153259 -1570432 -953210 -754863 -910988 -705400 -1048759 -3306438 -6227255 -6795508
59991 -6795508 -4473268 -2017500 -1445597 -1798462 -1853683 -2212353 -3018638 -2322761 805263
59982 805263 3589566 2812173 -560778 -2789752 -2515041 -1761737 -2259001 -3434587 -4160986
59973 -4160986 -4223573 -3700141 -2662549 -1788772 -1820507 -2320367 -2277895 -1803412 -1830820 -2368162
59963 -2368162 -2543103 -2195985 -1896390 -1544189 -545158 689305 999195 296341 -288138
59954 -288138 -124766 317205 532242 455168 81865 -308301 -76557 509686 -44502 -1932628
59944 -1932628 -2509686 340986 4362796 5387001 3029963 677474 31013 -591327 -2013119
59935 -2013119 -2230499 -256981 1512128 975521 -333903 148559 2285103 4244813 5224455
59926 5224455 5085119 3322775 684476 -153534 1911213 3965468 2899110 65882
59918 65882 -1014751 -308891 -907242 -3491510 -5083342 -3942245 -2235966 -2429994 -3765248
59909 -3765248 -4071325 -3003338 -1637300 -408765 688935 992716 115707 -724533 -95113
59900 -95113 1383165 1906858 1387218 1485716 2455268 2096910 -889710 -4235540 -4756118
59891 -4756118 -2719730 -1250539 -1615580 -1691340 197464 2418775 2619821 1239974 358727
59882 358727 401327 269303 -207010 -366929 -630542 -1782739 -2756459 -1873586 -174311
59873 -174311 -476343 -2778439 -3846698 -2305869 -814387 -1542496 -2690191 -1909829 -470595
59864 -470595 -1014910 -3120387 -4242393 -3763084 -3014139 -2157604 -191642 2198967 2708233
59855 2708233 647088 -2092483 -3572553 -3503197 -2448256 -1214619 -997324 -2256370 -3442507
59846 -3442507 -2671170 -604945 298112 -581698 -1306368 -602346 381537 238421 -705621
59837 -705621 -1487412 -2010920 -2505071 -2725976 -2505975 -2107340 -1582578 -839572 -495698 -1270778
59827 -1270778 -2369405 -2164385 -796171 -111375 -433573 304714 2999359 5205944 4451702
59818 4451702 1971040 869655 1741909 2490323 1811253 442743 -870092 -2330189 -3707076
59809 -3707076 -4032512 -3298916 -2783099 -2982364 -2795036 -1620235 -738096 -1338096 -2442310
59800 -2442310 -2399556 -1579898 -1721577 -2979252 -3645682 -3011603 -2483287 -3038866 -3386826
59791 -3386826 -2020205 309588 1834572 2385497 2843981 2853676 1459174 -331239 -337768
59782 -337768 1094511 960507 -1827808 -4374325 -3930715 -1691255 -308995 224179 1388904
59773 1388904 2404833 1109003 -1913805 -3387994 -1951625 27540 24063 -1508146 -2539252
59764 -2539252 -2187134 -983697 257187 932696 896662 672484 700812 529770 -216982
59755 -216982 -623859 160689 962452 146604 -1309247 -1029616 571350 560105 -1542341
59746 -1542341 -2629967 -1146405 310157 -379020 -1195487 10865 1057352 -1037278
59738 -1037278 -4363278 -4509912 -1376599 1055671 1290149 1838362 3693351 4123028 1751715
59729 1751715 -372184 500187 2352320 1952398 415531 1339595 4547796 5694350 2468610
59720 2468610 -2087362 -3764246 -2344427 -764655 -576762 -473236 877036 2567142
59712 2567142 2958210 2235336 2007971 2711703 2962824 1837437 290582 -630440 -1610964
59703 -1610964 -3504358 -4917654 -3585065 -23488 2470309 2031301 331827 -483623
59695 -483623 -823993 -1891302 -2708166 -1475273 902268 1399785 -810733 -3036009 -2880147
59686 -2880147 -1374312 -966951 -1922909 -2498515 -1946146 -1518720 -2414494 -4038877 -4718395
59677 -4718395 -3443971 -720899 1781603 2448687 1188946 -373652 -783627 -576364 -1280878
59668 -1280878 -2808420 -3258104 -1676964 438967 1226694 766768 212766 -185951 -666168
59659 -666168 -520415 929207 2362244 1677248 -642605 -1593625 141138 2095843 1506878
59650 1506878 -764313 -1687578 -452185 758051 256675 -852259 -589847 945697 1644727
59641 1644727 100760 -2555283 -3855055 -2805761 -1024978 -776798 -2281025 -3655543
59633 -3655543 -3341680 -1678881 -22433 693907 272226 -828527 -1515896 -1032410 -193737
59624 -193737 -388641 -1061339 -50377 2741088 4222065 2331141 -688886 -1617655 -1094036
59615 -1094036 -2011148 -4239291 -4716660 -2711008 -1158302 -1844945 -2717533 -1592380 410242
59606 410242 1153131 757966 380433 -232208 -1563798 -2395459 -1597547 -588885 -1445727
59597 -1445727 -3509017 -4439895 -3921211 -3621200 -3891905 -3340156 -1786643 -913124 -1385330
59588 -1385330 -1781987 -1238564 -932923 -1795346 -2627620 -1850189 280505 2369797 3536189
59579 3536189 3302241 1174836 -2304525 -5053715 -5330949 -3568596 -1478718 -125674
59571 -125674 310565 -81729 -674756 -343257 1009438 1805034 920366 -402512 -239497
59562 -239497 1182474 2027910 1706343 1325774 1476736 1460324 926968 537898 545600 274434
59552 274434 -410448 -562890 203956 860350 573466 -59940 -401710 -1236147 -3450030
59543 -3450030 -5934057 -6354779 -4066877 -1162343 -270275 -1835016 -3817864 -3925297 -2094407
59534 -2094407 -676471 -1831717 -4895047 -7087512 -6923704 -5829070 -5798033 -6546418 -6166153
59525 -6166153 -3995242 -1455558 -60444 241569 414580 891099 1324766 1392729 1372732
59516 1372732 1878299 3064415 4152084 4011716 2372568 172153 -1461384 -2179097 -2148894
59507 -2148894 -1431860 -188974 932493 1335233 1204152 1110812 1075999 642222 -225411
59498 -225411 -907302 -841915 -130882 469812 -26673 -1976551 -4267883 -4939228 -3336580
59489 -3336580 -1137045 -368624 -923340 -1173742 -673262 -686611 -1816526 -2638557 -1618190
59480 -1618190 492924 1227209 -792349 -4205750 -6154923 -5071845 -2243146 -394417
59472 -394417 -629616 -1406794 -998566 43308 107334 -683437 -932265 -977666 -2869511 -6523637
59462 -6523637 -8403188 -5938212 -1515616 336293 -1227153 -2950754 -2597951 -1666482
59454 -1666482 -2208258 -3430088 -3290429 -1978976 -1561312 -2583251 -3167335 -1981689 -443686
59445 -443686 -844270 -3212332 -5306013 -5334983 -3481916 -797695 2093319 4688870 6045679
59436 6045679 5418914 3122498 303690 -1738947 -1877030 197314 2972239 3770528 1520363
59427 1520363 -1772897 -3384760 -2979203 -2122467 -1590588 -1049935 -915815 -2181078 -4163272
59418 -4163272 -4717399 -3439381 -2517050 -3250587 -3770420 -1943644 1066336 2325143 1312838
59409 1312838 324411 860449 1688574 1066353 -555829 -1047846 672042 3161573 3932585
59400 3932585 2325730 452658 668659 2452724 3023652 1182014 -1016116 -1199964 153835
59391 153835 817505 38922 -867899 -637630 619158 1969621 2491463 1830914 776860
59382 776860 801656 2180278 3229101 2408787 420354 -984389 -1471127 -1916447 -2401511
59373 -2401511 -2125277 -959110 565873 2491607 4869768 6233181 4767881 1287837
59365 1287837 -992214 -348844 1457125 1829378 445128 -1183424 -1924607 -1743860 -1142227
59356 -1142227 -815576 -1229717 -1923446 -1876433 -918950 62141 580560 1099550 1725720 1663431
59346 1663431 709035 41418 497571 1097075 496616 -840645 -1257637 -351093 398970
59337 398970 -465826 -2601335 -4149231 -3519242 -980440 1404560 1741934 231869 -1362488
59328 -1362488 -2023154 -2247383 -2425047 -1915563 -541219 343491 -363904 -1560788 -1384104
59319 -1384104 -155994 -105798 -2007129 -3801233 -3373326 -1434790 -440318 -1356106 -2911761
59310 -2911761 -3903914 -4674811 -5667289 -5899392 -4388132 -2452972 -2644059 -5031274 -6380542
59301 -6380542 -4160402 -78468 1870083 184799 -2736090 -3617911 -1528239 1636418
59293 1636418 2860832 655050 -3017056 -4188787 -1495552 1671837 1356827 -1672870
59285 -1672870 -3288606 -1997370 -500769 -1087332 -2636813 -3202621 -2761849 -1997489 -812110
59276 -812110 359619 2496 -1970717 -3183220 -2055227 -176241 405458 236504 687068
59267 687068 1165067 685280 443436 1831656 3219049 1974382 -1057665 -2401368 -1079731
59258 -1079731 222537 -592034 -2406264 -3120660 -2231508 -561150 752575 694877 -501257
59249 -501257 -789952 1173770 3334332 2581164 -406888 -1757240 -227706 967351 -588758
59240 -588758 -2665385 -1915826 1214308 3550053 3489938 2005123 594766 269967 1535962
59231 1535962 3505233 3926934 1865586 -497125 -493166 1384645 2321980 1081891 -866535
59222 -866535 -1843729 -1691021 -915226 192371 1097876 913158 -627713 -2660806 -3924481
59213 -3924481 -3686945 -2122150 -175532 1240033 2230022 3506149 4691728 4218424 1834014
59204 1834014 -40850 919907 3605107 4760168 3292757 1344305 989279 1835520 2495154
59195 2495154 2656480 2603450 1986671 432729 -1295106 -1956261 -1401104 -603984 -330262
59186 -330262 -563340 -1121484 -1946172 -2571076 -2116267 -438938 1134811 1048629 -510233
59177 -510233 -1722787 -1575959 -1258958 -2208953 -3533928 -2987004 -446021 1385209 458597
59168 458597 -1946184 -3112603 -2200120 -354897 1371591 2500388 2261625 275658 -1975055
59159 -1975055 -2195468 -149312 1962946 2310709 1207758 -287469 -1970741 -3832256
59151 -3832256 -5060889 -4875233 -3700527 -2605991 -1996733 -1545492 -1068641 -922557 -1706029
59142 -1706029 -3674731 -6030251 -6950105 -5272438 -2243792 -474148 -880438 -1898457
59134 -1898457 -2085746 -1906605 -2072818 -1792611 -183806 1830482 2746231 2600951 2069587
59125 2069587 446195 -3112386 -6838673 -7570438 -5007621 -2226484 -1228020 -482864 1781796
59116 1781796 4231474 4510659 3069209 2403105 3216817 3768110 2982685 2043684 2313401
59107 2313401 3276776 3373491 1933989 -292579 -1884963 -1778729 -285660 761263 -280663
59098 -280663 -2814286 -4518324 -4084033 -2471737 -1239692 -843494 -1117677 -2144339 -3640794
59089 -3640794 -4466947 -3906970 -2760992 -2067425 -1430627 86892 1984059 2825248 2545222
59080 2545222 2596303 3570789 4256728 3673203 2688351 2682453 3536596 3900466 2877508 715291
59070 715291 -1641732 -3058224 -2835154 -1477466 -351464 -95643 -33387 362213 409338
59061 409338 -516602 -1606793 -1654809 -707668 476348 1712905 2670226 1890486 -1320408
59052 -1320408 -4644621 -4980591 -2842993 -1711578 -2617421 -2690285 -434548 1049015 -1143086
59043 -1143086 -4470238 -4203939 -333041 2757772 2825568 1869977 1510073 506086 -1683143
59034 -1683143 -2617753 -589711 2075206 2100057 -254311 -2343561 -3216842 -3834799 -4372930
59025 -4372930 -4188495 -3891717 -4621805 -5400999 -3996331 -763093 1017603 -503422 -3325033
59016 -3325033 -4662027 -4420561 -4167723 -4320062 -4217450 -4003076 -4537826 -5716529 -6357134
59007 -6357134 -5839154 -4806541 -4105764 -3809959 -3495411 -2938524 -2274384 -1696170 -1201041
58998 -1201041 -721034 -520491 -1132262 -2477829 -3344801 -2526569 -497553 881550 556362
58989 556362 -595560 -1133189 -749649 -122791 232200 315536 257540 124327 -101857 -619835
58979 -619835 -1619945 -2867007 -3796052 -4023594 -3405907 -1883488 38885 1040400 308917
58970 308917 -1120932 -1674146 -1661674 -2642873 -4330885 -4388237 -2020064 535704 1379813
58961 1379813 1581802 2654166 3513020 2423143 378234 -317045 154371 -260420 -1556941
58952 -1556941 -1514942 319712 1503162 446062 -1191718 -1095744 638376 2306552 2961889
58943 2961889 2768361 2111126 1377517 864403 390725 -179756 -28465 1615187 3533066
58934 3533066 3487679 1557823 386789 1256751 2147781 1093759 -649958 -732936 696519
58925 696519 1756112 1935225 2051034 1915932 533961 -1621738 -2807498 -2605697 -2347889
58916 -2347889 -2702715 -2700577 -1607990 -76629 1189157 2373693 3397118 3234167 1424638
58907 1424638 -792094 -1967062 -2325502 -3054791 -4218510 -4587408 -3508959 -1928233 -1216347
58898 -1216347 -1610407 -2244278 -2389917 -2185731 -2159429 -2445102 -2726258 -2768957 -2711490 -2871933
58888 -2871933 -3500179 -4575838 -5460403 -4925446 -2291677 1228521 3102581 2056770 -306801
58879 -306801 -1152993 475245 2796707 3533474 2397952 1012879 682274 848870 99767
58870 99767 -1656734 -2885942 -2564932 -1633547 -1384495 -1252001 193259 2347208 2674678
58861 2674678 213610 -2873239 -4263207 -4365066 -4843549 -5625863 -5214389 -3180778 -495253
58852 -495253 2186132 4714387 6086386 4846696 1329409 -2007570 -3207943 -2793362
58844 -2793362 -2575495 -3343325 -4294804 -4182581 -2591738 -464155 492968 -620864 -2819604
58835 -2819604 -4141371 -3629384 -2023585 -700614 -472600 -1202925 -2003391 -2037776 -1621005
58826 -1621005 -1970984 -3194112 -3422197 -1245740 1769020 2797528 1617361 676684 1245017
58817 1245017 1775286 772190 -926304 -1997494 -2860405 -4331017 -5472740 -4816955 -2962863
58808 -2962863 -1974549 -2418793 -2776966 -1948037 -776057 -528225 -982168 -870178 232219
58799 232219 1187875 632020 -1150088 -2058812 -389369 2844744 4557612 2905736 -705867
58790 -705867 -3352615 -3580297 -2075150 -205175 1062504 1296634 803867 539330 887896
58781 887896 774073 -947431 -3391871 -4295178 -3026599 -1588032 -1848652 -2908710 -2467825
58772 -2467825 -287910 1143721 -332124 -3864480 -6586866 -6682330 -4714636 -2285415
58764 -2285415 -435719 387203 -171513 -1934092 -3608163 -3642755 -1833648 475871 1780133
58755 1780133 1436563 -436060 -3013451 -4611884 -3779652 -1232729 365547 -490214 -2144568
58746 -2144568 -2026924 -100979 1471110 1630484 1422537 1494914 697867 -1682709 -3941890
58737 -3941890 -3968179 -2305236 -1223609 -1128500 -180558 2078069 3098908 860669 -2750395
58728 -2750395 -4330918 -3722704 -3743146 -5397207 -6360217 -5087129 -3527082 -3789656 -4426070
58719 -4426070 -2777604 460500 2192490 1794518 1681621 2808122 2991154 906963 -1240642
58710 -1240642 -1045135 351082 214874 -1512093 -2355648 -1043703 1040829 1973818 1231979
58701 1231979 -426068 -1810397 -2143379 -1872089 -2177903 -3035217 -2844494 -1043455 365263
58692 365263 -324294 -1449985 -250763 2564538 3428424 1121619 -1521511 -1819731 -514264
58683 -514264 398505 790532 1603507 2593597 2821620 2478778 2561258 3225258 3719337 3546658
58673 3546658 2760135 1616596 737365 940700 2071910 2737691 2103854 1131188 972897
58664 972897 1076762 352934 -485808 346257 2677877 3907996 2179628 -1220268 -3357015
58655 -3357015 -2755700 -472900 1282714 1123579 -407104 -1356936 -474902 1078312 930439
58646 930439 -1316322 -3211832 -2619813 -750576 -569912 -2637757 -4336264 -3533539 -1249514
58637 -1249514 274318 585697 499357 -259334 -2610822 -5617643 -6830648 -5618227 -3941900
58628 -3941900 -2946732 -1128767 2462833 5404210 4883758 2136525 908945 2085546
58620 2085546 2960748 1964565 885370 1349901 1968094 839233 -1148651 -1642352 -244620
58611 -244620 1237695 1246987 -212420 -2000858 -2430226 -330523 3195328 4978871 3189433
58602 3189433 -182308 -1681869 -561052 993432 1260489 722028 354615 -29079 -1002231
58593 -1002231 -2170883 -2526580 -1944196 -1773894 -3471665 -6375199 -7496628 -4749846 -144811
58584 -144811 2053544 648854 -1276139 -1427637 -1807670 -4845683 -8394186 -8134810 -3961669
58575 -3961669 -309007 -115521 -1786418 -2708006 -2658796 -2549036 -2392124 -2087996 -2285988
58566 -2285988 -3022564 -3080234 -1972239 -1112898 -1795325 -3312795 -4193948 -4024312 -3048355
58557 -3048355 -1435642 -135375 -914186 -3922918 -6423718 -5724514 -2618451 -252615
58549 -252615 -156137 -1036887 -1181522 -347011 937003 2604042 4915540 7526373 9047365
58540 9047365 7767329 3398261 -1732487 -4109820 -2356804 1330011 3568525 3097461
58532 3097461 1262135 -110079 -555387 -940637 -2083614 -3469668 -3614850 -2106266 -626966
58523 -626966 -833311 -1778666 -1167049 1038326 2367159 1478825 -165130 -908290 -906174
58514 -906174 -577511 542420 1959733 1568543 -1218283 -3662650 -3161017 -819171 587897
58505 587897 570186 460439 551011 386032 702565 2278851 3757209 3418818 2380716
58496 2380716 3105977 5211752 5765827 3698872 1131885 122149 500846 1030080 520282
58487 520282 -1934624 -5487729 -6840833 -3807078 892362 2521845 632962 -1112532
58479 -1112532 -1204959 -1984851 -4330755 -5245372 -2707935 943023 2812486 3276614 3617879
58470 3617879 3085267 1094157 -513452 -372209 -224005 -1681032 -2888032 -1746143 -121729
58461 -121729 -992873 -3210190 -3261532 -1102222 29327 -914935 -1743500 -1557252 -2198174
58452 -2198174 -4283497 -5447025 -4013992 -1562674 -324233 -433905 -1176586 -2652146
58444 -2652146 -4479898 -4784747 -2503207 504754 1476463 137763 -1447189 -1840591 -1535905
58435 -1535905 -1466763 -1589579 -1369195 -857967 -590006 -542376 113930 1719640 2995041
58426 2995041 2272801 57760 -877138 1251867 4885315 7000034 6391924 3970652 945767
58417 945767 -1557709 -2026813 -58220 1889122 694367 -2997901 -4796315 -2012379
58409 -2012379 2788195 5053218 3594146 982194 -466710 -1088077 -2158734 -3443940
58401 -3443940 -3483874 -1828546 11283 232824 -1094275 -2238567 -2160696 -1764277 -2318149
58392 -2318149 -3468997 -3787691 -2860305 -1762978 -1513853 -1985604 -2497573 -2730016 -2772556
58383 -2772556 -2772704 -2852285 -3176396 -3895475 -4894685 -5525902 -4951647 -3294057 -2095318 -2701412
58373 -2701412 -4403198 -5374816 -5215811 -4873770 -4198021 -2076400 452640 277963 -2959385
58364 -2959385 -5118082 -3241717 -317434 -826198 -3605735 -3586698 202710 3075809 1630619
58355 1630619 -1924553 -3708894 -2985728 -1381011 -120527 147170 -973579 -2424942
58347 -2424942 -2032938 504292 2705976 2652927 1432071 936767 1080642 742871 -127960
58338 -127960 -956332 -1767314 -2563119 -2701836 -2104322 -1752337 -1864250 -1136197 895808
58329 895808 2407883 1844285 439107 363317 1587077 2447059 2280732 1603551 571501
58320 571501 -768804 -1385026 -401111 1087465 1252918 369059 478710 2048030 2736626
58311 2736626 304841 -4268714 -7452251 -6771784 -3382225 -818491 -1075564 -2421710
58303 -2421710 -1838905 913829 3168109 3152875 1987268 1367694 1291628 1153992 1258949
58294 1258949 1758278 1571357 -32859 -1935205 -2727957 -2704589 -2903730 -3308355 -3460037
58285 -3460037 -3711091 -4266100 -4063528 -2336327 -360131 85161 -800230 -1521703 -1611363
58276 -1611363 -1576139 -1364151 -674126 -92341 -172797 -67120 1177266 2631958 2594462 1068696
58266 1068696 -580651 -1743663 -2557748 -2611161 -1662677 -924484 -1519188 -2355645 -1780195
58257 -1780195 -632109 -1098952 -3012608 -4061476 -3546041 -3067555 -3294105 -2944851 -1619629
58248 -1619629 -904806 -1656807 -2540371 -2359901 -1733991 -1335452 -482160 1182959 2303830
58239 2303830 1546590 -468315 -2119968 -2686334 -2442362 -1843838 -1328566 -1077675 -602122
58230 -602122 475806 1214494 347048 -1448585 -2062900 -1079805 -412314 -1140484 -1789893
58221 -1789893 -945587 275405 -4089 -1455061 -2028259 -723833 1474660 3054294 3384068
58212 3384068 2896816 2410742 2063453 928544 -1672375 -4652050 -6013072 -5175479 -3265335
58203 -3265335 -1213151 873850 2392513 2190388 408600 -1270013 -1875870 -2139320 -2652814
58194 -2652814 -2752729 -2073946 -1592396 -2045683 -2642388 -2365425 -1440006 -675935 -428093 -840554
58184 -840554 -1956037 -3071832 -3245516 -2784774 -2769905 -2938519 -2008134 -423828 -371003
58175 -371003 -2258987 -3717496 -3260044 -2344552 -2221506 -1405863 1480834 4610328 5276330
58166 5276330 3657265 1808606 394916 -1081992 -2083418 -1641009 -317559 611015
58158 611015 1042561 1257092 590608 -985500 -1539943 5514 1306061 -127255 -2467823
58149 -2467823 -1993264 884273 1963508 -449094 -3502433 -4637858 -4742926 -5254984 -5407237
58140 -5407237 -4136421 -2254534 -958850 -36333 1019113 1743563 1787345 1802122 2272908
58131 2272908 2840404 3366354 3982577 3629655 782182 -3494672 -5632760 -4122246 -1746120
58122 -1746120 -1521125 -2546590 -2125231 -230695 849786 285634 -610038 -1065585 -1714180
58113 -1714180 -2663864 -2879201 -2001649 -1126898 -1172467 -1729695 -2041690 -2026054 -1823657 -1314116
58103 -1314116 -668062 -563018 -1159835 -1461839 -492934 1134428 1612709 72856 -2199248
58094 -2199248 -3102929 -2063922 -492842 145918 28690 243971 986583 1421848 1118330
58085 1118330 530993 -50489 -945812 -2097049 -2666758 -2246981 -1590821 -1381516 -1056518
58076 -1056518 212230 1985268 3058157 3076673 2540015 1487590 -495315 -2867993 -4052563
58067 -4052563 -3296257 -1605271 -202583 963277 2265236 2866745 1642015 -597652
58059 -597652 -1408907 219295 2327715 2386858 366833 -1640282 -2232969 -1806726 -1056319
58050 -1056319 116392 1696558 2702081 2142517 352111 -1311185 -1860460 -1381767 -652461
58041 -652461 -425291 -834481 -1242817 -919785 19632 722922 681421 159361 -504324 -1280126
58031 -1280126 -1944617 -2034770 -1675109 -1645013 -2189963 -2573453 -2270388 -1746715 -1573084 -1746656
58021 -1746656 -2422989 -4058750 -5940509 -5922177 -3026898 706150 2523767 2325616 2102041
58012 2102041 2655120 2766538 1471844 -588000 -2264495 -2970802 -2526075 -1191071 -18178
58003 -18178 -88174 -1277892 -2579404 -3358318 -3409931 -2433413 -784635 -77456 -1332001
57994 -1332001 -3052887 -3091881 -1975325 -2058413 -3556679 -4160620 -3017797 -2255357 -3450853
57985 -3450853 -5170829 -5518302 -4830127 -4091089 -2831766 -797331 130451 -1640608 -4175666
57976 -4175666 -3931987 -495133 3031031 4260804 3874857 3522863 3543955 3471346 3075907
57967 3075907 2009414 -255854 -3170853 -4835190 -4027708 -1848533 -384478 -228804
57959 -228804 -323749 17501 140160 -580155 -1370564 -905555 862059 2572310 3136729
57950 3136729 2748418 2049166 1152588 5666 -993217 -1439643 -1481994 -1306646 -665224
57941 -665224 348494 795317 235013 -105501 1091256 2933601 3217432 1508226 -319828
57932 -319828 -751487 -211679 311548 575072 483181 -263488 -1242131 -1454712 -1069372 -1489759
57922 -1489759 -2834528 -3009395 -709259 1927064 1465121 -2445591 -6293056 -6416448 -2745109
57913 -2745109 1279206 2264265 331970 -1297038 -464496 1217570 1085287 -332674 -298511
57904 -298511 1354121 1664729 -553724 -2496446 -1617528 736305 1961936 1968175 1998465
57895 1998465 1935180 1348339 1236372 1975698 1422070 -1877842 -5288352 -5358443 -3131157
57886 -3131157 -2399067 -3647235 -3938666 -2484482 -1810803 -2777617 -2808703 -586508 1298682
57877 1298682 455174 -1621778 -2164389 -966362 467998 1426513 1648277 538671 -1217381
57868 -1217381 -1190322 1433716 3766462 2874720 22065 -1343500 -670701 -488349 -2025569
57859 -2025569 -3557255 -3457187 -2524531 -2413280 -3347172 -4288237 -4394457 -3610435 -2364478
57850 -2364478 -1113926 24170 1215173 2383815 3144871 3462149 3726174 3855921 3221936
57841 3221936 1986981 1421167 2029462 2491292 1585964 42722 -937727 -1845227 -3605690
57832 -3605690 -5012823 -3843716 -458450 2049005 1740655 -159858 -1743755 -2794877
57824 -2794877 -3573145 -3128714 -636238 2631517 4421670 4166235 3143202 2284189 1200851
57815 1200851 -554058 -2442288 -3553715 -3588653 -2972068 -2454428 -2636254 -3337480 -3432828
57806 -3432828 -2029149 16730 575536 -1217599 -3564451 -3977032 -2262547 -465919
57798 -465919 133851 599107 2174507 3787014 3345855 1192563 312879 2380645 5104882
57789 5104882 4914020 1488267 -1934743 -2567382 -890548 799981 1323041 1283094 1588336
57780 1588336 2249656 2599076 2251850 1701707 1797356 2471083 2494689 1186205 -177305
57771 -177305 86301 1378710 1483752 153676 -208982 1425957 2351716 22151 -3484647
57762 -3484647 -3978538 -1205841 1141135 1407092 2049398 4565965 6205254 4310544 970566
57753 970566 -2605 1260306 1673116 582652 195867 953893 570473 -1545887 -2606427
57744 -2606427 -755740 1950580 2798412 2117225 1608375 1196239 48633 -948525 -431198
57735 -431198 805396 963837 270018 339022 1059413 710792 -934599 -2136439 -2013070
57726 -2013070 -1497642 -1081451 69887 2023567 3274190 3038868 2446778 2339539 1755064
57717 1755064 -14722 -1610709 -1653088 -1242169 -2330840 -4405612 -4943810 -2992606 -398712
57708 -398712 736878 310620 -397098 -307673 853247 2401578 2737995 668837 -2725395
57699 -2725395 -4592149 -3545398 -1587836 -1716667 -4144019 -6236520 -6165839 -5113062 -5080352
57690 -5080352 -5695519 -4767318 -1842735 474781 -334363 -3266584 -4874302 -3513812 -1070220
57681 -1070220 -91081 -595421 -821900 -181979 246285 53845 447108 1990125 2909632
57672 2909632 1297021 -1766766 -3263776 -2355679 -1332098 -1823057 -2289568 -854743 1293228
57663 1293228 1791996 1167605 1917495 3856830 3850673 1024020 -1115916 312773 3202756
57654 3202756 3733944 1940601 884735 1557216 1992750 1081095 787 -460444 -1088832
57645 -1088832 -2001703 -1822236 -175888 1197166 1015856 204910 -114803 -449969 -1351653
57636 -1351653 -1901833 -1586904 -2078092 -4933579 -8511299 -9434829 -6808319 -3104078 -987815
57627 -987815 -895642 -1725306 -2335762 -2046169 -868134 315158 504815 -357965 -1606875
57618 -1606875 -2787548 -3573057 -3167091 -980103 2136502 4374684 4768954 3740247 2096098
57609 2096098 545924 -19071 855180 2159046 2335923 1459874 1085155 1544409 1119156
57600 1119156 -1058727 -2831784 -1449139 2659969 6311487 7412343 6635132 5250101
57592 5250101 3205170 227467 -2524352 -3231882 -1448442 1418363 3374374 3195071
57584 3195071 1149748 -1013389 -1434631 -230944 435856 -766067 -2267685 -1817855 -39169
57575 -39169 353198 -1138944 -1713489 578887 3826537 5113562 4695565 5089054 6963267
57566 6963267 8402488 8112918 7087502 6592041 6347767 5589483 4603188 4194100 4384247
57557 4384247 4485775 4101904 3534503 3408374 4113537 5437825 6756019 7750686 8705459
57548 8705459 9899433 11236582 12796828 15020923 17896600 20878149 24083769 28215836
57540 28215836 32617628 35424331 37070911 41329490 50562291 62325002 73862712 87618862
57532 87618862 108206241 136587562 173114101 223276257 289610508 355387317 387593007
57525 387593007 365615788 302940463 233476942 180069452 143167770 115182439 93483555
57518 93483555 77548962 63889087 50087639 38850812 33222894 31105935 28310470
57511 28310470 24243108 21064597 19430705 18328351 17448076 16811622 15400139 12692368
57503 12692368 10268727 9477948 8797112 6077185 2408705 1032927 2780429 5004926
57495 5004926 5140801 3467976 2115270 2597721 4471254 5743516 4975091 3295396 3134610
57486 3134610 4434770 4179363 1095309 -1556287 -449279 2541596 3056135 1042037
57478 1042037 616697 3083059 4490236 1765405 -2386549 -3382859 -1187268 96869
57470 96869 -2066275 -5878543 -7882204 -6666404 -3934819 -2835724 -4864768 -7830368
57462 -7830368 -7826013 -4012298 -166276 -225463 -3555977 -6328678 -6494199 -5225933 -4032115
57453 -4032115 -2909481 -1613703 -687196 -522502 -794702 -1283539 -2078116 -2797386 -2899952
57444 -2899952 -2818428 -3336891 -3907047 -3376305 -2366088 -2661564 -3929096 -3689724 -1381954
57435 -1381954 435197 331646 364073 1988145 2731656 242985 -2888362 -2494345 636766
57426 636766 2117781 1003965 603278 2157479 2777059 984900 -382133 880699 2450457
57417 2450457 1419627 -962452 -1558892 -5881 1787695 2832287 3035723 1833636
57409 1833636 -440861 -1520520 -232224 1144428 341130 -928430 235804 2799459
57401 2799459 3318820 1524380 301020 586008 485492 -442180 -290643 1070124 1141044
57392 1141044 -518746 -675191 2366507 5341027 4603039 1544706 329295 1883465
57384 1883465 3309126 2588749 977539 397116 582266 -136234 -2132090 -3701584 -3298677
57375 -3298677 -1934966 -2055559 -3708384 -3744837 -443523 2994596 2531630 -390219 -624852
57366 -624852 2714393 4653080 2025133 -1732031 -2091876 35172 829384 -259425 -932381
57357 -932381 -780709 -1395723 -2655049 -2880677 -2386037 -3053198 -4229791 -2914845 1004831
57348 1004831 3315032 1155965 -2662659 -3456150 -939842 901585 -591591 -3711422
57340 -3711422 -5090353 -3675046 -1252279 41308 -164129 -672643 -394806 485071 814323
57331 814323 -346376 -2753485 -4932120 -5352452 -4176656 -3507973 -4933895 -6967623 -6388754
57322 -6388754 -2572537 1076307 1103082 -1809431 -4036049 -3510521 -1439123 -4071 -24607
57313 -24607 -949585 -1811483 -1834400 -938208 131931 663283 797487 980419 1033568 534981
57303 534981 -298970 -966579 -1510373 -2133949 -2512628 -2504956 -2951305 -4439885 -5775336 -5327308
57293 -5327308 -3716359 -3266841 -4458550 -4825247 -2365381 1421509 3261219 2002778
57285 2002778 -592188 -2540137 -3650703 -4579219 -5099638 -4424104 -2964380 -2516757 -3949757
57276 -3949757 -5467738 -4511141 -1322659 921331 166495 -1801032 -1957359 -206751 899090
57267 899090 124428 -848696 -176582 1520097 2275363 1445956 114551 -706980 -1207749
57258 -1207749 -1980990 -2770117 -2535598 -771963 1628888 3191623 3357479 2671710 1648592
57249 1648592 343260 -809467 -894535 43989 442461 -885684 -2966831 -3846621 -3043917
57240 -3043917 -1729838 -845697 -219199 570435 1470231 2089132 1841938 268787 -1965144
57231 -1965144 -2899259 -1341062 1114435 1427843 -1433401 -5442829 -7899442 -7736787 -5486323
57222 -5486323 -2398270 -106398 80445 -1498883 -2817860 -2181110 -52859 1526748
57214 1526748 1149953 -596994 -1864054 -1463425 43457 1313402 1968196 2635639 3317867
57205 3317867 2980650 1335933 -254157 -717533 -1015240 -2572871 -4828131 -5883448 -5007961
57196 -5007961 -3007175 -731759 1156643 1606172 343142 -822526 -47404 1421546
57188 1421546 633303 -2441327 -4428360 -3466795 -1844380 -2198785 -3518312 -3179745 -1299235
57179 -1299235 -409547 -1446901 -2529183 -1991610 -780552 -980217 -2890498 -4438860 -3444375
57170 -3444375 -172187 2584770 2205471 -1041064 -4298492 -5028597 -3166163 -597319
57162 -597319 733786 179631 -1361438 -2342634 -2191909 -1913273 -2515178 -3330236 -2943274
57153 -2943274 -1367652 110059 1024517 1975184 2714407 1939284 -375203 -2192746 -1950813
57144 -1950813 -527762 230943 -277825 -1467371 -2467380 -2122262 369994 3623210 4390687
57135 4390687 1323991 -2813404 -4421607 -3480414 -2687568 -3047233 -2880739 -1274558 23838
57126 23838 -783048 -2775872 -3603081 -2642016 -1532497 -1848472 -3331367 -4563535 -4651015
57117 -4651015 -3906216 -3257467 -3300119 -3733947 -3556788 -2110382 -153030 640313 -183777
57108 -183777 -857570 331103 2225651 2045086 -456854 -2287751 -1579885 -362084 -1216095
57099 -1216095 -3202824 -3607651 -2276562 -1372797 -1746030 -2467573 -3316097 -4601061 -4917815
57090 -4917815 -2521124 1013803 2088393 487513 -221437 1486229 2847667 1852039
57082 1852039 452985 510861 439126 -1086906 -1614710 1095125 4334797 3957251 794971
57073 794971 -669690 1030895 3094876 3389147 2784059 2359181 1576388 -122737 -2283306
57064 -2283306 -4346045 -5755290 -5481297 -3400466 -1507102 -1568009 -2444201 -2237322 -1940798
57055 -1940798 -3641305 -5889887 -4929258 -774985 1944934 356641 -2940191 -4101148
57047 -4101148 -3018325 -2148983 -2637946 -3621848 -4026401 -3600748 -3000309 -3291669 -4298418
57038 -4298418 -3860596 -768923 2165160 1103731 -2795877 -4212199 -1350908 1412248
57030 1412248 468672 -1644767 -865380 1998209 3395007 2848107 2342260 1822899 -105006
57021 -105006 -2081974 -1355532 924808 414189 -3718787 -7105417 -6601576 -4401756 -3590128
57012 -3590128 -3172234 -661198 2918829 4220327 2559742 466895 -282943 -298609 -273415
57003 -273415 212451 1054975 1122272 254467 -163057 431217 670668 -288145 -994989 -32240
56993 -32240 1382718 1164914 -329532 -1059463 -735265 -973428 -2110794 -2520607 -1681014
56984 -1681014 -1421968 -2949582 -4704254 -4603421 -2743501 -491497 1492793 2829435
56976 2829435 2645364 1068398 146092 1302997 2968563 2685951 563009 -1375760 -2226176
56967 -2226176 -2374720 -1634904 237955 1874715 1786596 984680 1318062 1726552 -512401
56958 -512401 -4797840 -7125756 -5795532 -3701250 -3559628 -4145371 -3227034 -1356331 -306855
56949 -306855 660 467062 444172 -1076221 -3138230 -3989207 -3638743 -3273364 -3078272
56940 -3078272 -2581132 -2237731 -2671455 -3087768 -2405487 -1328903 -1368075 -2349278 -2861796
56931 -2861796 -2788416 -3379828 -4870093 -5839631 -5179221 -3343267 -1549799 -769630 -1281570
56922 -1281570 -2210094 -1976209 -294241 1009145 458943 -755005 -652401 349153 387930
56913 387930 -446816 -439283 284754 -239922 -1844630 -1491624 2073981 5749843 6143244
56904 6143244 3929159 1891399 652049 -808285 -1860769 -931090 878219 345404
56896 345404 -2998023 -5587646 -4806333 -2626183 -2202946 -2920613 -1725634 1528304 3190701
56887 3190701 686092 -4123251 -7379537 -7271200 -4668239 -1368167 925784 1099940
56879 1099940 -318426 -1244836 -428738 848971 611896 -1058266 -2489225 -2900149 -2744157
56870 -2744157 -2110751 -717369 657459 677211 -461993 -1236995 -1261447 -1623863 -2451439
56861 -2451439 -2301852 -778145 355382 -77757 -614894 587805 2845506 3979708 3333954
56852 3333954 2183583 1686698 1736147 1583556 748465 -459068 -991343 -184549 1187453
56843 1187453 1986402 2586938 3974930 5154780 4034755 1344569 508521 2229934 2562702
56834 2562702 -1146232 -5461435 -5444283 -1709482 1071295 1160374 934579 1757346 2069332
56825 2069332 962649 -154788 -306285 -228983 -214327 381877 892068 -319120 -2557746
56816 -2557746 -3065220 -1543284 -1080893 -3207413 -5376858 -5219186 -4069295 -3944233 -3968829
56807 -3968829 -2569167 -702558 75659 625701 2231534 3530710 2751708 1352672 1784490
56798 1784490 2899813 1609574 -1535558 -2677847 -724820 1099588 703574 172513
56790 172513 1672164 3772330 4177937 3366789 2877506 2117159 -211714 -2839459 -2957694
56781 -2957694 -4126 3847401 6541310 7403920 6043238 2440439 -1638033 -3496141
56773 -3496141 -2490745 -606122 467200 1207467 2460259 3381586 2545759 164258 -2183480
56764 -2183480 -3598035 -4420815 -4855451 -4151081 -1626727 1949801 4520488 4521204 2558917
56755 2558917 969997 1263730 2298688 1777949 -610855 -2697111 -2673424 -1127881 397347
56746 397347 1504847 2422075 2568104 1411644 224842 1043027 3681405 5406224 4157876
56737 4157876 912506 -1796142 -2734308 -2613157 -2578413 -2892149 -2968188 -2298029 -1297012
56728 -1297012 -1077259 -2109972 -3467486 -3978420 -3732187 -3548374 -3319887 -2168004 -256164
56719 -256164 904544 343384 -1263567 -2698920 -3312871 -2738468 -864508 1231366 1579974
56710 1579974 -441939 -2996046 -3792998 -2603631 -1104334 -874677 -2127526 -3740401
56702 -3740401 -4032738 -2249362 293282 1385566 597499 -325177 -143510 257455 -223345
56693 -223345 -881001 -460247 654501 1011596 218345 -794227 -1191617 -920886 -420636
56684 -420636 -361650 -1037180 -1513698 -478507 1441575 1712331 -665517 -3283032 -3368956
56675 -3368956 -1325238 426478 758894 65709 -1523461 -3758372 -4914622 -3369463
56667 -3369463 -349529 1052814 -367235 -2867685 -4265104 -3894035 -2417432 -1285373
56659 -1285373 -1926220 -3940434 -4844958 -3248134 -1116194 -799135 -1264186 -187427 1521503
56650 1521503 1066477 -1002108 -1238366 693773 939026 -2298743 -5610807 -5629783 -3765479
56641 -3765479 -2995004 -3017255 -1859168 -93688 -8815 -1755914 -3319698 -3656602 -3332097
56632 -3332097 -2516210 -714361 1540780 2627061 1734678 -247167 -1661708 -1230470 1109593
56623 1109593 3719086 4358262 2576339 199903 -1119839 -1563457 -1633887 -775498 1083740
56614 1083740 2251824 1432523 -49504 -136240 909075 1438137 1466603 2285745 3452575
56605 3452575 2861078 165804 -2254106 -2623177 -2117927 -2678038 -3968061 -4107728 -2683583
56596 -2683583 -1407302 -1722545 -3026476 -3843119 -3886613 -3937693 -4042241 -3242035 -1499799
56587 -1499799 -481417 -1303142 -2614600 -2510530 -1550547 -1878988 -3698428 -4883306 -4286605
56578 -4286605 -3163270 -2701946 -2340609 -1515014 -1045835 -1486891 -1813906 -1141000 -262780
56569 -262780 -165161 -451266 -620916 -1429889 -3324611 -4777993 -4039668 -1779616 -332233
56560 -332233 -758850 -1948685 -2265452 -1166124 374432 525581 -1538066 -4111251 -4473733
56551 -4473733 -2243979 294187 1472612 1780105 1646713 358117 -1637952 -2110085 -481918
56542 -481918 754380 116747 -144024 1956130 4084064 2905424 -628904 -2930838 -3108323
56533 -3108323 -2962600 -3005089 -2437118 -2215939 -4011819 -6374692 -5899685 -2382098 819374
56524 819374 1810109 1991753 2521002 2589832 1957683 1703306 1545985 -160552 -2731048
56515 -2731048 -3060398 -782614 72685 -3084635 -6950260 -6605646 -2147381 1889288 2431133
56506 2431133 507230 -1304775 -1637639 -532435 1298068 2838983 3175957 1968145
56498 1968145 -355061 -2614165 -3406683 -2358075 -700171 118990 81828 97176 496269
56489 496269 1052702 1654732 1695404 -74553 -3375671 -5353962 -3939944 -1046303 190454
56480 190454 18067 587300 1089418 -1236513 -5474529 -7171788 -4942435 -2432365 -2295204
56471 -2295204 -2613431 -1353307 -164431 -934647 -2108170 -1567616 -317405 -209518 -485061
56462 -485061 332226 1245088 579907 -755877 -724301 519515 1280069 982131 43239
56453 43239 -1371239 -2513865 -1884087 79469 392139 -2073442 -4105111 -2881285 -546973
56444 -546973 -588443 -2105928 -1949609 -722857 -1831669 -5310402 -7312650 -5940912 -3516186
56435 -3516186 -2504791 -2696491 -3063787 -3355132 -3248373 -2555018 -2438651 -3771586 -4512923
56426 -4512923 -1955403 2414456 3930660 1196583 -2097536 -2858413 -2538207 -3711933
56418 -3711933 -5848426 -6748376 -5933957 -4424360 -2768293 -1182839 -391518 -736553 -1380812
56409 -1380812 -1466925 -1125670 -659366 58506 759656 713112 81601 -60992 387513 192716
56399 192716 -1088293 -2182458 -1986566 -907272 203254 842887 191415 -2333085 -5131302
56390 -5131302 -5217658 -2135630 904047 1162477 -232190 -623082 209086 436407 -670555
56381 -670555 -2052177 -2720778 -2662942 -2280228 -2204705 -3226792 -5279064 -6908324 -6724283
56372 -6724283 -4980203 -2988977 -1548854 -680572 -289559 -270704 -382837 -602264 -1210358
56363 -1210358 -2251441 -3418278 -4462486 -4962413 -4041743 -1689968 -51012 -1404591
56355 -1404591 -4725908 -6461652 -5158220 -2886660 -1417150 53926 1946968 2240328
56347 2240328 -127873 -2395549 -1620475 705780 998813 -876666 -1992413 -1482755 -1490875
56338 -1490875 -2919570 -3811471 -2832272 -1414034 -1187829 -1585022 -1285564 -267469 743181
56329 743181 1406709 1390535 174241 -1868200 -3287879 -3173536 -2007223 -586731 677156
56320 677156 1080794 -196128 -2496494 -3627741 -2346716 47829 1328361 682817 -1049662
56311 -1049662 -2480958 -2501220 -1052545 378876 54966 -1776783 -3060453 -2763949 -2150436
56302 -2150436 -2537791 -3230612 -2746821 -1006098 726800 1208415 -165738 -2970459 -5283907
56293 -5283907 -5034828 -2750997 -1444313 -2664904 -4411952 -4382579 -3274868 -2765476 -2223022
56284 -2223022 -421241 990935 -526959 -3499310 -3489549 457150 4157039 4245101 2358770
56275 2358770 1652263 2293490 2769118 3005007 3388512 2733767 219588 -2156083 -2104421
56266 -2104421 -878704 -1429794 -3589524 -4544465 -3744866 -3554261 -4568207 -4174189 -1254158
56257 -1254158 1168785 327307 -2001988 -2475802 -1456724 -2000709 -4533712 -5923954 -4115693
56248 -4115693 -931377 705364 388191 -153613 193574 895548 1058643 708776 556112
56239 556112 848886 878243 -57028 -1405480 -1865673 -1296097 -1072717 -1902885 -2404208 -1060531
56229 -1060531 1252445 2228247 1153713 -621296 -1946663 -2784554 -2842811 -1404090 759708
56220 759708 1216763 -1085472 -3980991 -4669650 -3064612 -1142689 6388 658671 654203
56211 654203 -678924 -2674887 -3425285 -2387873 -1243164 -1293073 -1588271 -892850 -84274
56202 -84274 -789777 -2524255 -3264604 -2557779 -1933985 -2129121 -2143225 -1665592 -2074255 -3683291
56192 -3683291 -4165952 -1789151 1394751 2029244 57258 -1719576 -1911859 -1525765 -1094409
56183 -1094409 -86160 573430 -1145140 -4447869 -5497451 -2873126 -169430 -826506
56175 -826506 -3170173 -3531647 -1938053 -1146481 -1618558 -1330479 91664 763886 83667
56166 83667 -398891 37798 328854 -24021 -385597 -1027445 -2842723 -4659383 -3988640
56157 -3988640 -1197223 315011 -757749 -1654633 -359229 970746 -166897 -2288548
56149 -2288548 -2519602 -1337019 -1330456 -2603858 -2791490 -1048428 995567 2083379 2499463
56140 2499463 2407049 1445394 201935 -79479 393120 80706 -1253753 -1878219 -694786
56131 -694786 1069698 1597997 747520 -218196 -404617 -167216 -596188 -2317892 -4546698
56122 -4546698 -5623900 -4963678 -3860048 -3597979 -3604731 -2772895 -1872861 -2785849 -5481357
56113 -5481357 -7634780 -7570611 -5978823 -4315990 -3123894 -2566672 -3034349 -4148690 -4376736
56104 -4376736 -2839894 -717694 243188 -1026 -108661 489404 930181 391430 -804428
56095 -804428 -1874300 -2620874 -3263558 -3659971 -3424480 -2817410 -2730423 -3301180 -3217154 -1407154
56085 -1407154 868517 1000514 -1575123 -4317760 -4689108 -3125407 -1854789 -1862014 -2479550
56076 -2479550 -3170034 -3945334 -4337153 -3702443 -2615841 -2401664 -3064743 -3149170 -2024593
56067 -2024593 -924436 -1107840 -2135794 -2685743 -2247031 -1386178 -939991 -1379763 -2475948
56058 -2475948 -3388925 -3579235 -3538758 -3929080 -4275694 -3605089 -2243605 -1674316 -2486811
56049 -2486811 -3734371 -4445672 -4384237 -3176524 -418951 2815096 4316152 3447826 1959641
56040 1959641 1208068 285312 -1825528 -3911754 -4076021 -2377636 -208744 1799361 3334598
56031 3334598 3011396 -84535 -3917603 -5124944 -3306453 -1460296 -1734855 -2935089
56023 -2935089 -3033244 -2068726 -1240543 -776612 -358349 -580011 -2221219 -4502621 -5587450
56014 -5587450 -4820097 -3372991 -2610145 -2705440 -3024013 -3127949 -3090638 -3155270 -3221918 -2618432
56004 -2618432 -731561 1845199 3386453 2981775 1922076 2093298 3271812 3421309 1838957
55995 1838957 376917 686875 1738083 1579934 511475 457272 1557523 1711872 57143
55986 57143 -1301463 -448694 1085593 262300 -3013703 -5527837 -4992695 -2826882 -1909809
55977 -1909809 -2809216 -3416218 -1910365 941511 2719069 2168776 615930 309114 1611824
55968 1611824 2564696 1502259 -684244 -1634757 -361383 1870752 3204324 2838022 1192454
55959 1192454 -628418 -1488182 -1069728 -144231 452779 741668 857499 112821 -1930284
55950 -1930284 -3940443 -4023714 -2405285 -1210728 -1345395 -1371808 -85393 1549610 2073725
55941 2073725 1706995 1585346 1829093 1603625 463594 -1320100 -3213268 -4469664 -4363564
55932 -4363564 -3041153 -1596689 -936694 -1260221 -2647435 -4826401 -6219930 -5102880
55924 -5102880 -2347471 -988360 -2047243 -2964969 -1601005 539753 1064874 385931 70097
55915 70097 -383049 -1900159 -2726567 -821979 1737976 1052290 -2221817 -3288994 -569960
55906 -569960 1888359 822481 -1683302 -2367215 -1811918 -2254510 -3249682 -2936012 -1757337
55897 -1757337 -1679487 -2851022 -3780918 -3862523 -3329900 -1860424 255728 726387 -2057764
55888 -2057764 -5700320 -6157238 -3100254 -40421 779472 585368 837423 874700 -105181
55879 -105181 -1215011 -1457048 -1319139 -1516394 -1609491 -997560 -52259 637117 997277 816863
55869 816863 -290245 -1629122 -1636118 -118551 1250060 1469973 1515844 2117916 2266229
55860 2266229 1439807 1252916 2668100 3366620 834621 -3027174 -3769938 -730700 1914046
55851 1914046 1187146 -811607 -746024 927626 1306328 -254842 -1635134 -1556992 -1057869
55842 -1057869 -1172646 -1429461 -1393682 -1845390 -3281095 -4637122 -4836498 -4564365 -4981345
55833 -4981345 -5393226 -4023957 -976003 1425001 1691288 988624 1123319 2113528 2831209
55824 2831209 2882490 2524162 1614357 134180 -883718 -511069 422575 411258 -387039
55815 -387039 -684363 -632185 -1634334 -3449392 -3974469 -2709705 -1957088 -3158989 -4334280
55806 -4334280 -3135226 -505646 1150340 1888191 3353999 4894572 3909668 321275
55798 321275 -2366405 -1554945 1208477 2795904 2504933 1990477 2404848 3126933 2841252
55789 2841252 903925 -2034928 -4282551 -4491920 -3104781 -1780698 -1325131 -1175589 -1006480
55780 -1006480 -1376014 -2251366 -2397833 -1164285 387219 1085691 1078868 595742 -1136383
55771 -1136383 -4012403 -5440882 -3042160 1541447 3986840 2611321 114892 -545960
55763 -545960 235181 531674 401120 1423432 3526969 4584977 3508450 1898889 1555744
55754 1555744 1595927 -233352 -3657104 -5225437 -2534485 2186180 4362967 2586182
55746 2586182 84437 340817 2858755 4369290 3171799 824029 -176183 849708
55738 849708 2486150 2917456 1596506 -444520 -1770654 -1953403 -1543655 -843189 397233
55729 397233 1816115 2134554 863328 -600553 -723221 -3132 -55428 -950369 -1022950
55720 -1022950 569680 2518704 3079205 2087234 712987 -32534 10683 402665 505451
55711 505451 -100637 -1265718 -2438946 -3199863 -3396568 -2889286 -1599909 145798 1634520
55702 1634520 2149781 1289933 -715126 -2781225 -3666196 -3387629 -3311892 -4165099 -4727972
55693 -4727972 -3573831 -1441111 -415405 -1027056 -1760430 -1568599 -1269862 -1852058 -2693876
55684 -2693876 -2361702 -425049 2181382 4044625 4125863 2394037 54007 -1386701 -1579905
55675 -1579905 -1388713 -1475695 -1647104 -1676032 -1726792 -1638453 -884382 222009 398241 -716925
55665 -716925 -1558985 -663420 1005154 1110635 -880538 -2933969 -3161714 -2171888 -1889139
55656 -1889139 -2672872 -2828708 -1185154 988343 1642532 878093 671819 1623631 1780332
55647 1780332 -362924 -3222247 -4006680 -2236944 210011 1740776 1960483 681462
55639 681462 -1799100 -3654438 -2982427 -529487 985525 499512 -404041 -374157 45070
55630 45070 211875 604002 1258806 1009996 -536273 -1965206 -2086146 -1412739 -707262
55621 -707262 159361 908496 376832 -1458490 -2922120 -3327931 -4046631 -5476356 -5513164
55612 -5513164 -3151204 -1111571 -2089400 -4448581 -4845808 -3484566 -3161947 -4141078 -3846363
55603 -3846363 -1493854 598128 795021 148406 -91378 -265562 -767855 -1035574 -929633
55594 -929633 -1146012 -1582974 -1178586 59946 720337 186156 -659762 -1317862 -2218275
55585 -2218275 -2878512 -1765629 1016498 2879460 1820398 -1136118 -3534156 -4132453
55577 -4132453 -3156785 -1397394 22070 245165 -176191 116180 1164329 1639719 1186530
55568 1186530 897111 914789 -185941 -2566871 -3926506 -2740806 -807660 -673399 -2021023
55559 -2021023 -2605356 -1634256 -198659 877393 1644203 1880111 1106181 -251980 -1006960
55550 -1006960 -643011 114618 67567 -1437468 -3720848 -4808578 -3282124 -440534 738958
55541 738958 -603027 -2058049 -1528191 -138925 -64845 -1125361 -1609798 -1308990 -1452854
55532 -1452854 -2283549 -2871053 -3033814 -3414623 -3735825 -2903157 -1031871 300426 164392
55523 164392 -681445 -1108165 -814187 -65460 649622 599992 -487446 -1630140 -1538614 -446841
55513 -446841 18856 -1085479 -3008488 -4454516 -4859309 -4406692 -3555236 -2669507 -1627471
55504 -1627471 -34606 1680608 2123875 888878 -161272 836480 2656158 2144407 -1358631
55495 -1358631 -4707030 -4800763 -2145870 480140 1603210 1836388 1785722 861201 -1420889
55486 -1420889 -3932608 -4665496 -3031501 -802078 -162018 -1132563 -1873285 -1524229 -1314186
55477 -1314186 -2146831 -2624278 -1068100 1470258 2232574 532997 -1403369 -1581323 -511000
55468 -511000 134129 -337938 -1507799 -2692920 -3216300 -2692133 -1611043 -969013 -1047650
55459 -1047650 -1340368 -1768091 -2879319 -4617544 -6091285 -6929345 -7591816 -7879427 -6645425
55450 -6645425 -3896748 -1778595 -2155577 -4217426 -5816920 -6272950 -6275811 -5734809 -3770606
55441 -3770606 -939447 459744 -816397 -3044577 -3468088 -1562439 517579 512045 -1637717
55432 -1637717 -4019314 -4706411 -3337475 -1152017 229898 164023 -657485 -1137085 -1038356
55423 -1038356 -1169622 -2234304 -3797896 -4780864 -4818562 -4531406 -4332989 -3679398 -2050130
55414 -2050130 -216062 256796 -1231868 -3610073 -5261177 -5396254 -4207731 -2205574
55406 -2205574 118816 2097183 2859686 1905553 -263880 -2358170 -3355526 -3208651 -2396517
55397 -2396517 -1225023 -39935 340045 -669075 -2351068 -3255901 -2922450 -2159976 -1589212
55388 -1589212 -1042396 -618706 -970394 -1946438 -2253957 -1293603 -130478 275028 530962
55379 530962 1345406 1866018 1046002 -285718 -446509 572501 1208147 599490 -629932
55370 -629932 -1505370 -1403405 -177723 1189449 854687 -1509969 -3490892 -2787565 -349785
55361 -349785 1345133 2102362 3432303 4844214 3972308 670404 -2069120 -2135750 -672518
55352 -672518 458178 1116847 1729620 1997609 2000450 2565227 3407226 2924994 963737 -346921
55342 -346921 214468 1075419 595625 -488656 -959158 -1242455 -1689444 -849067 2149729
55333 2149729 5193136 5707939 4342555 3696812 4425339 5016312 4643467 3903206 3251908
55324 3251908 2741730 2744876 3133397 2575727 562132 -889017 228156 2601806 3299831
55315 3299831 2008648 959600 1220382 1868620 2524177 3717777 4650899 3530806 612048
55306 612048 -1748339 -2547063 -2989277 -3386305 -2190863 745178 2768085 1960423 -135096
55297 -135096 -1026990 -619732 -374438 -813468 -1575970 -2541055 -3275296 -2668543 -704512
55288 -704512 643691 -113546 -1784591 -2407233 -2185866 -2627321 -3663811 -3750018 -2458764
55279 -2458764 -1099523 -817809 -1589478 -2985934 -4523349 -5375025 -5149741 -4906198 -5978927
55270 -5978927 -7734397 -7945680 -5723474 -2776691 -1263722 -1497501 -2358890 -2968921 -3125335
55261 -3125335 -2768864 -1952855 -1129573 -769885 -695922 -254948 736633 1488218 874128 -1362760
55251 -1362760 -4066471 -5508956 -5010778 -3702478 -3428350 -4813747 -6610037 -7067159 -5756678
55242 -5756678 -3789696 -2361979 -1576444 -952798 -605323 -1154680 -2489600 -3440052 -3069460
55233 -3069460 -1686692 -136579 1289337 2635774 3601298 3905486 3883453 3818710 3101280
55224 3101280 1131605 -1192822 -2114093 -1170331 371405 1287523 1472977 1136615 210837
55215 210837 -973201 -1493884 -927566 79304 663417 508561 -269664 -1093097 -875676
55206 -875676 715918 1969193 736480 -2349831 -4094492 -2854353 -605395 51786
55198 51786 -931548 -2141947 -3037090 -3426662 -2364377 224421 2125930 1434022 -427960
55189 -427960 -741097 310104 261951 -1293151 -2111269 -1230002 -424478 -936621 -1572922
55180 -1572922 -1284796 -1078002 -1758786 -2056839 -932982 156037 -486808 -1772090 -1477148
55171 -1477148 78864 570950 -528684 -1184345 -74664 1477004 1525301 -58352 -1847749
55162 -1847749 -2459465 -1401330 685878 2196818 1819413 -42754 -1817595 -2721698 -3158113
55153 -3158113 -3259410 -2573939 -1543856 -1543132 -2531926 -2364780 86213 2546740 2116092
55144 2116092 -424059 -1448720 462140 2695158 2467973 430524 -848849 -425652
55136 -425652 604466 1263914 1514555 1219174 -127969 -2314893 -4066895 -4242296 -2936464
55127 -2936464 -1263889 -359920 -509641 -924851 -571619 456779 752533 -761677 -3380703
55118 -3380703 -5324710 -5485270 -3971746 -1574487 537773 1247132 618718 58659 383915
55109 383915 581283 -193855 -494659 1374103 3918286 3884488 1168506 -736348 72985
55100 72985 1371413 879461 -193072 53790 545531 -638593 -2455468 -2598144 -1746714
55091 -1746714 -2581001 -5095169 -6376633 -5141537 -3309757 -2652255 -2819264 -3268221 -4232355
55082 -4232355 -4961736 -3912809 -1795264 -1518855 -3627013 -4689593 -2274370 1172363
55074 1172363 2016578 771669 643668 2238964 3027001 1486791 -1167600 -3293062 -4326112
55065 -4326112 -3974613 -2240794 -466294 -309530 -1476724 -2309486 -2542267 -3290360 -4282322
55056 -4282322 -3747746 -1662455 -370491 -720829 -185930 3211482 7253248 8347158 6544590
55047 6544590 4887097 4451929 3169321 -46436 -2895924 -2946538 -1326984 -1129586 -3022595
55038 -3022595 -4500680 -3496341 -986115 676508 779493 496818 749577 1116976 967059
55029 967059 630390 888966 1805066 2573355 2347063 972864 -849347 -1994355 -1832384
55020 -1832384 -841600 69916 793554 1842152 2897090 2673783 816865 -1146744 -1674008
55011 -1674008 -1138255 -840550 -961075 -865616 -785539 -1532772 -2753495 -3048677 -1926126
55002 -1926126 -323936 856399 1496370 1577749 1073094 521736 430179 215290 -876325
54993 -876325 -2115298 -2287176 -1967645 -2569146 -3336105 -2136596 435868 1034159 -1273292
54984 -1273292 -3175207 -2295319 -846341 -1415588 -2189219 -66269 3690480 5089844 3427814
54975 3427814 1505491 513057 -1004401 -3002136 -3048926 -576999 1712782 2126446 2406506
54966 2406506 4194667 5963169 5535092 3408907 1545071 633369 374949 843505 1807496
54957 1807496 2142056 1549462 1490384 2837659 3999011 3061100 575239 -1479251 -2416176
54948 -2416176 -2843852 -2874136 -2005765 -255851 1755310 3220747 3052374 758507 -1813282
54939 -1813282 -1577288 1590293 3833265 2314815 -889417 -2187988 -1603260 -1502282 -2047807
54930 -2047807 -1630498 -759181 -1524299 -3456235 -3805357 -2202829 -1273254 -1961468 -2054427
54921 -2054427 -575226 95007 -1541050 -3054240 -1914616 243918 200744 -1751155 -2389252
54912 -2389252 -451638 1824304 2041744 472065 -815206 -427631 1042095 1695513 458592
54903 458592 -1425351 -1827676 -640952 179476 -290275 -780185 -534409 -923200 -2822001
54894 -2822001 -4473248 -4043736 -2548784 -1819763 -1155762 1009995 3211370 2287303 -1462889
54885 -1462889 -4000850 -3289962 -2176885 -3913532 -7294675 -8463968 -6061207 -2367974
54877 -2367974 -23369 501288 306697 458560 1227486 2021693 1844836 333425 -1645022
54868 -1645022 -2848506 -2987860 -2700055 -2332728 -1501704 -140934 683455 -143847 -1952282
54859 -1952282 -2528340 -842458 1225513 1109187 -808321 -1469611 526865 2717365 2205321
54850 2205321 -214810 -1388672 -388306 645753 163122 -767108 -789120 -434032 -630037
54841 -630037 -693272 508354 2373083 3181250 2374054 851295 -568156 -1629664 -1918395
54832 -1918395 -1127213 -51336 51774 -701086 -880387 45073 828432 325109 -945749
54823 -945749 -1894720 -2388655 -2605350 -1845827 478665 3111158 3833756 2232053 226692
54814 226692 -476066 -192859 1277 61736 517647 1156347 1359246 1235336 1253209 1030988
54804 1030988 -279297 -2333289 -3451021 -2586474 -722326 201209 -615897 -2130652 -2630522
54795 -2630522 -1442981 394460 1184090 385890 -855329 -1188162 -604293 -81005 -191828
54786 -191828 -764362 -1488332 -1990674 -1609305 -105626 1474289 1624562 164864 -1544002
54777 -1544002 -2153800 -1453267 -212076 327831 -721542 -2563341 -2834303 -430790 2453749
54768 2453749 2945373 1525961 1007950 1754801 1082428 -1912326 -4261441 -3565864 -1623997
54759 -1623997 -1283782 -2057746 -1665315 -161816 511582 6781 -324859 -172159 -411872
54750 -411872 -882083 -472020 809937 2064325 3339172 4906740 5288652 2806965 -1085055
54741 -1085055 -2940990 -1942208 -528584 -228673 -82704 169332 -1071345 -3679796 -4404690
54732 -4404690 -1422112 2307680 2873979 583766 -1412403 -1950829 -2255349 -2611979 -1952905
54723 -1952905 -623764 -583483 -2273182 -3676831 -3368707 -2521364 -2723796 -3361286 -2691690
54714 -2691690 -683132 813565 645394 -193613 -168471 646541 924722 206894 -478523
54705 -478523 -322608 26648 -458882 -1847625 -3769702 -6143228 -8163555 -7818087 -4390673
54696 -4390673 -624109 17171 -2127410 -3696568 -3356237 -2833135 -2576727 -375204 3940867
54687 3940867 6232560 3587411 -768132 -1804710 127500 611978 -1554614 -2991276
54679 -2991276 -1729111 -207360 -975632 -2918724 -3680257 -3256799 -3105345 -3482367 -3628310
54670 -3628310 -3389095 -3016912 -2283440 -1178179 -708787 -1742756 -3599237 -4780817 -4640421
54661 -4640421 -3654788 -2678696 -2480579 -3191383 -3659811 -2392748 181814 1655804 880348
54652 880348 -74174 1202008 3642906 3864347 840856 -2676313 -3790123 -2697838 -1461548
54643 -1461548 -1007140 -728116 -395273 -939573 -2984661 -5429738 -6266118 -4863549 -2908253
54634 -2908253 -2467391 -3243623 -2705684 539242 4438072 5686453 3677067 772858 -1186469
54625 -1186469 -2740062 -4586965 -5544656 -4396426 -2462522 -2166010 -3536009 -4315928 -3534331
54616 -3534331 -2651112 -2553963 -1806277 627457 2873719 2527007 325960 -904010 -358207
54607 -358207 152706 -391573 -786476 -172942 296667 -472344 -1665526 -2149456 -2297973
54598 -2297973 -2653559 -2217817 -94301 2103307 1738094 -1171299 -3749325 -3898927 -2420591
54589 -2420591 -1167694 -718436 -600904 -576244 -769706 -1201369 -1806321 -2425181 -2506129 -1521476
54579 -1521476 39142 900780 602051 38751 -8442 59292 -285262 -538888 -69381 555530
54569 555530 347922 -437498 -733974 -539035 -840180 -1484464 -852417 1409302 2866537
54560 2866537 1240529 -1955540 -2864131 -375335 2447728 2813719 1849973 2019119 2692837
54551 2692837 1184020 -2387500 -4502585 -3281427 -1271088 -1540636 -3300781 -3786243
54543 -3786243 -2909410 -3127715 -5238336 -7192067 -7380597 -6548701 -5634932 -4034854 -1424124
54534 -1424124 530398 183025 -1412810 -1734867 -245052 1142712 1031031 334825 572461
54525 572461 1616174 2125797 1632234 1133126 1540625 2325020 2237530 1027951 -311584
54516 -311584 -1096233 -1880147 -3235991 -4354166 -4013188 -2653001 -2059923 -2730880 -2972923
54507 -2972923 -1385069 994110 2176529 1962100 1765882 2204789 2436161 1951826 1584489
54498 1584489 2184699 3259789 3557910 2504588 721575 -485211 -108218 1535236 2817142
54489 2817142 2560581 1639925 1805831 3042441 3566860 2678730 1790897 1808882 1394881
54480 1394881 -637515 -2855822 -3224193 -2397534 -2596631 -3948880 -4603183 -4155783 -4025582
54471 -4025582 -4196813 -2765829 215208 1490262 -916224 -4388552 -5137090 -3092571
54463 -3092571 -1100121 -733661 -1318965 -2020516 -2533048 -2425521 -1805665 -1807013 -2614475 -2356557
54453 -2356557 -196445 1128963 -1042807 -4462085 -4600451 -1445552 564400 -542900
54445 -542900 -1892306 -1194771 -75289 -149675 55027 1620544 2222256 -226350 -3636888
54436 -3636888 -4711998 -3742004 -3294674 -3869886 -3989942 -3256053 -2324508 -922411 1337330
54427 1337330 3135839 3020612 1784218 847007 -397975 -2868753 -4818230 -3838288 -867539
54418 -867539 1141892 1778087 2876691 4268424 3703843 1075821 -1043975 -1518536 -1725683
54409 -1725683 -1988980 -669060 2145839 3676540 2703800 1506195 1822703 1983636 158747
54400 158747 -2287402 -3077013 -2451781 -1939647 -1470077 -70792 1820668 2766352 2153009
54391 2153009 257354 -2348964 -4406004 -4555546 -3422642 -3231342 -4138764 -3286578 712132
54382 712132 4787077 5435084 3662319 2875521 3390643 2557904 -239569 -2205988 -1205921
54373 -1205921 1478227 3278057 3278915 2237586 1133742 516479 458488 662079 922897
54364 922897 1273488 1310844 166852 -2050722 -3633548 -3159056 -1296225 279780 929108
54355 929108 911281 245297 -858712 -1310986 -452307 632850 570090 -292035 -784046 -897807
54345 -897807 -1165153 -1022494 175153 1291165 774968 -689523 -1209943 -865493 -1295567
54336 -1295567 -2337264 -1905383 434380 2495072 2825046 2554265 2846353 2735650 884072
54327 884072 -2117775 -4380999 -4447694 -1869960 2314011 5221595 4304412 705105 -1649703
54318 -1649703 -1203107 -577232 -1946861 -3471418 -2690967 -946162 -1145739 -2833092 -3218905
54309 -3218905 -2319695 -3054457 -5950231 -7645836 -6034638 -3582706 -3376688 -4452841 -3813401
54300 -3813401 -1439596 -201446 -1260822 -2409978 -1435786 1061705 3066804 3693868
54292 3693868 3249202 1962420 -39901 -2037265 -3053485 -2764763 -1568461 -133157
54284 -133157 687745 165446 -1329022 -2226449 -1541518 -306997 -224012 -1253499 -1761944
54275 -1761944 -948863 149651 262013 -648445 -1788792 -2375566 -1815517 -173267 1167607
54266 1167607 510982 -1861974 -3501547 -2664595 -449832 742629 4744 -1721707 -3255188
54257 -3255188 -4004776 -3631137 -1985759 514124 2914870 4169281 3705945 2125357 1132937
54248 1132937 1782350 2902034 2578245 1060562 319269 630785 160731 -1287555 -1108358
54239 -1108358 1751722 4205847 3502404 1735834 2377429 4289442 3484670 -151660 -2546999
54230 -2546999 -1926010 -1042834 -1921144 -2672688 -1492964 -121752 -735033 -2276817 -2677641
54221 -2677641 -2451891 -3160441 -3993178 -2902177 -136633 2105026 2939636 3229107 3202660
54212 3202660 2167129 584842 112251 1129567 2098239 1888428 1120138 599228 -65386
54203 -65386 -1407866 -2844905 -3522591 -3689554 -4144439 -4622735 -3803613 -1202277 1644809
54194 1644809 2546380 1062361 -1141050 -2533470 -3508089 -5197382 -7198302 -7829755 -6576270
54185 -6576270 -4841893 -3903092 -3454920 -2819804 -2251413 -2013189 -1322597 402856 1996462
54176 1996462 1739258 -183069 -1740120 -1510502 35475 1650248 2551225 2394595 1125502
54167 1125502 -624494 -1693760 -1486023 -595561 -86288 -452765 -1456376 -2656887 -3855612
54158 -3855612 -5121412 -6458833 -7420776 -7225126 -5515041 -2946577 -774507 202367 246877
54149 246877 327310 1160986 2432262 2988496 2088843 400613 -655183 -501392 189801
54140 189801 618071 563375 -134817 -1721874 -3598184 -4271016 -3150937 -1612163 -1211054
54131 -1211054 -1535393 -1140627 -150297 -270397 -2125672 -4190600 -4932692 -4632079 -4192705
54122 -4192705 -3338209 -1284024 1489134 3537012 4308471 4426657 4112612 2662244 -58571
54113 -58571 -2720860 -3884223 -3491404 -2355337 -978057 211447 227375 -1489838 -3710810
54104 -3710810 -4369974 -2955584 -829991 821454 2005908 2697983 2218704 636383 -541863
54095 -541863 -170050 951333 1271612 488463 -542992 -1106031 -947114 -137446 505401
54086 505401 -202114 -2037320 -3038586 -2065736 -511733 -118624 -435337 -236148 -126198
54077 -126198 -1346398 -2911988 -2664867 -789786 433093 292688 308932 1080167 1387412
54068 1387412 1050818 1735950 3731847 4598750 2671798 -226329 -1302463 -313985 1046549
54059 1046549 1794882 2067903 2058934 1980624 2237400 2664880 2513054 1748167 1122917 592632
54049 592632 -643945 -2158462 -2494138 -1881780 -2166752 -3196675 -2373990 739736 2781415
54040 2781415 1817697 772493 2432285 4239844 2340575 -1570475 -2458422 209277
54032 209277 2012950 858231 -378065 514385 1378808 -351651 -3522661 -5438415 -5614420
54023 -5614420 -5110335 -4100289 -2370930 -957039 -1194464 -2657180 -3473282 -2509378 -488997
54014 -488997 849940 446771 -910877 -1262561 169405 1843737 1935571 630361 -882064
54005 -882064 -2556177 -4610597 -5494616 -3536107 -366636 288571 -2325303 -4911168 -4844142
53996 -4844142 -3306975 -2634057 -3039872 -3446521 -3484565 -3154612 -2187831 -1025442 -838446
53987 -838446 -1540302 -1561082 -556599 -197803 -1032927 -982608 1195254 3184693 2212236
53978 2212236 -840458 -2827542 -2459983 -714229 1498379 3468434 3619275 1179555
53970 1179555 -1668268 -2089470 -726858 -780466 -3075880 -4974042 -4578807 -3113082 -2152704
53961 -2152704 -1238346 184431 770534 -645536 -2565019 -2751131 -1734063 -2000753 -3928789
53952 -3928789 -4934170 -3277173 -666176 243537 -523297 -923807 -334744 -110075 -706821
53943 -706821 -675448 449311 450099 -2375428 -5854186 -6373780 -3912902 -1782084 -1503584
53934 -1503584 -1145979 542725 1665500 629907 -760518 -194416 1328419 1480380 795122
53925 795122 1546687 3340148 3436626 1501137 438336 1506221 1819949 -1331860 -6002202
53916 -6002202 -7829115 -5576844 -2247270 -1108653 -2422197 -4147626 -4481102 -3238150
53908 -3238150 -1524967 -607261 -960622 -2151263 -3379778 -3940695 -3451378 -2198948 -1150482
53899 -1150482 -1003623 -1363454 -1580717 -2076788 -3608087 -5357975 -5516144 -4196852 -3780849
53890 -3780849 -5171966 -5707886 -2917684 1085660 1816977 -1403008 -4400892 -3675206 -237927
53881 -237927 2967494 4727475 4942586 2889995 -1200500 -4399593 -3890310 -868106 1060585
53872 1060585 898237 777364 1619910 1652694 71930 -1031850 -62561 1390907 1183893
53863 1183893 -290754 -1666050 -3101435 -4829690 -5180649 -2928191 -127187 412607
53855 412607 -697485 -944776 -525922 -1677170 -3859703 -3781317 -772904 1779727 1575275
53846 1575275 405711 451780 940035 584862 366428 1323959 1980890 678249 -1343125
53837 -1343125 -1751368 -507770 893071 2011698 2820637 1998049 -1244797 -4633240 -5055947
53828 -5055947 -2829249 -1094477 -1334971 -2097332 -1972992 -1187493 -48485 1662798 3224271
53819 3224271 3105358 1293638 -304429 -434720 127804 307972 199689 84301 -519321
53810 -519321 -1810188 -2716532 -1947209 392793 2784913 3715835 3075001 2324268 2900442
53801 2900442 4202797 4069410 1860439 -240767 -248821 642399 -38647 -2248097 -3868995
53792 -3868995 -4273304 -4803976 -5827676 -6008983 -4967923 -4198361 -4526323 -4737273 -3645799
53783 -3645799 -1781623 -215842 692854 760382 -148380 -1131306 -880000 126288 -72454
53774 -72454 -1778464 -2840198 -1823445 147149 1735529 3272099 4786834 4404477 849294
53765 849294 -3947371 -6790706 -6756758 -5237210 -3692244 -2923615 -3249439 -3709419 -2429277
53756 -2429277 499920 2077691 430260 -1860023 -1191520 1632714 2713579 1039865
53748 1039865 -548784 -493817 -770844 -2830190 -4711665 -4262489 -2605770 -1969414 -2015646
53739 -2015646 -1047793 397446 115329 -1975460 -3403327 -2924723 -2306086 -3305385 -4869565
53730 -4869565 -4914774 -3530517 -2522257 -2479242 -2316133 -1634180 -1474251 -2110036 -1919851
53721 -1919851 330065 3376873 5009441 4758705 3636892 2133451 268320 -965587
53713 -965587 -326785 1501489 2394815 1710258 940229 1122766 1497702 1337910 1199455
53704 1199455 1410597 1069037 -303707 -1633239 -1976796 -1869279 -1819752 -1083657 578523
53695 578523 1503956 400494 -1214647 -946942 960811 2184888 1853548 1340996 1624764
53686 1624764 1879094 1086671 -454575 -1706271 -1971334 -1156617 281371 1574191 2325209
53677 2325209 2718578 2703340 1692156 -363990 -2487184 -3885459 -4581486 -4297713 -2414830
53668 -2414830 -5458 265797 -1973481 -3213309 -806295 2736550 3317199 1360008
53660 1360008 464133 1077761 113414 -3050694 -4830561 -3019169 -213694 244104 -1304079
53651 -1304079 -2409516 -2031599 -690988 747810 931761 -1267500 -4565303 -5902557
53643 -5902557 -4420534 -2447869 -1473715 -83910 2526162 4208646 3363761 1827186
53635 1827186 1544665 1193564 -682897 -1873561 185543 3310370 3230341 233536 -1343704
53626 -1343704 89301 1535573 799864 -455934 -315448 233998 -448205 -1791673 -2186285
53617 -2186285 -1296545 91860 1135676 1029047 -502275 -2192107 -2253855 -891481 -131279
53608 -131279 -726540 -1160320 -402453 365528 -141208 -1222542 -1462754 -723586 251550
53599 251550 1031306 1334021 853246 126519 352281 1459298 1676963 78268 -1734787
53590 -1734787 -1763018 -380668 393960 -346456 -1698546 -2553416 -2724003 -2614532 -2583713
53581 -2583713 -2622578 -2327021 -1392360 -162447 807736 1590575 2455522 2811117 1826625
53572 1826625 110423 -678570 -99568 669578 873143 863364 471764 -1141936 -3295075
53563 -3295075 -3750709 -2080842 -814372 -1706830 -3121483 -3040020 -2400371 -2907340 -3536992
53554 -3536992 -2350314 -334926 27866 -845555 -384500 1243206 894791 -2195641 -4526328
53545 -4526328 -3395660 -847476 -458869 -2475133 -4451811 -5087165 -4928139 -4128939 -1952769
53536 -1952769 1348406 3830073 3648776 961431 -2178393 -3648312 -3161678 -2392186 -2853443
53527 -2853443 -3965698 -4139992 -3426114 -3410530 -4281986 -4086069 -1950192 -65944 -641130
53518 -641130 -2394329 -2440361 -799990 -332110 -2177792 -3946593 -3333147 -1343826 -449059
53509 -449059 -1087699 -1758965 -1638815 -1288793 -1180576 -1233032 -1750540 -3172080 -4668237
53500 -4668237 -4636783 -3136125 -2162629 -2594817 -2616798 -758869 1085630 81564 -3018475
53491 -3018475 -4644501 -3627298 -2580145 -3351408 -4267530 -3613629 -2921591 -4067399 -5365231
53482 -5365231 -4060876 -1432198 -1508906 -4873409 -7528680 -6688754 -4237827 -2996315 -2672633
53473 -2672633 -1711417 -702396 -1225326 -2768048 -3396753 -2685054 -1746393 -1025392 -271463
53464 -271463 -221119 -1925349 -4413723 -5320741 -4219313 -3190738 -3404972 -3280957 -1323264
53455 -1323264 1040210 1338707 -285104 -1319790 -453734 943864 1080740 -114667 -1625175
53446 -1625175 -2746973 -3035509 -2007537 -69416 1055129 225159 -1183879 -745754 1652535
53437 1652535 3485935 2984566 1268277 312353 268384 34419 -690904 -1390592 -1892690
53428 -1892690 -2057686 -1110019 1032653 2487294 1462724 -893737 -1939831 -1528991 -1888371
53419 -1888371 -3349689 -3348669 -847001 1258435 241443 -2291666 -2869899 -1047038 903125
53410 903125 1916556 2764974 3325921 2273027 -235728 -2099631 -2146215 -1464472 -1274174
53401 -1274174 -1301998 -979832 -572400 -248167 544222 1862884 2634161 2134186 1157806
53392 1157806 917158 1546805 2264236 2227198 877958 -1557021 -3562507 -3564671 -2155283
53383 -2155283 -1688724 -2981992 -4037463 -3154349 -1607672 -1493961 -2338174 -2170583 -1163247
53374 -1163247 -1499204 -3562383 -4883849 -3801038 -2046309 -2215782 -4057104 -4901217 -3079807
53365 -3079807 461156 3522576 4415824 2704622 -495341 -2875505 -2692930 -505951
53357 -505951 1559983 2404521 2951906 4301094 5887074 6259089 5081944 3459657 2471843
53348 2471843 2150071 1883770 1194865 8680 -1335084 -2199709 -2176791 -1629918 -1422248
53339 -1422248 -2048348 -3263170 -4403845 -4656592 -3280376 -394180 2451672 3484810
53331 3484810 2833572 2440294 3246392 3559779 1421094 -2160410 -3974757 -2551644 223795
53322 223795 1794518 1742567 1123350 389111 -546763 -963068 105822 1878778 2056734
53313 2056734 -230682 -2910764 -3439877 -2006173 -1044721 -1937754 -3531571 -4039823 -3168852
53304 -3168852 -1802350 -538854 622148 1657289 2361405 2608379 2318745 1506529 755259
53295 755259 1096911 2774790 4592759 5207197 4606686 3523303 1981861 -326916 -2523549
53286 -2523549 -2876457 -971721 1534715 2672964 1851193 -235966 -2282700 -2798549 -1147133
53277 -1147133 1332250 2309020 1085618 -701724 -1315847 -654110 612106 2082172 3011825
53268 3011825 2236487 -32368 -1640539 -1139492 151402 294738 -177570 655600 2606852
53259 2606852 3231289 1270278 -1633556 -3078214 -2329094 -251302 1841366 2738717 1829183
53250 1829183 -240019 -1899981 -2018603 -722533 888733 1399071 -29017 -2605701
53242 -2605701 -4219858 -3681101 -2139334 -1335456 -1245647 -818467 -179643 -157774 -157224 1134421
53232 1134421 2912973 2659099 24606 -2039654 -1215660 1087251 2010300 1042553 -54291
53223 -54291 -11780 754135 1011939 -309363 -3241508 -6025666 -6313959 -4081047 -2039473
53214 -2039473 -1926086 -1928037 237798 2998877 2516432 -1571314 -4832211 -3429268 1237699
53205 1237699 4670300 4672533 3012607 2365958 3247366 4201295 3946129 2644606 1358095
53196 1358095 772526 588243 -9965 -1407422 -3013765 -3607347 -2442576 -256330 1056722
53187 1056722 263355 -1737957 -2804943 -2021523 -703450 -660987 -2028011 -3334802 -3381046
53178 -3381046 -2429746 -1612274 -1649361 -2312091 -2889284 -2940978 -2526663 -1844748 -1015638 -378135
53168 -378135 -527230 -1509847 -2276426 -1704077 -173208 625847 -343262 -2349974 -4018485
53159 -4018485 -4899619 -5426657 -5793271 -5616671 -4755822 -3912667 -3911785 -4353368 -3600402 -847119
53149 -847119 2088083 2345280 -181048 -2070965 -543136 2857800 4445487 3336743
53141 3336743 1937991 1785974 1566510 20887 -1550555 -1287256 247811 871945 -144062
53132 -144062 -1350673 -1285339 -221147 416700 -197147 -1358115 -1682833 -906622 -323253
53123 -323253 -899637 -1660828 -1096453 408679 1177805 971701 1112947 1773567 1405317
53114 1405317 -399743 -1656567 -848103 715841 794856 -920531 -3102881 -4603159 -4743842
53105 -4743842 -3174043 -790219 446479 -59062 -526019 496739 1839077 1674929 403020
53096 403020 -262977 17995 313096 365780 696956 1409420 2288893 3236045 3414981 1404883
53086 1404883 -2248444 -4360740 -3096015 -906604 -885473 -1885846 -697267 2095824
53078 2095824 2605525 -20390 -1931459 -406361 2175137 2053648 -838269 -3548331
53070 -3548331 -3989294 -2268644 487518 2823738 3284460 1648874 -348071 -481481 1718075
53061 1718075 4428592 5143886 2985889 -339017 -2346733 -2705369 -3214740 -4431034 -4384674
53052 -4384674 -2195012 -641719 -2317551 -5027390 -4678257 -1652127 -100409 -1244232
53044 -1244232 -2010928 -935819 -591559 -2365817 -3291795 -874372 2546845 3477406 2451574
53035 2451574 2174152 2766526 2407401 1128435 467623 249339 -1046408 -3054699 -3492492
53026 -3492492 -1478221 1185484 2159022 618728 -2452461 -4833083 -4705155 -2890013
53018 -2890013 -2268905 -3756330 -4647434 -2831358 -585767 -1311636 -4033025 -4629344 -1869913
53009 -1869913 1279040 2334390 1949094 1450834 861530 268229 410751 780939 -396939
53000 -396939 -3020877 -4247416 -2332087 629697 1543510 278703 -1071377 -1541076 -1737956
52991 -1737956 -1718744 -751240 732605 957195 -681871 -2338754 -2046844 -481326 -43143
52982 -43143 -1400041 -2482873 -1569568 18991 -182341 -2002074 -2880886 -1908652 -1197475
52973 -1197475 -2296039 -3582971 -3063040 -1846375 -2299529 -3906846 -3876592 -1548406 646112
52964 646112 975712 560087 833370 1114101 139469 -1538439 -2253079 -1493663 -278614
52955 -278614 217796 -429796 -1870353 -3115878 -3051272 -1399799 895517 2381527 2050721
52946 2050721 -54479 -2595411 -3711302 -2980464 -2235573 -3187753 -4583285 -3520728 188180
52937 188180 2993833 1991794 -1249955 -2773365 -1214692 966815 1061598 -576876 -1416430
52928 -1416430 -237648 1258271 764562 -1298824 -2086646 -363826 1323619 28495
52920 28495 -3174124 -4429549 -2426353 121736 780413 538285 1270669 2282612 1547586
52911 1547586 -797997 -2350163 -1501716 903054 2798551 2707489 652567 -1754033 -2451160
52902 -2451160 -968965 1070215 2046114 2039343 1612462 188528 -2674420 -5232531 -4941312
52893 -4941312 -1933169 720625 645904 -1367858 -2955811 -2855448 -1371038 611106 2156648
52884 2156648 2587784 2060441 1429028 1171966 1099550 1413531 2960730 5569969 7101291
52875 7101291 5589620 2053291 -266676 291044 2000179 2327768 1230275 740778 1810140
52866 1810140 3000073 2635199 1112022 159912 351440 486258 -389234 -1324060 -645452
52857 -645452 1488452 2693094 1039356 -2340546 -4170656 -2674512 443219 2099286
52849 2099286 1234833 -659446 -1846965 -1948652 -1382011 -600213 -239975 -764386 -1430504
52840 -1430504 -873229 627185 924334 -896394 -2724219 -2295947 -482316 356265 173891
52831 173891 787356 2192132 2337235 845088 5972 1090610 2313571 1900065 827953
52822 827953 657491 609801 -924213 -3317578 -4481744 -3899026 -2733173 -1484600 286926
52813 286926 2100246 2559900 1531984 532126 406672 117486 -1414717 -3411176 -4135978
52804 -4135978 -3104694 -1559751 -902514 -1257925 -1790043 -2117222 -2794723 -4049833 -4690031
52795 -4690031 -3344863 -622856 1305366 1498445 1193632 1510192 1850743 1473857 921095
$$ [...]
##END NTUPLES=NMR SPECTRUM
##END=
