##TITLE=31Pdec_SR120_1
 , 24 sc
 6.4.2022
##JCAMPDX= 6.0         $$ Bruker NMR JCAMP-DX V2.0
##DATA TYPE= NMR SPECTRUM
##DATA CLASS= NTUPLES
##ORIGIN= UXNMR, Bruker Analytische Messtechnik GmbH
##OWNER= root
$$ XWIN-NMR		Version 3.5
$$ Wed Apr  6 13:42:16 2022 Russian Standard Time (UT+4h)  she@DPX200
##.OBSERVE FREQUENCY= 81.013821
##.OBSERVE NUCLEUS= ^31P
##.ACQUISITION MODE= SIMULTANEOUS
##.ACQUISITION SCHEME= undefined
##.AVERAGES= 24
##.DIGITISER RES= 16
##SPECTROMETER/DATA SYSTEM= spect
##.PULSE SEQUENCE= zgpg30
##.SOLVENT NAME= DMSO
##.SHIFT REFERENCE= (INTERNAL, DMSO, 0, 248.564)
##AUDIT TRAIL= $$ (NUMBER, WHEN, WHO, WHERE, WHAT)
$$ ##TITLE= Audit trail, XWIN-NMR		Version 3.5
$$ ##JCAMPDX= 5.01
$$ ##ORIGIN= Bruker BioSpin GmbH
$$ ##OWNER= she
$$ F:/spectra/data/she/nmr/P31/1/pdata/1/auditp.txt
$$ ##AUDIT TRAIL=  $$ (NUMBER, WHEN, WHO, WHERE, WHAT)
(   1,<2022-04-06 13:40:55.76 +0400>,<she>,<DPX200>,
      <created by zg, POWCHK disabled, PULCHK disabled
       configuration hash MD5:
       00 E9 B6 7A A2 85 ED C7 34 08 36 98 17 FE 4E 26
       data hash MD5: 32K
       09 16 A6 57 E2 03 76 5F 07 BB 91 33 63 B8 D0 98>)
(   2,<2022-04-06 13:41:15.43 +0400>,<she>,<DPX200>,
      <Start of raw data processing
       efp BC_mod = 2 LB = 1 FT_mod = 6 PKNL = 1 PHC0 = -9544.079 PHC1 = 125.8756 SI = 64K 
       data hash MD5: 64K
       03 E2 6E 89 C8 59 B0 2F 34 DA 1F B0 1B 1A 0B 8F>)
(   3,<2022-04-06 13:41:45.79 +0400>,<she>,<DPX200>,
      <pk PHC0 = 0.0954228 PHC1 = -31.8 
       data hash MD5: 64K
       89 79 ED 1A BC EF F3 BE 5A 12 5C A3 27 5C 08 CC>)
$$ ##END=
$$ 
$$ hash MD5
$$ 07 91 45 1D C5 A2 5B A9 DE 31 47 FD AA 80 16 27
##$RELAX= 
##$RELAX= 
##$RELAX= 
##$RELAX= 
##$RELAX= 
##$RELAX= 
##$RELAX= 
##$RELAX= 
$$ Bruker specific parameters
$$ --------------------------
##$DU= <F:/spectra>
##$EXPNO= 1
##$NAME= <P31>
##$PROCNO= 1
##$TYPE= <nmr>
##$USER= <she>
##$AMP= (0..31)
100 100 100 100 100 100 100 100 100 100 100 100 100 100 100 100 100 100 
100 100 100 100 100 100 100 100 100 100 100 100 100 100 
##$AQSEQ= 0
##$AQ_mod= 1
##$AUNM= <au_zg>
##$AUTOPOS= <>
##$BF1= 81.014009
##$BF2= 200.13
##$BF3= 200.13
##$BF4= 200.13
##$BF5= 200.13
##$BF6= 200.13
##$BF7= 200.13
##$BF8= 200.13
##$BYTORDA= 1
##$CFDGTYP= 0
##$CFRGTYP= 5
##$CHEMSTR= <none>
##$CNST= (0..31)
1 1 145 1 1 1 1 1 1 1 1 1 1 1 1 1 1 1 1 1 1 1 1 1 1 1 1 1 1 1 1 1 
##$CPDPRG= <waltz16>
##$CPDPRG1= <>
##$CPDPRG2= <waltz16>
##$CPDPRG3= <>
##$CPDPRG4= <mlev>
##$CPDPRG5= <mlev>
##$CPDPRG6= <mlev>
##$CPDPRG7= <mlev>
##$CPDPRG8= <mlev>
##$CPDPRGB= <>
##$CPDPRGT= <>
##$D= (0..31)
0 1 0 0 0 0 0 0 0 0 0 0.03 2e-05 3e-06 0 0 0 0 0 0 0 0 0 0 0 0 0 0 0 0 
0 0 
##$DATE= 1649238055
##$DBL= (0..7)
120 120 120 11 120 120 24 19 
##$DBP= (0..7)
150 150 150 150 150 150 150 150 
##$DBP07= 0
##$DBPNAM0= <>
##$DBPNAM1= <>
##$DBPNAM2= <>
##$DBPNAM3= <>
##$DBPNAM4= <>
##$DBPNAM5= <>
##$DBPNAM6= <>
##$DBPNAM7= <>
##$DBPOAL= (0..7)
0.5 0.5 0.5 0.5 0.5 0.5 0.5 0.5 
##$DBPOFFS= (0..7)
0 0 0 0 0 0 0 0 
$$ [...]
##$SUBNAM2= <"">
##$SUBNAM3= <"">
##$SUBNAM4= <"">
##$SUBNAM5= <"">
##$SUBNAM6= <"">
##$SUBNAM7= <"">
##$SUBNAM8= <"">
##$SUBNAM9= <"">
##$SW= 501.771253377433
##$SWIBOX= (0..15)
0 1 3 0 0 0 0 0 0 0 0 0 0 0 0 0 
##$SW_h= 40650.406504065
##$TD= 32768
##$TD0= 1
##$TE= 0
##$TE2= 300
##$TE3= 300
##$TEG= 300
##$TL= (0..7)
0 120 53 12 22 120 120 120 
##$TP= (0..7)
150 150 150 150 150 150 150 150 
##$TP07= 0
##$TPNAME0= <>
##$TPNAME1= <>
##$TPNAME2= <>
##$TPNAME3= <>
##$TPNAME4= <>
##$TPNAME5= <>
##$TPNAME6= <>
##$TPNAME7= <>
##$TPOAL= (0..7)
0.5 0.5 0.5 0.5 0.5 0.5 0.5 0.5 
##$TPOFFS= (0..7)
0 0 0 0 0 0 0 0 
##$TUNHIN= 0
##$TUNHOUT= 0
##$TUNXOUT= 0
##$USERA1= <user>
##$USERA2= <user>
##$USERA3= <user>
##$USERA4= <user>
##$USERA5= <user>
##$V9= 5
##$VALIST= <valist>
##$VCLIST= <CCCCCCCCCCCCCCC>
##$VD= 0
##$VDLIST= <DDDDDDDDDDDDDDD>
##$VPLIST= <PPPPPPPPPPPPPPP>
##$VTLIST= <TTTTTTTTTTTTTTT>
##$WBST= 1024
##$WBSW= 4
##$XGAIN= (0..3)
0 0 0 0 
##$XL= 0
##$YL= 0
##$YMAX_a= 8799
##$YMIN_a= -13656
##$ZGOPTNS= <>
##$ZL1= 120
##$ZL2= 120
##$ZL3= 120
##$ZL4= 120
##$ABSF1= 0
##$ABSF2= 0
##$ABSG= 0
##$ABSL= 0
##$ALPHA= 0
##$AQORDER= 0
##$ASSFAC= 0
##$ASSFACI= 0
##$ASSFACX= 0
##$ASSWID= 0
##$AUNMP= <proc_1d>
##$AZFE= 0.1
##$AZFW= 0.5
##$BCFW= 0
##$BC_mod= 2
##$BYTORDP= 0
##$COROFFS= 0
##$CY= -3
##$DATMOD= 1
##$DC= 0
##$DFILT= <>
##$DTYPP= 0
##$F1P= 0
##$F2P= 0
##$FCOR= 1
##$FTSIZE= 65536
##$FT_mod= 6
##$GAMMA= 0
##$GB= 0
##$INTBC= 1
##$INTSCL= 5.30512e-09
##$ISEN= 30
##$LB= 1
##$LEV0= 0
##$LPBIN= 0
##$MAXI= 10000
##$MC2= 0
##$MEAN= 0
##$ME_mod= 0
##$MI= 50
##$NCOEF= 0
##$NC_proc= -8
##$NLEV= 6
##$NOISF1= 182.463
##$NOISF2= 159.3651
##$NSP= 0
##$NTH_PI= 0
##$NZP= 0
##$OFFSET= 248.5645
##$PC= 4
##$PHC0= -9543.983
##$PHC1= 94.07561
##$PH_mod= 1
##$PKNL= yes
##$PPARMOD= 0
##$PSCAL= 0
##$PSIGN= 0
##$REVERSE= no
##$SF= 81.014009
##$SI= 65536
##$SIGF1= 159.3651
##$SIGF2= -187.1042
##$SINO= 113.3802
##$SIOLD= 16384
##$SREGLST= <1H.CDCl3>
##$SSB= 0
##$STSI= 65536
##$STSR= 0
##$SW_p= 40650.406504065
##$SYMM= 0
##$S_DEV= 0
##$TDeff= 32768
##$TDoff= 0
##$TI= <>
##$TILT= no
##$TM1= 0
##$TM2= 0
##$TOPLEV= 0
##$USERP1= <user>
##$USERP2= <user>
##$USERP3= <user>
##$USERP4= <user>
##$USERP5= <user>
##$WDW= 1
##$XDIM= 65536
##$YMAX_p= 525132469
##$YMIN_p= -214044771
$$ End of Bruker specific parameters
$$ ---------------------------------
##NTUPLES= NMR SPECTRUM
##VAR_NAME=  FREQUENCY,     SPECTRUM/REAL,   SPECTRUM/IMAG
##SYMBOL=    X,             R,               I
##VAR_TYPE=  INDEPENDENT,   DEPENDENT,       DEPENDENT
##VAR_FORM=  AFFN,          ASDF,            ASDF
##VAR_DIM=   65536,         65536,           65536
##UNITS=     HZ,            ARBITRARY UNITS, ARBITRARY UNITS
##FACTOR=    0.620285442955139, 1,           1
##FIRST=     20137.2065510759, 0,            0
##LAST=      -20513.1999529892, 0,           0
##MIN=       -20513.1999529892, -214044771,  0
##MAX=       20137.2065510759, 525132469,    0
$$ Real data points
##PAGE= N=1
##DATA TABLE= (X++(R..R)), XYDATA
$$ [...]
60057A205592K7512j349513m886500l383055K745117M858888K37089l728318k056391
60048f329579Q08542K48099j048375L38326K060464J496680J274271L505308M148892
60039F502628l84828n435798l964592K458353N421054J417440m249853n531332
60031c766928k586318M56107J072264J04721j60981J326779L016326K368657o99060
60022A131567l287880l262704j738964o25905K00188J527747K675008K821170
60014e59773K656097K607117J318805j787413m332666l953807j789469m27570
60006f268679j09579L04592M48694l94494j019929m47642m35444k144839k448051
59997a2515371J633714O466723N642327j87143l585766j192308K088793J730731
$$ y = [1205592, 1233104, -116409, -5002909, -8385964, -5640847, -781959, -544870, -4273188, -6329579, -5521037, -5272938, -6321313, -5982987, -3922523, -2425843, -1151572, 2353736, 6502628, 6117800, 682002, -3282590, -824237, 4596817, 6014257, 1764404, -3766928, -6353246, -5897139, -4824875, -4720154, -4881135, -3554356, -538030, 1830627, 1131567, -2156313, -5419017, -7157981, -7783886, -7583698, -6055951, -3380943, -559773, 2096324, 4703441, 6022246, 4234833, -97833, -4051640, -5841109, -6268679, -6378258, -6073666, -5624972, -6019466, -7039395, -7487037, -7922481, -10067320, -12515371, -10881657, -4414934, 1227393, 1040250, -2545516, -3737824, -1649031, 81700]
59989H1700O8085O04930J509530j66418j999043J18819M176583M019988j367167
59980G047007n933962m833129m07778J838041L07491j872798j667629L45731J449972
59971c727054P01980J29779J430544K786051J228614k195873k895435N74250L628106
59962A660962J836399k723901m437981j640835K176533L563730K393943N35650
59954C364500j09929J200873K653090Q62218m259998p376274l980795K624624
59946e021691M952634J297710k690560k647785o80011m58556j798960k692363
59938i739582l088513l655450l327297r20710K472000M796252N263589L939240
59930d260471J152047j359190j194081J151847K089036J81178j339847K16272
$$ y = [81700, 149785, 754715, 2264245, 2097827, 98784, 217603, 4394186, 8414174, 7047007, 1113045, -3720084, -4127862, -2289821, -1982330, -3855128, -5522757, -5177026, -3727054, -3025074, -2895295, -1464751, 1321300, 2549914, 354041, -2541394, -1967144, 1660962, 3497361, 773460, -3664521, -5305356, -3128823, 434907, 2828850, 3364500, 3254571, 4455444, 7108534, 7970752, 3710754, -3665520, -7646315, -5021691, -69057, 1228653, -1461907, -4109692, -4789703, -5248259, -7047219, -9739582, -12828095, -16483545, -19810842, -20731552, -18259552, -13463300, -8199711, -4260471, -3108424, -4467614, -5661695, -4509848, -2420812, -2239634, -3579481, -3363209]
59922c363209K394645J713754l00271K91396K837984K739164j123749m438731
59914G50983l908871j394505J58787J199143L191379M447714J992804l163427
59906C274007n883391k889197K974935N738891K866930k230113m183411j383365
59898a714714K660601L280366n10845n085773n873778k032622K591044L567329
59890c118392P04706k321646l003405k443328j926936j11847L597232N553276
59882c070340K296753k817519k931192K069805M520749K33459m970509l874981
59874h543775J731484M547209K453763k35456p28935r22902k318469l033219j511752
59865h562052O34751J428087J360328J562509J313640n47733k921730l080211
$$ y = [-3363209, -968564, 745190, 444919, 736315, 3574299, 6313463, 5189714, 750983, -3157888, -4552393, -4393606, -3194463, -3084, 4444630, 6437434, 3274007, -2609384, -5498581, -2523646, 3215245, 6082175, 3852062, -331349, -1714714, 945887, 4226253, 3715408, -1370365, -7244143, -9276765, -6685721, -3118392, -2413686, -4735332, -7738737, -10182065, -12109001, -12220848, -8623616, -3070340, -773587, -3591106, -6522298, -4452493, 68256, 301715, -4668794, -8543775, -6812291, -2265082, 188681, -46775, -775710, -1698612, -4017081, -7050300, -8562052, -7927301, -6499214, -5138886, -3576377, -2262737, -2810470, -5732200, -8812411]
59857h812411R041L905278M713321J161175l512302m744034j963742Q06614M58737
59848g978323j112858k92075K614041L850774J766653r46393j102342R01882J913286
59839c85355R8720k650805k767112L21687K579423L03256l875705l272111L590502
59830f057500R634135P697545m80560o921296o971543k857108Q13631J576327
59822c566369k68261k661547l468734k680643k024759j558957P79229M682221
59814a0767820O127427L327351K06741J06692N8141l391925o388337k879719M545675
59805i055774O713567P77745n896107n892061j1086N861050P221624L370121k290452
59796G98627m176881q32429J910687q95445m472096j135097O156803P101981P09453
$$ y = [-8812411, -8803370, -4898092, -184771, 976404, -2535898, -7279932, -9243674, -8437060, -7978323, -9091181, -9383256, -6769215, -2918441, -1151788, -2098181, -3200523, -2298641, -385355, -286635, -2937440, -5704552, -5382865, -2803442, -2500186, -6375891, -9648002, -6057500, 3576635, 11274180, 10793620, 3872324, -3099219, -5956327, -5142696, -3566369, -3834630, -6496177, -9964911, -12645554, -14670313, -16229270, -15450041, -10767820, -4640393, -1313042, -1106301, -999609, -941468, -4333393, -10721730, -13601449, -9055774, -2342207, -1564462, -7460569, -13352630, -13363716, -7502666, -281042, 3089079, 798627, -3378254, -4210683, -2299996, -3195441, -7667537, -8802634, -2645831, 4456150, 5165603]
59787E165603k934100J94285J637624l468273o277004Q45739R598787P512470
59779A2275131k686433p893972m504567r20035j887129k563480N59190L352850
59771d268445J924618j140791j999187j100435l86214L41612J517372K020762
59763c090708J420312R80143J169034J039325N79946N30040j20441k632363m636375
59754d761087k415267K436296L846202K85868k357340K68060M034335K612656
59746C949723k767769m991040j132331L955178M556858Q35592k913784m139166
59738b646739l608177k135972J071184N511476P335398L476498k791743m323633
59730A888292P39072N917522M819273o46097l795477k261879O32796J909541J727595
$$ y = [5165603, 2231503, 2425788, 4063412, 595139, -5681865, -4836126, 4762661, 12275131, 9588698, 1694726, -2809841, -3729876, -5617005, -8180485, -7621295, -4268445, -2343827, -3484618, -5483805, -6584240, -6970454, -6628842, -5111470, -3090708, -1670396, -690253, 478781, 1518106, 2098052, 2628092, 2507651, -124712, -4761087, -7176354, -4740058, -893856, -607988, -2965328, -2697268, 1337067, 3949723, 1181954, -3809086, -4941417, -986239, 3570619, 4406211, 1492427, -2646739, -6254916, -8390888, -7319704, -1808228, 5527170, 9003668, 6211925, 1888292, 2627364, 8544886, 13364159, 12718062, 8922585, 6660706, 7293502, 9203043, 10930638]
59721A0930638P39320r09392j792321m71927J083006n85493m411467n037658n62655
59712a017949M142238M244521J316472l40403o19769k541019n807475o169996
59704f793380j844360L127305L874975Q92014j148783J17694K041687J309962
59696A577114j260168k282015r97050j29201j281169k227750l21233L399025N537770
59687B015323M571478J745940j387402m150282n664402m672335j169316K730394
59679e980602M283516K625321j30918q24964R88540K068999j46712l290253l025505
59670c432578L26967K086791N20859q07327M23011J398633k46919j797592n24622
59661b052777J013397j24723r87752K321379O410042M696280j673307m763551
$$ y = [10930638, 11669958, 10760566, 8968245, 8496318, 9579324, 8993831, 4582364, -455294, -1017949, 3124289, 7368810, 8685282, 8344879, 7725110, 5184091, -623384, -6793380, -8637740, -5510435, -1635460, -743446, -1892229, -1774535, 267152, 1577114, 316946, -1965069, -2962119, -3091320, -4372489, -6600239, -6921472, -3522447, 2015323, 6586801, 8332741, 6945339, 2795057, -2869345, -7541680, -8710996, -5980602, -1697086, 928235, 797317, -27647, 960893, 3029892, 2883180, -407073, -3432578, -3105611, -1018820, -497961, -1305288, -882277, 516356, 269437, -1528155, -2052777, -1039380, -1164103, -2151855, 169524, 6579566, 11275846, 9602539, 4838988]
59653D838988j866586J079696k92804k471387j241007J077718J96707k766774
59645a445449l487807j332591N75059Q27232J238673L104571M975736M652976
59637I108400J711614k243153m851827m559818j756244J376211K436735O76024
59629A897942k178369l155558j150976J269859R01617j171454n07670L733003
59621c61606O263393K784973l405342n614671k433844J682768L001898J803953
59613C721522J10849m02832Q50551J918994o18499o212247q783312m539436J796010
59604a2158400L543612J615663J332121K701819J528632j606530j807663J223382
59596c627364K903491K327672K781249L549716L65260m919647m846579J177721
$$ y = [4838988, 2972402, 4052098, 3759294, 1287907, 46900, 1124618, 1321325, -1445449, -4933256, -6265847, -5690788, -4863556, -3624883, -520312, 4455424, 9108400, 10820014, 8576861, 3725034, -834784, -2591028, -1214817, 1221918, 1897942, -280427, -3435985, -4586961, -3317102, -2415485, -3586939, -4094609, -361606, 5901787, 8686760, 5281418, -333253, -2767097, -1084329, 1917569, 3721522, 3832371, 3429539, 4280090, 6199084, 5580585, -631662, -9414974, -13954410, -12158400, -8614788, -6999125, -5667004, -2965185, -1436553, -3043083, -4850746, -3627364, -723873, 1603799, 4385048, 7934764, 8300024, 3380377, -1466202, -288481]
59588b88481M758179K141373j06424K353207L590416j528991p345299o374417
59580b800437r07903K277750K356770J826761k69434m183962m370757K370514
59572c700698Q534328N169429m282401q818841n503470q42611J051893J993332
59564f399039K673402J456676J4651J725351M472297K988930j679532l050994
59556B201742J65986K263637K38936k262723k096780q26399k76038l2891m85372
59547a109902k520663l711959q85994L454998L935319J370028J399747L880491
59539E812065K468242l606900o579322k318228L011971K879426n03045j905243
59531g41034j263529q45155K4570J982156K176729j017528l857236k436169J480075
$$ y = [-288481, 4469698, 6611071, 6504647, 8857854, 12448270, 10919279, 3573980, -2800437, -3708340, -1430590, 926180, 2752941, 2483507, -1700455, -6071212, -3700698, 4833630, 10003059, 5720658, -3098183, -8601653, -9444264, -8392371, -6399039, -3725637, -2268961, -2254310, -528959, 3943338, 6932268, 5252736, 2201742, 2367728, 4631365, 4870301, 2607578, 510798, -315601, -591639, -624530, -1109902, -3630565, -7342524, -8228518, -4773520, -838201, 531827, 1931574, 5812065, 8280307, 4673407, -1905915, -4224143, -1212172, 1667254, 1164209, -741034, -2004563, -2849718, -2825148, -842992, 1333737, 316209, -3541027, -5977196, -4497121]
59522d497121L660777K923386L68487k845979m296394j624472K441625K155112
59514a714579j604376j139022M815004O495070j700043j0083715p042924L330423
59506h644162P805931L387466j461736k044447j820029k254238j1651M245790
59498g97076M634492J46652l002070j657602J42017j22110N89641K846525J697037
59489D477506l557709n143926J285069Q030348O141690j250465m613534k310841
59481C058138l86525j151967j173703M57358N76138q97284j87642K444202J447462
59472D186177m552600q519534m427271L821727P532597M217843r29832k720460
59464a391353j067508R37750Q33038j398940l280656j835893K707313N787730
$$ y = [-4497121, -836344, 2087042, 2455529, -390450, -4686844, -6311316, -3869691, -1714579, -3318955, -4457977, 357027, 6852097, 5152054, -4931661, -11974585, -8644162, -838231, 2549235, 1087499, -956948, -2776977, -5031215, -5042866, -797076, 3837416, 3984068, 981998, -675604, -533587, -655697, -66056, 2780469, 4477506, 919797, -4224129, -2939060, 5091288, 11232978, 9982513, 5368979, 3058138, 2671613, 1519646, 345943, 803301, 1379439, 482155, 294513, 2738715, 4186177, -366423, -8885957, -13313228, -9491501, -1958904, 2258939, 1329107, -1391353, -2458861, -1521111, -688073, -2087013, -5367669, -7203562, -4496249, 1291481]
59456A291481L121705l578296p449473l894591L840659P576764K853513n894662
59448b132900r801593n416637J556696L774142J455217O77508L614882N661567
59440f11118L438410J99539j06608N37528j501888m156250k745826J555563K994549
59431c96101M56820j231926K18140J431959K97450n77450P3029q22762l912895
59422d463736m029342J407048O344013M666793j46153j163779M14776j472628
59414A556992n523160m084232L503945Q265453M733999j599753l617922k092691
59406A142631j291226j259057l2829J024127k04023j834709j011904P94058M09212
59397b263720j194823o13415J850292K601511O26799j471304k045088j962244
$$ y = [1291481, 4413186, 834890, -6614583, -10509174, -6668515, 908249, 3761762, -2132900, -11934493, -17351130, -15794434, -12020292, -10565075, -9887567, -6272685, -611118, 2827292, 3026831, 2920223, 3457751, 1955863, -2200387, -4946213, -3390650, -396101, 60719, -1171207, -953067, 478892, 776342, 198892, 271921, -550841, -4463736, -8493078, -7086030, -742017, 3924776, 3778623, 2614844, 3029620, 1556992, -3966168, -8050400, -4546455, 3718998, 8452997, 6853244, 3235322, 1142631, -148595, -1407652, -1440481, -416354, -620377, -2455086, -3466990, -2672932, -2263720, -3458543, -4071958, -2221666, 379845, 1006644, -464660, -2509748, -4471992]
59389d471992j650283m78885O23355l13067k451749k306164J120899M431295M476262
59380a020329K203813K55584p69940j534863j481618J35329J744000Q16107k175499
59371a827416l624257j517825J680438K423010Q30590k18298J31106n7010j223920
59362c403582q87447J665952K708173n87197m806821m677361j039584P08230n80175
59353a0899812l96054L252407O145651M568187O24621j971757k851336k680084
59345d208177m74381L048431L725876q1720l577424k245638J148449J495676j86812
59336a355720N56251L074968K719635p50013k729835j569934m20344r16888j095655
59327b487535m19272j058343k878803k588877N27895K998685K817620J927539
$$ y = [-4471992, -6122275, -6601160, -5977805, -6290872, -8742621, -11048785, -9927886, -5496591, -1020329, 1183484, 1439068, 669128, -865735, -2347353, -2212024, -468024, 348083, -1827416, -5451673, -6969498, -5289060, -2866050, -2035460, -2253758, -2122652, -2179662, -3403582, -4291029, -2625077, 83096, -504101, -5310922, -9988283, -11027867, -10319637, -10899812, -11295866, -8043459, -1897808, 2670379, 3295000, 1323243, -1528093, -4208177, -4682558, -1634127, 2091749, 2010029, -1567395, -3813033, -2664584, -1168908, -1355720, -799469, 2275499, 4995134, 4245121, 1515286, -54648, -474992, -1391880, -2487535, -2906807, -3965150, -6843953, -9432830, -8904935, -5906250, -3088630, -1161091]
59319a161091J612622M05242j627869j480278J668480M368057M011493J822252
59311I618908p35681l641495n013276k067286K493266J832019l942198n469044
59303f924787J835757Q760129M983422n004441q198700k030201L255074Q60736
59295b463011l651722k354430L651601P086458M320886j429862m519290k194808
59287a554178L103242N869720L255097j568134l474576j819795j98834p90141
59279B822401k297694l114411l107463k221742m21136R72573Q31717P86028K911895
59270b837832N200445L346694k442927o429932m531165O78672L756752K691178
59262e68115j19031j368364p6959J751716J549436r9639L41479L746434N384154
$$ y = [-1161091, 451531, 856773, -771096, -2251374, -582894, 3785163, 7796656, 9618908, 8883227, 5241732, 228456, -1838830, 654436, 2486455, -1455743, -6924787, -5089030, 3671099, 8654521, 3650080, -4548620, -6578821, -3323747, -2463011, -6114733, -8469163, -4817562, 2268896, 6589782, 5159920, 640630, -1554178, 1549064, 7418784, 10673881, 9105747, 5631171, 3811376, 3612542, 2822401, 524707, -2589704, -5697167, -7918909, -8340045, -7367472, -6535755, -5749727, -2837832, 2362613, 5709307, 3266380, -3163552, -7694717, -7016045, -3259293, -568115, -687146, -2055510, -2132469, -380753, 1168683, 1069044, 1410523, 5156957, 10541111]
59253A0541111J159559n256786o482730j701412K567356K091408l26478r06964
59245A685064k33215k78547o89312o53740q33727j233482n12991Q62465M64153
59236a423332j502523j583199J003956K259660k55165l278754l001358l61070
59228h141785J813909K992039L212789J341853j613587j787827J293267K458311
59220A568969q11452l013260P16543N475269L539710l037426n089306J0334N519277
59211D878658O004009L246603N68859j837666m015408m330857k615015r83551
59203I15632k79373M22806N06173j469660l679235k810355j21518J5941j980234
59194h479823j139716K729852L560665l50040k205479J963421N366402R72731
$$ y = [10541111, 11700670, 6443884, -38846, -1740258, 827098, 2918506, 2592028, 1685064, 1451849, 1173302, 483990, -169750, -1003477, -2236959, -2749950, -1887485, -1423332, -2925855, -4509054, -3505098, -1245438, -1500603, -4779357, -7780715, -8141785, -6327876, -3335837, -123048, 1218805, -394782, -2182609, -889342, 1568969, 757517, -2255743, -1539200, 3936069, 7475779, 4438353, -650953, -640619, 4878658, 10882667, 14129270, 14698129, 12860463, 8845055, 4514198, 1899183, 915632, 636259, 1059065, 1565238, 95578, -3583657, -6394012, -6515530, -6499589, -8479823, -9619539, -6889687, -3329022, -3679062, -5884541, -3921120, 1445282, 2418013]
59186B418013n988937n059964L180620P560610K743199l906947m237450l87910
59178c678766N97616k162707l579478j362171J134775Q43467q12864j130831k01741
59169a0352700N56469J568183L676133M870054K285979k448938l943041n36372
59161d324233K859689J965006o26739k91631J850740J401542j096830q28768K557658
59152C466434L417940r79420n738469n476514j662930O61235J26744o60854Q0134
59143f765700J477948J948834Q77487q31600j017984J426485M165603L601024
59135D882097k34255l705634m649985l950501j934602K118185N889837M864653
59127C279795m63585l565264j207067J479507o15697m197537k972120K488310
$$ y = [2418013, -3570924, -8630888, -5450268, 2110342, 4853541, 946594, -3290856, -3678766, -3081150, -5243857, -8823335, -10185506, -9050731, -8207264, -9020128, -10150959, -10352700, -9796231, -8228048, -4551915, 318139, 2604118, 155180, -3787861, -4324233, -1464544, 500462, -126277, -417908, 1432832, 2834374, 1737544, 908776, 3466434, 6884374, 5904954, 166485, -5310029, -6972959, -6311724, -6184980, -6845834, -6765700, -5287752, -3338918, -2461431, -3293031, -4311015, -2884530, 1281073, 4882097, 4647842, 942208, -3707777, -7658278, -9592880, -7474695, -1584858, 3279795, 2816210, -749054, -1956121, -476614, -1092311, -5289848, -8261968, -5773658]
59119e773658O176446N289957J952007j562577m125451m113424j327165J166653
59111b317212J331469J679054L974976M198662r31754o002968l576776L478987
59103A834438N457400P79359k352377j77977J023212l142149p220083n276412
59095i074589m13413J424487R18111J884606L299485J929550o38501o20098Q37218
59086d53144l6341k006255n44214L551476M345031L03175k975863j612199Q22837
59077A394503l15471l312253l300421Q6733K766062K503344J012317N9389p25247
59068A68956j436181o47503J709509K779567M62409l012985l817998j762477P9244
59059e477459L42475N19358J012034Q6539j813314q52777M139342P845707M805178
$$ y = [-5773658, 402788, 5692745, 7644752, 6082175, 1956724, -2156700, -3483865, -2317212, -985743, 693311, 4668287, 8866949, 7935195, 1932227, -1644549, 1834438, 7291838, 8071197, 5718820, 5540843, 6564055, 3421906, -3798177, -9074589, -9488002, -8063515, -7145404, -5260798, -1961313, -31763, -670264, -1290362, -453144, -489485, -2495740, -3039954, 511522, 4856553, 5159728, 2183865, 571666, 1394503, 1079032, -2233221, -5533642, -5446909, -2680847, -177503, 834814, 894203, 168956, -1267225, -1914728, -205219, 2574348, 3036757, 23772, -3794226, -5556703, -5477459, -5134984, -4615626, -3603592, -3517053, -5330367, -6183144, -2043802, 5801905, 10607083]
59050A0607083k624865p112670n882260k748698j117282j0364J893316K804669
59042d191071Q73456k154058k846354l31008K921894L807649J533191j409870
59034a796171j519820J469468L710087K232781q67142j833815r57852j115784
59026f78248k106692j211514J200086J769951K5528r91557m26561m88615r25384
59017c833006J162401M471451L365398k541775n743005k087992K211034O54217
59009b341277k849368r93702M210008M799323J27656k708925j022687J02512k155679
59000b832139l400989j03685M247211M967991K872747J189471R5499j566834k525982
58991B943290j267494L90312j28503j708548j410112M48412Q68706o68929j345514
$$ y = [10607083, 7982218, 869548, -5012712, -7761410, -8878692, -8889056, -6995740, -4191071, -3317615, -5471673, -8318027, -8649035, -5727141, -1919492, -386301, -1796171, -3315991, -1846523, 1863564, 4096345, 3229203, 1395388, 437536, -678248, -2784940, -3996454, -2796368, -1026417, -1000889, -1992446, -2419007, -2907622, -3833006, -2670605, 1800846, 5166244, 2624469, -3118536, -5206528, -2995494, -2341277, -5190645, -6184347, -1974339, 2824984, 2952640, 243715, -778972, -676460, -2832139, -6233128, -6336813, -2089602, 2878389, 5751136, 6940607, 7036106, 5469272, 2943290, 1675796, 2066108, 1937605, 229057, -1181055, -732643, 136063, -532866, -1878380]
58982a878380L02585K125187J901953M02040o92416j585911k876795l081461o57166
58973f040364K317970J965086j505879l259037p13469K412778J636819j592523
58965d778619k500999k99013J547470J335564O97555L69220p26765j651098L02230
58956e704455M247148N471723K413418p96360q47129M79125R46048J600830K773643
58947A0583991J700353j948977l562942j246688l26284m366422p429330k950842
58939i547141M521879N653437R94461q44571K036639K788723j094738l569912
58931I38777j476391j16930l172175n773833l008741J795695L018158J289585
58923f505855N94734J509393K340673K929679L003744R00545k258004k036903
$$ y = [-1878380, -1575795, 549392, 2451345, 2853385, 2160969, 575058, -2301737, -5383198, -6040364, -3722394, -1757308, -3263187, -6522224, -7235693, -4822915, -3186096, -4778619, -7279618, -7578631, -6031161, -4695597, -3998042, -3628822, -4355587, -6006685, -5704455, -1457307, 4014416, 6427834, 5631474, 4784345, 5263470, 6209518, 7810348, 10583991, 12284344, 10335367, 6772425, 5525737, 5199453, 833031, -6596299, -9547141, -5025262, 628175, 1622636, 778065, 2814704, 5603427, 4508689, 938777, -537614, -654544, -3826719, -9600552, -12609293, -10813598, -7795440, -6505855, -5911121, -4401728, -2061055, 868624, 3872368, 4772913, 2514909, 478006]
58915D78006J625685K076433l401127o888642j207153P361076P020085k063556
58907E000807q217653n287008O20599K592219J982085K705414L833758K580189
58899E810410j58926j663377j726920j667071j279107L46248K486061L367154
58891E514472K172908m14951k615379k551934m50507Q50233k30295j034039J036666
58882B277174K927127n1622n312518m990704J765999N878702J453698m980807
58874a032951m260870J746757L891050K8218k950503j010675J316751n71029l764740
58865f607992k894392J453224L960549K232784p72723j471694K52586K071145
58857a776513K244985P56922j435464l115161k964932k64724L589952N094492
$$ y = [478006, 2103691, 4180124, 778997, -6109645, -7316798, 44278, 7064363, 5000807, -3216846, -8503854, -7883255, -5291036, -3308951, -603537, 3230221, 5810410, 5651484, 3988107, 2261187, 594116, -684991, -338743, 2147318, 5514472, 7687380, 7272429, 4657050, 2105116, 1654609, 2504842, 2274547, 1240508, 2277174, 5204301, 5152679, -159839, -5150543, -3384544, 2494158, 3947856, -1032951, -5293821, -3547064, 343986, 372204, -2578299, -3588974, -2272223, -2843252, -6607992, -9502384, -8049160, -4088611, -1855827, -2628550, -4100244, -3847658, -1776513, 468472, 1225394, -210070, -3325231, -6290163, -6554887, -2964935, 2129557]
58849B129557K216081j933914j819355K753212M809022o96855q690919r768200
58841a1001371k897976L436435L202334j84364r89660N74527J180690P54953J047752
58832d876680J266475K63753K23394K701154L682945q69317o514152n194934J847081
58823g470281M750913K08641l191142J029996O518393M395215k308872l478762
58815D54101K475707P181257N502993J415734m72227j519939m181960o454847
58807D400819n142148j044250K403324L240988J509892j832684m465069l612935
58799d542063L75166L340338K207377j147304k652511r81705J879943L362461
58791A841702K120758j173091l470282j769872K550143M149174N96704l574216
$$ y = [2129557, 4345638, 2411724, 592369, 3345581, 8154603, 7457748, -1233171, -11001371, -13899347, -10462912, -7260578, -7444942, -8434602, -7860075, -6679385, -5924432, -4876680, -3610205, -3346452, -3123058, -421904, 3261041, 2391724, -4122428, -9317362, -7470281, -2719368, -2510727, -5701869, -4671873, 1846520, 6241735, 3932863, 454101, 2929808, 10111065, 15614058, 17029792, 16557565, 15037626, 10855666, 4400819, -741329, -1785579, 617745, 3858733, 5368625, 3535941, -929128, -4542063, -4166897, -826559, 1380818, 233514, -2418997, -3400702, -1520759, 1841702, 3962460, 2789369, -680913, -2450785, 99358, 4248532, 4845236, 1271020]
58783A271020k739928J775229L528722K37262l129226j741869K256418L121040
58775D578668k87739l229480k089707O69260N94714j983060k815119p87849L26256
58766e024056j357791j899909J929378N974943M187892j414867l081103P57337
58758G1824L258473M03927k951855j776613J175694J260913P9649J286170K715375
58749E523557J21471m074547l669853Q93709K796763l00536l216464k450148j175517
58740e551565k211300k475263J267665N949154O298469K337388j551445k917554
58732A145549k652274j542501P66657L567632M626012K475021j811069n006558
58724A568469m020356O96140M155143J846647l907485o005283k007481K574896
$$ y = [1271020, -1468908, 306321, 3835043, 4072305, 943079, -798790, 1457628, 4578668, 4290929, 1061449, -1028258, -358998, 235716, -1747344, -4562463, -5350312, -5024056, -6381847, -8281756, -6352378, -377435, 3810457, 2395590, -685513, 71824, 3330297, 3734224, 782369, -994244, 181450, 1442363, 1522012, 2808182, 5523557, 5645028, 1570481, -2099372, -1205663, 1591100, 1290564, -1925900, -4376048, -5551565, -7762865, -10238128, -8970463, -3021309, 3277160, 5614548, 4063103, 1145549, -1506725, -3049226, -2282569, 1285063, 5911075, 8386096, 6575027, 1568469, -2451887, -1755747, 2399396, 4246043, 338558, -5666725, -7674206, -5099310]
58716e099310K608952M36823P61966K477364J236034k222806k762705N47462K649451
58707F33231M08800k977426l431950j390118O70645K248433L504877L087704M23360
58698C177556k141007k421368j560317j297543m29604K397116M402033J873699
58690D000565l107704m206261K17443M421024L383191n90915k199478p04135N03356
58681A717086k49089j373450j415203o09983O17187J912929K109201O44837p56276
58672B597239o07562q41826l713090o300022l243808M321314Q186514L869830
58664D268589l093184n193105k630087l72730K96283J347814K025729M5248k603630
58655e909073j819355J023627M96764l408210m387415r5622L837031K999588N71995
$$ y = [-5099310, -2490358, -2053535, -1291569, 1185795, 2421829, 199023, -2563682, -2016220, 633231, 1042031, -1935395, -5367345, -6757463, -6086818, -3838385, -333508, 2754196, 3177556, 1036549, -1384819, -2945136, -4242679, -4672283, -2275167, 2126866, 4000565, 892861, -3313400, -3095957, 1325067, 4708258, 4117343, 1917865, 1213730, 1717086, 1467997, 94547, -1320656, -1930639, -1313452, 599477, 2708678, 3353515, 2597239, 1989677, 1147851, -2565239, -8865261, -12109069, -7787755, 398759, 4268589, 1175405, -4017700, -6647787, -7020517, -6724234, -5376420, -3350691, -3305443, -5909073, -7728428, -6704801, -6208037, -9616247, -14003662, -14099284, -10262253, -7262665, -6690670]
58646f690670N05839R51193k48552K41241M686590P253204K026174n567536m990828
58637a833345L209851P538067K706563l327242k722699J033568R31357j880215
58629E655905j612963J599971K458215k63602k263741j179446L81327m2309j383417
58620C349940k031180k444733l228944l317880j616417J223150L585686M292243
58612a88135L103891J117364L32006J312877J920758J74141k577417l699753l359535
58603a863803l304688k473227J668924P045719P369285Q93679n694547n684965
58595b043623j215843N94678j962697l757974j166626L105872M670289L148512
58587A372588J268983P37977J106372J404695J112054m525j839488l737985m668916
$$ y = [-6690670, -6184831, -5233638, -5482190, -5240949, -554359, 6698845, 8725019, 3157483, -1833345, 1376506, 8914573, 11621136, 8293894, 5571195, 6604763, 7536120, 5655905, 4042942, 5642913, 8101128, 7837526, 5573785, 4394339, 4775666, 4733357, 3349940, 1318760, -1125973, -4354917, -7672797, -9289214, -8066064, -4480378, -188135, 2915756, 4033120, 4365126, 5678003, 7598761, 7772902, 5195485, 1495732, -1863803, -5168491, -7641718, -5972794, 1072925, 8442210, 9335889, 3641342, -2043623, -3259466, -2664788, -4627485, -8385459, -9552085, -6446213, -1775924, 1372588, 2641571, 3379548, 4485920, 5890615, 7002669, 6998144, 5158656, 1420671, -3248245]
58578c248245l620668l66979L507840N150594L368856M64094n03406K67157K11666
58569E230909j049612j107630O26235J043011j893665n184462m487929q7375L871469
58560c039049N007191M316649K738837j40827l330783l964016j377415J085948
58552A296535N83823j119753p27380J143899R98808j683870l303679j522972J420427
58543b914162K330539J335026M09235k45531j550648k581195j416414J308047
58535c325103K651486J556173J68493L06176J117315J228292P42341j79254k160507
58526B105412m285908l592434N71394M026203K837904q91842k030098Q5181J445402
58517B71214J86103j147307q23581p10917k011965k429550l39135J653522O76312
$$ y = [-3248245, -6868913, -7235892, -3728052, 1422542, 4791398, 5255492, 4752086, 5019243, 5230909, 4181297, 3073667, 3699902, 4742913, 2849248, -2335214, -6823143, -6910518, -3039049, 1968142, 6284791, 9023628, 8882801, 5552018, 1588002, 210587, 1296535, 1880358, 760605, 33225, 1177124, 2175932, 492062, -2811617, -4334589, -2914162, -583623, 751403, 1160638, 915107, -635541, -3216736, -4633150, -3325103, -673617, 882556, 1051049, 1357225, 2474540, 3702832, 4445173, 4265919, 2105412, -2180496, -5772930, -5201536, -1175333, 1662571, 770729, -1259369, -1174188, 271214, 457317, -689990, -1513571, -2224488, -4236453, -6666003, -7005138, -5351616, -4675304]
58508d675304j442155q58735K166027L518377J180003k141436k674113J38821
58500d788515L416204L824943Q56923k406455k566047r7186J433702O45122O8721
58491C87412J408106K378600P41306j513500j311431N88260J403762R55159O35498
58482E673172k38310k657919m166393j809482K157787K645189o35050k990287
58474b021293j967153M61559K665583M488633L676966j940630p815729n949648
58466h401712K801886P648640K949607l661540l752876o66420j630631m154467
58458h867513q37471O199499P271560Q32855l723919p28866M014950L579767l55368
58449G385494k803459l550858m329005l350049J055348N062180L970501m5063
$$ y = [-4675304, -6117459, -6976194, -4810167, -1291790, -111787, -2253223, -4927336, -4788515, -1372311, 2452632, 3309555, 903100, -1662947, -1760133, -326431, 318691, 387412, 1795518, 4174118, 4915424, 3401924, 2090493, 2678753, 4082515, 5037674, 5673172, 5434862, 2776943, -1389450, -3198932, -1041145, 1604044, 968994, -2021293, -3988446, -3526887, -861304, 3627329, 7304295, 5363665, -2452064, -8401712, -5599826, 2048814, 4998421, 1336881, -2415995, -3082415, -4713046, -8867513, -9704984, -3505485, 3766075, 4598930, 875011, 146145, 4161095, 7740862, 7385494, 4582035, 1031177, -3297828, -6647877, -5592529, -530349, 3440152, 3395089]
58441C395089r71443J388923J133626l811436p548553m754518J142059K603003
58433g423250j444371m375824j246143M803360P407676N174484J906751L81021
58425E183704k60441j161223j665157j522461j796612k181611o86392K293265
58417a796928L109602M21859k039626j340033j38661j545154l009010q00745K569267
58408d569429K004960j229950j548963J062491J191741j780841k114883J824366
58400e160508L995982J013501j880922j5944K607253M97191l798478m145704n89397
58391g477026K036838K079153J276943k63700k945648l783565r5496M571202M587266
58382a4033R50785p47152J8987j449866n354474n432269Q20204O720284N247102
$$ y = [3395089, 2423646, 3812569, 4946195, 1134759, -6413794, -11168312, -10026253, -7423250, -8867621, -13243445, -14489588, -9686228, -2278552, 2895932, 4802683, 5183704, 4923263, 3762040, 2096883, 574422, -1222190, -3403801, -4090193, -1796928, 1312674, 1734533, -305093, -1645126, -1783787, -3328941, -6337951, -7138696, -4569429, -2564469, -3794419, -5343382, -4280891, -3089150, -4869991, -6984874, -5160508, -1164526, -151025, -2031947, -2047891, 559362, 1056553, -2741925, -6887629, -7477026, -5440188, -3361035, -2084092, -2347792, -5293440, -9077005, -9172501, -4601299, -14033, 936752, 189600, 208587, -1241279, -6595753, -12028022, -11207818, -4487534, 759568]
58373G59568j319805m866733j791231L760838N618822J976943l400765n178730
58365d441093k035893J941757K370355j66009j923597j438934q4546J326675K552529
58356a898756J693130k320811n576325k871948M123481P931538N441582J324366
58348G846257k23138q55883k431872k393995O77197K354709j067874n408208m318685
58339e821492O05291K154278j284762l528603k10996N082642O209364K030374
58331E236096l442215n778196l469354J354377M333135K670704j688892m135914
58323d920259k812895J0693K054134L604414M826487L619109j002396n327348
58315E1939m532140M16788L253397R55985j877585M4803M472642M816252J17181
$$ y = [759568, -560237, -5426970, -7218201, -3457363, 2161459, 4138402, 737637, -4441093, -6476986, -4535229, -2164874, -2330883, -4254480, -5693414, -5777960, -4451285, -1898756, -205626, -2526437, -8102762, -10974710, -6851229, 1080309, 6521891, 7846257, 7623119, 6767236, 4335364, 1941369, 2618566, 4973275, 3905401, -1502807, -5821492, -5216201, -3061923, -4346685, -7875288, -8086284, -3003642, 3205722, 5236096, 1793881, -3984315, -7453669, -6099292, -1766157, 904547, -784345, -4920259, -7733154, -7722461, -5668327, -2063913, 2762574, 6381683, 5379287, 51939, -4480201, -4063413, -810016, 145969, -1731616, -1686813, 2785829, 7602081, 7719262]
58306G719262l707782l010796j015815j143804j442820M74419K080525P54639
58298G07828m59279J720988L413699o26025o480463n523172J440834M411508j90034
58289a584116m137022r38248M622024N561381L108760J808233J068487j551560
58281G957939m021161l490203j855176j720160j278036J035476J768342j364887
58273b967866l665218q13205L061937K394244P5636J485133L588409L56175m911826
58264a396581m196542R77917K102822r98097m06576M412251N076925j558k310013
58255C260548Q24282J058249m614706o355191J434245Q381694M151607m610911
58247C529817n457898L65368K656430K5349p48525R45460m54313m045305k814181
$$ y = [7719262, 4011480, 1000684, -15131, -1158935, -2601755, -2127336, -46811, 707828, 248549, 1969537, 5383236, 4757211, -1723252, -7246424, -5805590, -1394082, -1584116, -5721138, -6659386, -2037362, 3524019, 6632779, 8441012, 9509499, 7957939, 3936778, 446575, -1408601, -3128761, -4406797, -3371321, -1602979, -2967866, -6633084, -7446289, -4384352, -1990108, -1914472, -429339, 3159070, 3515245, -1396581, -5593123, -4615206, -2512384, -3510481, -3917057, 495194, 5572119, 5570561, 3260548, 4084830, 5143079, 528373, -5826818, -4392573, 3989121, 8140728, 3529817, -1928081, -1562713, 1093717, 1119066, 370541, 1316001, 861688, -3183617, -5997798]
58238e997798L105013N346458J063210k892327j950405j64497j224388k058591
58230d773325J57918K123742N94649j461958p289L192258L550185L70915l293147
58221D53948n034063m335463j635823J478200L081094L372706M070849M612286
58213F063734K305868k480410n031437k377007K303055L604518Q5751m888272
58205d14200o430079j826674O223962J0110001M985872l912636o610988j608469
58197E16789K508632L59723k831287j177210K023990R93269k040031j351451J436401
58188D38825K42557l921481l909843J164913L928356R24981k006024j9916K955041
58179b02591J796449r73544l20659J971917K79212m898036o921187k787487K885006
$$ y = [-5997798, -2892785, 2453673, 3516883, 624556, -1325849, -1490346, -2714734, -4773325, -4615407, -2491665, -1897016, -3358974, -3366263, -174005, 3376180, 3747095, 453948, -4580115, -8915578, -10551401, -9073201, -5992107, -2619401, 1451448, 6063734, 8369602, 5889192, 857755, -1519252, 783803, 4388321, 4474072, -414200, -6844279, -8670953, -2446991, 7663010, 12648882, 8736246, 2125258, 516789, 3025421, 3385144, 553857, -623353, 1400637, 2393906, 353875, -997576, 438825, 681382, -3240099, -7149942, -5985029, -2056673, -1131692, -3137716, -3157632, -202591, 1593858, 620314, 299655, 2271572, 2550784, -2347252, -9268439, -12055926, -9170920]
58170i170920M704271K800737N59836m68489j026268j490269j138493K83292J626600
58161c319703J385835m36305j822694q08880J842427L145900J589825r49167j841021
58152a213783r02601K02859M49175r0112j080540j741194r77212Q13862J407258
58143c132288j12383j439140l45966J693184J715553k83486j886240j972678j019015
58134f782459Q77290K969489K509396j489904m707362k731749J426665J129629
58126f799005l155593m256026k51186K267668k07900j763926K388634O754063
58118e023271M410940r85627r68409L829280N020966J41895m203436l225603J17848
58109h85417J549052R30474n63653k688474l566149m52351M765670O022796J485298
$$ y = [-9170920, -4466649, -1665912, -1106076, -1574565, -2600833, -4091102, -5229595, -4946303, -3319703, -1933868, -2370173, -4192867, -5001747, -3159320, -13420, 1576405, 627238, -1213783, -2116384, -1913525, -1464350, -1554462, -2635002, -4376196, -5353408, -4539546, -3132288, -3244671, -4683811, -5029777, -3336593, -1621040, -1904526, -3790766, -5763444, -6782459, -5905169, -2935680, -426284, -1916188, -6623550, -9355299, -7928634, -6799005, -9954598, -14210624, -14461810, -12194142, -12402042, -14165968, -11777334, -5023271, -612331, -1597958, -2566367, 1262913, 6283879, 6425774, 2222338, -1003265, -885417, 663635, 1594109, 1030456, -1658018, -5224167, -5676518, -910848, 5111948, 6597246]
58100F597246l192456k689956J083399K787371Q86634j793902k338913m45955
58092H93468J482718L75730l371024m711817l93230M924805M314207q50593l025966
58083c61702q91941p62397m064110l601289L201822P442995K504801m127496k420631
58074c079948L804035L452202l355258n966898r70343L246462J224993j767356
58066c412111n71791J173196r82162l495770j193980K967206K202857k915852
58058f228407n042887j310975K561078J008563l456369m151650O15079N734547
58050a0271021O026340J864142k603276m473970l588748p36034K861638M775670
58042f145259L090804n56390k213776o41235J350120J323464J89976l30537k80155
$$ y = [6597246, 3404790, 714834, 1798233, 4585604, 5472238, 3678336, 1339423, 893468, 2376186, 2751916, -619108, -5330925, -5724155, -799350, 3514857, 2664264, -361702, -1253643, -2016040, -6080150, -9681439, -6479617, 963378, 3468179, -659317, -3079948, 724087, 4176289, 821031, -5145867, -6116210, -2869748, -1644755, -3412111, -3983902, -2810706, -3792868, -7288638, -8482618, -5515412, -3312555, -6228407, -11271294, -12582269, -10021191, -9012628, -12468997, -16620647, -16005568, -10271021, -4244681, -2380539, -4983815, -9457785, -13046533, -13782567, -10920929, -6145259, -3054455, -3610845, -5824621, -6465856, -5115736, -3792272, -3602296, -3932833, -4212988]
58033d212988m9920P05130J264573P7769j747399r36860K172758K832881n36014
58024d30070k987092j010009J415967j43931k575811r03963K309310J282339k185104
58015e228364j194352M081987N912031J488041k729722j526814J681583J362523
58007C846913k197597n044818n090670k483713J717780M868480M210371P45832
57999E72578j703241k031590k293574k309910N69482N049466N481095N31632l625163
57990B40775k346645O59622p9276l107641l143447M27222L423033L381863J697802
57981A153308K46767n37021o94661l41267J27558O39021J317778J477126O42744
57972D031353L80083K048701L055352j91253n294926n527713q7243L521013M96372
$$ y = [-4212988, -4262908, -3557778, -2293205, -2215436, -3962835, -4899695, -2726937, 105944, -430070, -3417162, -4427171, -3011204, -3155135, -5730946, -6634909, -4325599, -3043260, -5228364, -6422716, -2340729, 3571302, 5059343, 2329621, 802807, 2484390, 3846913, 1649316, -3395502, -8486172, -10969885, -9252105, -4383625, -173254, 572578, -1130663, -3162253, -5455827, -7765737, -7196255, -2146789, 3334306, 3865938, 240775, -2105870, -1446248, -1525524, -4633165, -7776612, -7349390, -3926357, -544494, 1153308, 1400075, 863054, 168393, -172874, -45316, 593705, 1911483, 3388609, 4031353, 4411436, 6460137, 9515489, 9324236, 4029310, -1498403, -1585646, 1935367, 2431739]
57963B431739l996501l232624Q42759J760776j136157l083000k185777r51198
57955i549983o27168K93939K059312K770593J734731K18935j003921j976260k013102
57946h092924n38618J292061K122265K351567K510907J640582l32055j070346
57938a16561L53880Q09198k077661n065304l652007Q21349L250211K436238J598455
57929a642202K071021J734423j56645j433441j137713j095299k279493k999829
57921f939178j828954M01390K340918L487266L349553J548664q13091j864473
57913c17905j284891l16187K19957K77122l08806j219426j084596N24103J684927
57904a825702Q57032l65922K70904J876966J929637L53427r06926j318489j747598
$$ y = [2431739, -1564762, -4797386, -3954627, -2193851, -3330008, -6413008, -8598785, -9549983, -10177151, -9883212, -7823900, -5053307, -3318576, -3099641, -4103562, -6079822, -8092924, -8631542, -7339481, -5217216, -2865649, -354742, 1285840, 953785, -116561, 237319, 1046517, -1031144, -6096448, -9748455, -8927106, -5676895, -3240657, -1642202, 428819, 2163242, 2006597, 573156, -564557, -1659856, -3939349, -6939178, -8768132, -8366742, -6025824, -2538558, 810995, 2359659, 1546568, -317905, -1602796, -1918983, -1699026, -1421904, -1730710, -2950136, -4034732, -3510629, -1825702, -968670, -1334592, -1063688, 813278, 2742915, 3096342, 2189416, 870927, -876671]
57895h76671k005279j426019r60050j698764k263283o28769K403896M335972M333048
57886A214081K854719r3142l276163l392134J29427K280915o27054m050229j496948
57877f456528M513365N535261N11852k555456M65745L681162J259962l602678
57869C352685m529919j302340J605897J912918M94851j521318k856830j885538
57861d729594N99765J199167q63288j698497J076287L907848K873108K9956n35723
57852A859029Q1251j952466n463123n224083m44088L582178L396073J732477J904468
57843e28284K441336N90427k226317k530275n29457M37759l97360l41947J320480
57834a763638J359092j643468l493078m22530L897382L000446j881488k747865
$$ y = [-876671, -2881950, -4307969, -5268019, -6966783, -9230066, -9858835, -7454939, -3118967, 1214081, 4068800, 3975658, 699495, -2692639, -2563212, -282297, -909351, -4959580, -6456528, -1943163, 3592098, 4103950, 1548494, 2014239, 5695401, 6955363, 3352685, -1177234, -2479574, -873677, 1039241, 1534092, 12774, -2844056, -4729594, -4129829, -2930662, -3793950, -5492447, -4416160, -508312, 2364796, 2394752, 1859029, 1940280, -12186, -5475309, -10699392, -11143480, -7561302, -4165229, -2432752, -528284, 1913052, 2503479, 277162, -2253113, -2782570, -2344811, -2742171, -3084118, -1763638, -404546, -2048014, -5541092, -5963622, -2066240, 934206, -947282, -3695147]
57826c695147K673344O618338L174908k273103j761224K294097J230074n358820
57818B902467q528594l798934K539513L507320N50460j295618j348256j494208
57810f965850r56276J680667L972585K493045j129572j928601R13777K747193
57802H26968N25191k595940k014563J332191K049046j845848n436603l383975
57794a0543533K301496M699393J690726j462160o52124J061586l68368k378012
57786e650996k38622L760994K740247l640516p528697l958152K344317M075035
57778h096390Q80879j616838K12242L974243M516163J24184m563895l224088L569570
57769d223930P564864L600782k674899k989098J340728K712184J42935l49786
$$ y = [-3695147, -1021803, 5596535, 8771443, 6498340, 4737116, 7031213, 8261287, 2902467, -5626127, -9425061, -6885548, -3378228, -2827768, -4123386, -5471642, -6965850, -7922126, -6241459, -2268874, 224171, -905401, -2834002, -1920225, 826968, 1352159, -1243781, -3258344, -1926153, 122893, -1722955, -7159558, -10543533, -8242037, -3542644, -1851918, -3314078, -3966202, -2904616, -3272984, -5650996, -5889618, -2128624, 611623, -3028893, -10557590, -14515742, -12171425, -8096390, -7215511, -8832349, -8620107, -4645864, -129701, -5517, -4569412, -7793500, -4223930, 3340934, 6941716, 4266817, 1277719, 2618447, 5330631, 5473566, 5123780]
57761E123780K342739K251135k276008m879354k217256N27979n09922j355241
57753i92148J200191K889198K38930k193076m1528K472329L07240k644531m11218
57744H25387L846055L051218j418716k448937M82648J543648m12264o87391J665169
57735F446817K133717o54778k749427k420985k443136l429787k000102K304847
57727b812834M565857J605515l317613n244324l137127O89993L396970L114172
57719a139391N67121j004271k55632k03681k649198l394527J171497N955687L589295
57710B636900l065564m251320J198554L986814l46380m707144k962371N85492
57702f925019K08470j003807K557656Q319529Q924116K960777m172885p765886
$$ y = [5123780, 7466519, 9717654, 7441646, 2562292, 345036, 873015, 363093, -992148, 208043, 3097241, 3336171, 1143095, 1101567, 3573896, 3881136, 1236605, 825387, 4671442, 7722660, 6303944, 3855007, 4337655, 5881303, 5469039, 4781648, 6446817, 8580534, 7925756, 5176329, 2755344, 312208, -3117579, -5117681, -2812834, 1753023, 3358538, 40925, -5203399, -8340526, -7650533, -4253563, -1139391, -572270, -1576541, -1832173, -2035854, -4685052, -8079579, -6908082, -952395, 2636900, -428664, -4679984, -3481430, 505384, 159004, -4548140, -7510511, -6925019, -6716549, -7720356, -5162700, 3156829, 12080945, 15041722, 10868837, 3102951]
57694C102951o997199l065434J236070K366862M65227K37549L691611N621116
57686F658753J178871n564280o726935j979717J715615P29362j407132j234415
57678f629878l54066j154751k197792q23205K328592M146739L259570J443566
57670A8775R71620J677624J347213q99881k700669j452365J444205J976985o42094
57661A741413k691327j555873P01337J237852O24317N93823O25401j57033l91545
57652G28365P65825Q03276k242507n158997l413600J699741M601740L558713K272269
57643C614825K937756K752688p23880m742912m866250j116565K110178J530734
57635A496574j489707k957841r87959J996436K286007j82922j660331m5030J849839
$$ y = [3102951, -3894248, -6959682, -5723612, -3356750, -2891523, -2653974, 1037637, 6658753, 7837624, 2273344, -4453591, -6433308, -4717693, -3988331, -5395463, -6629878, -6983944, -8138695, -10336487, -11159692, -8831100, -4684361, -1424791, 18775, 990395, 2668019, 4015232, 3115351, 414682, -1037683, 406522, 2383507, 1741413, -949914, -2505787, -1804450, -566598, 57719, 651542, 1276943, 1119910, 728365, 1494190, 2297466, 54959, -5104038, -8517638, -6817897, -2216157, 1342556, 3614825, 6552581, 9305269, 8581389, 3838477, -1027773, -2144338, -34160, 1496574, 6867, -2950974, -3938933, -1942497, 343510, 160588, -1499743, -1544773, 305066]
57626C05066N67907k487595k900944M67409M199420M944022K541329j133521l752146
57617B750947l346332l06335J873165P24390j067479O99015M537870M405001j230203
57608I040039o257161n042115K32922L195130J489056j461570j275469K740942
57600B661774O644992N165044j926611p255416l788848M584483O466926j083428
57592A1468916p189229k661858N932424N758247l253758q837812m645856K073167
57584a355759K948615k95488j383995M62783J433385k320j959132k565518j244531
57575c961960J355861K681350M02588l082840k241533L260051O582131L476955
57567H472603j046874p40305J956066O30544l855293m636684p2886L929987L212399
$$ y = [305066, 872973, -1614622, -4515566, -4048157, 151263, 5095285, 7636614, 6503093, 2750947, -595385, -901720, 971445, 1695835, 628356, 1327371, 5865241, 10270242, 9040039, 2782878, -2259237, -2026315, 1168815, 2657871, 1196301, -79168, 2661774, 9306766, 14471810, 12545199, 5289783, 1500935, 6085418, 12552344, 11468916, 4279687, 1617829, 7550253, 13308500, 10054742, 1216930, -3428926, -1355759, 1592856, 1297368, -86627, 376156, 1809541, 1807221, -151911, -2717429, -3961960, -2606099, 75251, 477839, -2605001, -4846534, -1586483, 4995648, 8472603, 7425729, 6685424, 8641490, 9272034, 5416741, 780057, 707171, 4637158, 7849557]
57558G849557K58332j351838j427704o06029J259152K432786J15739m212217n139360
57549h21582j024074L359801L921305K143587O21694j041935k809871j879638
57541B469287K208870M735914K512938p78636q08560l8317k957363p081923n790868
57532e528658R90484N717250L474995k116968m542014j688726L881634Q475080
57524H663077R370670N867400Q3956m178913m257188l96472M620469P531581P709433
57515C5014013Q210386J1553877J5119654J4910187J3605855J8346094K9231092
57508A45991158L8810814M6776268O3307955Q7306162R1991494N0948618k2881052
57501E02251417q2430093r5675553p5297195n3406593m2357315l3078886k0429840
$$ y = [7849557, 8107889, 6756051, 5328347, 4722318, 5981470, 8414256, 8529995, 4317778, -821582, -1845656, 1514145, 5435450, 7579037, 8200731, 7158796, 4348925, 2469287, 4678157, 9414071, 11927009, 11148373, 10339813, 10301496, 7344133, 262210, -5528658, -4538174, 1179076, 4654071, 2537103, -2004911, -3693637, 187997, 8663077, 18033747, 23901147, 23985103, 19806190, 15549002, 15152530, 19772999, 27304580, 35014013, 43224399, 54778276, 69897930, 84808117, 98413972, 116760066, 145991158, 184801972, 231578240, 294886195, 382192357, 474183851, 525132469, 502251417, 419821324, 324145771, 248848576, 195441983, 153084668, 120005782, 99575942]
57494I9575942j1649473j1214915j2712722r851148n598483n389797p936723q043992
57486B7178689m644042j369207r88531k689996m017193l236267m43742K118469
57478A1908180J741916j291975l103053j062942J869630P75584l486678m430519
57470B920143L91491M423086J145801n483318o208268m35096L086385L11058k258189
57461b106907O83416M307131K592556j276326j351344M36059p98390k463451N58468
57452E81212M429150J600910m690925m035372L284751N604557p88647n293081
57444F92555p04350N490354M424245p04980k596280j677068j409843k40156K887921
57435F162398K702487l417472p769178l458993L399014L195545j507015j577286
$$ y = [99575942, 87926469, 76711554, 63998832, 54147684, 48549201, 43159404, 35222681, 27178689, 22534647, 21165440, 20176909, 17486913, 13469720, 10233453, 9789711, 11908180, 13650096, 12358121, 9255068, 8192126, 10061756, 10837340, 7350662, 2920143, 3311634, 7734720, 8880521, 3397203, -2811065, -3246161, -159776, 151282, -2106907, -1423491, 2883640, 5476196, 4199870, 2848526, 3284585, 2486195, 22744, 581212, 5010362, 6611272, 1920347, -2115025, 1169726, 6774283, 5985636, 692555, -11795, 5478559, 9902804, 9197824, 6601544, 4924476, 3514633, 3274477, 6162398, 8864885, 5447413, -2321765, -5780758, -2381744, 813801, -693214, -2270500]
57427b270500K335205K086916k211575k344638K526917L700952j886091o176143
57419d238957l203275K243283L446122J011484j022557j542358q86115J249137
57411b943236L123715J358839l242662n218182k106937K233112L913121L654150
57403G71920L257436K472537J445423J575902K093301L39900l119196m490239
57395D346984l013391j971507k344954j385244J012275J059442j525994j660262
57387e482651K306947M577129J012692l692966l060156J811495N157597M905589
57379G535676L015588O16785k291435m405167m347035k738766o17213J841023
57371a390544L353250J914761r86900r80024K118326L020677l10305k529541L18512
$$ y = [-2270500, 64705, 2151621, -59954, -2404592, 122325, 3823277, 1937186, -4238957, -7442232, -5198949, -1752827, -741343, -1763900, -3306258, -4192373, -2943236, 180479, 1539318, -1703344, -6921526, -9028463, -6795351, -2882230, 771920, 4029356, 6501893, 7947316, 9523218, 11616519, 11956419, 8837223, 4346984, 1333593, -637914, -2982868, -4368112, -3355837, -2296395, -3822389, -5482651, -3175704, 1401425, 2414117, -1278849, -4339005, -2527510, 2630087, 7535676, 10551264, 11168049, 8876614, 4471447, 124412, -2614354, -3231567, -1390544, 1962706, 3877467, 2890567, 1910543, 4028869, 7049546, 6739241, 4209700, 4528212]
57362D528212L799630K348843j769636l140178k306049l183699m973980m007986
57354h704843j062653L40061P93109K996154M817137K049636l023413l739457
57346e534269M57841L386263K344822J063838J295341k86194m111685m579004
57338e963047P18767N261342K621980l702036n413502j113320L026044K656268
57330a907504j14739j457933q56482j79213k75464p3711J500747L461663L315343
57321C412707L73681k443184k095786o8559m45692l183287l274504J608865O508893
57312C93134N604784N15407k136806k10063J607776n30915l884866l366855J169628
57303h38776M924237M417998R77987k098928l410868l514755k994942k070465
$$ y = [4528212, 8327842, 10676685, 8907049, 5766871, 3460822, 277123, -4696857, -8704843, -9767496, -9427435, -8634326, -5638172, -821035, 1228601, -1794812, -5534269, -5076428, -1690165, 654657, 1718495, 3013836, 2727642, -1384043, -5963047, -5244280, 17062, 2639042, -1062994, -6476496, -7589816, -4563772, -1907504, -2022243, -3480176, -4336658, -4515871, -4791335, -4865046, -3364299, 97364, 3412707, 3786388, 1343204, -752582, -821141, -1266833, -4450120, -7724624, -6115759, 393134, 5997918, 6513325, 4376519, 4166456, 5774232, 5243317, 1358451, -2008404, -838776, 4085461, 8503459, 9481446, 7382518, 3971650, 456895, -2538047, -4608512]
57295d608512j130769j82971J462471L525402L815526J060230k125212j912105
57287i5940J163156K404535n44258m440511m983151j861703K210759M774201M317017
57278B944105P14658k950332k193872K596120M970361Q19074n353980o722212
57270e176078l476854o14359P60756L130979N061610J981733m623032o525059
57262i480304l41057O537775N787413r81394n838016n284060k389856n24662J30243
57253a2383918N77734J304436K468082L439041K873533J021440L01594J442603
57245A044545J379374j842148m461603j922405L057798L188065k186158m875288
57237f617820K57912O768282N323438k621598o780082k896137J817079M45192
$$ y = [-4608512, -5739281, -5922252, -4459781, -934379, 2881147, 3941377, 1816165, -95940, 1067216, 3471751, 2927493, -1513018, -6496169, -8357872, -6147113, -1372912, 2944105, 3658763, 708431, -1485441, 1110679, 6081040, 6900114, 1546134, -5176078, -8652932, -9267291, -8506535, -5375556, -313946, 1667787, -2955245, -9480304, -9821361, -3283586, 2503827, 1522433, -4315583, -9599643, -11989499, -12514161, -12383918, -11806184, -10501748, -8033666, -4594625, -1721092, -699652, -398058, 1044545, 2423919, 581771, -3879832, -5802237, -2744439, 443626, -1742532, -6617820, -6359908, 408374, 5731812, 3110214, -3669868, -6566005, -4748926, -4303734]
57229d303734l241320j623291M189068O128625J902466k066261j490415k71870
57221g76732k284487m025242j052945L491637L610513J60158j407215o08926j325564
57212d218803k803383p8583N712220O406665n34572o415841l383496M277948O960027
57203E922182L026170j326781k377253k242794l027961l517972k231216J48250
57195e627375J939867J831172l41343k459009j495377K080202L880678J927216
57187A736031j28092N64423P37479k663059n093157q80660N706313N112036k227937
57178B863377n344423K08937M832104m3526p977323p127405J705070O652157K576258
57169a654774k571387q68792M421805N276820Q53081k840650k520746r83139j131794
$$ y = [-4303734, -7545054, -9168345, -4979277, 1149348, 3051814, 985553, -504862, -776732, -3061219, -7086461, -8139406, -4647769, -1037256, -877098, -2284313, -2893239, -4218803, -7022186, -7100769, -1388549, 5018116, 4483544, -1932297, -5315793, -1037845, 5922182, 8948352, 7621571, 5244318, 3001524, -26437, -3544409, -5775625, -5627375, -3687508, -1856336, -2197679, -4656688, -6152065, -4071863, -191185, 1736031, 1607939, 2172362, 2909841, 246782, -4846375, -5727035, -20722, 5091314, 2863377, -2481046, -2272109, 2559995, 2516469, -5460854, -12588259, -10883189, -4231032, -1654774, -4226161, -5094953, -673148, 4603672, 5456753, 2616103, 95357, -887782, -2019576]
57160b019576j865554j530197j282403k092433j561909K235788N798199M167367
57152A849282p57782j832348K187967L605225k377670q734930n893435L976987
57144g976704R651973O317433M52792j254812k78497j007779l434716m805220
57136b335530m180332j993779J439878M308362L753503M14850j259920K66335
57128D13367R10016j931090m283479j952933K263948L028374P68320k53287L51181
57119f85583m55650k396815j853668J576151L965811K923336Q9750k327482l403091
57110b567241k285275N17355J372107k012429n151733j768593N937266Q853759
57102B895216L954684j426301r96152J794788Q44245k759143l837678k036833
$$ y = [-2019576, -3885130, -5415327, -6697730, -8790163, -10352072, -8116284, -2318085, 1849282, 1091500, -740848, 1447119, 5052344, 2674674, -6060256, -11953691, -7976704, 1675269, 7992702, 8445494, 7190682, 6912185, 5904406, 2469690, -2335530, -6515862, -8509641, -7069763, -2761401, 992102, 1406952, 147032, 413367, 1323383, -607707, -4891186, -6844119, -4580171, -1551797, -783477, -1036764, -685583, -1141233, -3538048, -5391716, -3815565, 150246, 3073582, 3163332, 835850, -2567241, -4852516, -4335161, -2963054, -4975483, -10127216, -11895809, -5958543, 2895216, 6849900, 5423599, 4427447, 6222235, 7066480, 4307337, 469659, -1567174]
57094a567174j321686k485049j937283K045004O068338N634194M59638m745251
57086B150731m622514Q25897N157569K887319k774298l839690Q32245L724503
57078D341762J70675m828373m888398j230501J456360K554371L185732J551634
57070B313262k725394m340568M3115M233029J319267l801748j225927O929297
57062B744333Q363087j15548p398844n274165O03113K016168K42991J04063N90443
57053A875641q54724j584971Q54532K346128q99523m247330j799918K877601K336292
57044I03728j925435k125308K222181L691467j29974l117010j635017K38067m96071
57035b373372l12432L131874N271317K113717k410382k608373r2927l26061l109231
$$ y = [-1567174, -2888860, -5373909, -7311192, -5266188, 802150, 6436344, 6895982, 2150731, -2471783, -1645886, 3511683, 6399002, 3624704, -214986, 617259, 4341762, 4512437, -315936, -5204334, -6434835, -4978475, -2424104, 761628, 2313262, -412132, -4752700, -4709585, -476556, 842711, -2959037, -4184964, 2744333, 11107420, 10991872, 3593028, -1681137, -1078024, 938144, 1181135, 1285198, 1875641, 1020917, -564054, 290478, 2636606, 1737083, -2510247, -4310165, -1432564, 903728, -1021707, -3147015, -924834, 2766633, 2636659, -480351, -2115368, -1877301, -2373372, -2685804, 446070, 5717387, 7831104, 5420722, 2812349, 2719422, 2393361, -715870]
57026g15870l156504R23721M263792K977449q46956k823909j757829J95614R00684
57017c9808K13969o30737o04343K09706J149269J978939K549267J809658j093926
57008E541994m405722m611653r60837K749346K685200k06197j937834q86639R74810
56999a057532J755160J928488K374805K226129J32224l114251m653134k721345
56991c129456Q29706K218403L65808j314695P15586M715161N189659K81861n117905
56982D754128n341141q46761L179961L546229J495508p77253k768986m258754
56974a017069m000361j449980J580110K494102P14713j859210k876038j585703
56966g999436Q01274K468576K745770K358307J862002O34601j753611l889332
$$ y = [-715870, -3872374, -2948653, 1315139, 4292588, 3445632, 621723, -1136106, -940492, -39808, 174161, -456576, -1060919, -851213, 298056, 2276995, 4826262, 6635920, 5541994, 1136272, -3475381, -4436218, -1686872, 998328, 792131, -1145703, -2032342, -1057532, 697628, 2626116, 5000921, 7227050, 7359274, 4245023, -408111, -3129456, -2299750, -81347, 284461, -1030234, -314648, 4400513, 9590172, 9872033, 4754128, -587013, -1433774, 1746187, 5292416, 6787924, 6010671, 3241685, -1017069, -5017430, -6467410, -4887300, -2393198, -1678485, -3537695, -6413733, -7999436, -7198162, -4729586, -1983816, 374491, 2236493, 2871094, 1117483, -2771849]
56958b771849l672522j024942J875543L149785K748872J397941l69526j637034
56950c03732j238681N19177J620725R71226k0781J50711N18535m48505j458598
56941C10077J51174L599124M483160O90110m190890n435188l098548p19954L54596
56932c856339J831961L932156L877587M53516k898963k179970J509469L155516
56924E824933L48051l769189m637162j675466J664880K538555J895946K269577
56916D460125L239459J360994m164633q024020m561299L501366O773902J365355
56908C951249n247292m350935J807592L889673m06626l567687o86677K870666
56900a740037N60937m402700l953709J926502M885076R87078l430634j758585
$$ y = [-2771849, -6444371, -7469313, -5593770, -2443985, 304887, 1702828, 1333302, -303732, -1542413, -1023236, 597489, 1568715, 1547934, 1698645, 2217180, 1768675, 310077, 461251, 4060375, 8543535, 9233645, 5042755, -392433, -3490981, -4210935, -3856339, -2024378, 1907778, 5785365, 6238881, 3339918, 1159948, 2669417, 5824933, 6172984, 2403795, -2233367, -3908833, -2243953, 294602, 2190548, 4460125, 7699584, 9060578, 4895945, -3128075, -7689374, -4188008, 2585894, 3951249, -1296043, -5646978, -3839386, 50287, -356339, -3924026, -4610703, -1740037, -1179100, -5581800, -9535509, -7609007, -2723931, -1736853, -5167487, -6926072]
56892f926072K823154K689482k141199m054431J55072M053534J373467m151947
56884f178940m146990J881696N803385K713848k666421l737271q98543J220282
56876f008954J384478J546292J500404o37405l444523l059750N99695L170631
56868d949132K148125m53653k503509m164215m647056j632700L705804N954712
56860f541624K974057k83149O74806K830548J158157k515737k408158J591007
56852b520093L833591J932349m53012m94359p0905j177402k443340k328434j634718
56843e356323q06900J344990M110360M044930L10748k871187k157688L7189J00613
56834a243268q03977K30642J805043P26433j281707K42652L921542L036957l579972
$$ y = [-6926072, -4102918, -1413436, -3554635, -7609066, -7453994, -3400460, -2026993, -6178940, -10325930, -8444234, -2640849, 72999, -2593422, -6330693, -7229236, -6008954, -4624476, -3078184, -1577780, -2215185, -5659708, -8719458, -8119763, -4949132, -2801007, -3254660, -5758169, -9922384, -14569440, -16202140, -12496336, -6541624, -3567567, -3850716, -3175910, -345362, 812795, -1702942, -4111100, -2520093, 1313498, 3245847, 2792835, 2298476, 2227571, 1050169, -1393171, -3721605, -5356323, -6163223, -4818233, -707873, 3337057, 3647805, 776618, -1381070, -1343881, -1243268, -2047245, -1816603, -11560, 714873, -566834, -324182, 3597360, 6634317, 3054345]
56825C054345p751148l134913M962648O703472J450567k356812k00714K718898
56817E446343O17673m016339m989987j921371J80467p62789j462014M19315K354525
56808d134177J470950o06624m57258J760410K870114J607842r4389o28375p09238
56799A079255j212072j338717k19554J226037J503807P37900K93615O76452J084660
56790C831383R55045P48667Q77247Q53552K16976l75159K0512R56565Q66098p86050
56780H164836k631403l099724k062427l51536J157406J339296o60428l417399
56772a561379l591055l92705K169748N98410k191872p00575M110622N189851o8765
56763C562280n484499n184578j640459k20655m23886J527199M652166M638411
$$ y = [3054345, -4696803, -7831716, -2869068, 3834404, 5284971, 2928159, 2727445, 5446343, 6064016, 2047677, -2942310, -4863681, -4683214, -5446003, -6908017, -6488702, -4134177, -2663227, -3269851, -3727109, -1966699, 903415, 2511257, 2416868, 1788493, 1079255, -132817, -1471534, -1691088, -465051, 1038756, 1776656, 2070271, 2746723, 3831383, 4786428, 5535095, 6412342, 7265894, 7482870, 7107711, 7128223, 8084788, 8950886, 8164836, 5533433, 2433709, 371282, 19746, 1177152, 2516448, 1856020, -1561379, -5152434, -5545139, -3375391, -2776981, -4968853, -5669428, -1558806, 3631045, 3562280, -1922219, -7106797, -8747256, -8967911, -9391797, -7864598, -3212432, 1425979]
56755A425979J733037L21553R83149j33822l278238l460608R11808M220029J935279
56746D658166k695999m287051k867407j309167M40377L154685L874252q1691m779325
56737c893160l862379J722635M585665J736841j725836j194655J221792J794629
56729C85532J149374J202014M09284k986302n773396l272010L034346O451539
56721F00381L910160n42908k078509r64725k48633p75083j181544r51497q48205
56712c080563j120694j222615r07483l62538K39565N85671N09446Q07176K115075
56703b436960K614639k98904m822032n036103O25330N102537J834353m924803
56695g341943n551364P52974N115524K876310j27489J798116N118905L858639
$$ y = [1425979, 3159016, 3480569, 4463718, 4329896, 1051658, -2408950, -1497142, 2722887, 4658166, 1962167, -2324884, -5192291, -6501458, -6061081, -2906396, 967856, 886165, -3893160, -7755539, -6032904, -1447239, 289602, -1436234, -2630889, -1409097, 385532, 1534906, 2736920, 3146204, 159902, -5613494, -8885504, -5851158, 600381, 4510541, 3967633, 1889124, 924399, 675766, -99317, -1280861, -2232358, -3080563, -4201257, -5423872, -6331355, -6693893, -6454328, -5868657, -5359211, -4552035, -2436960, 177679, -121225, -4943257, -9979360, -9354030, -4251493, -2417140, -7341943, -12893307, -12140333, -7024809, -4148499, -4275988, -2477872, 2641033, 6499672]
56687F499672o96100l273889l043489k486257j481076J149197L102980J839042
56679A610080k45195K3616K20541k992006n860206k614492L582898M328232j53627
56670b100159j222675L242872N165071N64390l348419p11060L169083J590231
56662F349334k292439k248536k46306j792856m886462l160650K676757N482871
56654a18287K656388j205491k219198j173002K48438J425941J156443j019752
56646b48520k523812j293150n105j692562l351451k65179M993911N215223k82643
56637E46712m550937l533886m76595J207340K182705K485551j48216m332460m205548
56628a0825334J582009O054271L576262j878558l192939n11462N48310j753573
$$ y = [6499672, 5803572, 2529683, -513806, -3000063, -4481139, -3331942, -228962, 1610080, 1364885, 1388501, 1609042, -1382964, -7243170, -9857662, -6274764, -1946532, -2100159, -3322834, -79962, 5085109, 5649499, 2301080, 1590020, 4759103, 6349334, 4056895, 1808359, 1562053, -230803, -5117265, -8277915, -5601158, -118287, 2538101, 1332610, -886588, -2059590, -1811152, -385211, 771232, -248520, -2772332, -4065482, -4070587, -5763149, -9114600, -9379779, -4385868, 829355, 546712, -4004225, -7538111, -8014706, -6807366, -4624661, -2139110, -2287326, -6619786, -10825334, -9243325, -3189054, 387208, -1491350, -4684289, -5195751, -4647441, -6401014]
56620f401014l537902j880724J637187L940923L688572J471951q27678j123038
56612c031723O39166J884862N62481j958053k589633l02811L003393M504925K501331
56603E213938k162239n774387m516912J075080N753118N023726o3406m598237
56595d9319n060646j868230K036419L811898K633405L6235j730552j697508k36433
56586b124731J924456L555428K935286o5505k872210l337738k784937l253540
56578f023491l269667k15515M139597N193977K482405K00895K89556J13070j798345
56569A112482k968178j968788j233699k226534k298596N84068L876778M286940
56561h35527K236238n2509j538039j374781J029025K948078K16348n326836n983615
$$ y = [-6401014, -9938916, -11819640, -10182453, -6241530, -2552958, -1081007, -1908685, -3031723, -2392557, -507695, 54786, -1903267, -4492900, -4795711, -1792318, 2712607, 5213938, 3051699, -2722688, -7239600, -6164520, -411402, 4612324, 4548918, -49319, -5109965, -6978195, -4941776, -1129878, 1503527, 1539762, -190790, -1888298, -2124731, -200275, 3355153, 6290439, 6224934, 3352724, 14986, -2769951, -6023491, -9293158, -9508673, -5369076, -175099, 2307306, 2508201, 2797757, 2910827, 1112482, -1855696, -3824484, -5058183, -7284717, -9583313, -8999245, -5122467, -835527, 1400711, 1348202, -189837, -1564618, -535593, 2412485, 2628833, -2698003, -8681618]
56552h681618O24617O637444N092598j42289j852857j003615k646785m952699
56544f925204k054341M409008O442397K214666j604292j014074K23238j245215
56536D46183k743647j375908P01787M20008j372107k220357j541102K54591K534971
56527d895581L076162k7579m048435l841521M48299L006145J168832j028972k94731
56518f437381J030964P64658J433959M527242N760324J654853l743927m715984
56510B74708k466571j476235r98974K139827M988098J723923n167965o381376
56502g364565n5941M505574J065815l932137j843222M805043O973842K762212
56494F916621j707390k677020j918792m00665K943470N413081J880016n519334
$$ y = [-8681618, -8057001, -1419557, 3673041, 3530752, 1677895, 674280, -1972505, -6925204, -8979545, -4570537, 1871860, 4086526, 2482234, 1468160, 1691398, 446183, -2297464, -3673372, -2971585, -2551577, -3923684, -6144041, -7685143, -7430552, -4895581, -1819419, -1846998, -5895433, -9736954, -9288655, -6282510, -5113678, -6142650, -6437381, -5406417, -4641759, -3207800, 1319442, 7079766, 8734619, 4990692, 274708, -2191863, -3668098, -4667072, -2527245, 2460853, 4184776, -983189, -7364565, -7420506, -2914932, -1849117, -5781254, -7624476, -2819433, 4154409, 6916621, 5209231, 2532211, 613419, 212754, 3156224, 8569305, 10449321, 4929987]
56486D929987p111068M09600P168347L654036n051853o903152o34349L746726
56478B08274P54878m098239m740444k469578m78249J767384M429111M015355p44833
56469a356341m650658k771818K257051M382108K430495j86408j332199j376317
56461b604087p07977K11599J59937p06485n14658L67762j031975m041011l013355
56452a1880250L467443P719957L479127l728820m379112P59862K910969l92164
56444b042988k640454J27908L864164M084421J754124l49469j449898j408956
56436A938852l08909n3796j983580l371728j194619J917876J422813j036418l93763
56427c063272K334547J633659k017582k449531R93451K278553J0483l74463J939022
$$ y = [4929987, -2181081, -1771481, 5396866, 9050902, 3999049, -2904103, -3538452, 208274, 963152, -3135087, -7875531, -10345109, -10823358, -9055974, -4626863, -611508, -1356341, -6006999, -8778817, -6521766, -2139658, 290837, 104429, -1227770, -2604087, -3312064, -3100465, -2940528, -3647013, -4161671, -3793909, -4825884, -8866895, -11880250, -8412807, -692850, 2786277, -942543, -5321655, -4561793, -1650824, -2042988, -4683442, -4555534, -691370, 3393051, 5147175, 4797706, 3347808, 1938852, 1629943, 1576147, -407433, -3779161, -4973780, -3055904, -1633091, -2669509, -3063272, -728725, 904934, -1112648, -3562179, -2568728, -290175, -279692, -654155, 1284867]
56418A284867N56096n256802o471125P41084O652240K758849m413808l919651
56410h068250K719821N725779K691607n78502j309954j820519k365139q75118
56402c880275J276447R27713n94070K07829J933810N79258k551205k499602O73377
56393c926718K082971N29442k28985J085528J375631l64612r67945R14883K104148
56384B604343J61539k796111l392540j113229J938193L120212J043815k549879
56376i83657l494455r9598M075406M842083K641387K59558j816103l790476l374221
56367a740076N96227L728586J102197m728207o601359k806692J423601K162651
56359f863072J017399P68235J585711K291859J849635l33001k755356j996202
$$ y = [1284867, 1840963, -3415839, -9886964, -9145880, -2493640, 265209, -4148599, -8068250, -5348429, 377350, 3068957, 2490455, 1180501, -640018, -3005157, -3880275, -2603828, -1676115, -2270185, -2062356, -128546, 450712, -2100493, -4600095, -3926718, -1843747, -1314305, -1543290, -457762, 917869, 553257, -414688, 500195, 2604343, 2765882, -30229, -3422769, -4535998, -2597805, 522407, 1566222, -983657, -4478112, -4577710, -502304, 4339779, 6981166, 7240724, 5424621, 1634145, -1740076, -1143849, 2584737, 3686934, -1041273, -7642632, -10449324, -9025723, -6863072, -5845673, -5077438, -3491727, -1199868, 649767, 316766, -2438590, -4434792]
56351d434792K185623M459325R76227l981980l772353P41737L156829J259056
56343E89672j612750l170544l608400k103492J408422K789366q03753m046635
56335a0558114k21912O992246P845604J650916k584203q87884R31603j100236
56327B068020l232661k557241j690298j557465J145841N715228N956227Q59002
56319F706653k527198j031381m26207l714260m695254L16212M349849J268702
56311B47116l560384k730503J108156J649659K6547J10345k62226l431264m066038
56302a0908592J909735O852560K138891n871093m345863M938988P916886Q76010
56294C507522m388623m53807M843279K614081l796627o538753n107454l321206
$$ y = [-4434792, -2249169, 2210156, 3186383, -795597, -4567950, -3826213, -669384, 589672, -1023078, -4193622, -7802022, -9905514, -8497092, -5707726, -6511479, -10558114, -10780026, -3787780, 4057824, 5708740, 3124537, 2236653, 3168256, 2068020, -1164641, -3721882, -5412180, -6969645, -5823804, -108576, 5847651, 6706653, 4179455, 3148074, 2721867, -992393, -5687647, -5371435, -1021586, 247116, -3313268, -6043771, -4935615, -3285956, -3259409, -3149064, -3411290, -6842554, -10908592, -8998857, -2146297, -7406, -5878499, -10224362, -5285374, 2631512, 3507522, -881101, -1334908, 3508371, 6122452, 2325825, -4212928, -9320382, -12641588]
56286a2641588j474563J479406L091818J190058j264584m99233K048821K740708
56278e329157J773342J581335J768204L81142j465080q49174J775076K725740
56270B361428N72082j821605j499505P44133J896295O36663j586938k766487k275265
56261c739199n05614J917860L448317J649268l562839p433277m723634K843596
56253a0105522P349191M515888j113136l242184j920496r13738p96299M34361
56245e791935K470864L439912L608430L695966J733425l247190o818753m617857
56237e527138j31744R1372k582069j206287L804716M101799k027184m876263J573209
56228f779589Q897319O454687k468005o188307k202259R50727j645316m606787
$$ y = [-12641588, -14116151, -12636745, -9544927, -8354869, -9619453, -10118686, -8069865, -5329157, -3555815, -1974480, -206276, 174866, -1290214, -2139388, -364312, 2361428, 2933510, 1111905, -387600, 356533, 2252828, 2889491, 1302553, -1463934, -3739199, -4244813, -2326953, 1121364, 2770632, -792207, -8225484, -12949118, -10105522, -2756331, 1759557, 646421, -2595763, -4516259, -5429997, -6226296, -5791935, -3321071, 118841, 3727271, 7423237, 9156662, 5909472, -909281, -5527138, -5658882, -5567510, -8149579, -9355866, -5551150, -1449351, -3476535, -8352798, -6779589, 2117730, 8572417, 6104412, -83895, -2286154, -1335427, -2980743, -7587530]
56220g587530k363015K086347K852176K64804p72872J194104K557709M84439l169634
56211d453472m472418k025022J792859L332059J153890k461977l567585o79596
56203a1381262L349461M312221J286336k607216l896792j949726J560288M593399
56195d733291N379580L014577q97199k588613j90789L446854M040957J132568
56187H604644k099211l273841k445740l31941J877172J739982j688354m896285
56179b513574l820740j05093J465646J119290L127712O417651M441540l039492
56171G092940o931276k558454K158232m44090m646438r86136O971174P574784
56163H230736O988m425108l88409M069977J513385l778184m120971j47936K032257
$$ y = [-7587530, -9950545, -7864198, -5012022, -4747218, -5520090, -4325986, -1768277, -1283838, -4453472, -8925890, -10950912, -9158053, -5825994, -4672104, -7134081, -10701666, -11381262, -8031801, -3719580, -2433244, -5040460, -8937252, -10886978, -9326690, -4733291, 646289, 3660866, 2763667, 175054, -15735, 3431119, 7472076, 8604644, 6505433, 3231592, 785852, 453911, 2331083, 4071065, 2382711, -2513574, -6334314, -6439407, -4973761, -3854471, -726759, 5690892, 10132432, 7092940, 161664, -2396790, -238558, -682648, -5329086, -6315222, 655952, 8230736, 8237724, 3812616, 3424207, 7494184, 9007569, 5229385, 1108414, 960478, 2992735]
56154B992735M23513j848609k241272j073306K68237O00226l12621j064562l27635
56145b583294P10006K21208n33149R12063L183459K606786l64527j577474l19744
56136B255334j44982j733710j430951J324159J905744j306906l340639j099061
56128c571012J008767j118953l660681j191590L933310N205278J877764j329525
56120A153358k419003l504361m814883l452674J172214N417779O145443M066650
56112C764523J487894n37178j874607k202391j320102L07070J738173K104922
56104C468304J363330M83620K3670j047670l425848m987761l005829J196911L110213
56095b821060J185680j208540r35526J153145K750483L025778J803663p89541
$$ y = [2992735, 3416248, 1567639, -673633, -1746939, -1478702, -878476, -1191097, -2255659, -2583294, -1873288, -1652080, -2185229, -1273166, 1910293, 4517079, 4152552, 2575078, 2255334, 2110352, 376642, -1054309, 269850, 2175594, 868688, -2471951, -3571012, -2562245, -3681198, -7341879, -8533469, -4600159, 605119, 2482883, 1153358, -1265645, -4770006, -9584889, -13037563, -11865349, -6447570, -302127, 3764523, 5252417, 4715239, 2840632, 638241, -681861, -374791, 1363382, 3468304, 4831634, 5315254, 5338924, 4291254, 865406, -4122355, -7128184, -5931273, -2821060, -1635380, -2843920, -3779446, -2626301, 124182, 3149960, 4953623, 4164082]
56087D164082k712785j657327O77705R7359l181331l987119k88308L395775L120032
56078c71917Q09370m71694j207261j999523q66625K108313K801646j3975j368048
56069e79714J445612L106405j032786o274223n730070j023097J941792L142503
56061e003578N624490O643738J618106n591027o599970j539031J792989J164459
56053a889824J845410M872005M345575j188807m979870l316394j087490j773788
56045c173183j027538M101617P750554L943711l720350p913038p661806n963447
56037a3663480k639142K866651N882650K082311l968312m067134J266384L854948
56029h385124R38504j250147J440194M389757K405621j598818j398681K813746
$$ y = [4164082, 1451297, -206030, 471675, 569034, -2612297, -6599416, -6887724, -3491949, -371917, 437453, -34241, -1241502, -3241025, -4107650, -1999337, 802309, 788334, -579714, 865898, 3972303, 2939517, -3334706, -9064776, -10087873, -8146081, -5003578, 620912, 7264650, 8882756, 3291729, -3308241, -4847272, -3054283, -1889824, -44414, 4827591, 9173166, 7984359, 3004489, -311905, -1399395, -3173183, -4200721, -99104, 7651450, 11595161, 7874811, -38227, -7700033, -13663480, -16302622, -13435971, -7553321, -5471010, -9439322, -13506456, -12240072, -8385124, -7446620, -8696767, -7256573, -2866816, -461195, -2060013, -3458694, -644948]
56021f44948M988508K069339k399437l655007j278143J512815J929272n992j888000
56012F28407j205242J849882L838887J767475k622934m319814j550977J582653
56004c1663Q12467k244042k765919O7746K495317K414718J869616K437322K389970
55995G445532M36275j414813j305805o44224r82112r32835N25836Q44196j793248
55986B178802l694388m61441N048667N460428m67755n644502m469496J41219K031411
55977A22945J91996j442524l25939J879495K282972L43510j854215k030061j70363
55968a002184J404443N45919k388365m881872m507086q91668L607855N344592
55960b768366L041752r4068l5541K473579L058683N44973j542508j270391j071094
$$ y = [-644948, 4343560, 6412899, 4013462, 358455, -919688, 593127, 2522399, 2516407, 628407, -576835, 1273047, 5111934, 6879409, 4256475, -63339, -1614316, -31663, 780804, -1463238, -4229157, -4161411, -1666094, 748624, 2618240, 5055562, 7445532, 7881807, 6466994, 5161189, 4516965, 3534853, 2602018, 3127854, 3972050, 2178802, -1515586, -1977027, 3071640, 8532068, 8064313, 2419811, -2049685, -1908466, 122945, 314941, -1127583, -1453522, 425973, 2708945, 3052455, 1198240, -831821, -1002184, 402259, 948178, -1440187, -6322059, -10829145, -11720813, -8112958, -2768366, 273386, 179318, 143777, 2617356, 5676039, 6221012, 4678504, 3408113, 2337019]
55951B337019k129948j571352J282860J639323k743833n733069j563794N183788
55943c299006N967841J125679j940791r10252o2846r77143o72149J051677Q88748
55934A171758r34670r03546K98504j099369l268983o97817M403366L328837l995431
55925a697351o444455J007538Q325038N558044k727645o431095n052290m353665
55917a1815881m332412q76219M426380N846016K968793M90727L4763o63940j754815
55908e676588j207928J89198j63855j527543j116638N47479P96591O3464Q03591
55899g292229K484590K770618K295523L038625L435978O75816l365367m237190
55891a93636k094089j034014j957867j974692n65263k65508j015137J32568K909815
$$ y = [2337019, 207071, -1364281, -81421, 1557902, -1185931, -6919000, -8482794, -3299006, 2668835, 3794514, 1853723, 943471, 880625, -96518, -768667, 283010, 1171758, 237088, -666458, -367954, -1467323, -4736306, -5434123, -1030757, 2298080, -1697351, -8141806, -7134268, 1190770, 6748814, 4021169, -2409926, -7462216, -11815881, -16148293, -17024512, -12598132, -6752116, -3783323, -3292596, -3257833, -3921773, -5676588, -6884516, -6695318, -6859173, -8386716, -9503354, -8955875, -8159284, -8095820, -7292229, -4807639, -2037021, 258502, 3297127, 6733105, 7408921, 4043554, -193636, -2287725, -3321739, -5279606, -7254298, -7819561, -8085069, -9100206, -8967638, -6057823]
55882f057823L298933L85208j745583o45451J065494Q95119L10845R26855J103882
55873d62521p59400k826024k498699j08878K212530L232976K554290R2686k718535
55864a281575l226600p11952K272242K872563Q51862k088087m146728l979110
55856i437385j376530J712319K571481J020980k60621L93481J076170r23825m671399
55847i895329n678279j123348N792193Q380063M213980j440785k306067M21519
55839a636053M47346l372366n081891j504384K349221J611701n49432J000692
55831f735166M158230L314750r47743l163518j983154o74581O7976K452192N217635
55822A706621M361175O47313p27121J072977J077011k557735n061273l000798
$$ y = [-6057823, -2758890, -2373682, -4119265, -4764716, -3699222, -2804103, -2493258, -1566403, -462521, -1221921, -4047945, -6546644, -6655522, -4442992, -1210016, 1344274, 1436960, -1281575, -4508175, -5220127, -2947885, -75322, 776540, -1311547, -5458275, -9437385, -10813915, -9101596, -6530115, -5509135, -5769756, -5376275, -4300105, -5223930, -9895329, -15573608, -16696956, -10904763, -2524700, 1689280, 248495, -2057572, -1636053, -1188707, -4561073, -9642964, -11147348, -8798127, -7186426, -7735858, -6735166, -2576936, 737814, -209929, -3373447, -5356601, -6031182, -5963206, -3511014, 1706621, 6067796, 6715109, 5987988, 7060965, 8137976, 5580241, 518968, -2481830]
55814b481830M71314J320670K53563m01502p71552j455564j405837k15787Q89014
55805c797511J665846K696677K315741j254065m504628j868991M675414O607966
55797F536449J455063l546453l336657j988199l297640l349340R04208L782461
55789b840108P085m897059k676130M166446O630456L300308L87824K26559m47644
55780C857737k078607j739194n63983k538533n779293m180938J555981L867783
55772g599047P94537j012558J597057K785002j216731m422548o38477O287521
55764c425244Q389959M490194r32838n089336p078149n073997L29365L559695
55756d830351J144951j951382M18681N264161M945695l71831l273372j337528
$$ y = [-2481830, -2010516, -689846, -436283, -837785, -1609337, -3064901, -4470738, -4686525, -3797511, -2131665, 565012, 2880753, 1626688, -2877940, -4746931, -71517, 6536449, 7991512, 4445059, 1108402, -879797, -4177437, -7526777, -6622569, -2840108, -2833023, -7730082, -10406212, -6239766, 390690, 3690998, 4078822, 4305381, 3857737, 1779130, 39936, -524047, -3062580, -8841873, -13022811, -11466830, -7599047, -6804510, -7817068, -6220011, -3435009, -4651740, -9074288, -9712765, -3425244, 4964715, 9454909, 8522071, 3432735, -3645414, -8719411, -8390046, -4830351, -3685400, -5636782, -5218101, 46060, 4991755, 4619924, 1346552, 9024]
55748I024L7380j930268k850057N2504K452529O95283j528393K01986K981446
55739A21434J491386k707067l561279j92407K458062J957877J000103J207952
55731A776061L86442k235529l349047j043693J314167J76581k473167k376517
55723g824702L82996K200368J989257J990738K822266K135396p21271k538203
55715D36845q92362J870007J962463m74980k321104k574202l024212l905110k645444
55706a1568099J480024M626522L227171m07463r77421K071851L785652J266112
55698C504349k205876k709131j509190j837331k860600j611525Q11430N54380
55690g863494j709932q28287L975870O258357J901864l537644k342918L753145
$$ y = [9024, 46404, -1883864, -4733921, -4681417, -2228888, -1533605, -3061998, -2860012, 121434, 1612820, -1094247, -4655526, -4847933, -2389871, -431994, 568109, 1776061, 2162503, -73026, -3422073, -4465766, -3151599, -2975018, -5448185, -7824702, -7441706, -5241338, -3252081, -1261343, 1560923, 3696319, 2975048, 436845, -455517, 1414490, 3376953, 2901973, 580869, -1993333, -5017545, -8922655, -11568099, -10088075, -5461553, -2234382, -2641845, -3619266, -1547415, 2238237, 3504349, 1298473, -1410658, -2919848, -4757179, -7617779, -9229304, -8417874, -7863494, -9573426, -10401713, -6425843, -167486, 1734378, -1803266, -4146184, -393039]
55682c93039N814053O72313m631640k921113L540591O737186L392008j861024
55674A0349335l257770q47319P03190j134782l562481k849457J05680J232952
55666G39348m51271j556850J7910J774856R26150j186358j719295p35866R1770
55657b099606Q63397K120853K224999p0229k088708m99022L007264L649884N38991
55648G647823k607021l406625l074569k636099j273443Q72549K102236K024010
55640c51139J671283P95187j248430k451224o46841J420664p21903m876472l853268
55631a0262143K834196O393586J505764n174173m545044K332917P191585O116978
55623F393666J973615j901372m309396m138065j210877J621991J596444J04090
$$ y = [-393039, 5421014, 6093327, 1461687, -1459426, 2081165, 8818351, 12210359, 10349335, 7091565, 6244246, 6947436, 5812654, 2250173, -599284, -493604, 739348, 288077, -1268773, -1250863, 523993, 1450143, 263785, -1455510, -2191376, -2099606, -1236209, 884644, 3109643, 3039414, 950706, 451684, 3458948, 7108832, 7647823, 5040802, 1634177, -1440392, -4076491, -5349934, -4477385, -2375149, -351139, 1320144, 2115331, 866901, -1584323, -2231164, -810500, -1532403, -6408875, -10262143, -7427947, -1034361, 471403, -4702770, -9247814, -6914897, 276688, 6393666, 8367281, 6465909, 2156513, -1981552, -3192429, -1570438, 26006, 130096]
55615A30096j98388l51024k524504m436582j985879L330454N355023J942459k384141
55606a122486l208069j082116J369601K966800L226476J717890m33399j299334
55598B135363j179471j942773l103840k217393K78245P94163j545032k953330
55590i734068q96876J965844K349582J300386J408867K028561R75458j015265
55582a617511j265348N26494K182411K474067J791380K53406j858750k560102
55574g3953m08325K109989J198329k036308k268880J748010M085072J05508n616372
55565a156930m868170K333719P137761L821955k843948m848955j533964J194707
55557g63825J03572j687971m84443K479153L288591J064185r55917J1580K190979
$$ y = [130096, -68292, -419316, -2943820, -7380402, -9366281, -6035827, -680804, 1261655, -1122486, -4330555, -5412671, -4043070, -1076270, 2150206, 3868096, 3434697, 2135363, 955892, -986881, -4090721, -6308114, -6029869, -5235706, -6780738, -9734068, -10630944, -8665100, -6315518, -5015132, -3606265, -1577704, -602246, -1617511, -2882859, -2356365, -173954, 2300113, 4091493, 4344899, 2486149, -73953, -482278, 1627711, 2826040, 789732, -1479148, 268862, 4353934, 4459442, -1156930, -6025100, -3691381, 3446380, 7268335, 4424387, -424568, -1958532, -763825, -660253, -2348224, -2832667, -353514, 2935077, 3999262, 3043345, 3054925, 5245904]
55548E245904J128439m045868p957788n017697K451258N895734J661308l662885
55540d301595k308803L789905O207444K078480k977452l759722j487491L51731
55532b407503R78580Q83246m25948k584953l384325j896399L6606J138315K579992
55523e082389M735195N188701K353484j452064k861934j516761L61647O43447
55515B369326j321730l857467l442991R43860M484352K023333l462285m062308
55507f325910Q69279L399314J15369k186204J459383N201632K604551j791529
55499C345885l56831M004994K673843l750666o188829j530744L728630M465802
55491F392084K451600Q0964k975047n409313m203221n68729Q55476j21775Q17858
$$ y = [5245904, 6374343, 2328475, -5629313, -10647010, -8195752, -2300018, -638710, -4301595, -6610398, -2820493, 3386951, 5465431, 2487979, -1271743, -2759234, -2407503, -1428923, -545677, -971625, -3556578, -6940903, -8837302, -8800696, -7662381, -5082389, -347194, 4841507, 7194991, 5742927, 2880993, 1364232, 1725879, 2369326, 1047596, -2809871, -6252862, -5309002, -824650, 1198683, -2263602, -6325910, -5456631, -2057317, -1941948, -4128152, -2668769, 2532863, 5137414, 3345885, 2989054, 6994048, 9667891, 5917225, -271604, -1802348, 1926282, 6392084, 8843684, 8924648, 5949601, 540288, -3662933, -4231662, -3376186, -3497961, -2680103]
55482b680103L707755L226554j644004m706016k261566J424878J776123L19022
55474h37357k49812j045011k870477k892266J68370K625613J834779P27497K139693
55465c98971L429709J339967k072918k984876j516014L12449K522669M932450
55457E564465M846646J324650j908584j940193j143096k047588k328284Q7720
55449B455736J627414j071797m123591k271549J619000Q32876l688480m565571
55441i185962o1498L377370J583238j857639k571877j284972j09206J420974L482304
55432e207268L726354J168680j308076j312424n76936j262305j680835O37607
55424e815203L723401L168567j109290l832093j185408L844597N056990J032579
$$ y = [-2680103, 1027652, 4254206, 2610202, -2095814, -4357380, -2932502, -1156379, -837357, -1087169, -2132180, -5002657, -7894923, -7726553, -5100940, -3266161, -2538664, -398971, 3030738, 4370705, 2297787, -687089, -2203103, -1890654, 632015, 5564465, 10411111, 11735761, 9827177, 7886984, 6743888, 4696300, 2368016, 2455736, 4083150, 3011353, -1112238, -3383787, -1764787, -931911, -4620391, -9185962, -9247460, -5870090, -4286852, -6144491, -8716368, -10001340, -10110546, -8689572, -5207268, -1480914, -312234, -1620310, -2932734, -3509670, -4771975, -6452810, -5815203, -2091802, 1076765, -32525, -3864618, -5050026, -1205429, 3851561, 4884140]
55416D884140k951401j911328K042154K595542j770163n404376l445708J316208
55408d644932K595333n97127l199736j526388K270211L922090K458814L80557
55400A658822j00698N76781N75627n95933j394180o82374J27892r53458k853366
55391c640887k320299J054679L456442J863730j919002l939645k799944m0796
55383h285722K226688K443335K52794k420603k769776o93376J211374J852139
55375f183147K530741K871561N60285k946866k013714M284710Q386469M447008
55367A1937047k663943m732701k069838o68126j283770r5811J989551K64923l877013
55358a199681l465886K295405N705446K474700k254153l070636j774160j577741
$$ y = [4884140, 1932739, 21411, 2063565, 4659107, 2888944, -2515432, -5961140, -4644932, -2049599, -2646726, -5846462, -7372850, -5102639, -1180549, 1278265, 1658822, 1558124, 2134905, 2710532, 2114599, 720419, 38045, 165937, -787521, -3640887, -5961186, -4906507, -1450065, 413665, -1505337, -5444982, -8244926, -8285722, -6059034, -3615699, -3362905, -5783508, -8553284, -9246660, -8035286, -6183147, -3652406, -780845, -220560, -3167426, -5181140, -896430, 7490039, 11937047, 9273104, 4540403, 2470565, 1802439, 518669, 422858, 2412409, 2677332, -1199681, -4665567, -2370162, 3335284, 5809984, 3555831, 485195, -1288965, -2866706]
55350b866706r63583J603549K899315M48558k114996p38647K142235J816360j145184
55341A080901k831149k374302j343930K25457K176547J760364j725666l057763
55333f089541J735508P055340M239866m920696r502246m882334J416939J910155
55325i037009n21475O26091M294114M164458n28919l236477L81633O158519O981027
55316I281962J959008k972038l175387j073855j811985m941460m574835J179479
55308f129111N537867J894773n708559p076568k12846N625846L259170k432565
55300e241993k452620L115621O256493L203366j372460k718037k293630l207873
55292d711133m179631k020964K552599N613398N350923L282500P78750k170979
$$ y = [-2866706, -3830289, -2226740, 672575, 1121133, -993863, -1732510, 409725, 2226085, 1080901, -1750248, -4124550, -5468480, -5243023, -3066476, -1306112, -3031778, -6089541, -4354033, 2701307, 6941173, 2020477, -7481769, -12364103, -10947164, -9037009, -9558484, -8932393, -4638279, -473821, -1002740, -4239217, -3857584, 2300935, 9281962, 11240970, 8268932, 5093545, 4019690, 2207705, -2733755, -7308590, -6129111, -591244, 1303529, -4405030, -11481598, -11694444, -6068598, -2809428, -5241993, -7694613, -4578992, 1677501, 4880867, 3508407, 790370, -1503260, -4711133, -8890764, -10911728, -8359129, -2745731, 2605192, 5887692, 6666442, 4495463]
55284D495463m585450m305624j384896J059062J009574K93458J204186K464258
55276B50031J287240j819430l446436k175469r4528Q77317J237628J518949N28889
55267a835809k118132l860655k017796K364041N584567N422375K473328j490107
55259D521812m299045l641974N11689M187769L362512k67248j150897J715152
55251D939770K731684j483123n736590l525115K386278L130049l052751p612882
55243h222680l810454L873390O529038K764523j376914k051527j398698j913764
55235e607086k283670n07732K402913L984160L423016J422885j296526l722054
55227b184094m102534j590955K101461L956768K586535n91416k978161l262589
$$ y = [4495463, -89987, -4395611, -5780507, -4721445, -3711871, -3418413, -2214227, 250031, 1537271, -282159, -3728595, -5904064, -5998592, -5121275, -3883647, -2364698, -1835809, -3953941, -7814596, -9832392, -7468351, -1883784, 3538591, 6011919, 4521812, 222767, -3419207, -2907518, 1280251, 4642763, 4375515, 3224618, 4939770, 7671454, 6188331, 451741, -3073374, -687096, 2442953, -609798, -8222680, -12033134, -8159744, -1630706, 1133817, -243097, -2294624, -3693322, -5607086, -7890756, -8398488, -5995575, -2011415, 1411601, 2834486, 1537960, -2184094, -6286628, -7877583, -5776122, -1819354, 767181, 175765, -2802396, -6064985]
55219f064985k219207j120608L8826J715012K688060J105888j713579j549029
55211g119622K559434N423551K503358k878592l898768l43141J459521j071717
55203c365976k823885M40799N015122M602176p84778n262278m516894K84934M749004
55194a661776N182898J420253k753017l174702J3564K996033L582607K978334
55186H584194K167299M97731j323960j246734j92830j575465m859201n107983
55178c056949j329793R53252j024311k177126J203955L976985Q76302l394348
55170c972033j503010L737817L774916j435834l907882j095931J468180J159629
55162a774148J557827L181210J110961m784734o627002m63042O408809N772996
$$ y = [-6064985, -8284192, -9404800, -9365974, -7650962, -4962902, -3857014, -5570593, -7119622, -4560188, 863363, 3366721, 488129, -3410639, -3753780, -2294259, -3365976, -6189861, -5749062, -733940, 3868236, 3083458, -2178820, -6695714, -6410780, -1661776, 3521122, 4941375, 2188358, -986344, -972780, 2023253, 5605860, 8584194, 10751493, 11249224, 9925264, 8678530, 8485700, 6910235, 2051034, -3056949, -4386742, -3433490, -4457801, -6634927, -5430972, -1453987, -577685, -3972033, -5475043, -1737226, 2037690, 601856, -3306026, -4401957, -2933777, -1774148, -216321, 2964889, 4075850, -708884, -7335886, -7798928, -1390119, 4382877]
55154D382877j69040l797478l282724k395982k606334j715491J015788L299102
55146e269282L138844Q73123j536529j755753R04069L686276K843915j095129
55138A789534l244924p75224L406392M720364K025488k359394n072677l605201
55130c115642J187065M308077J928632k761422l491510l19978P95299j810017
55122c279496k860248L63422L224008J938467k00988O64193K263160J135543r71078
55113B276983j003909l06105j034520j126425J591321M072198K529419r95152
55105F003810k090045j122105j509188l336511l824178k096548P77001M001621
55097c196143N651394K676950l595386o336882k418065K049775J026462j866242
$$ y = [4382877, 4213837, 416359, -2866365, -5262347, -7868681, -9584172, -8568384, -5269282, -2130438, -1257315, -2793844, -4549597, -3645528, 40748, 2884663, 1789534, -1455390, -2230614, 1175778, 5896142, 7921630, 5562236, 489559, -3115642, -1928577, 2379500, 4308132, 1546710, -1944800, -2264778, -1469479, -3279496, -6139744, -5776322, -2552314, -613847, -814835, -150642, 2112518, 3248061, 2276983, 1273074, 966969, -67551, -1193976, 397345, 4469543, 6998962, 6003810, 3913765, 2791660, 1282472, -2054039, -5878217, -7974765, -7197764, -3196143, 2455251, 5132201, 1536815, -4800067, -7218132, -5168357, -4141895, -6008137]
55089f008137k14748L719886L245272o60390j196360K169902L101200m52998l356406
55080C47221k147521Q51264K876144L399751J513462k753005n168566k245778
55072c327028J798432O04105l518609l197967J154605K478978K88438R67207M183376
55063A431537K027344n372130o818761J850146R296049N867425k093712m011720
55055B176178r52712M00014P71571L866898N812930J037129o000953o478548j295069
55046f62562J346252l17861j123334k09756j606061m293605k594785K915250N059644
55037a486818J934061m44667Q80487J522945j078484l124790k179894j107024
55029e084184j110681P73472L744932J810683m931507o818165R06325Q753747
$$ y = [-6008137, -6222885, -2502999, 742273, 81883, -1114477, 1055425, 4156625, 3703627, 347221, -1800300, -949036, 1927108, 5326859, 6840321, 4087316, -1081250, -3327028, -1528596, -924491, -4443100, -7641067, -6486462, -4007484, -3719046, -2751839, 1431537, 3458881, -1913249, -8732010, -6881864, 2414185, 8281610, 6187898, 2176178, 1223466, 1623480, 2395051, 6261949, 12074879, 13112008, 7111055, 632507, -662562, 683690, 365829, -757505, -967261, -2573322, -6866927, -9461712, -6546462, -1486818, 447243, 2576, 883063, 2406008, 1327524, -1797266, -3977160, -5084184, -6194865, -5421393, -1676461, 134222, -4797285, -11615450, -10709125, -1955378]
55021a955378O603619q26896k339794J742983J924630l184990m808219L19194
55013b524851M250412J195256l531797l066162N28986J375676o63430j804918
55005d240828j378830j092921m67736J504485K709053J043415j121016o49217
54997c693595N28661j162000l742647k262961K490305M582578K218507k62526
54989a303678m16983q09672k357437j596750K318221M464510K083442l62106J078386
54980C097933K764891J23800l630234k657821J273321J597647k173088m319130
54972c922681k626453l59650J245456M260759O904393L680148m452878q089957
54964c360863k304046N115414M362367k515591n431590r45554M224730L901399
$$ y = [-1955378, 4648241, 3821345, 1481551, 3224534, 5149164, 1964174, -2844045, -2524851, 1725561, 2920817, -610980, -3677142, -3148156, -1772480, -2435910, -4240828, -5619658, -6712579, -7180315, -5675830, -2966777, -1923362, -3044378, -3693595, -3164934, -4326934, -8069581, -10332542, -7842237, -3259659, -1041152, -1303678, -1720661, -2530333, -4887770, -6484520, -4166299, 298211, 2381653, 2019547, 3097933, 5862824, 5986624, 2356390, -301431, 971890, 2569537, 396449, -3922681, -6549134, -6908784, -5663328, -1402569, 5501824, 9181972, 4729094, -3360863, -5664909, -549495, 3812872, 1297281, -4134309, -5079863, -855133, 3046266]
$$ [...]
##END NTUPLES=NMR SPECTRUM
##END=
