##TITLE=31Pdec_SR11_rm
 , 124 sc
 8.7.2020
##JCAMPDX= 6.0         $$ Bruker NMR JCAMP-DX V2.0
##DATA TYPE= NMR SPECTRUM
##DATA CLASS= NTUPLES
##ORIGIN= UXNMR, Bruker Analytische Messtechnik GmbH
##OWNER= root
$$ XWIN-NMR		Version 3.5
$$ Wed Jul  8 13:32:03 2020 Russian Standard Time (UT+4h)  she@DPX200
##.OBSERVE FREQUENCY= 81.013821
##.OBSERVE NUCLEUS= ^31P
##.ACQUISITION MODE= SIMULTANEOUS
##.ACQUISITION SCHEME= undefined
##.AVERAGES= 124
##.DIGITISER RES= 17
##SPECTROMETER/DATA SYSTEM= spect
##.PULSE SEQUENCE= zgpg30
##.SOLVENT NAME= DMSO
##.SHIFT REFERENCE= (INTERNAL, DMSO, 0, 182.463)
##AUDIT TRAIL= $$ (NUMBER, WHEN, WHO, WHERE, WHAT)
$$ ##TITLE= Audit trail, XWIN-NMR		Version 3.5
$$ ##JCAMPDX= 5.01
$$ ##ORIGIN= Bruker BioSpin GmbH
$$ ##OWNER= she
$$ F:/spectra/data/she/nmr/P31/1/pdata/1/auditp.txt
$$ ##AUDIT TRAIL=  $$ (NUMBER, WHEN, WHO, WHERE, WHAT)
(   1,<2020-07-08 13:31:11.17 +0400>,<she>,<DPX200>,
      <continue with go, POWCHK disabled, PULCHK disabled
       configuration hash MD5:
       00 E9 B6 7A A2 85 ED C7 34 08 36 98 17 FE 4E 26
       data hash MD5: 32K
       F3 AE BA 94 6F 8D ED D4 44 B2 9E A6 24 79 F9 0B>)
(   2,<2020-07-08 13:31:12.59 +0400>,<she>,<DPX200>,
      <Start of raw data processing
       efp BC_mod = 2 LB = 1 FT_mod = 6 PKNL = 1 PHC0 = -1954.505 PHC1 = -88.19806 SI = 64K 
       data hash MD5: 64K
       4D 64 F1 91 37 7A 4A AF F1 64 6F 9C A6 D4 1E 0A>)
(   3,<2020-07-08 13:31:36.45 +0400>,<she>,<DPX200>,
      <pk PHC0 = -91.13943 PHC1 = 168.6 
       data hash MD5: 64K
       6F D0 51 8D B2 37 3E 5F 93 7F DE 22 7F 60 88 4E>)
(   4,<2020-07-08 13:31:39.71 +0400>,<she>,<DPX200>,
      <abs ABSG = 5 
       data hash MD5: 64K
       A5 DA 1E E6 EA CA 18 F1 E4 EB 50 48 B0 3B 1A EA>)
$$ ##END=
$$ 
$$ hash MD5
$$ F3 52 AA FB A5 0D 42 6B A0 33 66 40 7B F4 EC 05
##$RELAX= 
##$RELAX= 
##$RELAX= 
##$RELAX= 
##$RELAX= 
##$RELAX= 
##$RELAX= 
##$RELAX= 
$$ Bruker specific parameters
$$ --------------------------
##$DU= <F:/spectra>
##$EXPNO= 1
##$NAME= <P31>
##$PROCNO= 1
##$TYPE= <nmr>
##$USER= <she>
##$AMP= (0..31)
100 100 100 100 100 100 100 100 100 100 100 100 100 100 100 100 100 100 
100 100 100 100 100 100 100 100 100 100 100 100 100 100 
##$AQSEQ= 0
##$AQ_mod= 1
##$AUNM= <au_zg>
##$AUTOPOS= <>
##$BF1= 81.014009
##$BF2= 200.13
##$BF3= 200.13
##$BF4= 200.13
##$BF5= 200.13
##$BF6= 200.13
##$BF7= 200.13
##$BF8= 200.13
##$BYTORDA= 1
##$CFDGTYP= 0
##$CFRGTYP= 5
##$CHEMSTR= <none>
##$CNST= (0..31)
1 1 145 1 1 1 1 1 1 1 1 1 1 1 1 1 1 1 1 1 1 1 1 1 1 1 1 1 1 1 1 1 
##$CPDPRG= <waltz16>
##$CPDPRG1= <>
##$CPDPRG2= <waltz16>
##$CPDPRG3= <>
##$CPDPRG4= <mlev>
##$CPDPRG5= <mlev>
##$CPDPRG6= <mlev>
##$CPDPRG7= <mlev>
##$CPDPRG8= <mlev>
##$CPDPRGB= <>
##$CPDPRGT= <>
##$D= (0..31)
0 1 0 0 0 0 0 0 0 0 0 0.03 2e-05 3e-06 0 0 0 0 0 0 0 0 0 0 0 0 0 0 0 0 
0 0 
##$DATE= 1594200490
##$DBL= (0..7)
120 120 120 11 120 120 24 19 
##$DBP= (0..7)
150 150 150 150 150 150 150 150 
##$DBP07= 0
##$DBPNAM0= <>
##$DBPNAM1= <>
##$DBPNAM2= <>
$$ [...]
##$SUBNAM3= <"">
##$SUBNAM4= <"">
##$SUBNAM5= <"">
##$SUBNAM6= <"">
##$SUBNAM7= <"">
##$SUBNAM8= <"">
##$SUBNAM9= <"">
##$SW= 369.568048894756
##$SWIBOX= (0..15)
0 1 3 0 0 0 0 0 0 0 0 0 0 0 0 0 
##$SW_h= 29940.119760479
##$TD= 32768
##$TD0= 1
##$TE= 0
##$TE2= 300
##$TE3= 300
##$TEG= 300
##$TL= (0..7)
0 120 53 12 22 120 120 120 
##$TP= (0..7)
150 150 150 150 150 150 150 150 
##$TP07= 0
##$TPNAME0= <>
##$TPNAME1= <>
##$TPNAME2= <>
##$TPNAME3= <>
##$TPNAME4= <>
##$TPNAME5= <>
##$TPNAME6= <>
##$TPNAME7= <>
##$TPOAL= (0..7)
0.5 0.5 0.5 0.5 0.5 0.5 0.5 0.5 
##$TPOFFS= (0..7)
0 0 0 0 0 0 0 0 
##$TUNHIN= 0
##$TUNHOUT= 0
##$TUNXOUT= 0
##$USERA1= <user>
##$USERA2= <user>
##$USERA3= <user>
##$USERA4= <user>
##$USERA5= <user>
##$V9= 5
##$VALIST= <valist>
##$VCLIST= <CCCCCCCCCCCCCCC>
##$VD= 0
##$VDLIST= <DDDDDDDDDDDDDDD>
##$VPLIST= <PPPPPPPPPPPPPPP>
##$VTLIST= <TTTTTTTTTTTTTTT>
##$WBST= 1024
##$WBSW= 4
##$XGAIN= (0..3)
0 0 0 0 
##$XL= 0
##$YL= 0
##$YMAX_a= 58043
##$YMIN_a= -64909
##$ZGOPTNS= <>
##$ZL1= 120
##$ZL2= 120
##$ZL3= 120
##$ZL4= 120
##$ABSF1= 182.463
##$ABSF2= -187.1042
##$ABSG= 5
##$ABSL= 3
##$ALPHA= 0
##$AQORDER= 0
##$ASSFAC= 0
##$ASSFACI= 0
##$ASSFACX= 0
##$ASSWID= 0
##$AUNMP= <proc_1d>
##$AZFE= 0.1
##$AZFW= 0.5
##$BCFW= 0
##$BC_mod= 2
##$BYTORDP= 0
##$COROFFS= 0
##$CY= -3
##$DATMOD= 1
##$DC= 0
##$DFILT= <>
##$DTYPP= 0
##$F1P= 0
##$F2P= 0
##$FCOR= 1
##$FTSIZE= 65536
##$FT_mod= 6
##$GAMMA= 0
##$GB= 0
##$INTBC= 1
##$INTSCL= 5.30512e-09
##$ISEN= 30
##$LB= 1
##$LEV0= 0
##$LPBIN= 0
##$MAXI= 10000
##$MC2= 0
##$MEAN= 0
##$ME_mod= 0
##$MI= 50
##$NCOEF= 0
##$NC_proc= -9
##$NLEV= 6
##$NOISF1= 182.463
##$NOISF2= 159.3651
##$NSP= 0
##$NTH_PI= 0
##$NZP= 0
##$OFFSET= 182.463
##$PC= 4
##$PHC0= -2045.644
##$PHC1= 80.40195
##$PH_mod= 1
##$PKNL= yes
##$PPARMOD= 0
##$PSCAL= 0
##$PSIGN= 0
##$REVERSE= no
##$SF= 81.0140089999434
##$SI= 65536
##$SIGF1= 159.3651
##$SIGF2= -187.1042
##$SINO= 113.3802
##$SIOLD= 16384
##$SREGLST= <1H.CDCl3>
##$SSB= 0
##$STSI= 65536
##$STSR= 0
##$SW_p= 29940.119760479
##$SYMM= 0
##$S_DEV= 0
##$TDeff= 32768
##$TDoff= 0
##$TI= <>
##$TILT= no
##$TM1= 0
##$TM2= 0
##$TOPLEV= 0
##$USERP1= <user>
##$USERP2= <user>
##$USERP3= <user>
##$USERP4= <user>
##$USERP5= <user>
##$WDW= 1
##$XDIM= 65536
##$YMAX_p= 326882892
##$YMIN_p= -165231375
$$ End of Bruker specific parameters
$$ ---------------------------------
##NTUPLES= NMR SPECTRUM
##VAR_NAME=  FREQUENCY,     SPECTRUM/REAL,   SPECTRUM/IMAG
##SYMBOL=    X,             R,               I
##VAR_TYPE=  INDEPENDENT,   DEPENDENT,       DEPENDENT
##VAR_FORM=  AFFN,          ASDF,            ASDF
##VAR_DIM=   65536,         65536,           65536
##UNITS=     HZ,            ARBITRARY UNITS, ARBITRARY UNITS
##FACTOR=    0.456856943014862, 1,           1
##FIRST=     14782.0589164792, 0,            0
##LAST=      -15158.0608439998, 0,           0
##MIN=       -15158.0608439998, -165231375,  0
##MAX=       14782.0589164792, 326882892,    0
$$ Real data points
##PAGE= N=1
##DATA TABLE= (X++(R..R)), XYDATA
$$ [...]
4018C1471505K724985j0373763q421574m273823j4297743k1110669l360974J9458118
4010h183938J4184818p611646m637885K3611789L0107883m282209l4265474j6309778
4002g386440K3463693K6329214j2896269m0234567k1874052J2211480J9027755
3995a359186L514364J81701J3653200J3844361j1814827l5479622k9506393m170739
3987e1137141J2326510J2394042P568400L055883k970436l280196J0752425K8104652
3979A6814139K7616936R340001m813548m063845r21682n403921r154743m988120
3971B4425217k268743r152431j5645045r843855J575531N496966N205789J3002517
3963A2795946K5003294K1844511l530049l2755672m2253305k8498377p661173
$$ plain form
4018 31471505 34196490 23822727 15401153 11127330 -3170413 -24281082 -27642056 -8183938
4010 -8183938 6000880 -1610766 -6248651 17363138 47471021 43188812 8923338 -7386440
4002 -7386440 16077253 42406467 29510198 -10724369 -32598421 -20386941 -1359186
3995 -1359186 2155178 2336879 15990079 29834440 18019613 -17460009 -46966402 -51137141
3987 -51137141 -38810631 -26416589 -18848189 -15792306 -18762742 -22042938 -11290513 16814139
3979 16814139 44431075 53771076 48957528 44893683 43972001 38568080 29413337 24425217
3971 24425217 22156474 13004043 -2641002 -12484857 -10909326 -5412360 -206571 12795946
3963 12795946 37799240 59643751 56113702 23358030 -18895275 -47393652 -55054825
3956e5054825N337639J0670747J5385011J7204289N781280j7409379l1138264
3949d9223502j7526248J2538977L0653662K5308326J0574624J174456l682646
3942I817649p838898p511785j863437O11091l324443l444743O393259J4380983
3934G219676P439216p942046j5530752j2577296q637235o177203K238254J7590885
3926a6376501K7941552K1948666K616051j4621803j6045311l980405L289543p309370
3918b537578k2971679j8273635P462487K3496505R554215j2961139j0892839J2297166
3910a4826497K3260689Q885470p717750n490893N316428M013264r267340j8655221
3902a4481850j6425710o047650R807101K7273243L2357143J3358336j5993923
$$ plain form
3956 -55054825 -49717186 -39046439 -23661428 -6457139 -675859 -18085238 -49223502
3949 -49223502 -66749750 -54210773 -23557111 1751215 12325839 13500295 9817649
3942 9817649 1978751 -5533034 -7396471 -6785380 -10109823 -13554566 -7161307 7219676
3934 7219676 14658892 6716846 -8813906 -21391202 -30028437 -36205640 -33967386 -16376501
3926 -16376501 11565051 33513717 36129768 21507965 5462654 1482249 4771792 -2537578
3918 -2537578 -25509257 -43782892 -36320405 -12823900 -3269685 -16230824 -27123663 -14826497
3910 -14826497 8434192 17319662 9601912 4111019 9427447 13440711 4173371 -14481850
3902 -14481850 -30907560 -36955210 -27148109 125134 32482277 45840613 29846690
3895B9846690k4422986k483118K1554654J8538373j775599p522859O380203J2751545
3887E2866903j759078j3915819k189270J7038744J5884704l31829n162635K438918
3879F4870638j742883k1462034k9924441j4192237K235536l375647j9859412k4613712
3871d8064192j6432997n337193J0396995L2940863M5400631K9511053m233722
3864D4181438k5920800k1900805m512110Q724214J0355604K539758n300787l528094
3856D638418L847096K410661p523514o821074Q232711J0655926j5349853l9545163
3848c9454792k5116654J3267759K8971356J2030812k847735M109915J2481607
3841C442268M561067n241811m62214Q679584N350924q075096k0062185k6139237
$$ plain form
3895 29846690 5423704 2940586 24495240 43033613 41258014 33735155 40115358 52866903
3887 52866903 51107825 37192006 35002736 52041480 67926184 67594355 62431720 64870638
3879 64870638 63127755 41665721 11741280 -2450957 -215421 -3591068 -23450480 -48064192
3871 -48064192 -64497189 -69834382 -59437387 -26496524 18904107 48415160 44181438
3864 44181438 18260638 -3640167 -8152277 571937 10927541 13467299 8166512 4638418
3856 4638418 8485514 10896175 3372661 -3448413 4784298 15440224 90371 -39454792
3848 -39454792 -64571446 -51303687 -22332331 -10301519 -13149254 -9039339 3442268
3841 3442268 8003335 2761524 2299310 10978894 16329818 8254722 -11807463 -37946700
3833c7946700k3314390q873328N185456l30946j9298869k1359596J582902J9137762
3825h5217709J0413719l187100J782148R340082k203053j2524808R028371M1325014
3817c1243336L4148359r913364l1366241l873929K4295995P058063k6364455j9110118
3809e6369026K1880690L6052854K599291l0251795k0575375Q754187J2480314
3802b5428860j0613277k7391359k3671275j0929549O148602K9368703M0989271
3795b1527744K0293761j2562437j3484240J6467579K6581709j569581k0120256
3788e921209M736937L0655700Q243606l1496313k5450064J5116493K3473547q916298
3780A0442399j9842957J5329044M3449062K5946537k645080n268590m810111k8613535
$$ plain form
3833 -37946700 -61261090 -70134418 -64948962 -65279908 -84578777 -105938373 -104355471 -85217709
3825 -85217709 -74803990 -77991090 -76208942 -66868860 -69071913 -81596721 -72568350 -31243336
3817 -31243336 2905023 -7008341 -38374582 -42248511 -17952516 -10894453 -37258908 -56369026
3809 -56369026 -34488336 1564518 4163809 -26087986 -46663361 -37909174 -25428860
3802 -25428860 -36042137 -63433496 -87104771 -98034320 -91885718 -62517015 -21527744
3795 -21527744 -1233983 -13796420 -27280660 -10813081 15768628 14199047 -5921209
3788 -5921209 -1184272 29471428 37715034 6218721 -19231343 -4114850 19358697 10442399
3780 10442399 -9400558 5928486 49377548 75324085 72679005 67410415 62600304 33986769
3772C3986769m8108642k9762348J17717J114709r074061Q216099L3704838J8037948
3764H233029k8686157m5280463j3335025K1617173K6101840J6025057R148566
3757f175980k709362j7555789j0397909K1149587M0700704K5456826j234024j0806057
3749C8427996q723021j0144603q330470N905307J8082843J0369319r019130j8917494
3741A7650747j4521244o640972l694367o787041j0688740k986898K1318304M0248108
3733C3897897K3189359k3314653n3992238m1306052q169856J0118434J0406494
3726d9170615R252718J0403575Q574788P954095J3638827J6901425Q021437o728314
3718A8847936j5150781j4134045m256897J3793629K7127511J6585895j1453344
$$ plain form
3772 33986769 -14121873 -43884221 -43766504 -42651795 -51725856 -43509757 -9804919 8233029
3764 8233029 -20453128 -65733591 -79068616 -57451443 -31349603 -15324546 -6175980
3757 -6175980 -8885342 -26441131 -36839040 -15689453 25011251 50468077 49234053 38427996
3749 38427996 29704975 19560372 11229902 17135209 35218052 45587371 36568241 17650747
3741 17650747 3129503 -3511469 -7205836 -13992877 -24681617 -27668515 -6350211 33897897
3733 33897897 57087256 33772603 -20219635 -61525687 -69695543 -59577109 -49170615
3726 -49170615 -39917897 -29514322 -20939534 -12985439 653388 17554813 25576250 18847936
3718 18847936 3697155 -10436890 -14693787 -900158 26227353 42813248 31359904
3711C1359904k2502184k00935K8392181L2444716J6967105J083615j5360864l4919865
3703C7263673l8957560j6271711O358574M26140j6003346p813116J5244516J4379159
3695e373671q716738j1367718J6945382L3126652Q975556k3916645k3963067J55581
3687a4134668J0308178k036339r703869N258765K6525669K6819739L163140j8378364
3679B7822251j3825422O666594R780796j3278294k9159201r618864K2763656K5276583
3671B6428099j534119j7897453p663178L452304k586059q804242J75406R674673
3663A245431L098663r959129j4042759j1984302j0026581k443913J0334702J2550271
3655b1227617K427186N191433L1712056M8555521K1367052k9337438n0445853
$$ plain form
3711 31359904 8857720 8656785 37048966 69493682 86460787 87544402 72183538 37263673
3703 37263673 -1693887 -17965598 -11607024 -11180884 -27184230 -34997346 -19752830 -5373671
3695 -5373671 -14090409 -25458127 -8512745 24613907 33589463 9672818 -14290249 -14134668
3687 -14134668 -3826490 -5862829 -15566698 -10307933 16217736 43037475 46200615 27822251
3679 27822251 13996829 20663423 30444219 17165925 -11993276 -21612140 1151516 26428099
3671 26428099 24893980 6996527 -666651 2785653 199594 -8604648 -8429242 1245431
3663 1245431 4344094 -5615035 -19657794 -31642096 -41668677 -44112590 -33777888 -21227617
3655 -21227617 -18800431 -13608998 18103058 66658579 88025631 58688193 8242340
3648H242340k5228079J2089113K6381072J6423274l57748j1247004j1823204n679694
3640H800070l927282j0913649j2978516K591588K2297275K0588647k493630j9693717
3632D270786j4919465k348712p52345o895066n224746P557578J8764571J6382577
3624A6835178K729031q732461r228585m942407n801128o929338L907879J8470416
3616F308585J0613937k0522081l4721564l237432M2265965M6605592N658188l2713145
3608B0258045l7662539k5132179j5165786k142427J6842010K2403957O783484
3601a3815435k856164J5613639L8968176L0395125l858004k2923654r373198J2073106
3593D4223591J3293295o215916k9691681m1917450l3503296o228638K0108216
$$ plain form
3648 8242340 -16985739 -4896626 21484446 37907720 37549972 26302968 14479764 8800070
3640 8800070 4872788 -6040861 -19019377 -16427789 5869486 26458133 23964503 4270786
3632 4270786 -10648679 -12997391 -13749736 -20644802 -25869548 -18311970 452601 16835178
3624 16835178 19564209 10831748 1603163 -3339244 -9140372 -16069710 -12161831 6308585
3616 6308585 16922522 -3599559 -38321123 -41558555 707410 47313002 52971190 20258045
3608 20258045 -17404494 -42536673 -57702459 -59844886 -43002876 -20598919 -13815435
3601 -13815435 -16671599 -1057960 37910216 68305341 64447337 41523683 32150485 44223591
3593 44223591 57516886 51300970 21609289 -20308161 -53811457 -60040095 -39931879
3586c9931879K2737156L443046j2991622j1110120L01863R283703J7394009K6062998
3578A5189154K4568806O725412j3491204j9464617j5599532j6248657j8320854
3571c6641492n371671K2295523M1934156L7370916J6965516l703293k0524411
3564E2325244l1921107k7112479j189316K6030827K5888641l579312l2842713
3557G599785l4918190j2793274J0342736J7069885O925479q207245j2913244m16174
3549b7310242J6946787J7004265m163854k1272662r433036K0048165K9930516
3542B1749939N504198k3761515k1746157P112087K5446351J3940064o023158p191604
3534A5030205N684894R904179K985265J327469N121389m884650k8337137l4130891
$$ plain form
3586 -39931879 -17194723 -13751677 -26743299 -37853419 -37551556 -28267853 -10873844 15189154
3578 15189154 39757960 46483372 32992168 13527551 -2071981 -18320638 -36641492
3571 -36641492 -42013163 -19717640 22216516 59587432 76552948 72849655 52325244
3564 52325244 20404137 -6708342 -7897658 18133169 44021810 40442498 7599785
3557 7599785 -27318405 -40111679 -29768943 -12699058 -5773579 -13980824 -26894068 -27310242
3549 -27310242 -10363455 6640810 2476956 -18795706 -28228742 -8180577 21749939
3542 21749939 27254137 3492622 -18253535 -11141448 14304903 28244967 22221809 15030205
3534 15030205 20715099 30619278 33604543 34932012 40053401 35168751 6831614 -27299277
3526b7299277p556218J8285212P220306k3411207k6480409N603803L4104223L3438480
3518A3904913J7268229J576385j6247082k9747994j7172867J6361173K9702301
3511A5645058O178696j3091213R060300M3538006L7535175n220867l5380955l4151807
3503B4112393k7335061k7976171j6773480J2042971K9967136J6119076j2288381
3496b131517k6209266j6551906R162211L6629845M4451196K0503749j4608823
3489E1245489k6857804j5898794j2665224k5673699k7106885l888787J6938690
3482d3907014J3865850N130252J1432704J7607639K709949j8925344k0639174
3475c2725138o680504P34408N76033O189692J3028342O459221p268368q895808
$$ plain form
3526 -27299277 -34855495 -16570283 -9349977 -32761184 -59241593 -53637790 -19533567 13904913
3518 13904913 31173142 32749527 16502445 -13245549 -30418416 -14057243 15645058
3511 15645058 21823754 8732541 17792841 61330847 98866022 93645155 58264200 24112393
3503 24112393 -3222668 -31198839 -47972319 -35929348 -5962212 10156864 -2131517
3496 -2131517 -28340783 -44892689 -35730478 899367 45350563 65854312 51245489
3489 51245489 24387685 8488891 -4176333 -29850032 -56956917 -60845704 -43907014
3482 -43907014 -30041164 -24910912 -13478208 4129431 6839380 -12085964 -32725138
3475 -32725138 -39405642 -38671234 -38095201 -31905509 -18877167 -12417946 -19686314 -28582122
3467b8582122J360626P336014O713573R742936J3535578N264113j1957773k1862242
3459a8449297k0787484j6771336p988730J1433105K8274650K2362881J662283
3452b63928m291345J0732521K0225487P016615j2747006j8129151j1592601n746183
3444a4795591k344010J355331J570328k775999k643147O531289J3351098O060466
3436F309765p906233j0061766M357034J8950721J4801892p057790k4690593j9402375
3428b4699345R12077J0842843J357615q032723K026934K3244458L2250446J9168673
3420E7070978p907556l4227174m2021210j9384427J7937248L1563368Q120043
3413A1151270j6954177q493191J6280981J8157602o74071o332279N973796R445230
$$ plain form
3467 -28582122 -27221496 -19885482 -13171909 -3428973 10106605 15370718 3412945 -18449297
3459 -18449297 -39236781 -56008117 -63996847 -52563742 -24289092 -1926211 -263928
3452 -263928 -4555273 6177248 26402735 33419350 20672344 2543193 -9049408 -14795591
3444 -14795591 -17139601 -15784270 -14213942 -16989941 -19633088 -13101799 249299 6309765
3436 6309765 -1596468 -11658234 -7301200 11649521 26451413 19393623 -5296970 -24699345
3428 -24699345 -23787268 -12944425 -11586810 -19619533 -17592599 5651859 37902305 57070978
3420 57070978 49163422 14936248 -27084962 -46469389 -28532141 3031227 11151270
3413 11151270 -5802907 -14296098 1984883 20142485 19468414 13136135 19109931 28555161
3405B8555161J29264K548829J6487637J0619580j7475418k6464921J406994K5810449
3397D1617575J0868823j9510226k4057352p186243n62419p796088p617896M170406
3389a0073420J1870595R361017M077248l18939m048473m527303n111207j3787231
3381a2557713j9909893J209008M1786332N3270131J4449161k5867564j5421960
3374C6957502K1197206K0392676k1161386m3943385j9129438J3015971J0387182
3367A7716328j3887192k3203703j0365386N807795J3106373J2953636Q377819
3360A0505670J388739l815077k692765P295787K3097832K9586955Q854242l0872988
3352D3348395n0876739k7486532J2056154K4842994R944897j65922N633622Q442256
$$ plain form
3405 28555161 28684425 31233254 47720891 58340471 40865053 14400132 15807126 41617575
3397 41617575 52486398 32976172 8918820 1732577 1170158 -6625930 -14243826 -10073420
3389 -10073420 1797175 11158192 15235440 14916501 10868028 6340725 1229518 -12557713
3381 -12557713 -32467606 -31258598 10527734 63797865 78247026 52379462 36957502
3374 36957502 58154708 78547384 57385998 13442613 -5686825 7329146 17716328
3367 17716328 3829136 -19374567 -29739953 -23932158 -10825785 2127851 10505670
3360 10505670 11894409 8079332 5386567 12682354 35780186 65367141 74221383 43348395
3352 43348395 -7528344 -35014876 -22958722 1884272 11829169 11663247 17296869 25739125
3344B5739125P40639l056061N4797n021263j8536691k0718132p179190L093705
3336b4883071K774511O343444J6813141J6345267J146801p753609j371956K443986
3328A1858514n433608q783155k33611K641533o477500n830161J3011307K1930623
3320B2683942J157702k4768833k5042861o934772P887533K1155516L7747035L6655904
3312G0541166L062585l3231633l4153825j0363424J287196R26922J6726447M1272011
3304E6067445L1684269j9149592n9561830m6000647K032562L3882208K8613997
3297B7568412M609720j2925569j4751469o406131K347350O911697Q168885M384110
3289A9907005o824429j4164535P67346K9547967L2999112m933538m2397956l2603453
$$ plain form
3344 25739125 26479764 23423703 23478500 18457237 -79454 -20797586 -27976776 -24883071
3336 -24883071 -22108560 -15765116 1048025 17393292 18540093 10786484 9414528 11858514
3328 11858514 6424906 -2358249 -2591860 49673 -6427827 -12257988 753319 22683942
3320 22683942 23841644 -927189 -25970050 -32904822 -25017289 -3861773 33885262 70541166
3312 70541166 73603751 40372118 6218293 -4145131 -2857935 -1931013 14795434 56067445
3304 56067445 87751714 68602122 9040292 -36960355 -34927793 -1045585 27568412
3297 27568412 32178132 19252563 4501094 -1905037 442313 7354010 15522895 19907005
3289 19907005 13082576 -1081959 -314613 29233354 62232466 57298928 14900972 -17702481
3281a7702481P533280K3622828M785248j1562309j0217623j6155701l4133153
3274e3829911k9436221P632158L1155563Q339850k4732091j7559494J8511126
3267e9919020L4036313J7555341P87989J366490N812891N433779Q620169J5032814
3259B8726766J1286794k843965j1375289q510609l514456J309377J1251011J7168650
3251D3498279K466096k2894449k5989534O80731K3164039J3758344j1534094k2665340
3243D84072j8503312j4792040q784496J1587655L2467386K3102533j5889347m2931421
3235c3258970k6871267J3319604L6146673K9468313J5210610J0317858N748322
3228E0081143j1232809l1277829l2945978j2704544Q081604Q907178n355105j2108228
$$ plain form
3281 -17702481 -10169201 13453627 18238875 6676566 -3541057 -19696758 -53829911
3274 -53829911 -83266132 -75633974 -44478411 -36138561 -60870652 -78430146 -59919020
3267 -59919020 -25882707 -8327366 -7539377 -6172887 -359996 5073783 13693952 28726766
3259 28726766 40013560 37169595 25794306 17283697 13769241 15078618 26329629 43498279
3251 43498279 45964375 23069926 -2919608 -2238877 20925162 34683506 23149412 484072
3243 484072 -18019240 -32811280 -41595776 -30008121 2459265 25561798 9672451 -33258970
3235 -33258970 -60130237 -46810633 -10663960 18804353 34014963 44332821 50081143
3228 50081143 38848334 7570505 -25375473 -38080017 -29998413 -21091235 -26446340 -38554568
3220c8554568M47162K0491867K9382835K3641456J4559565J0584242Q356836J039557
3212F9948952j1701489k4003423k8810971k1411422m026622J1796533J4908100
3205F699658Q972428P967824J3828266J1457982n594544j9308055j2861041M74595
3197A1637113l521598k0134005k2800499q164591j732444j1723628j1690530J3017206
3189e5112976L3329393J9278159r590402j1394607J5452968L3623130K4200736
3182D9786401O136860j980299m964314r446520j0023420o786950j0194307j8462022
3174e934571j4948099K264459J3715416J1668949J1642776J7644739P957726k2902674
3166B1108721l9870311j6662000J6036329J0578397k5704023m0916937j4696157
$$ plain form
3220 -38554568 -38107406 -17615539 11767296 35408752 49968317 60552559 68909395 69948952
3212 69948952 58247463 34244040 5433069 -15978353 -20004975 -8208442 6699658
3205 6699658 15672086 23639910 37468176 48926158 43331614 24023559 11162518 11637113
3197 11637113 8115515 -12018490 -34818989 -42983580 -44716024 -56439652 -68130182 -55112976
3189 -55112976 -21783583 -2505424 -12095826 -23490433 -8037465 25585665 49786401
3182 49786401 55923261 53942962 48978648 39532128 29508708 22721758 12527451 -5934571
3174 -5934571 -20882670 -18618211 -4902795 6766154 18408930 36053669 44011395 21108721
3166 21108721 -18761590 -35423590 -19387261 -8808864 -34512887 -75429824 -90125981
3159i0125981J8697489K6757202J7782880J0748819J810816j6499405k7749227
3152e8577407j0843688K4037393M1778895K3307031j3523904l4201261k1221605
3145d9244546J1666174L4685034L2073952J5993925P219997P738683L277275j1029874
3137E2380620k3384644k4372289j7156569o087071P837827J6205043P608266r363223
3129C667960q667684J4810778L0304707J3026210j7715577k6012623j0201470
3122g87699J960917o52700l219148Q28083k82281p115591j615017J8343268K6489228
3113C3949060Q817345r355736j670497J5142471O498386k3495796l5593947j3701584
3105a9410298J3557645J6916652L698177k767036J593132N099665L643027Q05154
$$ plain form
3159 -90125981 -71428492 -44671290 -26888410 -16139591 -14328775 -30828180 -58577407
3152 -58577407 -69421095 -45383702 -3604807 19702224 6178320 -28022941 -49244546
3145 -49244546 -37578372 -2893338 29180614 45174539 52394536 60133219 63410494 52380620
3137 52380620 28995976 4623687 -12532882 -18619953 -10782126 5422917 13031183 3667960
3129 3667960 -4999724 9811054 40115761 53141971 35426394 9413771 -787699
3122 -787699 1173218 520518 -2698630 -1870547 -2152828 -9268419 -10883436 7459832 33949060
3113 33949060 42766405 33410669 31740172 46882643 53381029 29885233 -5708714 -19410298
3105 -19410298 -5852653 11063999 14762176 11995140 13588272 18687937 22330964 23136118
3097B3136118o359336k2069805l5097422k5347602Q472681L9462856L8184630
3090B0382120M180659l2245130l9595478j5400166J4479991K6701786K4449538
3083B953320K4298888K6857302J7155384n823205k0634640j3621473M43092K447351
3075C4076019j902530L741326J5002070J3443901p27703p524216J27759N770058
3067F2006684k315961j2482720r765511P35462K879473p155413j7103735j4178105
3059B620174J219847J4943250J2318441l850819j3143998l811341Q508433L386660
3051B2190647j0813257r082963P248587R038068j2591702k7167267j0776422J4581291
3043a7373018J1848527j7800846l8659517k9054153k689113J5989621J8745250
$$ plain form
3097 23136118 16776782 -5293023 -40390445 -65738047 -57265366 -17802510 20382120
3090 20382120 24562779 -7682351 -47277829 -62677995 -48198004 -21496218 2953320
3083 2953320 27252208 54109510 71264894 65441689 44807049 31185576 31628668 34076019
3075 34076019 32173489 35914815 50916885 64360786 63633083 56108867 56236626 62006684
3067 62006684 59690723 47208003 37442492 38177954 41057427 33902014 16798279 2620174
3059 2620174 3840021 18783271 31101712 27250893 14106895 10295554 18803987 22190647
3051 22190647 11377390 2294427 9543014 18581082 5989380 -21177887 -31954309 -17373018
3043 -17373018 -5524491 -23325337 -61984854 -91039007 -93728120 -77738499 -58993249
3036e8993249J4660451J6555485K7159679L3528391K0388996p018066k4277484
3029B2004203j8144964j707343Q975378J5925379K4062493K3776685P797141r942255
3021G2746717j3510775j0016330j3717957j8307481j0076954K327189o65760j5139545
3013f360896j8681424o161814O118047R620605J0838890J1102959N248478k61864
3005A1462981O375189J8371512J8087648O959429N49143l506779k0841843m3710221
2997f252941m4105462j8811927K843691M039829j20642L418966P037644P685592
2989d4265250J4183838J7617177n335925m3382695m8801368q818849K5117670
2982i3685402J1852100j7567208j3498346J4058223K0871949M461626k40932J4794643
$$ plain form
3036 -58993249 -44332798 -27777313 -617634 32910757 53299753 46281687 22004203
3029 22004203 3859239 2151896 11127274 27052653 51115146 74891831 82688972 72746717
3021 72746717 59235942 49219612 35501655 17194174 7117220 9444409 8778649 -6360896
3013 -6360896 -25042320 -31204134 -25086087 -15465482 -4626592 6476367 11724845 11462981
3005 11462981 17838170 36209682 54297330 61256759 61805902 58299123 37457280 -6252941
2997 -6252941 -50358403 -69170330 -66326639 -62286810 -62407452 -58988486 -51950842 -44265250
2989 -44265250 -30081412 -12464235 -17800160 -61182855 -109984223 -118803072 -93685402
2982 -93685402 -81833302 -99400510 -112898856 -98840633 -77968684 -73507058 -73747990 -58953347
2974e8953347K4738283K3127369K7722405L5578419K0965381j5160144l6982276
2967B1036090k6393460o754212j590224k594352O212057K0000161K5023030J9019901
2959E3958991P520590m370149r612872m158279K846590J57411n260753O92135
2951D1773664J0051028O29407k4725811l4545235j3067597J5697140K0031689
2944A5844285q43541k0578763j6229547J0646609L5021323L2197860Q433486l416875
2936F1074837Q860867J4983203q518335l2683488j9528550J0467770P468171k3339130
2928A8785345k9129655p10127J2642668p270295j5481574R900553K0651250j6297474
2920f909309m9844726k1755481L6465013N2096392K1527717K96456N165245Q13490
$$ plain form
2974 -58953347 -34215064 -11087695 16634710 52213129 73178510 58018366 21036090
2967 21036090 -5357370 -12111582 -13701806 -16296158 -10084101 9916060 34939090 53958991
2959 53958991 61479581 57109432 47496560 43338281 46184871 46342282 41081529 41773664
2951 41773664 51824692 52454099 27728288 -6816947 -19884544 -4187404 15844285
2944 15844285 15000744 -5578019 -21807566 -11160957 23860366 56058226 64491712 61074837
2936 61074837 69935704 84918907 76400572 43717084 24188534 34656304 42124475 18785345
2928 18785345 -10344310 -11054437 1588231 -5682064 -21163638 -11263085 9388165 -6909309
2920 -6909309 -56754035 -78509516 -42044503 10051889 31579606 31876062 37041307 37854797
2912C7854797k1723822k5119890M707059K8282190J2033243k4951258m2536563
2905c1454244k6064410J1417024M5375548M9571553J6062259k7676304m4453274
2898g221848l1337332j4622245o420091K526143J1067149O152183n143205K90537
2890d4708709K0119468K5922324J0609832j597320j354059r199993k9621912l2162119
2882f1992488k133729K6909493K1240490k088936m627164J5313404K6690455J4026625
2874C3338150q048042k1495518k2661649j7011191j2275980j3181262j3791284
2867g5126776k858420J7393914L0132040K6510406J4061824o96980j7065882k3206636
2859c0856510j767408L6510146N2480786K7657298j1280083l1926756l2974141
$$ plain form
2912 37854797 16130975 -8988915 -4281856 24000334 36033577 11082319 -31454244
2905 -31454244 -57518654 -46101630 -726082 48845471 64907730 37231426 -7221848
2898 -7221848 -38559180 -53181425 -59601516 -57075373 -46008224 -39856041 -44999246 -44708709
2890 -44708709 -24589241 1333083 11942915 10345595 8991536 -208457 -29830369 -61992488
2882 -61992488 -64126217 -37216724 -15976234 -18065170 -22692334 -7378930 19311525 33338150
2874 33338150 25290108 3794590 -18867059 -35878250 -48154230 -61335492 -75126776
2867 -75126776 -77985196 -60591282 -30459242 -3948836 10112988 9416008 -7649874 -30856510
2859 -30856510 -32623918 3886228 56367014 84024312 72744229 40817473 7843332
2852G843332k5460902q881392J1079009J2178243q696634j8435060K875758K5262159
2844b235487J7868805L920427J9844857M4765636K8423742k2362364m6273296
2837D3952320j9778315J0204080J169462k6526230l0133441o068543J6226212
2830a0954455J7573663L251664j0292641q023764J0929358K5573848J3830979
2823D1888652j5610958l1905675k4779976j4762672j6460230j8175899o977531
2816h6784289J0323442K1478779K3034936J3285847o924618k1860911j4861295
2809f2308109J738255Q99630j1094681O57160L6925442N1181120K0697768j4107077
2801B4589508j3352577J648056o714489k4749899j7770829P47663p560874k9117240
$$ plain form
2852 7843332 -17617570 -26498962 -15419953 -3241710 -11938344 -30373404 -27497646 -2235487
2844 -2235487 15633318 19553745 39398602 84164238 112587980 90225616 43952320
2837 43952320 24174005 34378085 35547547 9021317 -21112124 -27180667 -10954455
2830 -10954455 6619208 9870872 -421769 -8445533 2483825 28057673 41888652
2823 41888652 26277694 -5627981 -30407957 -45170629 -61630859 -79806758 -86784289
2816 -86784289 -76460847 -54982068 -31947132 -18661285 -25585903 -47446814 -62308109
2809 -62308109 -60569854 -59670224 -70764905 -70107745 -33182303 17998817 38696585 24589508
2801 24589508 11236931 12884987 6170498 -18579401 -36350230 -35602567 -43163441 -72280681
2793g2280681j2583375L9521462O1663441K5678101j2670660j505598K5944322
2786E3767012P236196m8076505p1992233l9869201q51207J997739p258839J6124231
2778h8922807O1586285P2726312K6091596l4034848n0928705k2763291N280625
2771c0964833M385434q381642o215354O863243Q303851m513563j0443986K444521
2763c8522329J8670420J6191034n314307k3935780j9060934P620700L2147575
2756a2203621K9800154J04318l1176861l8395803k0705916L740198K0839936K7522648
2748b0474947K1355060l83544k7907820l9099661k2300628O883773K0248033P580568
2740e4099166j2996451j6609350m257J6196017J4346953K089139l52040R349460
$$ plain form
2793 -72280681 -84864056 -45342594 16320847 41998948 29328288 27822690 53767012
2786 53767012 61003208 12926703 -59065530 -98934731 -99785938 -97788199 -105047038 -88922807
2778 -88922807 -27336522 45389790 71481386 37446538 -13482167 -36245458 -30964833
2771 -30964833 -26579399 -34961041 -41176395 -34313152 -26009301 -30522864 -40966850 -38522329
2763 -38522329 -19851909 -3660875 -8975182 -32910962 -51971896 -44351196 -12203621
2756 -12203621 17596533 17700851 -13476010 -51871813 -72577729 -68837531 -47997595 -20474947
2748 -20474947 880113 496569 -27411251 -66510912 -88811540 -81927767 -61679734 -54099166
2740 -54099166 -67095617 -83704967 -83709224 -67513207 -53166254 -51077115 -51429155 -42079695
2732d2079695J3299031M641127K610453K2677033M5926437L9459607K243766l1015148
2724E7762611l3685978j5823655k775997j927851k316518L094760Q453870O335464
2716A9116706j312019n942968k815857M055806Q120504Q776159Q422660L024999
2708D1445990j2707137k7784470j9470627J2311975L1945418J1796353k2771536
2701A4765966k2342411J5433262L8863784J5718358k0936027k2526910P195332
2694B6171354K5695838J5760200o06984p176585j4512149k7864064k7556330j532479
2686a1621199K5866435K3762096O20348p864946O825713J3663755p558716l0785206
2678A2908280j9995999J5868495L2479821J0641997k0977156k9990736k1384975
$$ plain form
2732 -42079695 -28780664 -24139537 -21529084 1147949 47074386 86533993 88777759 57762611
2724 57762611 24076633 8252978 5476981 3549130 1232612 4327372 12781242 19116706
2716 19116706 17804687 11861719 9045862 13101668 21222172 29998331 38420991 41445990
2708 41445990 28738853 954383 -18516244 -6204269 25741149 37537502 14765966
2701 14765966 -7576445 7856817 46720601 62438959 41502932 18976022 26171354
2694 26171354 51867192 67627392 67020408 59843823 45331674 17467610 -10088720 -11621199
2686 -11621199 14245236 38007332 38627680 30762734 37588447 51252202 43693486 12908280
2678 12908280 -7087719 8780776 41260597 51902594 30925438 934702 -20450273
2671b0450273j8370068k1777763j2758480J1907753L1413530K9796208J4694921
2664A4455828J544708o551790j4260561j8685667j0097942J2300921L2438861
2657A1144358L0781710O874926j6578591j8657180n141499K800225J188294M798546
2649A7210789J3893870O358167k2646874m0176320k0337647J1884114J4509010
2642a9304891q869769j8177548j64520J8464851K0293397J7434983J6781764O857748
2634C3316015r118149q003406R473685J0707489j2237125k0434613Q706466L7185467
2626D9595829K3657355j0786275j9822084o220042p137927k4686712k6891104
2619b2290960r448028j439144q826733m906162J4974362J9388949k793872j7537108
$$ plain form
2671 -20450273 -38820341 -60598104 -73356584 -61448831 -30035301 -239093 14455828
2664 14455828 16000536 9448746 -4811815 -23497482 -33595424 -21294503 11144358
2657 11144358 41926068 48800994 32222403 13565223 8423724 11223949 12412243 17210789
2649 17210789 31104659 37462826 14815952 -25360368 -45698015 -33813901 -19304891
2642 -19304891 -28174660 -46352208 -46516728 -28051877 -7758480 9676503 26458267 33316015
2634 33316015 24197866 16194460 25668145 36375634 24138509 3703896 12410362 49595829
2626 49595829 73253184 62466909 42644825 36424783 29286856 4600144 -22290960
2619 -22290960 -31738988 -33178132 -42004865 -46911027 -31936665 -12547716 -15341588 -32878696
2611c2878696p959K3974844J7896795j2457884l2404577k4197782K461336K8429035
2603b9184888L5694278J6469964j3197026k5106192j5050201p182141j3203555
2596e0759761j5069060l262990q1987j9679123l4441284j4546943K1656298L3937556
2588h2247294K0415782J2081509J7589158J5689868J133098l417315J0816175
2581g939019K0782945Q806048j0925436j7538351j1344233k302325P874093J6565108
2573C978830J2050770p967631k3609431j5584923Q740191K5685278K2983428N665665
2565C1942177j5730321k9771549k5683842m673745J5350188J8104989P174909
2558c287194l711096j0817830j7840309j9962525p102931J7729603L7188816L7982134
$$ plain form
2611 -32878696 -32886655 -8911811 8984984 -3472900 -35877477 -60075259 -57613923 -29184888
2603 -29184888 6509390 22979354 9782328 -15323864 -30374065 -37556206 -50759761
2596 -50759761 -65828821 -69091811 -69173798 -88852921 -123294205 -137841148 -116184850 -82247294
2588 -82247294 -61831512 -49750003 -32160845 -16470977 -15337879 -18755194 -7939019
2581 -7939019 12843926 21649974 10724538 -6813813 -18158046 -20460371 -12586278 3978830
2573 3978830 16029600 8061969 -15547462 -31132385 -22392194 3293084 26276512 31942177
2565 31942177 16211856 -13559693 -39243535 -43917280 -28567092 -10462103 -3287194
2558 -3287194 -6998290 -17816120 -35656429 -55618954 -62721885 -44992282 -7803466 30178668
2550C0178668K0546685p677902l6053444m8996955l6179270q517631R577986R620702
2542f7501161P935358J7855263K6909918J5413305j1230912k6145386j5759616
2535e2523231M436868J3016874R077789P036786J2541027J5355425O708066o112089
2527I537515r562402m067418l908567j3951935j7896756j885003J7583962J0860702
2519a3289902j5713439j3216841M6213163J15697803J16196412L3247825n9914470
2512B09220551q7835009n4527783j9162642j3094749j4965515j356057J5205488
2505C3484284J1604555p712305j8259938r699077N270317J1631817P211294k114716
2497C1416231j0696204j4387838j1375554m434841K299949R504301K0158398K9752060
$$ plain form
2550 30178668 50725353 43047451 6994007 -42002948 -78182218 -86699849 -77121863 -67501161
2542 -67501161 -59565803 -41710540 -14800622 612683 -10618229 -36763615 -52523231
2535 -52523231 -48086363 -35069489 -25991700 -18954914 -6413887 8941538 15649604 9537515
2527 9537515 -24887 -4092305 -8000872 -21952807 -39849563 -41734566 -24150604 -13289902
2519 -13289902 -29003341 -42220182 3992981 119690784 235887196 269135021 209220551
2512 209220551 121385542 66857759 47695117 34600368 19634853 18278796 33484284
2505 33484284 45088839 37376534 19116596 9417519 14687836 26319653 33530947 31416231
2497 31416231 20720027 6332189 -5043365 -9478206 -7178257 2326044 22484442 52236502
2489E2236502K6052410M260720k1402585k9126752j3977876N202481P656840n100396
2481B5801344j4057986r309513j186930j474440m512774K807042J8406210K5330558
2473D1803511J4328713n281758j9581070k4673072k3355225j7001991p936483
2466d1697375k814704m841803o010258M660862K5415947M0224276L4407862R683515
2458E9028322j6054381k3316426q367425J1993712J6157018L67916j8052637k2066752
2450c10653j3122055k925376N723386J8703565L2868162L1693789N644854k9662150
2442D8613522m4869297k7436573M300978K0837671J3059828r24809j863573M853002
2434A6570749j062703k1541105l2020149j5140453J0315529J1700713j1247190
$$ plain form
2489 52236502 78288912 82549632 61147047 32020295 18042419 23244900 30901740 25801344
2481 25801344 11743358 2433845 1246915 -227525 -4740299 -1933257 16472953 41803511
2473 41803511 56132224 50850466 31269396 6596324 -16758901 -33760892 -41697375
2466 -41697375 -44512079 -49353882 -55364140 -50703278 -25287331 14936945 49344807 59028322
2458 59028322 42973941 19657515 11290090 23283802 39440820 39808736 21756099 -310653
2450 -310653 -13432708 -16358084 -10634698 8068867 40937029 72630818 78275672 48613522
2442 48613522 3744225 -23692348 -19391370 1446301 14506129 13581320 11717747 16570749
2434 16570749 15508046 -6033059 -38053208 -53193661 -42878132 -31177419 -42424609
2427d2424609k4022916n690943K1844335K6778142J2100431N269352J3298144
2420G151936J6012810M518708k787533N966999J2063193l760659k6496095k8037928
2412a5368569j0921375j768676o922437o723492M206156M895551j2261823k1123852
2404f5988517j298450K7093501L2668532J7191566L759575l484670j6367727k8597763
2396c5023953j8947975J0489419K9377338J9424730m017390j7760829j7309273
2389c3767933j0122806j530586L908088K611060L30800N999326J3823700Q836286
2381i912065o342720j1115299N25138R755365N539685M199569K0212523L7391161
2373E0253357K9977108r7530k6287377k9961631j4790232M235349J3298665P517975
$$ plain form
2427 -42424609 -66447525 -72138468 -50294133 -23515991 -11415560 -6146208 7151936
2420 7151936 23164746 27683454 24895921 30862920 42926113 39165454 12669359 -15368569
2412 -15368569 -26289944 -28058620 -34981057 -41704549 -37498393 -32602842 -44864665 -65988517
2404 -65988517 -67286967 -40193466 -7524934 9666632 13426207 9941537 -6426190 -35023953
2396 -35023953 -53971928 -43482509 -14105171 5319559 1302169 -16458660 -33767933
2389 -33767933 -43890739 -45421325 -41513237 -38902177 -38571377 -32572051 -18748351 -9912065
2381 -9912065 -16254785 -27370084 -26844946 -17089581 -11549896 -7350327 12862196 50253357
2373 50253357 80230465 80132935 53845558 23883927 9093695 13329044 26627709 34145684
2365C4145684m011114p316252k821251m522589j5805107k2268925j5328138m482197
2357d2409889K182667Q742211J3092681L059318j5581744j5835035O461604J6366011
2349b3922176n540813k4056076j790749L7014534M0908896R868484j1162775o148552
2341A5170773j745607r141682o193221J3732972K3858735R400737j0639034k0403868
2333A4039805k5975776k5466366m104888K5272514K3796629r054989k0823283
2326b2316354J3387657M3491626J9839256k6156224l0636094L773972J8561923
2319A9945762n763268k6717517j3304440J1833713J6872117M602671o015732r815910
2311h362604q870569k15611J3453220J8546684Q593082o665003j7693552k5334337
$$ plain form
2365 34145684 30134570 22818318 19997067 15474478 -330629 -22599554 -37927692 -42409889
2357 -42409889 -40227222 -31485011 -18392330 -15333012 -30914756 -46749791 -40288187 -23922176
2349 -23922176 -29462989 -53519065 -55309814 -18295280 22613616 32482100 21319325 15170773
2341 15170773 13425166 4283484 -1909737 11823235 35681970 45082707 34443673 14039805
2333 14039805 -11935971 -37402337 -41507225 -16234711 7561918 -1493071 -22316354
2326 -22316354 -8928697 34562929 54402185 28245961 -2390133 1383839 19945762
2319 19945762 14182494 -12535023 -25839463 -14005750 2866367 7469038 1453306 -8362604
2311 -8362604 -17233173 -17448784 -3995564 14551120 23144202 16479199 -1214353 -26548690
2303b6548690k8531389j9572902p49175J0036241J792957j2759247j3529307J801986
2295h8059526J7841958K1394839J4486134R392317J2944695J6135584N180827
2288I316828j3985098j5274613J0987340L4977070K3635046q802833j6985488
2281B3868252Q717646K6132129M229181l0534503l4855965j0886554L796726n283142
2273a4816230j5800282j1383334m648409q504446j2043851j920038J1787170J1811574
2265d5517846L644726O501133J9557098K1008221L125346j4345888j4408472n934453
2257b6370135k670075J865781J7091311K7068169Q076963k9433475m5596288k2547679
2249g2515428J4036486L2334745K9089020J6548754K3375j4321160j1116384J2352445
$$ plain form
2303 -26548690 -55080079 -74652981 -75402156 -65365915 -63572958 -76332205 -89861512 -88059526
2295 -88059526 -70217568 -48822729 -34336595 -24944278 -11999583 4136001 9316828
2288 9316828 -4668270 -19942883 -8955543 26021527 49656573 40853740 23868252
2281 23868252 32585898 58718027 62947208 32412705 -2443260 -13329814 -9533088 -14816230
2273 -14816230 -30616512 -41999846 -46648255 -55152701 -67196552 -69116590 -57329420 -45517846
2265 -45517846 -41873120 -35371987 -15814889 5193332 8318678 -6027210 -20435682 -26370135
2257 -26370135 -29040210 -27174429 -10083118 16985051 25062014 -4371461 -49967749 -72515428
2249 -72515428 -58478942 -26144197 2944823 19493577 19516952 5195792 -5920592 6431853
2241F431853L1204673K2190793l437524j6872125j0729434p2098M943201M442693
2233C8102032m085583j9504107k5203751r723205O877370l487160k9900161l1451019
2225g8375584L233636L8058078M0711514K1270352M770470o478855k1416376l2372690
2217c0599455k4421095j922804J5978800K0889486J8985932J3534686K76696j8717673
2209e995427k9142391j8468270P331520K5553365J9548981R1135m904040J2349180
2201F364053K5559591J1506127j3183616j6456684j534055r571j6535929j9583162
2193b3873246L184776J9818625M884851j9576361k1917783j0041522q678060j1564408
2185f7763128L138105K4365903J9120549j1005884k5917858o153815K0334131
$$ plain form
2241 6431853 37636526 59827319 56389795 39517670 28788236 28716138 33659339 38102032
2233 38102032 34016449 14512342 -10691409 -20414614 -13537244 -17024404 -46924565 -78375584
2225 -78375584 -75141948 -37083870 3627644 24897996 29668466 23189611 1773235 -30599455
2217 -30599455 -55020550 -56943354 -40964554 -20075068 -1089136 12445550 12722246 -5995427
2209 -5995427 -35137818 -53606088 -46274568 -20721203 -1172222 -1081087 -5985127 6364053
2201 6364053 31923644 43429771 30246155 13789471 12255416 12245845 -4290084 -23873246
2193 -23873246 -20688470 -869845 4015006 -15561355 -37479138 -47520660 -56198720 -67763128
2185 -67763128 -64625023 -40259120 -21138571 -32144455 -58062313 -64216128 -43881997
2178d3881997K2987440Q770807p21903o812058k3688073m4746685m4265412j2034301
2170a44392182K9975036M9662652L6525358R243184n055351K291768J5150792
2163f598743J2987695n357936k1494175j8461611K829782K6570093L6698685K9408732
2155E6582522J4823327N615017K606690m676765k1207962l6398330l6048819j9971726
2147c8676046k104079M773593J216094k36028J1001461K7685724K8179620N168990
2139C7009329j6642128r948387J3030806J4850476r017579k0240390J484801K3529410
2131C4056338J1388343j7376332k4701531j1931474p164909j1166871k090965
2124b8987401J5091552J1825097j1483725k1689297p192124O873539N916471N427053
$$ plain form
2178 -43881997 -20894557 -12123750 -12845653 -19657711 -43345784 -88092469 -132357881 -144392182
2170 -144392182 -114417146 -64754494 -28229136 -18985952 -24041303 -21749535 -6598743
2163 -6598743 6388952 1031016 -20463159 -38924770 -36094988 -9524895 27173790 56582522
2155 56582522 71405849 77020866 79627556 74950791 53742829 17344499 -18704320 -38676046
2147 -38676046 -40780125 -36006532 -34790438 -35026466 -24025005 3660719 31840339 37009329
2139 37009329 20367201 10418814 23449620 38300096 29282517 9042127 10526928 34056338
2131 34056338 45444681 28068349 3366818 -8564656 -15729565 -26896436 -28987401
2124 -28987401 -13895849 -2070752 -13554477 -35243774 -42435898 -35562359 -29645888 -24218835
2116b4218835J1628956O938640p877456k024858K9631270M2437570P581111l5719124
2108B8377274l4603604N87818J8940879O601604o428864m783534m013080r734498
2100e056005n415137J1375861J7463377N11918k1684137k9134164k2760310j0716584
2092f5415181M853188J6918425J1150597j2084084k9645606k2580109N41346J7613889
2084g8647535K0280784J7401355J8121510K0391352J5559568K134056o916286
2077H324804J627348J7433313J2820649j5704332l0984521l326468M0273855M7166886
2069G7631534J1526973k1163204k1973272j0326565q383910n113951J2140004
2062C4337609K5485228J6040213m00606l617O184928q779126l7575909m3979209
$$ plain form
2116 -24218835 -12589879 -5651239 -13528695 -15553553 14077717 56515287 64096398 28377274
2108 28377274 -6226330 -5638512 13302367 19903971 13475107 8691573 4678493 -5056005
2100 -5056005 -10471142 904719 18368096 18880014 -2804123 -31938287 -54698597 -65415181
2092 -65415181 -60561993 -43643568 -32492971 -44577055 -74222661 -96802770 -96261424 -78647535
2084 -78647535 -58366751 -40965396 -22843886 -2452534 13107034 15241090 8324804
2077 8324804 9952152 27385465 40206114 24501782 -6482739 -9809207 30464648 77631534
2069 77631534 89158507 67995303 46022031 35695466 27311556 22197605 34337609
2062 34337609 59822837 75863050 75462444 75458827 81643755 72864629 35288720 -8690489
2054h690489j6686169J4231787J9502887L827364j0162321j0781173j927040O237801
2046d447353M303354q191262j8672595j5334540l945174J527303K354934J1668506
2038c0736827K7234843K8607156R112780q314224j017151K0766153K7307712Q935652
2030H1896094j3242025j5692788M13240J3903865Q439760j1898255k9351930l1194178
2022C273783k0948541j2205262j2919952j6636244r498950J2695661L4178463
2015b2061042L1223681L80868l0352249l0082680k828687J8440869J6544029Q125452
2007a0609759Q938215N855350j5660357l5991911k3881593J3936468L7020739
2000b0392848K5228901J75404j1099071p081046R46175P566364Q532741j007944
$$ plain form
2054 -8690489 -25376658 -11144871 8358016 12185380 2023059 -8758114 -10685154 -4447353
2046 -4447353 -143999 -8335261 -27007856 -42342396 -46287570 -44760267 -42405333 -30736827
2038 -30736827 -3501984 25105172 34217952 25903728 24886577 45652730 72960442 81896094
2030 81896094 68654069 52961281 53374521 67278386 75718146 63819891 34467961 3273783
2022 3273783 -17674758 -29880020 -42799972 -59436216 -68935166 -56239505 -22061042
2015 -22061042 9162639 9543507 -20808742 -50891422 -53720109 -35279240 -18735211 -10609759
2007 -10609759 -1671544 4183806 -11476551 -47468462 -71350055 -57413587 -20392848
2000 -20392848 4836053 5011457 -6087614 -13168660 -12222485 -4656121 3876620 2868676
1992B868676j2774524r827684N590104J0653584r09669n926608P930052J6399925
1984A4003856j930814k4407771j5745780J4473200K2831042l636517k9401675
1977b3814459k1708277R254626L1567927L0677862J4975211k020699j2184344
1970B6747847j3299672q036843n84261O559666J0298086O892662k4842M18794
1962B8971437R461271J2279164M34409j1549636q683169j612770p907927j8743803
1954B648976j2559314N172814Q371514m721344p485833R311246K2040598J4803227
1946C7581884K473733j292101o827673j9848548k0805668J689080K2926486J7042280
1938C2939473j016395m88880J4082569J1835500j1930174k6910729j3272889J1977416
$$ plain form
1992 2868676 -9905848 -19733532 -14143428 -3489844 -4399513 -10326121 -2396069 14003856
1984 14003856 12073042 -12334729 -28080509 -13607309 9223733 5587216 -23814459
1977 -23814459 -45522736 -36268110 -4700183 25977679 40952890 38932191 26747847
1970 26747847 13448175 5411332 4827071 11386737 21684823 28577485 28552643 28971437
1962 28971437 38432708 50711872 51146281 39596645 30913476 29300706 21392779 2648976
1954 2648976 -9910338 -4737524 3633990 -1087354 -8573187 738059 22778657 37581884
1946 37581884 40055617 38763516 31935843 12087295 -8718373 -7029293 15897193 32939473
1938 32939473 31923078 31434198 45516767 57352267 45422093 18511364 5238475 17215891
1930A7215891K0466309M865842j9187851k9838648j6519552P903345J5692909
1923E98245l256151k4571759k0200178K459799J1932398l223566k3979622l1041762
1915i1282596k2235500j080637K6939484M4237134L2976013M677983n494921J4810159
1907C547119L5310673K4234727q026684k4540856j0604735J1334008J2424654
1900D3678906j0923198l7401137m4248134k7223846m39400J9853679K7633138
1893b9069992K3905814J0446469o045003j1635233N77913J7244970J7550781k378722
1885B0596997k7254894m0772970l5881157j3788605J3336991K5228743J5532427
1878d3002468M739683J2772715K6748087K0796013J670289J815446K5054935L5387814
$$ plain form
1930 17215891 37682200 42548042 23360191 -6478457 -22998009 -15094664 598245
1923 598245 -2657906 -27229665 -47429843 -44970044 -33037646 -36261212 -60240834 -91282596
1915 -91282596 -113518096 -114598733 -87659249 -43422115 -10446102 -5768119 -11263040 3547119
1907 3547119 38857792 63092519 55065835 30524979 19920244 31254252 43678906
1900 43678906 32755708 -4645429 -48893563 -76117409 -76556809 -56703130 -29069992
1893 -29069992 -5164178 5282291 -762712 -12397945 -11820032 5424938 22975719 20596997
1885 20596997 -6657897 -47430867 -83312024 -97100629 -83763638 -58534895 -43002468
1878 -43002468 -38262785 -25490070 1258017 22054030 23724319 25539765 50594700 85982514
1870H5982514J2300187j6709397j9664668p273585r089156k3728517k4640989
1863b823611n115539J2523849J1493187Q25239k299852N549691J4162405J2781895
1855D7097264J186692q794885n811867N634057J0225319L446637m115910o413321
1847D2453986r416135j3954541j0671503p08675K3828j0956734j3973941k392760
1839a9596475N99932j6112602k1370813J1477258N0743917M4799233K133320j7912362
1831C4761408M852369K3528516K050460k7881874j9705808J4222199K3595808
1824E5423078l303931k6687918j7385177M651582N526338j4519427k7343462j8663829
1816d2302746l037063K073319n43992J096043O609684P727918Q174561J9407455
$$ plain form
1870 85982514 98282701 81573304 61908636 54635051 45545895 21817378 -2823611
1863 -2823611 -7939150 4584699 16077886 16903125 14603273 20152964 34315369 47097264
1855 47097264 48283956 39489071 33677204 39311261 49536580 52983217 48867307 42453986
1847 42453986 33037851 19083310 8411807 7703132 7726960 -3229774 -17203715 -19596475
1839 -19596475 -18996543 -35109145 -56479958 -45002700 5741217 50540450 52673770 34761408
1831 34761408 39613777 63142293 65192753 37310879 17605071 31827270 55423078
1824 55423078 52119147 25431229 8046052 12697634 18223972 3704545 -23638917 -42302746
1816 -42302746 -45339809 -43266490 -43810482 -42714439 -36104755 -28376837 -20202276 -794821
1808g94821L4729656K9283764l213946l2766518k9786014n420612O216117l111217
1800d863591r281576L787507K1300489K1079151K702319j4697147j3759582O257135
1792A2524705K8940006L4798275K2052157R196510R272533J0197677o292943l4263654
1784H6425266m8985570l7972598j0988211J5525089K8301254J9207739m111400
1777D7401569j7317982q963314q32604j4886605l2828173k1932432Q110164J6016497
1769b5232880l956244j1690989J1891683L3303200K2384490j188628n639968K265153
1761B2135817k670397j8011267k1341530q201591O454597J3122973J1107337n70058
1753B025881j5287170j5575184K925939J8813396J4315123O77331l931505k340376
$$ plain form
1808 -794821 33934835 63218599 60004653 27238135 -2547879 -7968491 -1752374 -4863591
1800 -4863591 -14145167 -10357660 10942829 32021980 34724299 20027152 6267570 12524705
1792 12524705 41464711 76262986 98315143 107511653 116784186 126981863 120688920 86425266
1784 86425266 37439696 -532902 -11521113 4003976 32305230 51512969 47401569
1777 47401569 30083587 21120273 20287669 5401064 -27427109 -49359541 -41249377 -25232880
1769 -25232880 -29189124 -40880113 -28988430 4314770 26699260 25510632 19870664 22135817
1761 22135817 19465420 1454153 -19887377 -28088968 -21634371 -8511398 2595939 2025881
1753 2025881 -13261289 -28836473 -25910534 -7097138 7217985 7895316 3963811 1623435
1745A623435l746033k192145O753142Q559765n479738j6770339r668593q56372
1737b1776878q218442j4471382J503259J9709226Q708560j7670693k0645983p54535
1729e3616868Q054541L01289J895725J3509759O683063j7429507k0240700R429568
1721e1413130L3598567K7035970J3657521J8062402K4198709R765224j4915781
1714E9989482k9725674l4761517l3463701j7464971P808646J4501260m987620
1707c8104095j7458064K111715L0459215L2816255J2506540l742075m575340O747717
1699B0761868K5299544L5328605K0733792M749561L3978694R3281567R2749261
1692C26882892q793022j19130439j22507461l6909801K0097133O68440k8805332
$$ plain form
1745 1623435 -2122598 -4314743 2438399 10998164 5518426 -11251913 -20920506 -21776878
1737 -21776878 -29995320 -44466702 -42963443 -23254217 -14545657 -32216350 -52862333 -53616868
1729 -53616868 -45562327 -45261038 -43365313 -29855554 -23172491 -40601998 -60842698 -51413130
1721 -51413130 -17814563 9221407 22878928 40941330 65140039 74905263 59989482
1714 59989482 30263808 -4497709 -37961410 -55426381 -47617735 -33116475 -38104095
1707 -38104095 -55562159 -53450444 -22991229 9825026 22331566 18589491 14014151 20761868
1699 20761868 46061412 81390017 102123809 106873370 140852064 234133631 326882892
1692 326882892 318089870 198959431 76451970 39542169 59639302 60307742 31502410
1685C1502410j2221555J8050605J2949342j7205842l5904431l6193456k7610110
1678f6633037q379604J8709947L5232170L3989291K6687517J3198187j8048708
1671C4755763m8612293l7396675J2623652M5255591L1389650O246717k1919r566823
1663C4673663l5837248l7168927J1523145N3548547K7235080l1363441l9869097
1656a7258278K571918K1866730p227649k9470346r937773J3595343M997928j0850690
1648c1712817K06095K2299911K2364249M983412l763159m60204J319488O13865
1640A5850840L715521M763470l664389j3309929j3475801r454619j0324712j1261425
1632c7161044m221826N001601N418544k291864q631492o755559M792224J9589460
$$ plain form
1685 31502410 19280855 37331460 50280802 33074960 -2829471 -39022927 -66633037
1678 -66633037 -75012641 -56302694 -21070524 12918767 39606284 52804471 34755763
1671 34755763 -13856530 -51253205 -38629553 6626038 38015688 44262405 44240486 34673663
1663 34673663 -1163585 -38332512 -26809367 26739180 53974260 22610819 -17258278
1656 -17258278 -14686360 7180370 -47279 -29517625 -39455398 -25860055 -20862127 -31712817
1648 -31712817 -31506722 -9206811 13157438 18140850 14377691 13917487 15236975 15850840
1640 15850840 19566361 24329831 20665442 7355513 -6120288 -15574907 -25899619 -37161044
1632 -37161044 -41382870 -36381269 -30962725 -33254589 -41886081 -48641640 -43849416 -24259956
1624b4259956K1214292K40877k4223854k1475402P363512K7113838J7247092l743383
1616e22984j3074400j3624811j3692266o235869J0633942J8821753R172059J036129
1608g486447R144736J5929321L945020r279351j235423J3144287O348459j1632853
1600A8877749q405263J5835800K8128052J3662497q611078j9464055j6717332
1593B3306370j923448J9334030K7081236P467668k0314219k7685693j9925238
1586G340706k2172328l1877820k6149362r216967m955173m875877K1899391O1610858
1578h396572N9163473O602769l1565177j2303376K1572050J2290700k4755657
1571B2608210l4447529q770991J3901624J4887066R480519P278613L299288J536651
$$ plain form
1624 -24259956 -3045664 -2804787 -27028641 -48504043 -41140531 -14026693 3220399 -522984
1616 -522984 -13597384 -27222195 -40914461 -47150330 -36516388 -17694635 -8522576 -7486447
1608 -7486447 1658289 17587610 21532630 12253279 11017856 24162143 30510602 18877749
1600 18877749 10472486 26308286 54436338 68098835 59487757 40023702 23306370
1593 23306370 21382922 40716952 67798188 75265856 54951637 27265944 7340706
1586 7340706 -14831622 -46709442 -72858804 -82075771 -87030944 -91906821 -70007430 -8396572
1578 -8396572 50766901 57369670 25804493 13501117 35073167 47363867 22608210
1571 22608210 -11839319 -20610310 -6708686 8178380 17658899 24937512 28236800 29773451
1563B9773451Q916594J3031791N85736j2242484m001224Q970345n397529l7595392
1555B041288m5478229j9147434P001980J1180205J0473839K0494616K8328325
1548A4894590K0851861P191555k262839j1025291j8323566j3960996k823199m510004
1540i967889j5727140o198060K9221856M7835989J6382599l5214232m9976268
1533b3643145j7544486J9438283K3791610J019934j8818843j4491034J1166836
1526a9080845L4614120L1609089L327320k2849914k5623713j2460463k302736
1519a2767142n18571k857936q521805j3983204q685420O511030J2283277R39824
1511b7599947m333146J4999463L5349979K1979793j3647257k6020890l498752
$$ plain form
1563 29773451 38690045 51721836 52307572 40065088 36063864 45034209 39636680 2041288
1555 2041288 -43436941 -62584375 -55582395 -44402190 -33928351 -13433735 14894590
1548 14894590 35746451 42938006 40675167 29649876 11326310 -2634686 -5457885 -9967889
1540 -9967889 -25695029 -31893089 -2671233 45164756 61547355 26333123 -23643145
1533 -23643145 -41187631 -21749348 2042262 3062196 -15756647 -30247681 -19080845
1526 -19080845 15533275 47142364 50469684 27619770 1996057 -10464406 -12767142
1519 -12767142 -13285713 -16143649 -24665454 -38648658 -47334078 -40823048 -28539771 -27599947
1511 -27599947 -31933093 -16933630 18416349 40396142 26748885 727995 -2770757
1504b770757J5743363L900708j7920633j8848319m044183L264657J890170O194195
1496a2590799J3902308R896701k775551k752485J5094775K6116066P105046l0346119
1488B3649942m8831990k6097013J8333208M0850599K0094041j7679882k7536899
1481a7217994M69498K9760120K4867082m498959k0729679q013734J4993025K7028302
1473D6657661K6128106J6939070j858692k6405158m0059545l1664596j2193768
1466b2456922k68813J374078J980988K778798k361791r369786n670805P656876
1458b6337377J2471672k47716j5043161j3251000J668423J2694537J4368583J3809904
1450A33865J1312152j642379k2099031l0244695j4380284R557224J6186664K938841
$$ plain form
1504 -2770757 12972606 16873314 -1047319 -19895638 -23939821 -20675164 -18784994 -12590799
1496 -12590799 1311509 11208210 8432659 5680174 20774949 46891015 53996061 23649942
1488 23649942 -25182048 -51279061 -32945853 7904746 27998787 10318905 -17217994
1481 -17217994 -16748496 13011624 37878706 33379747 12650068 4636334 19629359 46657661
1473 46657661 72785767 89724837 87866145 61460987 21401442 -10263154 -22456922
1466 -22456922 -22725735 -21351657 -19370669 -16591871 -18953662 -28323448 -33994253 -26337377
1458 -26337377 -13865705 -14113421 -29156582 -42407582 -40739159 -28044622 -13676039 133865
1450 133865 11446017 9803638 -12295393 -42540088 -56920372 -47363148 -31176484 -28237643
1442b8237643r583098q396018l626013o922127r013876N834180L0525021M0430097
1434A1010523K8982585J6885766J7453226J4535439p097536k8260681k0332264
1427C3177058O377916J2816646j0109233k7873894j6844371J611465K52952j1163642
1419a1755103q782172L700577P994619Q395316K0911155L5310275K4600250r295413
1411G1079504l3057476k8520053j1886018j640441L756600Q329569O043961l132202
1403A0973444p621699m880704o127191j1938385p003750J0071339J6888592K019265
1395B380911j4008336j0484555J975218K228149p145173q745831p3567P187913
1387b6685271P864422M606597k622444j1500755j0498074O706961K7132036L2258186
$$ plain form
1442 -28237643 -37820741 -46216759 -49842772 -56764899 -65778775 -59944595 -29419574 11010523
1434 11010523 39993108 56878874 74332100 88867539 81770003 53509322 33177058
1427 33177058 39554974 52371620 42262387 14388493 -2455878 -844413 -591461 -11755103
1419 -11755103 -20537275 -16836698 -8842079 -446763 20464392 55774667 80374917 71079504
1411 71079504 38022028 9501975 -2384043 -4024484 -267884 8061685 14105646 10973444
1403 10973444 3351745 -1528959 -7656150 -19594535 -26598285 -16526946 361646 2380911
1395 2380911 -11627425 -22111980 -20136762 -17908613 -25053786 -33799617 -33873184 -26685271
1387 -26685271 -18820849 -14214252 -16836696 -28337451 -38835525 -32128564 -4996528 27261658
1379B7261658J8755027l516471k2424341k4626099l646154K1936701K0056859
1372C3797180r721550k7350990r471457J2063091p86746l0376300l1366208k999073
1364f6212053J3851499N267540J016576J7631151L0064726J5311761j1928405
1357E002795k5539096k1851733j0329052N291076J9793375K0795628N982787j0045547
1349a0899767j7159363k0778206k2664217j1499955J4315104L3514905K7462247
1342g709252M936502j1956988j4553409r260046m506834o284659j5714168k2951621
1334h8000475j4549369P316478K5074778K8502773K2513789J1243677m990736
1327a2889085j3996591Q19709K8537989L4101017Q075490j4633351n938028J2175455
$$ plain form
1379 27261658 46016685 42500214 20075873 -4550226 -8196380 13740321 33797180
1372 33797180 24075630 -3275360 -12746817 -683726 -1470472 -31846772 -63212980 -66212053
1364 -66212053 -52360554 -47093014 -46076438 -28445287 1619439 16931200 5002795
1357 5002795 -20536301 -42388034 -52717086 -47426010 -27632635 -6837007 -854220 -10899767
1349 -10899767 -28059130 -48837336 -71501553 -83001508 -68686404 -35171499 -7709252
1342 -7709252 -2772750 -14729738 -29283147 -38543193 -43050027 -49334686 -65048854 -88000475
1334 -88000475 -102549844 -95233366 -70158588 -41655815 -19142026 -7898349 -12889085
1327 -12889085 -26885676 -26065967 2472022 36573039 44648529 30015178 24077150 36252605
1319C6252605L159419k6284495l7039400j5105401J3921699K4675202J8443784
1312A8023413Q593402K835233L927377J0081203J0783423l670000k5650863l4919533
1304i996345k2015758K114814K0100880K3731227J6543652Q319194O279313P207314
1296E2284291J365905j3035926k5949211k8907989k2735960q790463J3128516
1289c2640837L1253541K3810776j1106990m1734846l6865919n277548J6322274
1282e6239549R089008j0211750j4126254O361695L6318132N1123865L8304797
1275F0619944J0395572q732017j1594887j0128803j0805714o410086J797289j728158
1267B3413140j7637341k2110337n177357O925092p154701k4618001j2728427J7058148
$$ plain form
1319 36252605 39412024 13127529 -23911871 -39017272 -25095573 -420371 18023413
1312 18023413 26616815 29452048 33379425 43460628 54244051 50574051 24923188 -9996345
1304 -9996345 -32012103 -29897289 -9796409 13934818 30478470 38797664 45076977 52284291
1296 52284291 53650196 40614270 14665059 -14242930 -36978890 -45769353 -32640837
1289 -32640837 -1387296 22423480 11316490 -30418356 -67284275 -72561823 -56239549
1282 -56239549 -47150541 -57362291 -71488545 -65126850 -28808718 22315147 60619944
1275 60619944 71015516 62283499 50688612 40559809 29754095 23344009 25141298 23413140
1267 23413140 5775799 -16334538 -21511895 -14586803 -21741504 -46359505 -59087932 -42029784
1259d2029784K6923308J2226563K931530J0507347J3937155J712257r358255o290812
1251A0559309L5800k226873q180328j0907744j2170926j1097696k542206Q089292
1243b8441372Q753832K851700N491666J5008546J2918273k873176j1052971j700426
1235I56072O815569k626509k1020163l0039147k5181668j1182619Q280428K5470588
1227d8527449K8504445J6264817J235883p725955j2177223j2001145l729587O410922
1219c1745292N609430o227923j6252532j7264782j0083415O218051K4441120K0323911
1211b4981432j4627483m0972779j4210645M3325253O2604910K4986496j4449954
1204B1674366j4217220R94549R62673M107396K8871495M1774317Q635757l8114083
$$ plain form
1259 -42029784 -15106476 -2879913 51617 10558964 24496119 26208376 16850121 10559309
1251 10559309 10595109 8368236 187908 -10719836 -22890762 -33988458 -36530664 -28441372
1243 -28441372 -19687540 -16835840 -11344174 3664372 16582645 13709469 2656498 956072
1235 956072 7771641 5145132 -15875031 -45914178 -71095846 -82278465 -73998037 -48527449
1227 -48527449 -20023004 -3758187 -2522304 -10248259 -22425482 -34426627 -38156214 -31745292
1219 -31745292 -26135862 -32363785 -48616317 -65881099 -75964514 -69746463 -45305343 -24981432
1211 -24981432 -39608915 -80581694 -94792339 -51467086 11137824 36124320 21674366
1204 21674366 7457146 8451695 9414368 13521764 42393259 84167576 92803333 54689250
1196E4689250m0719255k200130K2676855Q198067j9762625l2623513k6074552
1189c5815903m977983J9334748K4047388K570876j4382952j216136J6445378J299520
1181G304936k7850252k1635728J6465924L1908719N949705j8192390p672866J5875867
1173B153915K2927571J8146977J3705138L690515j0606126q409720J2480310K0509600
1165G4598180j096336k3358813j5996231P429339J7200208J2702993R760770O469917
1157H7710027o803452k1573547k4438110k0409536j7464392o032121J8206647
1150I195516L0058054P334925k6185825k7715243J338102J7620200K622132j1155322
1142C112539O282141L4318240L0156180j1761513n2343694n5443207k4797694
$$ plain form
1196 54689250 13969995 11769865 34446720 42644787 22882162 -9741351 -35815903
1189 -35815903 -40793886 -21459138 2588250 5159126 -9223826 -10439962 6005416 7304936
1181 7304936 -20545316 -42181044 -25715120 6193599 12143304 -6049086 -13721952 2153915
1173 2153915 25081486 43228463 56933601 60624116 50017990 41608270 54088580 74598180
1165 74598180 73501844 50143031 34146800 41576139 58776347 71479340 81240110 87710027
1157 87710027 80906575 59333028 34894918 14485382 -2979010 -9011131 9195516
1150 9195516 39253570 46588495 20402670 -7312573 -5974471 11645729 14267861 3112539
1142 3112539 9394680 43712920 73869100 62107587 9763893 -45679314 -70477008
1135g0477008R122294K5518477K6723192K1518326J0248802p408508k1143296
1128e897721j9050177l386013J3634138K4839383K7529009J6328618n877136j7584042
1120C0536059k875315J8322132J2429410j5731947k6329760o028562J0966270
1113B1288287j046557j9081212j2974601N234871P080910k050667K931519J8389521
1105A9772071J8015498K27354r497764m023103n777513k4841031l7550459k1896843
1097f5571790Q198013K1317726Q932820p435591n287711J2000928J9605898K120486
1089f119221k3832618k7291226l697397J7476708J2370735p732713j8232395j3817992
1081g0876119k690659J2925236K8986674K9981421J2294677M31494J1098484J8933702
$$ plain form
1135 -70477008 -61354714 -35836237 -9113045 12405281 22654083 15245575 -5897721
1128 -5897721 -24947898 -28333911 -14699773 10139610 37668619 53997237 48120101 30536059
1120 30536059 27660744 45982876 58412286 42680339 16350579 10322017 21288287
1113 21288287 20241730 1160518 -11814083 -6579212 501698 -1548969 1382550 19772071
1105 19772071 37787569 38014923 28517159 24494056 18716543 -6124488 -43674947 -65571790
1097 -65571790 -57373777 -36056051 -27123231 -34558822 -39846533 -27845605 -8239707 -6119221
1089 -6119221 -29951839 -57243065 -60940462 -43463754 -31093019 -38825732 -57058127 -70876119
1081 -70876119 -73566778 -60641542 -31654868 -1673447 10621230 11052724 22151208 41084910
1073D1084910n189481l7311871k9123239J2884010L1306769P324279j0799767
1066A0175610R840573L1169795R629617k7984988k7049481M820993J0258816k3501395
1058b640460m2227705r232451L7032278L8255063l212528l3831102k3370971M627618
1050c4600258J6045583R455504L784953L433195l244187j7565104k3478548j0483985
1042e6652847J1479133K6677229L0963631K6715213J2916847p324251j9016290
1035B5758665j0614168P452027J3972065M307857o382468n443991L926451J0313815
1027D3290253M746135j3063859k9377215k4236350K826805K4071228J7203381
1020B5460378k712161p218710L48423n278657k1435960j6392499J5058813L3892899
$$ plain form
1073 41084910 35895429 -1416442 -30539681 -17655671 13651098 20975377 10175610
1066 10175610 20016183 51185978 60815595 32830607 5781126 10602119 20860935 -2640460
1058 -2640460 -44868165 -54100616 -17068338 21186725 17974197 -15856905 -39227876 -34600258
1050 -34600258 -18554675 -9099171 -5314218 -1881023 -5125210 -22690314 -46168862 -56652847
1042 -56652847 -45173714 -18496485 12467146 39182359 52099206 44774955 25758665
1035 25758665 15144497 22596524 36568589 40876446 34493978 29049987 32976438 43290253
1027 43290253 48036388 34972529 5595314 -18641036 -15814231 8256997 25460378
1020 25460378 22748217 15529507 15877930 10599273 -10836687 -27229186 -12170373 21722526
1012B1722526J3262608k0002239k5150914l301880J4455426J5869668J4364735
1005C1219930J7419446J6130369M004549j4031525l0009604l6561370k7489540
998c9317745p586115N414632J878347m742977K872870K0610299L0507610K4466626
990C4103547O877447j5711316l2975383l1303525j3198696l529230j6430788k8768667
982a00936611j0806896K7355867M8120107L8766547K1482803J2735878L739975
975D0457670j3737935l0172574l5451876l0042940j2226442K1368281N4020281
968e785535N4405370J8805590j5586353j8236691n667087j1367540l1938549l3036065
960d8406860l904130K3838206J9324703p374941k2113422j1179964P602252J4695326
$$ plain form
1012 21722526 34985134 14982895 -10168019 -13469899 985527 16855195 31219930
1005 31219930 48639376 64769745 68774294 54742769 24733165 -11828205 -39317745
998 -39317745 -46903860 -41489228 -39610881 -44353858 -41480988 -20870689 9636921 34103547
990 34103547 40980994 25269678 -7705705 -39009230 -52207926 -55737156 -72167944 -100936611
982 -100936611 -111743507 -84387640 -36267533 2499014 23981817 36717695 40457670
975 40457670 26719735 -3452839 -38904715 -68947655 -81174097 -59805816 -5785535
968 -5785535 48619835 67425425 51839072 33602381 27935294 16567754 -15370795 -48406860
960 -48406860 -52310990 -28472784 -9148081 -16523022 -38636444 -49816408 -42214156 -27518830
952b7518830J2618696J3206344J4016907K886131j7463299k6642698j2977126
945d1873875J1573915K9270043L4743699K7491395N259171j9855000j8512137
938B8097211J7768737N0238439L5764794j1779516l7638746k2286386k980515
931E7184018j1120132k7566124k1528180j473544K800573j1636736k1310796j4006021
923d8656942J121249J5188143K7503684L3922333K7224337R745491q264982k0916620
915C6866693k5924227j8312855m6567J0373298l185400k7755823l1877218m997808
907f4859907K9148877M1517716K6666473m1367k0448191k3670051j0155561O516588
899a5325423R225811m601159j8865379j7316920k576865P668859K037173j0566938
$$ plain form
952 -27518830 -14900134 -1693790 12323117 15209248 -2254051 -28896749 -41873875
945 -41873875 -30299960 -1029917 33713782 61205177 66464348 46609348 28097211
938 28097211 45865948 96104387 131869181 120089665 82450919 60164533 57184018
931 57184018 46063886 18497762 -3030418 -4503962 -1703389 -13340125 -34650921 -48656942
923 -48656942 -47535693 -32347550 -4843866 29078467 56302804 66048295 57783313 36866693
915 36866693 10942466 -7370389 -7416956 2956342 -229058 -27984881 -59862099 -64859907
907 -64859907 -35711030 5806686 32473159 32431792 11983601 -11686450 -21842011 -15325423
899 -15325423 -6099612 -10700771 -29566150 -46883070 -49459935 -41791076 -39753903 -50320841
891e0320841j0674881P583084K6391449K4806363O503797n026254l45630K990275
883A907362j0155262k6344558k2761280j126983J6495759J8602749J1236892m24153
875a2569474j4302160j6341393J0112304N1554423O4629509K5662559l4691776
868G4053992o3208470m2289888j756533K1744682K1192149J4131412J4329416
861C8196760J7270867J1814094j225562r543889q800031j1174055k5643039l8446832
853b7551687k9008331j906870J6119662J3463209P949485J5800120K5498362J7119305
845C7483255o519691k5099570k8086256k0495506q211967N991654J5996489J7519984
837a1421608J7018642K1030962K0431002K262941k4756503l6089349k4963451
$$ plain form
891 -50320841 -60995722 -53412638 -27021189 -2214826 4288971 -737283 -1082913 1907362
883 1907362 -8247900 -34592458 -57353738 -58480721 -41984962 -23382213 -12145321 -12569474
875 -12569474 -26871634 -43213027 -33100723 18453700 83083209 108745768 74053992
868 74053992 10845522 -31444366 -33200899 -11456217 9735932 23867344 38196760
861 38196760 55467627 67281721 66056159 56512270 47712239 36538184 10895145 -27551687
853 -27551687 -56560018 -58466888 -42347226 -28884017 -20934532 -5134412 20363950 37483255
845 37483255 30963564 5863994 -22222262 -42717768 -50929735 -44938081 -28941592 -11421608
837 -11421608 5597034 26627996 47058998 49321939 24565436 -11523913 -36487364
830c6487364j0584795o960889l094033J4508865L5970569M0044915K2167916k801568
822E2763616j8428083j6798193m72045J3784303M639701k4652184l8338277j1008475
814c8509637L0558696L6589851L244226k0603304l707538K4106326J9364039j2132519
806C8910140k9839843j8244824J479516J1515814J5570698J7196263J1222540
799D7810304K128924K732333P177612o001622l2723161l6207389q84241L4864627
791A8897387K8558089n068137j7009434M320401K1931484Q701826j9118083l3862574
783G350959l0928755j9011573j813158J4536879J6180875J122914j1025796n226953
775b8814608O202872L828533p415778o610976R476893K0733461J1894208q631738
$$ plain form
830 -36487364 -47072159 -54033048 -57127081 -42618216 -6647647 33397268 55565184 52763616
822 52763616 34335533 17537340 17065295 30849598 35489299 10837115 -27501162 -38509637
814 -38509637 -7950941 28638910 31883136 11279832 7572294 31678620 51042659 38910140
806 38910140 9070297 -9174527 -7695011 3820803 19391501 36587764 47810304
799 47810304 49939228 52671561 59849173 53847551 21124390 -15082999 -15967240 18897387
791 18897387 47455476 42387339 25377905 29698306 51629790 60331616 41213533 7350959
783 7350959 -23577796 -42589369 -44402527 -29865648 -13684773 -12561859 -23587655 -28814608
775 -28814608 -22611736 -18783203 -26198981 -32809957 -23333064 -2599603 9294605 662867
767F62867k1092605j5909174n73355R144103M626114n845793n998046P412440
759b7573449J9727644J8704625R656998L110319j110666o591954q794115n168034
751A961368n602948j4585442j3388352J5536248N1527254N1380780N618954m6223583
743D6224279o3709461m5797210j5154629J1946519K5284275J4406753j4550229
736d1349703l1104083j2392055K5677897M7541721L9771310J7030307l419122
729D1756272j3544864r302861N178609J2981057K929654j2446291j5240918r686689
721B623969r935010j1015155l76923R902360k192716k3881913j7597630J7961521
713c4511497L8179917J8678105r242532j1637565k050717q067130k0921061j5545715
$$ plain form
767 662867 -20429738 -36338912 -36912267 -27768164 -23142050 -28987843 -34985889 -27573449
759 -27573449 -7845805 10858820 20515818 23626137 22515471 15923517 7129402 1961368
751 1961368 -3641580 -18227022 -31615374 -16079126 35448128 86828908 92447862 46224279
743 46224279 -17485182 -63282392 -78437021 -66490502 -41206227 -26799474 -41349703
736 -41349703 -72453786 -84845841 -59167944 -11626223 28145087 45175394 41756272
729 41756272 28211408 18908547 24087156 37068213 39997867 27551576 12310658 2623969
721 2623969 -7311041 -18326196 -18703119 -8800759 -10993475 -34875388 -52473018 -34511497
713 -34511497 3668420 22346525 13103993 1466428 -584289 -8651419 -29572480 -45118195
705d5118195L927630J6210921J9978840K2394238J1675785j8042464l4904304
698b3877549j0505051K3050973J2314311l0059715l8493307K843478L5322247
691b9404613J9022533j2140257j5113693l5218P277493J3651873K7586570K4937456
683C5782144p705875l3432127j7798845J2216897J3064248l101219K215845J9619604
675B0860672J1283656j4143671j4983734M340094r71131l0640375l2388153P642695
667d8999947L8061946K7155841P694993Q320097N381319j8349521k7866692K270344
659f331620L2214923J7701257j6553001k1970971o588256p074842j2329678J2589624
651h342564M5382018K7099727l7795723p5779498m9928958m264762J6092614K4445797
$$ plain form
705 -45118195 -41190565 -24979644 -5000804 17393434 29069219 11026755 -23877549
698 -23877549 -34382600 -11331627 982684 -29077031 -67570338 -64726860 -29404613
691 -29404613 -10382080 -22522337 -37636030 -37671248 -30393755 -16741882 10844688 35782144
683 35782144 28076269 -5355858 -23154703 -10937806 2126442 -974777 1241068 20860672
675 20860672 32144328 18000657 3016923 7357017 6385886 -24254489 -56642642 -48999947
667 -48999947 -10938001 16217840 23912833 32232930 37614249 19264728 -8601964 -6331620
659 -6331620 25883303 43584560 27031559 5060588 -1527668 -8602510 -20932188 -8342564
651 -8342564 37039454 64139181 26343458 -49436040 -99364998 -103629760 -87537146 -63091349
643f3091349M2070602M6996183J7300648j7337164j5713200J0877796J9561199
636D0664715J666905j4842461j5973885j3293249j0287035L437166K1633369J9893970
628C2899495n749975k6180100j8160077M376091J1962644j871063j7731145j7361465
620c7815595j033700J8196806K7878402K4096829J2056821M67565n919303q338122
612B9589703r505553r549506p049447k357869J503202J862194N92223L454653
604H539600J2518775K0802179J9043168O928546q155749k2199740l5067867l9233778
596c6824866k1730473J4133398M0160973L0676084n196905l1535261k5739920
589c6056970j22035J7289145J3241595k479002j1132932l244675J2380263J6386153
$$ plain form
643 -63091349 -21020747 25975436 43276084 25938920 10225720 21103516 40664715
636 40664715 42331620 27489159 11515274 -1777975 -12065010 -8627844 13005525 32899495
628 32899495 27149520 969420 -17190657 -12814566 -851922 -2722985 -20454130 -37815595
620 -37815595 -38849295 -20652489 7225913 31322742 43379563 43847128 37927825 29589703
612 29589703 20084150 10534644 3485197 1127328 2630530 4492724 5084947 8539600
604 8539600 21058375 41860554 60903722 67832268 59676519 37476779 2408912 -36824866
596 -36824866 -58555339 -44421941 -4260968 26415116 21218211 -10317050 -36056970
589 -36056970 -36179005 -18889860 -5648265 -8127267 -19260199 -22504874 -10124611 6261542
581F261542R62185j6626093j2237736J1758717K4060502L167452l2648402m6725432
573f2027265k7877717K507275K2812210L0790962K8424229R828683k1554395m0490111
565e7586129k6319043N227795J8667782O334578l189724J0559109K9807567K6814342
557A0316277M742368r796496n637902K948149L126320J78673K651908O599565
549A5128862L616372m501790p842290j392039R350124J4155621P738999m339999
541C1913860r953471l678167N951047O549541l538014j5896663k3052738k1566058
533c3270663r428936Q654126J7488161O815555j1228605j5412885n318923P31159
525d0971011r69751P263470K8155357L2679418J663316l5149325l1545141J1363275
$$ plain form
581 6261542 7223727 -9402366 -21640102 -9881385 14179117 17346569 -15301833 -62027265
573 -62027265 -89904982 -87397707 -64585497 -33794535 -5370306 4458377 -17096018 -57586129
565 -57586129 -83905172 -78677377 -60009595 -53675017 -56864741 -46305632 -16498065 10316277
557 10316277 15058645 5262149 -375753 2572396 5698716 5877389 8529297 15128862
549 15128862 18745234 14243444 6401154 5009115 14359239 28514860 36253859 31913860
541 31913860 21960389 18282222 24233269 30782810 27244796 11348133 -11704605 -33270663
533 -33270663 -42699599 -34045473 -16557312 -9741757 -20970362 -36383247 -41702170 -40971011
525 -40971011 -41940762 -34677292 -6521935 26157483 27820799 -7328526 -38873667 -27510392
517b7510392M3811067L1392368o129626k7480150j8741426K737890J6368923J5508616
509B9957270O383566J655698Q585588J6758913P191523j9603360l8041097l0906637
501a8018536j3867018r922969j2937061j073175K0943627K3510048p21591k1552130
493c3638805j5644227L41060N75202q353062l328161J3010551J7225168O340660
485b3471614K291012J3134049J9935591J0484503j654260m751951r897527k5949606
477a9879803l5596088k0163259P336181J9383478J3763710J0311968J4314308
470a0529505J0656758n403381j7467531j3883071l544494J727535L382471O758536
462b8302682R989179J0204685R107795O235774k348610j3910451j8792341j4200056
$$ plain form
517 -27510392 16300675 47693043 41563417 14083267 -4658159 -1920269 14448654 29957270
509 29957270 36340836 37996534 46582122 63341035 70532558 50929198 12888101 -18018536
501 -18018536 -31885554 -41808523 -54745584 -55818759 -34875132 -11365084 -12086675 -33638805
493 -33638805 -49283032 -48941972 -48366770 -56719832 -60047993 -47037442 -29812274 -23471614
485 -23471614 -21180602 -8046553 11889038 22373541 20719281 15967330 6069803 -19879803
477 -19879803 -55475891 -75639150 -68302969 -48919491 -35155781 -24843813 -10529505
470 -10529505 127253 -5276128 -22743659 -36626730 -40171224 -38443689 -35061218 -28302682
462 -28302682 -18313503 -8108818 998977 7234751 4886141 -9024310 -27816651 -42016707
454d2016707o891888j41526P975056J1768507K034770j1977634o064248K2509393
446b2804277M2469458K8350119m218997k1290031j4118401K42370R194614J2094446
438B9919301O350527q256396j5040203L341415L2156059L3824970j909840l9015945
430D1369888l8899085o219223K3026013K5612635O908154j7738624l7481914m2995653
422d6417809k7447878K160388K5332000K8356074J8656895J1734989R315310J167367
414B2857336j3260146j8980362o839307J0740296J5537233P279200o5761J93844
406A7462333L240600N866768Q304273N357599o506790j3835432N02042K4985927
398D5377320K5117387p688760l7246575l0622467l472656O892347l282619o613935
$$ plain form
454 -42016707 -48908595 -49050121 -41075065 -29306558 -27271788 -39249422 -45313670 -22804277
446 -22804277 19665181 48015300 43796303 22506272 8387871 8630241 17824855 29919301
438 29919301 36269828 28013432 12973229 16314644 48470703 82295673 80385833 41369888
430 41369888 2470803 -3748420 19277593 44890228 51798382 34059758 -3422156 -46417809
422 -46417809 -73865687 -71705299 -46373299 -18017225 639670 12374659 21689969 22857336
414 22857336 9597190 -9383172 -16222479 -5482183 10055050 17334250 17268489 17462333
406 17462333 20702933 26569701 34873974 40231573 33724783 19889351 20391393 45377320
398 45377320 70494707 62805947 25559372 -5063095 -8535751 -1643404 -4926023 -11539958
390a1539958O064385J2334220k055524j8645647j3596551R205089K5461113K0192312
382B7419439L96595j5591873j5567755m369127J794277l546309o128710R034040
374f559423L1535971L4906034J1610362j7663027l2510712l3799688k9793277
367d2273760j8482680K826946K1637973K1041083M086145o913930J105159J4643088
359b329976J2794377k344815p548123O832992J8829966M639316k4094948l3801447
351b7022658j6273114K889837O221769N764448J1298312Q224623j1462061k4506793
343d4865637j1744735O326904L678241l985891J1537461L2384928J7529858k2652696
335a1791567l1964996N038146L8098887K9806974O005238J659993N498663n844177
$$ plain form
390 -11539958 -5475573 6858647 4803123 -13842524 -27439075 -18233986 7227127 27419439
382 27419439 27816034 12224161 -3343594 -7712721 -5918444 -9464753 -15593463 -6559423
374 -6559423 24976548 59882582 71492944 53829917 21319205 -12480483 -42273760
367 -42273760 -60756440 -57929494 -36291521 -15250438 -11164293 -18078223 -16973064 -2329976
359 -2329976 10464401 8119586 571463 7404455 26234421 30873737 6778789 -27022658
351 -27022658 -43295772 -40405935 -34184166 -28419718 -17121406 -8896783 -20358844 -44865637
343 -44865637 -56610372 -50283468 -46605227 -50591118 -39053657 -6668729 10861129 -11791567
335 -11791567 -43756563 -38718417 -619530 29187444 35192682 36852675 42351338 36507161
327C6507161j9642595j4258538k537620o209527j3222223k716017J0839201L352552
319g887606r026128M725434K9091043K0252456j8095055l3105970n194970K0892056
311A651260P194042k1031214j9185411J0761395L1716557K6534950R058427p110643
303C9589363k0723109k7786943j9495326J314744J7735307J7594238N870778l995813
295A0103239m813192K95258M163523L123691p97334k978982L1714P775898J3100070
286C0003885N507831j3979047k4615681q485488J8202038J9129884q679638k2926976
278e843192L492021L7988861L4943421L035265j5274982j4740554k6099436m7875561
270c0374157l7703730J3440953N2121837L6785237j782315j0085533J1923898
$$ plain form
327 36507161 16864566 2606028 68408 -6141119 -19363342 -22079359 -11240158 -7887606
319 -7887606 -16913734 -12188300 16902743 37155199 19060144 -14045826 -19240796 1651260
311 1651260 8845302 -12185912 -31371323 -20609928 11106629 37641579 46700006 39589363
303 39589363 18866254 -8920689 -28416015 -27101271 -9365964 8228274 14099052 10103239
295 10103239 5290047 5585305 9748828 12872519 12075185 9096203 9127917 16903815 30003885
286 30003885 35511716 21532669 -3083012 -11568500 6633538 25763422 17083784 -5843192
278 -5843192 -2351171 35637690 70581111 73616376 58341394 43600840 17501404 -30374157
270 -30374157 -68077887 -54636934 -2515097 34270140 32487825 22402292 34326190
263C4326190K4187268J1036540r293912k3428296l0911279k3788289L186627K7409627
255A2724476K0400736p074554j7390615l501313L525494j0242693j8023203L34194
247a9247478K1527669J3671743j5200736k9388827j3308882J4964618L0833157
240C851264K6670257J2131809K920918O154746J1184007K353164j5735216j9875965
232B9654984k731278J1727194J789122j8599111k0505495l386131O657034j364686
224C241633q477610K048383J8567046J9033077K608109r850889l187735J3010939
216C6992953J4649747q547188l6667864l8064423p899679K1387271J8640910o156536
208e664809j7687813n223026O604890q10517j3175204r769995M265319J0214543
$$ plain form
263 34326190 58513458 69549998 60256086 36827790 5916511 -17871778 -14685151 12724476
255 12724476 33125212 26050658 8660043 5158730 8684224 -1558469 -19581672 -19247478
247 -19247478 2280191 15951934 751198 -28637629 -41946511 -26981893 3851264
240 3851264 30521521 42653330 45574248 51728994 62913001 65266165 49530949 29654984
232 29654984 26923706 38650900 40440022 21840911 1335416 -2050715 4606319 3241633
224 3241633 -5235977 -3187594 15379452 34412529 37020638 27169749 23982014 36992953
216 36992953 51642700 43095512 6427648 -31636775 -39536454 -18149183 491727 -5664809
208 -5664809 -23352622 -28575648 -21970758 -22781275 -35956479 -45726474 -41461155 -31246612
200c1246612N832215L165107N389033N613317L890954O634302J0902543O640795
192A6821654m874846j0139683k711907R282282J5571680J2110421r75500j6213275
184A8870826j7034904K911463K0991701Q882567k3367225l3131305m278928K6806294
176F50489K1920382o319227j7694882k886508J1280255O917105m951787j0164557
168a248730j0721001j1860206j0465320m729107J13981K812696R022472J6771990
160a0303225J3416465l783729j6804589q801974J1415730J9834546Q591864n125735
152H439353k922063J0887817J5080661p65065k0683371k0064192K315692J9303066
144A1591898P990198k0731337l5465820k2265893L024615J8246983J6823003M707922
$$ plain form
200 -31246612 -25414397 -22249290 -16860257 -11246940 -7355986 -721684 10180859 16821654
192 16821654 11946808 1807125 -904782 8377500 23949180 36059601 35084101 18870826
184 18870826 1835922 4747385 25739086 34621653 11254428 -21876877 -26155805 650489
176 650489 22570871 16251644 -1443238 -4329746 6950509 13867614 8915827 -1248730
168 -1248730 -11969731 -23829937 -34295257 -39024364 -38910383 -36097687 -27075215 -10303225
160 -10303225 3113240 -670489 -17475078 -26277052 -14861322 4973224 13565088 8439353
152 8439353 5517290 16405107 31485768 30720703 10037332 -10026860 -7711168 11591898
144 11591898 19582096 -1149241 -36615061 -58880954 -55856339 -37609356 -20786353 -16078431
136a6078431j0202992j9288511j4780899J496281J7237593K3305367K2414217
129D102625J9825143J3160570j197285j6995431k1838431j1079478O636293J7047384
121I661390J2082264l048373j3530474r833729N25246J822287q757309j7138241
113b8216939j2189220R2388Q161962J1356567J5163784J7010263R441415m397287
105A6422933j0818056l788205O333073O821324j520384q024631o833085j397802
97b804833L086955M714752K550837l642113r320972p601451J18115K660584n158290
88a5396416j1691547l752277J1706217J5170828L256636o336206k729359K223796
80g548328m159675j2767465p360911P999946J3407942J059417j5874263k0962182
$$ plain form
136 -16078431 -26281423 -45569934 -60350833 -58854552 -41616959 -18311592 4102625
129 4102625 23927768 37088338 35891053 18895622 -2942809 -14022287 -7385994 9661390
121 9661390 21743654 18695281 5164807 -4668922 -4143676 -2321389 -11078698 -28216939
113 -28216939 -40406159 -40313771 -32151809 -20795242 -5631458 11378805 20820220 16422933
105 16422933 5604877 1816672 8149745 14971069 13450685 5426054 -1407031 -2804833
97 -2804833 282122 4996874 7547711 3905598 -5415374 -13016825 -12898710 -10238126 -15396416
88 -15396416 -27087963 -30840240 -19134023 -3963195 -706559 -7042765 -9772124 -7548328
80 -7548328 -11708003 -24475468 -31836379 -23836433 -10428491 -9369074 -25243337 -46205519
72d6205519r890155R726608K3980549K1387136N693872m041734M408758J9680547
64B4740062K1830839O695047j5304216l4194730m0467814k3117994J2153597L4383141
56a3282068K2216478j461785J090628K4876546K9241055K726777j9057534j1459779
48C4890318K007134p855421k8255770k8132217p911695M692661k821738j5508909
40d8895637j6349009m624534Q573032J1430653K524448l379147Q781840K8523504
32a3414850K7600391J384988j9232355j0563906J1212523J7664394P633954j582000
24B0703139l833833k365607M543933J2975553N263805k2442772m1129824k5188267
16e1473873P728622K3059711K0005641K1076527K4792756J0984877j2459476j3480280
$$ plain form
72 -46205519 -56095674 -46369066 -22388517 -1001381 4692491 650757 5059515 24740062
64 24740062 46570901 53265948 37961732 3767002 -36700812 -59818806 -47665209 -13282068
56 -13282068 8934410 7472625 8563253 33439799 62680854 65407631 46350097 34890318
48 34890318 36897452 29042031 786261 -27345956 -35257651 -30564990 -33386728 -48895637
40 -48895637 -65244646 -69869180 -61296148 -49865495 -47341047 -50720194 -41938354 -13414850
32 -13414850 14185541 15570529 -3661826 -14225732 -3013209 14651185 22285139 20703139
24 20703139 16869306 14503699 19047632 32023185 37286990 14844218 -26285606 -51473873
16 -51473873 -43745251 -20685540 -679899 20396628 45189384 56174261 43714785 30234505
8C0234505R290121J8518365l417346k7135767k4507326r335488p285195j3721648
0b7359779
$$ plain form
8 30234505 39524626 58042991 54625645 27489878 2982552 -6352936 -13638131 -27359779
0 -27359779
$$ Imaginary data points
##PAGE= N=2
##DATA TABLE= (X++(I..I)), XYDATA
65535b0269557K1843508K4939188J6862091O047755p078501k1943711k8786258
65528h385485j9270587J314646J8664799K1258233P540846j1247360j7557412
65521g682320o088950P427225O669266j286314K474461J6664142J8863578k27294
65513C6813794k0261386j8470441M2569J1877732P910551K248150P946436J5913166
65505D4020571P730616j4745923k6863606j3838332P594911J3246104N255032
65498B2399373J618918J381420j0736035k7131364j9935233J0893532K8070218
65491F560829J2804621m568709N154262K1687991J1072420j6367929k3943900
65484A2399585p212100O344729N793533M845013P133012K128036o180763l241436
$$ plain form
65535 -20269557 1573951 26513139 43375230 49422985 42344484 20400773 -8385485
65528 -8385485 -27656072 -26341426 -7676627 13581606 21122452 9875092 -7682320
65521 -7682320 -13771270 -6344045 325221 -961093 1513368 18177510 37041088 36813794
65513 36813794 16552408 -1918033 -1875464 10002268 17912819 20160969 28107405 44020571
65505 44020571 51751187 37005264 10141658 -3696674 3898237 17144341 22399373
65498 22399373 24018291 25399711 14663676 -12467688 -32402921 -21509389 6560829
65491 6560829 19365450 14796741 19951003 41638994 52711414 36343485 12399585
65484 12399585 5187485 11532214 17325747 22170760 29303772 31431808 25251045 22009609
65476B2009609L793572n945817k5631110k4523954K242701K4171463K2931326
65469A9047790J3800650J0368452L565418j0894054j7546606r142185K85987L961555
65461A3447007J2799622K3442283J1279281k4451872m4062026k3146713O930769
65454b3761649O807010j0364023n030251K1733873L0686342P405623j7010398
65447A0466527j2709680J1664560K7294797K0413113R34337j1878732p841899
65440C8343023L521392K688735j4339188k8453021k3299408p207105K421650L981631
65432b2342291N169609L585210n861723j2097726Q58299K5555304L4758120J6225083
65424D5849885j2170294k5529871j7450053L92390J3060223J3228399N259975
$$ plain form
65476 22009609 25803181 19857364 -5773746 -30297700 -28054999 -3883536 19047790
65469 19047790 32848440 43216892 46782310 35888256 18341650 9199465 9485452 13447007
65461 13447007 26246629 49688912 60968193 36516321 -7545705 -30692418 -23761649
65454 -23761649 -16954639 -27318662 -32348913 -10615040 20071302 27476925 10466527
65447 10466527 -2243153 9421407 36716204 57129317 58063654 46184922 38343023
65440 38343023 41864415 44553150 30213962 1760941 -21538467 -28745572 -26323922 -22342291
65432 -22342291 -17172682 -13587472 -19449195 -31546921 -30688622 -5133318 29624802 45849885
65424 45849885 33679591 8149720 -9300333 -8907943 4152280 17380679 22640654
65417B2640654R49037O028714J1766063O138241q289833j5431624n569581J1768018
65409B9999689J7952509O785046p204000o121450O042398O034892j3971310k8529159
65401A0988615j3454252J3722904J5507741q286829j9405680j884997J3478457
65394A0665959Q08654k0391481k1160827q753671n397394o250560N802519K1026919
65386b3649882J6008401m151231j2329779k633043N471903K610240k012092m900415
65378b5585898j0465174j0901172M964573K3549491J9671185j159273p742460
65371g668728N720471J0157354p376879k0437007p864830J1790994J3048568K753116
65363A23059R36175M706492q96586j1170479q160679R028898K2625510K0428985
$$ plain form
65417 22640654 23589691 29618405 41384468 47522709 39232876 23801252 18231671 29999689
65409 29999689 47952198 54737244 47533244 41411794 47454192 53489084 39517774 10988615
65401 10988615 -2465637 11257267 26765008 18478179 -927501 -2812498 10665959
65394 10665959 11474613 -8916868 -30077695 -38831366 -44228760 -50479320 -44676801 -23649882
65386 -23649882 -7641481 -11792712 -24122491 -26755534 -21283631 -18673391 -20685483 -25585898
65378 -25585898 -36051072 -46952244 -41987671 -18438180 1233005 73732 -7668728
65371 -7668728 -1948257 8209097 832218 -19604789 -27469619 -15678625 -2630057 123059
65363 123059 1059234 5765726 4869140 -6301339 -14462018 -5433120 17192390 37621375
65355C7621375N396146j3077802k3664992j6722938K938255J5188230R250808
65348A6929082j091582m83426L520203k180546p914166L641931K1875918J8208989
65340E2506403p870477k3589054j2167232K028538n653291j9913650j2315799
65333b6974562Q756642Q127651j9725922l7297216j6379274K3025397M2859895
65326a7607389L5711631K1576165J0444175m504045k1108675k3769334r787843
65319i045315K521056L25652p617031r001949l456735Q073816K8086583M5043118
65311E4929195L4654931l315665l1836340k3616501j104085r39846j6667244j3400843
65303a296398J1195770K2369233N150846j4101847j1814348J938243R142916R472346
$$ plain form
65355 37621375 43017521 29939719 6274727 -10448211 -7509956 7678274 16929082
65348 16929082 15837500 15354074 18874277 16693731 8779565 12421496 34297414 52506403
65340 52506403 44635926 21046872 8879640 10908178 5254887 -14658763 -26974562
65333 -26974562 -18217920 -10090269 -29816191 -67113407 -83492681 -60467284 -17607389
65326 -17607389 18104242 39680407 50124582 45620537 24511862 742528 -9045315
65319 -9045315 -6524259 -6198607 -13815638 -22817587 -26274322 -18200506 9886077 54929195
65311 54929195 89584126 86268461 54432121 30815620 29711535 28771689 12104445 -1296398
65303 -1296398 9899372 32268605 37419451 23317604 11503256 13441499 22584415 32056761
65295C2056761N795095p125858k2765330j8613638Q702085K8206361J5810147
65288D2065623j0723712k0497769j2964589p213386n163072N081665J9584266
65281A0169026K1522605J0013042J167206J646408K337058k279707p327693r818927
65273B7429018j1246503r075715j063707M196132l166315j6256584j8377046n917791
65265c3478511J0218946K1778218K5498779J4380507j2217518l3179323k4748550
65258c1747452L771978J8085853O669359n569842N54393J0587111O369403j847308
65250F873495L232963J1917082L559023j4594220j5531403K870134J1734733l627687
65242F434120j9412313r161477J6149135K4464010Q300936p963451m837375Q050421
$$ plain form
65295 32056761 37851856 30725998 7960668 -10652970 -1950885 26255476 42065623
65288 42065623 31341911 10844142 -2120447 -9333833 -14496905 -9415240 10169026
65281 10169026 31691631 41704673 42871879 44518287 46855345 44575638 37247945 27429018
65273 27429018 16182515 7106800 6043093 10239225 7072910 -9183674 -27560720 -33478511
65265 -33478511 -23259565 -1481347 24017432 38397939 26180421 -6998902 -31747452
65258 -31747452 -27975474 -9889621 -3220262 -8790104 -8235711 2351400 8720803 6873495
65250 6873495 10106458 22023540 25582563 10988343 -4543060 -1672926 10061807 6434120
65242 6434120 -12978193 -22139670 -5990535 18473475 26774411 18810960 13973585 22024006
65234B2024006J0596052P25409o687440k402524O991265J0734528P215438K693127
65226E1889861J350557R01191k285081o819591p979592n633153n990865j1664221
65218A3769106j4110250l877486J2957110J8862907P546016q324508j6634719
65211A0188176k0315674k3354253j6325211P127526K8599749K2122036p541053
65204E01296k5255012r646816K1356980L7300634L0856044J4892145j846672j8978121
65196D9180478l0848800k6282563n002155J5955295J8240431K256492j2481965
65189A1017213q893171P518017J6013924R073802K159550P197509J0391175n336865
65181D9141154k6255991k2846141L148344J6515344l9083k1435171k0307892m377805
$$ plain form
65234 22024006 32620058 33345467 26658027 24255503 31246768 41981296 49196734 51889861
65226 51889861 53240418 54141609 51856528 45036937 37057345 31424192 25433327 13769106
65218 13769106 -341144 -4218630 8738480 27601387 35147403 26822895 10188176
65211 10188176 -10127498 -33481751 -49806962 -42679436 -14079687 8042349 501296
65204 501296 -24753716 -34400532 -13043552 24257082 55113126 70005271 68158599 49180478
65196 49180478 18331678 -7950885 -12953040 3002255 21242686 23499178 11017213
65189 11017213 2124042 9642059 25655983 34729785 36889335 44086844 54478019 49141154
65181 49141154 22885163 39022 3187366 19702710 19663627 -1771544 -22079436 -26457241
65173b6457241N077715Q022482J4990080K0319289J2328067k245458p958679m472976
65165A9603279L92681Q221212J7836567J1758262j6113078l4683845j4212478
65158g197400J9942477J5567848k6551045m8670346k0977800J7313211K2521791
65151b8051264Q312926J0707624K6043042K4279700K995880j2497661j2258299
65144A9531948q357768m378664O651929J5391781K457199k3404572k7034339J017426
65136a8125060K3901449R064868k4144677l1867302n613877K1925795K4763108
65129i5696J1032593J02324m240364o746258l628851J0722818K6682249K5273627
65121E9102442K758062k1463581k5700832q511986J2610661J9692057Q413534
$$ plain form
65173 -26457241 -21379526 -13357044 1633036 21952325 34280392 32034934 24076255 19603279
65165 19603279 19995960 28217172 46053739 57812001 41698923 7015078 -7197400
65158 -7197400 12745077 28312925 1761880 -46908466 -67886266 -50573055 -28051264
65151 -28051264 -19738338 -9030714 17012328 41292028 44287908 31790247 19531948
65144 19531948 11174180 6795516 13447445 28839226 31296425 7891853 -19142486 -18125060
65136 -18125060 5776389 14841257 -9303420 -41170722 -46784599 -24858804 -95696
65129 -95696 10936897 11039221 6798857 52599 -3576252 7146566 33828815 59102442
65121 59102442 61860504 40396923 14696091 6184105 18794766 38486823 46900357
65114D6900357j0877858k2048047j6612463j636043Q817508J0897312J2685199
65107B8125965J6748631J2792606l583343j6648454j0979464J497883m031450
65100B3922374k5037258l0159432n434357K1629584K0617563J862621j913072
65093E488023J4100052K2927063J0011541p442434j2392195j2958732k0377884
65086f44566k3649804q456976J2866283J6298798M214184O50516Q817416M095867
65078A4191718k0535572l2374924n339021L3197474L3326512q302053m2367018
65071b8202884l2008151M534860K6184158J9917687L279144o989076q870375n018954
65063b7173591L350672J2066230J4218474P066581n043574j3840250j2532903
$$ plain form
65114 46900357 36022499 13974452 -2638011 -4274054 4543454 15440766 28125965
65107 28125965 44874596 57667202 54083859 37435405 26455941 27953824 23922374
65100 23922374 -1114884 -31274316 -36708673 -15079089 5538474 7401095 5488023
65093 5488023 19588075 42515138 52526679 45084245 32692050 19733318 -644566
65086 -644566 -24294370 -32751346 -19885063 -3586265 627919 1278435 10095851 14191718
65078 14191718 -6343854 -38718778 -44057799 -10860325 22466187 14164134 -28202884
65071 -28202884 -60211035 -55676175 -29492017 -9574330 -6295186 -13284262 -22154637 -27173591
65063 -27173591 -23822919 -11756689 2461785 9528366 4484792 -9355458 -21888361
65056b1888361k589532M751286Q81363o473699k264655J2506437J9986096J1323576
65048A6232511j927844p931588r255911q951797m66276J5412467K1422369Q733440
65040C3267371n022562k153684N853026j359702j6786278j7510371l457096M731926
65032b437370K020813K880852R391729O208584q516831j6506650j0413166l222595
65024b0594634J226383J6221728L7677111L4251760n442516m3599732m0941894
65017b1201794j3231262n522702k2002854k1248030J5671765M9807030L6571433
65010A8843586j0108718l3360908p164787L1131027L1095657n776944l1276274
65003f617361j5797602J5467895K0840152l407264k5689746k3507043k540448
$$ plain form
65056 -21888361 -24477893 -19726607 -18845244 -25318943 -27583598 -15077161 4908935 16232511
65048 16232511 14304667 6373079 -2882832 -11834629 -12300905 3111562 24533931 33267371
65040 33267371 28244809 26091125 31944151 30584449 13798171 -3712200 -7169296 -2437370
65032 -2437370 -416557 2464295 11856024 18064608 9547777 -6958873 -17372039 -20594634
65024 -20594634 -19368251 -3146523 34530588 68782348 63339832 19740100 -21201794
65017 -21201794 -34433056 -39955758 -61958612 -83206642 -67534877 -17727847 18843586
65010 18843586 8734868 -24626040 -31790827 -659800 30435857 24658913 -6617361
65003 -6617361 -22414963 -6947068 13893084 10485820 -15203926 -38710969 -41251417
64996d1251417K1853257L7596490L2042315J162397l2907946l7227780r029968
64989b7762652J8713873J9998472L839937p849597q321051j259393J0616467J9319046
64981B7295102J3170925l406816j1184921p086037r206694j9092517j0916372
64974b0427330K0592784L5718076O590629l1280263k7444113N562603J3753145
64967C065531j0352823j8490373J0635700L5951722K1659065p545951j0514140
64960B4408731O654546Q621017r573375j9774333r032418L834568J697950p863668
64952a026982j0822618q736929j0849309j4916465r066252Q499898K2104549J7389890
64944g424218K797354Q47135J5743096K3776983O694387j8566794k2365279n982230
$$ plain form
64996 -41251417 -19398160 18198330 50240645 51403042 18495096 -18732684 -27762652
64989 -27762652 -9048779 10949693 14789630 6940033 -1381018 -2640411 7976056 27295102
64981 27295102 40466027 37059211 25874290 18788253 9581559 -9510958 -20427330
64974 -20427330 165454 35883530 42474159 11193896 -16250217 -10687614 3065531
64967 3065531 -7287292 -25777665 -15141965 20809757 42468822 34922871 24408731
64960 24408731 31063277 39684294 30110919 10336586 1304168 5138736 6836686 -1026982
64952 -1026982 -11849600 -20586529 -31435838 -46352303 -55418555 -46918657 -24814108 -7424218
64944 -7424218 -4626864 -3779729 11963367 35740350 42434737 23867943 1502664 -4479566
64936d479566K412937o089111q339170R145724K4639056J6189187j096152J128025
64928C3510930J8023706J8741453m763573k5217490k0774454l701247K475225
$$ plain form
64936 -4479566 -2066629 -8155740 -16494910 -7349186 17289870 33479057 32382905 33510930
64928 33510930 51534636 70276089 65512516 40295026 19520572 15819325 18294550
$$ [...]
##END NTUPLES=NMR SPECTRUM
##END=
