##TITLE=31Pdec_SR118_4
 , 24 sc
 5.4.2022
##JCAMPDX= 6.0         $$ Bruker NMR JCAMP-DX V2.0
##DATA TYPE= NMR SPECTRUM
##DATA CLASS= NTUPLES
##ORIGIN= UXNMR, Bruker Analytische Messtechnik GmbH
##OWNER= root
$$ XWIN-NMR		Version 3.5
$$ Tue Apr  5 11:04:10 2022 Russian Standard Time (UT+4h)  she@DPX200
##.OBSERVE FREQUENCY= 81.013821
##.OBSERVE NUCLEUS= ^31P
##.ACQUISITION MODE= SIMULTANEOUS
##.ACQUISITION SCHEME= undefined
##.AVERAGES= 24
##.DIGITISER RES= 16
##SPECTROMETER/DATA SYSTEM= spect
##.PULSE SEQUENCE= zgpg30
##.SOLVENT NAME= CDCl3
##.SHIFT REFERENCE= (INTERNAL, CDCl3, 0, 248.564)
##AUDIT TRAIL= $$ (NUMBER, WHEN, WHO, WHERE, WHAT)
$$ ##TITLE= Audit trail, XWIN-NMR		Version 3.5
$$ ##JCAMPDX= 5.01
$$ ##ORIGIN= Bruker BioSpin GmbH
$$ ##OWNER= she
$$ F:/spectra/data/she/nmr/P31/1/pdata/1/auditp.txt
$$ ##AUDIT TRAIL=  $$ (NUMBER, WHEN, WHO, WHERE, WHAT)
(   1,<2022-04-05 11:03:18.46 +0400>,<she>,<DPX200>,
      <created by zg, POWCHK disabled, PULCHK disabled
       configuration hash MD5:
       00 E9 B6 7A A2 85 ED C7 34 08 36 98 17 FE 4E 26
       data hash MD5: 32K
       41 8C AC A0 3D A3 20 02 E4 BD 47 EC FD 2E 1C 67>)
(   2,<2022-04-05 11:03:21.10 +0400>,<she>,<DPX200>,
      <Start of raw data processing
       efp BC_mod = 2 LB = 1 FT_mod = 6 PKNL = 1 PHC0 = -9525.75 PHC1 = 29.07561 SI = 64K 
       data hash MD5: 64K
       F0 1F F0 57 5D 28 43 37 F2 2C 6D DD ED AB C1 6B>)
(   3,<2022-04-05 11:03:41.50 +0400>,<she>,<DPX200>,
      <pk PHC0 = -14.16499 PHC1 = 41.8 
       data hash MD5: 64K
       86 42 80 18 A7 B8 DD A8 AF EF 0A D7 1B E8 E4 A0>)
(   4,<2022-04-05 11:03:48.79 +0400>,<she>,<DPX200>,
      <abs ABSG = 5 
       data hash MD5: 64K
       16 27 18 9C CA 56 F7 4B FE 61 89 24 7A 42 AB 58>)
$$ ##END=
$$ 
$$ hash MD5
$$ 84 76 EF 46 72 FC D2 3C 8C DD D9 CB 98 7E 0E 1F
##$RELAX= 
##$RELAX= 
##$RELAX= 
##$RELAX= 
##$RELAX= 
##$RELAX= 
##$RELAX= 
##$RELAX= 
$$ Bruker specific parameters
$$ --------------------------
##$DU= <F:/spectra>
##$EXPNO= 1
##$NAME= <P31>
##$PROCNO= 1
##$TYPE= <nmr>
##$USER= <she>
##$AMP= (0..31)
100 100 100 100 100 100 100 100 100 100 100 100 100 100 100 100 100 100 
100 100 100 100 100 100 100 100 100 100 100 100 100 100 
##$AQSEQ= 0
##$AQ_mod= 1
##$AUNM= <au_zg>
##$AUTOPOS= <>
##$BF1= 81.014009
##$BF2= 200.13
##$BF3= 200.13
##$BF4= 200.13
##$BF5= 200.13
##$BF6= 200.13
##$BF7= 200.13
##$BF8= 200.13
##$BYTORDA= 1
##$CFDGTYP= 0
##$CFRGTYP= 5
##$CHEMSTR= <none>
##$CNST= (0..31)
1 1 145 1 1 1 1 1 1 1 1 1 1 1 1 1 1 1 1 1 1 1 1 1 1 1 1 1 1 1 1 1 
##$CPDPRG= <waltz16>
##$CPDPRG1= <>
##$CPDPRG2= <waltz16>
##$CPDPRG3= <>
##$CPDPRG4= <mlev>
##$CPDPRG5= <mlev>
##$CPDPRG6= <mlev>
##$CPDPRG7= <mlev>
##$CPDPRG8= <mlev>
##$CPDPRGB= <>
##$CPDPRGT= <>
##$D= (0..31)
0 1 0 0 0 0 0 0 0 0 0 0.03 2e-05 3e-06 0 0 0 0 0 0 0 0 0 0 0 0 0 0 0 0 
0 0 
##$DATE= 1649142197
##$DBL= (0..7)
120 120 120 11 120 120 24 19 
##$DBP= (0..7)
150 150 150 150 150 150 150 150 
##$DBP07= 0
##$DBPNAM0= <>
##$DBPNAM1= <>
##$DBPNAM2= <>
$$ [...]
##$SUBNAM3= <"">
##$SUBNAM4= <"">
##$SUBNAM5= <"">
##$SUBNAM6= <"">
##$SUBNAM7= <"">
##$SUBNAM8= <"">
##$SUBNAM9= <"">
##$SW= 501.771253377433
##$SWIBOX= (0..15)
0 1 3 0 0 0 0 0 0 0 0 0 0 0 0 0 
##$SW_h= 40650.406504065
##$TD= 32768
##$TD0= 1
##$TE= 0
##$TE2= 300
##$TE3= 300
##$TEG= 300
##$TL= (0..7)
0 120 53 12 22 120 120 120 
##$TP= (0..7)
150 150 150 150 150 150 150 150 
##$TP07= 0
##$TPNAME0= <>
##$TPNAME1= <>
##$TPNAME2= <>
##$TPNAME3= <>
##$TPNAME4= <>
##$TPNAME5= <>
##$TPNAME6= <>
##$TPNAME7= <>
##$TPOAL= (0..7)
0.5 0.5 0.5 0.5 0.5 0.5 0.5 0.5 
##$TPOFFS= (0..7)
0 0 0 0 0 0 0 0 
##$TUNHIN= 0
##$TUNHOUT= 0
##$TUNXOUT= 0
##$USERA1= <user>
##$USERA2= <user>
##$USERA3= <user>
##$USERA4= <user>
##$USERA5= <user>
##$V9= 5
##$VALIST= <valist>
##$VCLIST= <CCCCCCCCCCCCCCC>
##$VD= 0
##$VDLIST= <DDDDDDDDDDDDDDD>
##$VPLIST= <PPPPPPPPPPPPPPP>
##$VTLIST= <TTTTTTTTTTTTTTT>
##$WBST= 1024
##$WBSW= 4
##$XGAIN= (0..3)
0 0 0 0 
##$XL= 0
##$YL= 0
##$YMAX_a= 18690
##$YMIN_a= -26490
##$ZGOPTNS= <>
##$ZL1= 120
##$ZL2= 120
##$ZL3= 120
##$ZL4= 120
##$ABSF1= 248.5645
##$ABSF2= -253.2056
##$ABSG= 5
##$ABSL= 3
##$ALPHA= 0
##$AQORDER= 0
##$ASSFAC= 0
##$ASSFACI= 0
##$ASSFACX= 0
##$ASSWID= 0
##$AUNMP= <proc_1d>
##$AZFE= 0.1
##$AZFW= 0.5
##$BCFW= 0
##$BC_mod= 2
##$BYTORDP= 0
##$COROFFS= 0
##$CY= -3
##$DATMOD= 1
##$DC= 0
##$DFILT= <>
##$DTYPP= 0
##$F1P= 0
##$F2P= 0
##$FCOR= 1
##$FTSIZE= 65536
##$FT_mod= 6
##$GAMMA= 0
##$GB= 0
##$INTBC= 1
##$INTSCL= 5.30512e-09
##$ISEN= 30
##$LB= 1
##$LEV0= 0
##$LPBIN= 0
##$MAXI= 10000
##$MC2= 0
##$MEAN= 0
##$ME_mod= 0
##$MI= 50
##$NCOEF= 0
##$NC_proc= -7
##$NLEV= 6
##$NOISF1= 182.463
##$NOISF2= 159.3651
##$NSP= 0
##$NTH_PI= 0
##$NZP= 0
##$OFFSET= 248.5645
##$PC= 4
##$PHC0= -9539.915
##$PHC1= 70.87561
##$PH_mod= 1
##$PKNL= yes
##$PPARMOD= 0
##$PSCAL= 0
##$PSIGN= 0
##$REVERSE= no
##$SF= 81.014009
##$SI= 65536
##$SIGF1= 159.3651
##$SIGF2= -187.1042
##$SINO= 113.3802
##$SIOLD= 16384
##$SREGLST= <1H.CDCl3>
##$SSB= 0
##$STSI= 65536
##$STSR= 0
##$SW_p= 40650.406504065
##$SYMM= 0
##$S_DEV= 0
##$TDeff= 32768
##$TDoff= 0
##$TI= <>
##$TILT= no
##$TM1= 0
##$TM2= 0
##$TOPLEV= 0
##$USERP1= <user>
##$USERP2= <user>
##$USERP3= <user>
##$USERP4= <user>
##$USERP5= <user>
##$WDW= 1
##$XDIM= 65536
##$YMAX_p= 330280245
##$YMIN_p= -37415633
$$ End of Bruker specific parameters
$$ ---------------------------------
##NTUPLES= NMR SPECTRUM
##VAR_NAME=  FREQUENCY,     SPECTRUM/REAL,   SPECTRUM/IMAG
##SYMBOL=    X,             R,               I
##VAR_TYPE=  INDEPENDENT,   DEPENDENT,       DEPENDENT
##VAR_FORM=  AFFN,          ASDF,            ASDF
##VAR_DIM=   65536,         65536,           65536
##UNITS=     HZ,            ARBITRARY UNITS, ARBITRARY UNITS
##FACTOR=    0.620285442955139, 1,           1
##FIRST=     20137.2065510759, 0,            0
##LAST=      -20513.1999529892, 0,           0
##MIN=       -20513.1999529892, -37415633,   0
##MAX=       20137.2065510759, 330280245,    0
$$ Real data points
##PAGE= N=1
##DATA TABLE= (X++(R..R)), XYDATA
$$ [...]
41413A567269k630006k102578n13967R89289J653281J147818J7456n58433j39791
41404e69662N04065N84438J19522n06997q47163l34350R89531J939403J573599
41395C452386O42130K55494j22015j451470k679277j961075J21105J196307P21321
41386A74906K28826J97950k51618o43125L95424J769760Q84713j493485j662939
41377c99588O56090J245219j322903k523334N90332L631199J546987k865257l068691
41368b509946R91125L137572O50415k403296k145032J23190J457959J512191J237585
41359B051763O21649k75842m36821L37309P23961J22936l47327p3756r9637r51446
41349A672789j337765l36993Q70162Q43219l31m35290l38552k51953p7176N10888
$$ plain form
41413 1567269 -1062737 -3165315 -3679282 -2689993 -1036712 111106 128562 -429871 -569662
41404 -569662 -65597 518841 638363 131366 -715797 -1050147 -60616 1878787 3452386
41395 3452386 4094516 4350010 4227995 2776525 97248 -1863827 -1742722 -546415 174906
41386 174906 403732 601682 350064 -293061 102363 1872123 2756836 1263351 -399588
41377 -399588 256502 1501721 178818 -2344516 -1754184 1877015 3424002 558745 -2509946
41368 -2509946 -1518821 1618751 2269166 -134130 -2279162 -2155972 -698013 814178 2051763
41359 2051763 2673412 2397570 1960749 2298058 3022019 3144955 2797628 2723872 2624235 1672789
41349 1672789 335024 -1969 868193 1711412 1711081 1275791 937239 685286 608110 1118998
41339A118998J050557P86168k15794j145888j355793q64038k73876j68749k56253
41330a324668L59542J447059J271717p22207k121165o45850J947369K033904k45399
41321B000302j099627P29800J822622k72633k893148k432162J85698J421404N66181
41312B8437j52807J64761Q9453j048006j912006j420945j90716P15718R74987
41303b751124O88101O7712m70612p43822j003546r99015K04177K334095L088258
41294D14224R96599j904634k446939o96997M65823k05665r61173l50539P26490
41285c962811J049804R07351Q46488M98012k06665k88470O08241J233428O36896
41276A322274k57568k74455L5425m59598j300790j096083J40440R31584N73997
$$ plain form
41339 1118998 2169555 2955723 2739929 1594041 238248 -625790 -899666 -1068415 -1324668
41330 -1324668 -965126 481933 1753650 1031443 -1089722 -1735572 211797 2245701 2000302
41321 2000302 900675 1630475 3453097 3180464 287316 -2144846 -1959148 -537744 28437
41312 28437 -124370 40391 129844 -918162 -2830168 -4251113 -4441829 -3726111 -2751124
41303 -2751124 -2063023 -1995311 -2465923 -3209745 -4213291 -5212306 -5008129 -2674034 414224
41294 414224 1410823 -493811 -2940750 -3637747 -3171924 -3377589 -4338762 -4689301 -3962811
41285 -3962811 -2913007 -2005656 -1159168 -661156 -867821 -1156291 -548050 685378 1322274
41276 1322274 1064706 790251 825676 366078 -934712 -2030795 -1890355 -958771 -384774
41267c84774L7294L06253Q63665M61803j025451k148675j498890M33630J601172
41258a353973R32450j84341J12381J292019J164051n86364j620984m76323J084197
41249C63113P76343o71804p80411P42168J675634Q44817k76528k16136J38476
41240B595672q29553k639520l105741j251023J461761K944485K554544J032521
41232B763146p03265j904928j737420N5051K084293K187382J37144j536552o61234
41223F83617J409262J492681p92702k270987p44792J797298K046310p0779j742249
41214A807659j379552j48613N32975Q60978J330252J308271J48227j325113j760883
41205A374201j206988q46890r57222m27422J230665K502929J644126o07869j554234
$$ plain form
41267 -384774 -347480 -41227 822438 1284241 258790 -1889885 -3388775 -2955145 -1353973
41258 -1353973 -421523 -605864 -493483 798536 1962587 1376223 -244761 -721084 363113
41249 363113 1139456 467652 -312759 429409 2105043 2949860 2673332 2457196 2595672
41240 2595672 1766119 -873401 -3979142 -5230165 -3768404 -823919 1730625 2763146
41232 2763146 2059881 154953 -1582467 -1527416 556877 2744259 2881403 1344851 683617
41223 683617 2092879 3585560 2792858 521871 -222921 1574377 3620687 3549908 1807659
41214 1807659 428107 279494 812469 1673447 3003699 4311970 4460197 3135084 1374201
41205 1374201 167213 -679677 -1636899 -2064321 -833656 1669273 3313399 2705530 1151296
41196A151296j50435J334415M63864j647973j736942P53539K567343J230072j326116
41187B639063j486424R89139K800317J666531r53278k139816j077544M76238N73009
41178C487235q36308k118286j928175o82314K14237L40609N82319J341920J603109
41169B004346N18910j022073j404716k48864J422248K313237J547137p56830k825700
41160A547695k441563J39735J945411J266834N9786M59446R78364q35153l586375
41151d65820l724933j280149K64128j98353j05913J481063J924387J40267p32551
41142b697874J399754L490848K074699j003824j599470K73214J256211M30002
41134C623560o7567M92434N33139k79923m34574J03241m54018k017288k009361
$$ plain form
41196 1151296 1000861 2335276 2799140 1151167 -585775 167764 2735107 3965179 2639063
41187 2639063 1152639 2141778 4942095 6608626 5655348 3515532 2437988 2914226 3487235
41178 3487235 2650927 532641 -1395534 -2077848 -1863611 -1523002 -940683 401237 2004346
41169 2004346 2523256 1501183 96467 -152397 1269851 3583088 5130225 4373395 1547695
41160 1547695 -893868 -754133 1191278 2458112 2517898 2977344 3955708 3120555 -465820
41151 -465820 -4190753 -5470902 -5206774 -5405127 -5511040 -4029977 -2105590 -1965323 -2697874
41142 -2697874 -1298120 2192728 4267427 3263603 1664133 1937347 3193558 3623560
41134 3623560 3555993 4048427 4581566 4301643 3867069 3970310 3516292 1499004 -510357
41125e10357L47310K207799J188045j244430k188329j058506P51742K139781K505590
41116D138645J261703j053036k342212j330590N31793J027382J32030m99523k02388
41107A663804K03398J15063k23647n87793r19177p64129J88203J139105J005057
41098A819884J35053j27011L55877K66331q07874j382223m36975O36412L2306
41089D91780j433273j311885O32381J788047N76396j118684q71142O18794R22663
41080B95077r5318k81255R74838J633806L94326j234660j428601n75049J04602
41071b12234O17046J205112R57706n82990j750023q69389R44316J343430L11533
41062A964507j80873M60465R24899O32028L91151L03786n29778j766358j632991
$$ plain form
41125 -510357 -163047 2044752 3232797 1988367 -199962 -1258468 -506726 1633055 4138645
41116 4138645 5400348 4347312 2005100 674510 1206303 2233685 2365715 1866192 1663804
41107 1663804 1867202 1982265 1758618 1170825 251648 -512481 -324278 814827 1819884
41098 1819884 1954937 1827926 2183803 2450134 1642260 260037 -176938 459474 491780
41089 491780 -941493 -2253378 -1620997 167050 743446 -375238 -1246380 -627586 295077
41080 295077 199759 -81496 893342 2527148 2921474 1686814 258213 -316836 -212234
41071 -212234 404812 1609924 2567630 1984640 234617 -634772 309544 1652974 1964507
41062 1964507 1783634 2244099 3168998 3801026 4192177 4495963 3966185 2199827 566836
41053E66836K63286K028685K258216J805321J824576J888567J263927N13110M77044
41044A2889568P73075M79766n13969j688883k597773k776419j893747n33218J39571
41035D277971j06977m24485m25064m91473m04729N24118J543847Q20575j426385
41026C887398k378760n96306J554512J275037o83152j604980r63986n02464r52481
41017i65182j144574k72483R53501J579090J373853M87708o57624j234304q37577
41008g17592k20284k04694k89451N02944J780669K065219P92914j007482j928567
40999G73676j325328L58490J657903J125861p99405j740473k60144K061211K692961
40990D544752J388659j80181j122761j742428j910134j243617o65663j472476
$$ plain form
41053 566836 830122 2858807 5117023 6922344 8746920 10635487 11899414 12412524 12889568
41044 12889568 13662643 14142409 13628440 11939557 9341784 6565365 4671618 4138400 4277971
41035 4277971 4170994 3746509 3321445 2829972 2425243 2949361 4493208 5313783 3887398
41026 3887398 1508638 912332 2466844 3741881 3058729 1453749 489763 -12701 -965182
41017 -965182 -2109756 -2382239 -1428738 150352 1524205 2011913 1354289 119985 -717592
41008 -717592 -937876 -1142570 -1432021 -929077 851592 2916811 3709725 2702243 773676
40999 773676 -551652 -193162 1464741 2590602 1791197 50724 -209420 1851791 4544752
40990 4544752 5933411 5753230 4630469 2888041 977907 -265710 -931373 -2403849
40982b403849k727130j965440R24605K881192J853592k66157n23035R08835J483744
40973A66357L39037o99379k49936N10150j28938j528840j410204P65866K665623
40964D29736K052489k48942j690209j590650j451739j705822o14352K397734M537878
40955B116123L028100o71226k634925j810587p69230j126085j268328K70419J853955
40946a011784J201509r03679j692371m05234J009350J060372N17205N49485Q22574
40937A147427N52368K29235P51894J404087M70089j896702l108055j426744J439303
40928d37098K441671J078102m82957p28943l50423l57614n28962l37248R4650
40919C91178N85893J101470R68986m97874k195196k069670m24486L6384j393331
$$ plain form
40982 -2403849 -5130979 -7096419 -6171814 -3290622 -1437030 -1703187 -2226222 -1317387 166357
40973 166357 505394 -193985 -443921 66229 -62709 -1591549 -3001753 -2235887 429736
40964 429736 2482225 2233283 543074 -1047576 -2499315 -4205137 -4819489 -2421755 2116123
40955 2116123 5144223 4472997 1838072 27485 -741745 -1867830 -3136158 -2865739 -1011784
40946 -1011784 189725 -713954 -2406325 -2811559 -1802209 -741837 -224632 324853 1147427
40937 1147427 1699795 1929030 2680924 4085011 4555100 2658398 -449657 -1876401 -437098
40928 -437098 2004573 3082675 2599718 1870775 1520352 1162738 633776 296528 391178
40919 391178 977071 2078541 3047527 2549653 354457 -1715213 -2139699 -2103315 -3496646
40910c496646j779654P10977L245151K472241q3720n02785J246050J695520j42587
40901C364547j531760r23687K8121J61656N86605J480292Q50085j658860l123728
40892g66729j743927K14020L87642J96245J568717K565110M49498k641838j944626
40883a715888K351391M585343J752695k192025k439390j66192J55845j982234
40875C49545k770015n02810J750416J085532r37092j191641J43777N45731l64250
40866a890807o14310J79263J62847q57151l80049K306378L859945J680148j683061
40857B763203k145871j04032Q80808L7182j60180R78062J214156k14526j096418
40848B152384k97217L60819k28595l91825Q03521J272263m16355k036788j232488
$$ plain form
40910 -3496646 -5276300 -4565323 -1320172 1152069 1068349 565564 1811614 3507134 3364547
40901 3364547 1832787 909100 937221 1098877 1685482 3165774 4015859 2356999 -766729
40892 -766729 -2510656 -2296636 -1908994 -1712749 -144032 2421078 2870576 228738 -1715888
40883 -1715888 635503 5220846 6973541 4781516 2342126 2175934 2331779 349545
40875 349545 -2420470 -2923280 -1172864 -87332 -1024424 -2216065 -2072288 -1526557 -1890807
40866 -1890807 -2505117 -2325854 -2163007 -3020158 -3400207 -1093829 2766116 4446264 2763203
40857 2763203 617332 513300 1394108 1431290 1271110 2249172 3463328 3248802 2152384
40848 2152384 1855167 2215986 1987391 1595566 2399087 3671350 3254995 1218207 -14281
40839a4281M47991K31452j146256q86938R64658J639989K18071j162164q10577
40830e18055M42616J065753O57923l25350j048040n32167J075071J867645N06694
40821C192090j392441j251673N55780J160435n22646k391266k303704m05157K007542
40812a351040L730345L419006N35921k812788l413703j211892M15204k83438r13154
40803a885539P09518K508344J387631j486641k222505j52445J388963L97711j087431
40794d42394p16944N63177N29439o39108r74724o0497N11476q801j78777J304601
40784a12552L156340K766412k57954l102203l025286q08703M30206l47457q21240
40775b122437P19550K235252R95767j634303j760800Q53745J915093q14564l642480
$$ plain form
40839 -14281 433710 665162 -481094 -1368032 -403374 1236615 1454686 292522 -518055
40830 -518055 -75439 990314 1648237 1322887 274847 -257320 817751 2685396 3192090
40821 3192090 1799649 547976 1103756 2264191 1741545 -649721 -2953425 -3358582 -1351040
40812 -1351040 2379305 5798311 6334232 3521444 107741 -1104151 -688947 -972385 -1885539
40803 -1885539 -1176021 1332323 2719954 1233313 -989192 -1141637 247326 645037 -442394
40794 -442394 -1159338 -596161 -66722 -705830 -1680554 -1741051 -1229575 -1238376 -1417153 -112552
40784 -112552 3043788 5810200 5552246 2450043 -575243 -1383946 -953740 -1301197 -2122437
40775 -2122437 -1402887 832365 1828132 193829 -1566971 -713226 1201867 387303 -3255177
40766c255177k314718J573614L163556J524997Q7232N81460R73874n3277p48579
40757A532982Q1735O98112k51565j079322j24023J131418O75889m91934l24309
40748A848983N77836K94327p64758p15733K10135P5062j263466j965836j225007
40739b928457J38801J609205K849098K386132m64959l012759k109474P21766J169028
40730C58381q48289q62069K411853M240744J329484k632411k693605j44610L62553
40721A522031j383395j471997J015338K363591L08008k460007k484436k54408
40713b845275J239594P78351k30465l18718K63042L61579m08425j256057j300419
40704c716793n99432K27956R57771J572773J504650L32050q42396l02256J655996
$$ plain form
40766 -3255177 -5569895 -3996281 -832725 692272 779504 1360964 2334838 2281561 1532982
40757 1532982 1614717 2312829 2061264 981942 857919 1989337 2665226 2173292 1848983
40748 1848983 2426819 2721146 1956388 1240655 1450790 1525852 262386 -1703450 -2928457
40739 -2928457 -2789656 -1180451 1668647 4054779 3589820 577061 -1532413 -810647 358381
40730 358381 -489908 -1351977 1059876 5300620 6630104 3997693 1304088 1159478 1522031
40721 1522031 138636 -1333361 -318023 2045568 2353576 -106431 -2590867 -2845275
40713 -2845275 -1605681 -827330 -1057795 -1376513 -1113471 -751892 -1160317 -2416374 -3716793
40704 -3716793 -4316225 -4088269 -3130498 -1557725 -53075 278975 -563421 -865677 790319
40695G90319K654624J427009n52783j446312j380205j342285j379680j180611
40687b409924j004099p67871K98349J792639J664074o95147k539185j114285K294848
40678b480601L918772K307149n28811k196823k158021j212908m42344m57398n72014
40669c822999O18845K844488L619177J543614j251833j810215k36698J105332
40661B609711J067039K33027q68599j785908j458075J71683J039253j15572j169045
40652b76486J40465J991463J206760j090492j038407J285795J755750p45216k280355
40643I49277m85860J569854P69359r71734m42233J238719O92691j933976l146008
40634a759911j391410J026560J466167J10246q96983k47334J072159R94395p81025
$$ plain form
40695 790319 3444943 4871952 4319169 2872857 1492652 150367 -1229313 -2409924
40687 -2409924 -3414023 -4181894 -3883545 -2090906 -426832 -1121979 -3661164 -4775449 -2480601
40678 -2480601 1438171 3745320 3216509 1019686 -1138335 -2351243 -2793587 -3250985 -3822999
40669 -3822999 -3204154 -359666 3259511 4803125 3551292 1741077 1504379 2609711
40661 2609711 3676750 3909777 3041178 1255270 -202805 -31122 1008131 892559 -276486
40652 -276486 -136021 1855442 3062202 1971710 933303 2219098 3974848 3229632 949277
40643 949277 463417 2033271 2802630 1830896 1388663 2627382 3320073 1386097 -1759911
40634 -1759911 -3151321 -2124761 -658594 -548348 -1445331 -1692665 -620506 373889 -407136
40625d07136j824322j74822K276122K084191l57692j106406J066997K591470R58544
40616E106946j281955j164365k88744j358658k744405j174021K104524K901744
40608B101066Q98459k26583O00242L35753k069530l076703l86882K755468K209387
40599C140677j035462k779474j629771J28097N94141K15920m1388j24928k84598
40590a816786n42018q46957q43183Q6214J643192K279818J174246l54948p46418
40581C3160m94032q41956j195333j33488J554888J530917k84859j265963j51924
40572a248590J023210L50087r32987o41489R43830J907423J623597Q25104j85184
40563C665001j318525j589246m29637N83502k71978j613760m95723K707278L984661
$$ plain form
40625 -407136 -2231458 -2406280 -130158 1954033 1596341 489935 1556932 4148402 5106946
40616 5106946 3824991 2660626 2371882 1013224 -1731181 -2905202 -800678 2101066
40608 2101066 2999525 2772942 3373184 3708937 1639407 -1437296 -1824178 931290 3140677
40599 3140677 2105215 -674259 -2304030 -2175933 -1581792 -1365872 -1407260 -1532188 -1816786
40590 -1816786 -2358804 -3205761 -4048944 -3962730 -2319538 -39720 1134526 779578 33160
40581 33160 -460872 -1302828 -2498161 -2631649 -1076761 454156 169297 -1096666 -1248590
40572 -1248590 -225380 124707 -808280 -1449769 -505939 1401484 3025081 3850185 3665001
40563 3665001 2346476 757230 327593 911095 639117 -974643 -1470366 1236912 5221573
40554E221573J264097k431206l157514j253525o1109p37018j011176Q53767L087668
40545A775557K621756n90075k946599j493582K036188L065515J73999k852045
40537A790714k274799M49279J320170r7757q11556J34108N47830k66439k03193
40528E88357J024760M21447k827595m602173j807589K463771L528640J853525
40520F43143R46288J070179l4295j833585j615239K66435P66635l09012k6140
40511a25591J968178K329463j71435k231831j262349Q60769J394728O32362m0537
40502C353757q35135j821981j317443J229390L048765J635674j268221k131954
40494A892852o83565L72254k39289j118222j090726p63341q01986o38994L46289
$$ plain form
40554 5221573 6485670 4054464 896950 -356575 -417684 -1154702 -2165878 -1312111 1775557
40545 1775557 4397313 3807238 860639 -632943 1403245 4468760 4642759 1790714
40537 1790714 -484085 -34806 1285364 1187607 376051 510159 1057989 791550 588357
40528 588357 1613117 2034564 -793031 -5395204 -7202793 -4739022 -1210382 643143
40520 643143 1589431 2659610 2625315 791730 -823509 -557074 209561 -99451 -125591
40511 -125591 1842587 4172050 4000615 1768784 506435 1367204 2761932 3394294 3353757
40502 3353757 2518622 696641 -620802 608588 3657353 5293027 4024806 1892852
40494 1892852 1209287 1581541 1342252 224030 -866696 -1630037 -2432023 -3071017 -2724728
40485b724728J556730J852422J018863R2510K05004J162338J482882K37990j541549
40476C342462k070216j089270N1946L19585j42986q03304j106872l60903J311984
40467e47574K282542J339568j53745l1141J225635J293997j3805n78289K8999
40458D846187k94845k151511l086579j570247M57087Q26196K24122J00378O3210
40449e86002m68694l68062J124177K467156K172560J100774L46139q57223k755196
40440B175629l135818p68531J530641P48523j379185j131967J091775J778195
40432I09262M41356O0373J418337J716768k09071j626789o33044N71257m42721
40423B205728k094060j352482J288307K402341N61240j859418k076844l48378
$$ plain form
40485 -2724728 -1167998 684424 1703287 1795797 2000801 3163139 4646021 4884011 3342462
40476 3342462 1272246 182976 234922 554507 411521 -391783 -1498655 -1859558 -547574
40467 -547574 1734968 3074536 2920791 2889650 4115285 5409282 5395477 4817188 4846187
40458 4846187 4551342 2399831 -686748 -2256995 -1799908 -973712 -749590 -649212 -586002
40449 -586002 -1054696 -1422758 -298581 2168575 4341135 5441909 5788048 4930825 2175629
40440 2175629 -960189 -1728720 -198079 550444 -828741 -1960708 -868933 909262
40432 909262 1350618 1410991 2829328 4546096 4337025 2710236 2077192 2648449 2205728
40423 2205728 111668 -1240814 47493 2449834 3011074 1151656 -925188 -1273566
40415a273566Q37173K17365p16862j1048J740488K041708K30468j254879m36585
40406A374262J117739P35651j136136j750557n02755L67415k52041n56371Q87514
40397B84721K441592J708443r29988k782371k110295L40540K559679L044613J723993
40388F280927j24477j040034p80814k66518j40477j17971J11098K43269O676l41491
40378C830188n64125p67489q47105m52724Q6546k12935j358210j750294k50163
40369b286311J824779K107572L35065j304304j166117j16285K00372j42119J10399
40360d36949R93517J110454m9874j109961q26035R4017K16613m73210q63635n52622
40350a897685j10857J51408M38308O82276O65089P26606J177719J278846J79204
$$ plain form
40415 -1273566 -436393 -219028 -935890 -946938 793550 2835258 3065726 1810847 1374262
40406 1374262 2492001 3227652 2091516 340959 -161796 205619 -46422 -602793 284721
40397 284721 2726313 4434756 3504768 722397 -1387898 -1047358 1512321 4556934 6280927
40388 6280927 6156450 5116416 4335602 4069084 3928607 3810636 3921734 4165003 4171679 3830188
40378 3830188 3266063 2498574 1651469 1198745 1285291 1072356 -285854 -2036148 -2286311
40369 -2286311 -461532 1646040 1981105 676801 -489316 -605601 -405229 -547348 -436949
40360 -436949 556568 1667022 1617148 507187 -318848 -224831 -8218 -481428 -1345063 -1897685
40350 -1897685 -2008542 -1857134 -1418826 -736550 -71461 655145 1832864 3111710 3290914
40341C290914j322081j524600l35852O06232M66921J56858M12638O83382M72523
40332B906935J31540k70999j169699j931064r56461J583160K911086J043707k268530
40323A979675l527935j581412J540203L216638K578591O92033p49475j020744
40315C127574q05918q26750o53717J72168P00030n5669j016088m87368Q37811
40306I92073Q96457j30787k29361O15643M74590m98366m9364J522737J061074
40297D654696j779996l121140j149293P79212N4086p79235Q76179K485567Q40447
40288B860523j845130j384138J383998K173223J58828j504571j027515L82384
40280A197602J417656J608824M00907j545120j711966M87410J555704q30206l148887
$$ plain form
40341 3290914 1968833 444233 108381 714613 1181534 1338392 1751030 2434412 2906935
40332 2906935 3038475 2767476 1597777 -333287 -1289748 293412 3204498 4248205 1979675
40323 1979675 -1548260 -3129672 -1589469 1627169 4205760 4897793 4148318 3127574
40315 3127574 2321656 1494906 841189 1013357 1713387 1657718 641630 154262 992073
40306 992073 1888530 1757743 1528382 2144025 2618615 2120249 2070885 3593622 4654696
40297 4654696 2874700 -246440 -1395733 -616521 -562435 -1341670 -465491 2020076 2860523
40288 2860523 1015393 -368745 1015253 3188476 3347304 1842733 815218 1197602
40280 1197602 2615258 4224082 4624989 3079869 1367903 1855313 3411017 2580811 -568076
40271e68076j187357K763336L330065O34404n94206P79513J282946l65238j576805
40262D498582j292878j363631j981206j085795J020533J556926L41871K6578Q79800
40253B600780M97603r58777p40580Q04620L70584j744936j434095J621280K606672
40244C623151k58128k645318j705590l90469j103296j186230J432402L633999
40236A400521K369742k40492j105084j015017j434648q79819J438515K549191
40228C082909M49380j957588j576133Q9759O20632R82896K145186J771213j226371
40219D381883l095158j017242J672891J090652o28439L6528J026667j105548l693571
40210a331337j913505K390706L316885O18622o50655P43309R29082j194689j942585
$$ plain form
40271 -568076 -1755433 1007903 4337968 4972372 4378166 5157679 6440625 6075387 4498582
40262 4498582 3205704 1842073 -139133 -1224928 -204395 1352531 1694402 1720980 2600780
40253 2600780 3098383 2139606 1399026 2203646 2574230 829294 -604801 1016479 3623151
40244 3623151 3365023 719705 -985885 -1376354 -2479650 -3665880 -2233478 1400521
40236 1400521 3770263 3529771 2424687 1409670 -24978 -904797 533718 3082909
40228 3082909 3532289 1574701 -1432 88327 708959 1691855 3837041 5608254 4381883
40219 4381883 1286725 269483 1942374 3033026 2404587 2441115 3467782 2362234 -1331337
40210 -1331337 -3244842 -854136 2462749 3081371 2430716 3174025 4103107 2908418 965833
40201I65833K24285J990143J006170p58335j022892j99749P42566J520977J034968
40192E503966j526893l851549k813660L14102J279503m41436j040799J066716
40184a510050K921870K276525O27122l37640j147012j955264j382074N29010J570798
40175A593285Q60993l8776k99056q23262j439659o40888J148527J615394N26856
40166B503414k243L18441l95118j794914j142581J343266J812851p84089k356925
40157d97898j66505K754236K571900K09289j159011r22846l35365K55379P62597
40148C471776L82345n54298k91529J054923R93492q36513j371496M97018J395534
40139D741252p52128k631192r98874J657964J433244l72165j815J975390K029374
$$ plain form
40201 965833 1190118 3180261 4186431 3428096 2405204 2205455 2948021 4468998 5503966
40192 5503966 3977073 125524 -2688136 -2374034 -1094531 -1535967 -2576766 -1510050
40184 -1510050 1411820 3688345 4315467 3977827 2830815 875551 -506523 22487 1593285
40175 1593285 2454278 2415502 2116446 1293184 -146475 -787363 361164 1976558 2503414
40166 2503414 2501171 2819612 2424494 629580 -513001 830265 2643116 1859027 -497898
40157 -497898 -664403 2089833 4661733 4871022 3712011 2789165 2453800 2709179 3471776
40148 3471776 3854121 3299823 3008294 4063217 5056709 4220196 2848700 3345718 4741252
40139 4741252 3989124 1357932 359058 2017022 3450266 3078101 3076286 5051676 7081050
40130G081050O8863r02313m51984p66225j610396n63205J656192J415139j423694
40121D503427k442201K70422K711568J252146j664561j620665Q06258J265581
40113E081975j404651l457999j916996J190889J930639o0788j465706k27176J754510
40104A424697J826611N77846M95644J602776J281978j249564l110891j786892
40096A062205J168896K299194O84506j531146k079200n93455J495864K088355
40088D595219M17593j451552p05714K014742K819246J49368k621886k185150p3427
40079B958439L91311o07687o85138J62422K81193K20930J566156K834110J161993
40070H283729k177883k778205r7142J419124m77526k304573p73332K041336K561128
$$ plain form
40130 7081050 7149913 6247600 5795616 5029391 3418995 2855790 4511982 5927121 4503427
40121 4503427 2061226 2331648 5043216 6295362 4630801 3010136 3816394 5081975
40113 5081975 3677324 219325 -1697671 -506782 1423857 1363069 -102637 -329813 1424697
40104 1424697 3251308 3829154 4324798 5927574 7209552 5959988 2849097 1062205
40096 1062205 2231101 4530295 5214801 3683655 1604455 1011000 2506864 4595219
40088 4595219 5012812 3561260 2855546 4870288 7689534 7838902 5217016 3031866 2958439
40079 2958439 3349750 2742063 2056925 2219347 2500540 2721470 4287626 7121736 8283729
40070 8283729 6105846 3327641 3230499 4649623 4172097 1867524 1094192 3135528 5696656
40061E696656J269436Q17066J119531J90704j661001k149723q86023J83582K3092
40052D603320l84988j74292L24403P17609R86080P89368j17144r08541n99734
40043E236081L29854O96160O01151R79024J504015R25128n26761j104316k55615
40034H384721N45536K37578l83942m17042l03262n31575n04406R7420K96715m19239
40024G002504p00678N57217J873100J089916j086936j882805o56589K37308o43710
40015E789327j530009m13095J655452K171136Q48744m13196o68415r23636j881009
40006D635299k469605j344404J174754L289381L366271J313217j097493j486702
39998G380718O14529K681858J867386j255264l144506j834783P09395J674108
$$ plain form
40061 5696656 6966092 7783158 8902689 9093393 7432392 5282669 4396646 4580228 4603320
40052 4603320 4218332 4044040 4368443 5086052 6072132 6861500 6744356 5835815 5236081
40043 5236081 5565935 6262095 6863246 7842270 9346285 10271413 9744652 8640336 8384721
40034 8384721 8930257 9167835 8783893 8366851 8063589 7532014 7027608 7125028 7421743 7002504
40024 7002504 6301826 6859043 8732143 9822059 8735123 6852318 6195729 6433037 5789327
40015 5789327 4259318 3846223 5501675 7672811 8521555 8108359 7439944 6516308 4635299
40006 4635299 2165694 821290 1996044 5285425 8651696 9964913 8867420 7380718
39998 7380718 7995247 10677105 12544491 11289227 8144721 6309938 7019333 8693441
39990H693441J085604Q06900J163225P78716o43297j583322j117802l18900n01041
39981H363524j342746j606900q42142M23680J516436J950007J525722P65433O81858
39972A1434872J416192J668447L47195j658213k372597j189990O11896J748056
39964A2005858K144143K059667J270641j17688j001686m71916Q09358J370123
39956A8068500P65281k23942r51901j454486j677233j201171l0111J102521J525918
39947A5923376J234024O42863L21856Q74311K299688L525982L462580K447098
39939C0731778J645040J257987P87683Q97965K900194N991280P435937O571325
39931E8219189O128784P889865R631918Q945544P647364Q751022J0706278R124437
$$ plain form
39990 8693441 9779045 10585945 11749170 12527886 11884589 10301267 9183465 8864565 8363524
39981 8363524 7020778 5413878 4571736 4995416 6511852 8461859 9987581 10753014 11434872
39972 11434872 12851064 14519511 14866706 13208493 10835896 9645906 10257802 12005858
39964 12005858 14150001 16209668 17480309 17362621 16360935 15889019 16698377 18068500
39956 18068500 18833781 18609839 17657938 16203452 14526219 13325048 13294937 14397458 15923376
39947 15923376 17157400 17800263 18122119 18996430 21296118 24822100 28284680 30731778
39939 30731778 32376818 33634805 34422488 35320453 38220647 44211927 51647864 58219189
39931 58219189 64347973 72237838 81869756 90815300 98462664 107213686 117919964 127044401
39923A27044401L887875O387O06750L170245M117792L241816J593625j274173
39915A42394718n019523o509135l652989P32037K298917R80807J86405J450366
39907A32861603L352620M892314O184023O038863K740668k171759m495541k977068
39899A46425723j270079k789742o380310q906551r613527r600217q958603p123485
39891I1783209m939403l903526l894695l606374k651585j404665N18971L460206
39883G5362138N869738N700513L716113L045898M993933P588349R043025J0160035
39875A25479742J1713309J1676218P674008J259192k815902j700158K896630P149847
39867A63332886Q557138O785640K949623r88428l138051k912771j006524J835183
$$ plain form
39923 127044401 130932276 130938663 131545413 134715658 138833450 142075266 143668891 142394718
39915 142394718 137375195 130866060 127213071 127945108 130244025 131224832 131411237 132861603
39907 132861603 136214223 141106537 147290560 153329423 156070091 153898332 149402791 146425723
39899 146425723 145155644 142365902 135985592 127079041 117465514 107865297 98906694 91783209
39891 91783209 86843806 82940280 79045585 75439211 72787626 71382961 71901932 75362138
39883 75362138 81231876 86932389 90648502 93694400 98688333 106276682 115319707 125479742
39875 125479742 137193051 148869269 156543277 157802469 154986567 153286409 156183039 163332886
39867 163332886 171890024 178675664 181625287 180636859 177498808 174586037 173579513 175414696
39859A75414696N017890P036534N863858J400197l552317n871870m980733k383343
39851A77944912M72783K509378K267804r47631n162515o962281n345214k899565
39843A61877671k259121k681576j539463J563840L976598L460587Q25823j807083
39835A63417276l981457o310693p619623n468523m44611K712673N54970m348731
39827A38511281p003433o778921o693191o784418l621431K419830N221098J744787
39819A17015602k180610k509N502117O850533M186916N143618J2108508J7420681
39811A66044856J4228164O045299J312800K784234O766921R737147J0890548R705596
39803B27515565N455576p36945o037365q232266o814066k994589N3918j075668
$$ plain form
39859 175414696 180432586 187469120 193332978 194733175 191180858 185308988 180328255 177944912
39851 177944912 178417695 180927073 183194877 182247246 177084731 170122450 164777236 161877671
39843 161877671 159618550 156936974 155397511 156961351 160937949 164398536 165224359 163417276
39835 163417276 159435819 153125126 145505503 140036980 139592369 142305042 142860012 138511281
39827 138511281 131507848 124728927 118035736 111251318 107629887 110049717 115270815 117015602
39819 117015602 114834992 114832483 120334600 127185133 131372049 136515667 148624175 166044856
39811 166044856 180273020 186318319 187631119 190415353 197182274 206919421 217809969 227515565
39803 227515565 232971141 232234196 226196831 217964565 211150499 208155910 208209828 207134160
39795B07134160o060276j0342182j0557456q501377p532652p458955o046147l489336
39787A47145779j691086n45427J266719K869581K535192J703386L477189P234746
39779A63996079Q858745O671009L212492O21902j635142l445572k759159L86452
39771A75906806K164383k48562m881176q124855r136912q953345p779594n816720
39763A33130025m827783o129027q242489q813081p795331o780311o283401n681655
39755G8576947m917901m381004l740012k430361p47813N67704J023160N2990k471568
39746F1532142m684214l790573J1329K879153K226658k5666j019380j162189k084168
39737E3883092k867921j768272J37171O49767L24774Q93053J230669p73201l310537
$$ plain form
39795 207134160 201073884 190731702 180174246 171672869 164140217 156681262 150635115 147145779
39787 147145779 145454693 144909266 146175985 149045566 151580758 153284144 156761333 163996079
39779 163996079 172854824 179525833 182738325 183360227 181725085 178279513 175520354 175906806
39771 175906806 178071189 177822627 172941451 164816596 155679684 146726339 138946745 133130025
39763 133130025 128302242 122173215 113930726 105117645 97322314 90542003 84258602 78576947
39755 78576947 73659046 69278042 65538030 63107669 62359856 62927560 63950720 64003710 61532142
39746 61532142 56847928 53057355 53068684 55947837 58174495 58148829 57129449 55967260 53883092
39737 53883092 51015171 49246899 49384070 50033837 50358611 51251664 52482333 51709132 48398595
39728D8398595k512461R49226K215633j47585k036862q25722N67041q09159k852986
39719D2945720k269239J5998J039667P67110J146592K112286K048372Q87526l13993
39710D8380039j598893l064365l076872o44526J751127J068769j543671k411120
39702C8860488r98566j19457p00204l92584J844253L482128K303271k72420j456637
39693D2550272o39312Q20367J701722J522483L16508j176608k046345k323504
39685D0725583k474121j967817j14720J809061J611061l52001j295504k46204
39677C7695338N40241m97459j691194j301505o21708j464395k520389j169202
39669B8969727K054385L634849J664048j889559l792085k888589m63615J588671
$$ plain form
39728 48398595 45886134 46835360 49050993 48903408 46866546 46040824 46607865 45798706 42945720
39719 42945720 40676481 40692479 41732146 42499256 43645848 45758134 47806506 48694032 48380039
39710 48380039 46781146 43716781 40639909 39995383 41746510 42815279 41271608 38860488
39702 38860488 37861922 37742465 37042261 36649677 38493930 41976058 44279329 44006909 42550272
39693 42550272 41910960 42731327 44433049 45955532 46272040 45095432 43049087 40725583
39685 40725583 38251462 36283645 36168925 37977986 39589047 39237046 37941542 37695338
39677 37695338 38235579 37738120 36046926 34745421 34123713 32659318 30138929 28969727
39669 28969727 31024112 34658961 36323009 34433450 30641365 27752776 27289161 28877832
39661B8877832K293752J702922J61062j862589l144153k195235M52326J720424
39653B8006341k15456k665132j830644J229986J857662q37196k370420j11803
39645B3063338K467871J568173r86704j369501j20763m50490k275370k506981
39637A9389573k75155K144899L085895K801990J661637J27615k72789R94736J515624
39628C1174025p02008l156070j967250J937356L983936K763734J301816J594619
39620C6930158K327374K520758L269600N043051O947266R146699J2182970J3705808
39612I2073684J0582131N162869M376903J0453031J6894068J6306692Q819624
39605A64669002M80801l472831j791525K797857M515339j140777j1479069j8067626
$$ plain form
39661 28877832 31171584 32874506 33035568 31172979 28028826 25833591 26285917 28006341
39653 28006341 27790885 25125753 23295109 24525095 26382757 25545561 23175141 23063338
39645 23063338 25531209 27099382 26112678 24743177 24622414 24171924 21896554 19389573
39637 19389573 19114418 21259317 24345212 27147202 28808839 28936454 28663665 29658401 31174025
39628 31174025 30472017 27315947 25348697 27286053 31269989 34033723 35335539 36930158
39620 36930158 39257532 41778290 45047890 50090941 57038207 66184906 78367876 92073684
39612 92073684 102655815 107818684 112195587 122648618 139542686 155849378 164669002
39605 164669002 165149803 161676972 159885447 162683304 167198643 166057866 154578797 136511171
39597A36511171j6348412j0647507p496798p814613q726429r351845j0575085
39590F5550482j1519364j0374301p463426m511369k221391q51472j212065k752977
39582B4644117k906935p86443Q75288j2196j403424p50248O85200M79166o06339
39573B0218186n38427O4305l45618p25564N46408K038179J411126n20001j443113
39564B0705481j420956j590652j112018Q26173K190242J298678M46482J969739
39556B3313169L279501R27173k746944k831247J03413J344892J48167j2162J352476
39547B4878438J038592j167725j693194J24381Q02252o59696r90896R68093J944656
39538B5244901K63037j181740r9894J896106L048202L862060M265002L206810
$$ plain form
39597 136511171 120162759 109515252 102018454 94203841 85477412 76125567 65550482
39590 65550482 54031118 43656817 36193391 31682022 29460631 28609159 27397094 24644117
39582 24644117 21737182 20950739 21826027 21813831 20410407 19660159 20345359 20824525 20218186
39573 20218186 19679759 19744064 19398446 18672882 19219290 21257469 22668595 22148594 20705481
39564 20705481 19284525 17693873 16581855 17408028 19598270 20896948 21343430 23313169
39556 23313169 26592670 27519843 24772899 21941652 22045065 23389957 23538124 23525962 24878438
39547 24878438 25917030 24749305 23056111 23180492 23982744 23323048 22332152 23300245 25244901
39538 25244901 25507938 24326198 24226304 26122410 29170612 33032672 37297674 40504484
39530D0504484K404285N217387J0400449J2611344J0628929Q894192R281018Q650266
39522A08592354P201198J0829606K0134163K4835900J6277922J6113j0978234
39515A76909022j1203346m344934M773423J1873075J0666085j897200j8368259
39508A68407866k6461795k2493756j3591145p257114m949327n653322q904888
39501G9096519j2625633j3288159j0326502o843992m956002l759691k394430j659472
39493B3242638j962537k563376l106399l446264k562155l47697P64137p81070
39485I237277k221960m20583K489968K220536m22980j129874J0334j177706m522897
39476D062115m513054M48704M491325L044519o34932j426387J58805P08381J00806
$$ plain form
39530 40504484 42908769 48126156 58526605 71137949 81766878 90661070 99942088 108592354
39522 108592354 115793552 126623158 146757321 171593221 187871143 187887256 176909022
39515 176909022 165705676 161360742 166134165 178007240 188673325 186776125 168407866
39508 168407866 141946071 119452315 105861170 98604056 93654729 88001407 79096519
39501 79096519 66470886 53182727 42856225 36012233 31056231 27296540 24902110 23242638
39493 23242638 21280101 18716725 15610326 12164062 9601907 9254210 10018347 9237277
39485 9237277 7015317 6594734 9084702 11305238 10882258 9752384 9762718 8585012 4062115
39476 4062115 -450939 -2235 4489090 7533609 6898677 5472290 5631095 6339476 6440282
39467F440282L92026J338084J240673K92936l57859j039640k093273k020881M559
39458D196907J866777J636568P73883J164178J366076n39577k550518j519613
39450F394681J145995J218773j533195k952886j166282Q50812N07692o15672j38045
39441C711873J161897J147726p4408p08845j22105P96871J261966J028370p6397
39432H126948j675466k422613j308960Q85628K388963K390841J404313J06312
39424I895966j159470j906611j637778o99717j83803n58967r74986l98312R64117
39415C340439J923216J771026Q99549J100p09183j255886j458810j185494p20019
39406B605938m18460k15432R5591L26404J71098j38453n1335M85091J037981J480757
$$ plain form
39467 6440282 6832308 8170392 9411065 9704001 9346142 8306502 6213229 4192348 4196907
39458 4196907 6063684 7700252 8474135 9638313 11004389 10464812 7914294 6394681
39450 6394681 7540676 8759449 7226254 4273368 3107086 3957898 4465590 3849918 3711873
39441 3711873 4873770 6021496 5947088 5238243 5116138 5913009 7174975 8203345 8126948
39432 8126948 6451482 4028869 2719909 3605537 5994500 8385341 9789654 9895966
39424 9895966 8736496 6829885 5192107 4492390 4308587 3749620 2774634 2376322 3340439
39415 3340439 5263655 7034681 7934230 7935330 7226147 5970261 4511451 3325957 2605938
39406 2605938 2187478 1972046 2067637 2394041 2565139 2426686 2375351 2860442 3898423 5379180
39396E379180K000890K184908J067363j270965k944658k209636Q2773J224952
39388E514807J57657j005398M2763K253619K448171Q403j836843n43875J811530
39379H850834J319944k073066m428686l371622r36614Q2056l6925M09234J192885
39370A008040R55568R1241J55909R39749P29365n20917q17919N07287J386160
39361D434483J22123j908330k197604n50810J042806J317238Q59721M57772p5023
39352C502376q50732r35824L73040J854768J441235p88928k196785j092012P22227
39343B029365N83958q99515q39852J106226J956043L03727j077231M10354K742810
39334F315885K166909r43771k475432n30020K076281J953095n17788k166193j126268
$$ plain form
39396 5379180 7380070 9564978 10632341 9361376 6416718 4207082 4289855 5514807
39388 5514807 5672464 4667066 4709829 6963448 9411619 9420022 7583179 7039304 8850834
39379 8850834 10170778 8097712 3669026 297404 -639210 -557154 -594079 -184845 1008040
39370 1008040 1963608 2054849 2210758 3150507 3879872 3358955 2541036 3048323 4434483
39361 4434483 4556606 2648276 450672 -100138 942668 2259906 3119627 3577399 3502376
39352 3502376 2651644 1715820 2088860 3943628 5384863 4595935 2399150 1307138 2029365
39343 2029365 2613323 1713808 873956 1980182 3936225 4239952 3162721 3573075 6315885
39334 6315885 8482794 7539023 5063591 4533571 6609852 8562947 8045159 5878966 4752698
39325D752698J130573J648636l94150k279955r77990K302675L009386k87332l134938
39316E769603j433942K135246J895799k131978m209847j576374J818587J788520
39308D055614k71515o97737O43716J147474N2370r15113n75065M79552J276159
39299E195455J370326P29108j44557n02052m58890q63580j542035j180470K81655
39290B884960R90760O8746q04688k60903L17108o85337j963170j262621Q20852
39281A05707J856502J526988J573301K185842J574401n91341k244410k169815
39273C817175j553261j295744l85544J567481K608582J353695l34836j40509P24945
39264F361984n57637l220490l260217M03252L563487K377766j308012k879430
$$ plain form
39325 4752698 5883271 7531907 7137757 4857802 3879812 6182487 9191873 8904541 5769603
39316 5769603 4335661 6470907 8366706 6234728 2024881 448507 2267094 4055614
39308 4055614 3784099 3086362 3730078 4877552 4929922 4014809 3439744 3919296 5195455
39299 5195455 6565781 7294889 7150332 6648280 6189390 5325810 3783775 2603305 2884960
39290 2884960 3875720 3944466 3139778 2878875 3195983 2510646 547476 -715145 105707
39281 105707 1962209 3489197 5062498 7248340 8822741 8231400 5986990 3817175
39273 3817175 2263914 968170 582626 2150107 4758689 6112384 5777548 5637039 6361984
39264 6361984 5804347 2583857 -676360 -273108 3290379 5668145 4360133 1480703
39256A480703j312974M75972O03964J31527P6856j42617n45906J14393J677596
39247B559514J967466L94318n31454P52817J933080M96084j979314k282040n20214
39238B790257O98175O54253O22734O35483k28111j020934j47526J025245k88202
39229D741374l220697l836681j163348J459065J725853R25977K74778r05865k019788
39220b019332q23950J874476J869413j553019l199677J11066L894376K796136
39212B949489r98268j655541R50614J864614m88287k459448j598035L39392J310689
39203B15219J515631J318919M15691l59496J99020Q30282p29474l270171l053299
39194b917678J50113K128954O36656j321565o14022J273966J333435m0526l46627
$$ plain form
39256 1480703 167729 643701 1247665 1379192 1456048 1313431 767525 881918 2559514
39247 2559514 4526980 4921298 4389844 5142661 7075741 7571825 5592511 3310471 2790257
39238 2790257 3488432 4142685 4765419 5400902 5172791 4151857 4004331 5029576 4741374
39229 4741374 1520677 -2316004 -3479352 -2020287 -294434 631543 906321 456 -2019332
39220 -2019332 -2843282 -968806 900607 -652412 -3852089 -3741023 153353 2949489
39212 2949489 1951221 295680 1246294 3110908 2622621 163173 -1434862 -1095470 215219
39203 215219 1730850 3049769 3465460 3105964 3304984 4135266 3405792 135621 -2917678
39194 -2917678 -2767565 -638611 -1955 -1323520 -1937542 -663576 669859 629333 282706
39185B82706P09321J288273Q11400N76970J249909J788805J066227o40662j939678
39176E193271j642146m8811R84833P580j971890k523504j004821P49499J292273
39167A036284J325560J745119J744637L93483j207515j186396K94932J180516
39159E326620L25974j252147k080371j941924j357048l22597J366415K818500
39151B883422K398240M7409j804486j043905J012281J241868o37384j554858N5781
39142B598368J733552J113370j79001M06042J645350O63929j626297j496275J440769
39133F299807L269429J651556j114077k075385j311351k21323Q29898J581351
39125H909905J311132P22064J771040M223544N265840M108944L671468N450614
$$ plain form
39185 282706 992027 2280300 3091700 3668670 4918579 6707384 7773611 7132949 5193271
39176 5193271 3551125 3502314 4487147 4494727 2522837 -667 -1005488 -255989 1036284
39167 1036284 2361844 4106963 5851600 6245083 5037568 3851172 4146104 5326620
39159 5326620 5652594 4400447 2320076 378152 -978896 -1301493 64922 2883422
39151 2883422 5281662 5329071 3524585 2480680 3492961 4734829 4097445 2542587 2598368
39142 2598368 4331920 5445290 5266289 5672331 7317681 7981610 6355313 4859038 6299807
39133 6299807 9569236 11220792 10106715 8031330 6719979 6498656 7328554 8909905
39125 8909905 10221037 10943101 12714141 16937685 22203525 26312469 29983937 35434551
39117C5434551O141836K577614k827405n364093m644193l933800m422072m400576
39109A8561862l396457k933835l191190k657137j377158j030399j394459l17321
39101B263906K056219K683496N46744j321954o09249O97752n7397j765652j771117
39092B722748m47414j55064q53755l01482J642517K273715K48448k184204k306848
39083F38661l04389J680837K279869J451926l55785k180299k572798j069422Q46936
39074D15536J381845N80373j67463j88971J30390N50789J031701Q76404m77346
39065D133258j816466j196120R76280J897886K89075j636228j523356l13686k69223
39056E41420j038552l72972J852437L109261J904638l81672j853041k132795j382415
$$ plain form
39117 35434551 41576387 44154001 41326596 35962503 31318310 27384510 22962438 18561862
39109 18561862 15165405 12231570 9040380 6383243 5006085 3975686 2581227 2263906
39101 2263906 4320125 7003621 7550365 6228411 5619162 6316914 6259517 4493865 2722748
39092 2722748 2275334 2120270 1266515 965033 2607550 4881265 5129713 2945509 638661
39083 638661 334272 2015109 4294978 5746904 5391119 3210820 638022 -431400 415536
39074 415536 1797381 2377754 2210291 2021320 2151710 2702499 3734200 4610604 4133258
39065 4133258 2316792 1120672 2096952 3994838 4283913 2647685 1124329 810643 541420
39056 541420 -497132 -870104 982333 4091594 5996232 5614560 3761519 1628724 246309
39047B46309M96814K512181K452682j60708k462106j551201J457012K723682P45737
39038F460402j816022j746240Q01554K844078K199330l49935k306079k127997
39030C959091m33020J020860J025831l38738j996277k532010j123239J493064
39022A075562L235042K578094K32324j586325j487287r2409R01169M06110j056775
39013D205505j712922l60808J866970K449683O97016j212214j310914m39183k64394
39004C918739l44050N55083J562010J053648M0384Q13995K507254J788534j531212
38995A0364385l526310k114979j64762n00519j342516J99958K800183K765927
38987H481367k25276k692665k171415K49171K048552J867659J32817j354729q08617
$$ plain form
39047 246309 743123 3255304 5707986 5547278 3085172 1533971 2990983 5714665 6460402
39038 6460402 4644380 2898140 3699694 6543772 8743102 8393167 6087088 3959091
39030 3959091 3526071 4546931 5572762 5234024 3237747 705737 -417502 1075562
39022 1075562 4310604 6888698 7121022 5534697 4047410 3955001 4856170 5262280 4205505
39013 4205505 2492583 2131775 3998745 6448428 7145444 5933230 4622316 4183133 3918739
39004 3918739 3574689 4129772 5691782 6745430 6785814 7599809 10107063 11895597 10364385
38995 10364385 6838075 4723096 4558334 4057815 2715299 2915257 5715440 8481367
38987 8481367 8256091 5563426 3392011 3641182 5689734 7557393 7690210 6335481 5526864
38978E526864J382927K673453J649724M6727L9157R92051Q52780m58542j250721
38969A1454420q06610J55750J083053J713322J296507l61242j648429q18493J502680
38960A3570958L053999K713351J308995M56925J589715M833119P903731Q128319
38952D3559112O699394Q054650J3315712J8276301K0941421K6018749L5757015
38945A72622354M0258369K6271444l959171l1148881l9329601l1377829k0974940
38938A12361745j5526700j2599331q793391m809425k015793O21722M479166Q850265
38930H2568258J2395129J6130767K3049148L2981672L8139773K7741995Q34677
38923B33841419k7875508m0618116l4887074k3888185j8757543j7509189j3837876
$$ plain form
38978 5526864 6909791 9583244 11232968 11279695 11318852 12310903 13163683 12705141 11454420
38969 11454420 10647810 10803560 11886613 13599935 14896442 14535200 12886771 12068278 13570958
38960 13570958 16624957 19338308 20647303 21104228 22693943 27527062 35430793 43559112
38952 43559112 50258506 58313156 71628868 89905169 110846590 136865339 172622354
38945 172622354 212880723 239152167 235192996 204044115 164714514 133336685 112361745
38938 112361745 96835045 84235714 75442323 70632898 68617105 69238827 73717993 82568258
38930 82568258 94963387 111094154 134143302 167124974 205264747 233006742 233841419
38923 233841419 205965911 165347795 130460721 106572536 87814993 70305804 56467928
38916E6467928q684136o760761p142117n147891j078741K47611k058145l481819
38908B2361929j512119J048999J341797L43714r1023k87095r98424j449809q43565
38899A9914404J64251O41383M39928m19933j742814k365372j236664O28935J203506
38890A7227624L94164j15760K01514K89448o0981Q4291N10711o6966j248972j011195
38880A6203878P87067J677463M25576r29964k72247J509501K176531J214740j73781
38871B2618764q75112n47287M39389J073725P83007N73294J595947K767935K106687
38862C0536349N04521J222275M823193P736297P419225O028171O840966R644117
38854G4755114J2296684J4821408J9007276K5060663L0918952L3860118L1319228
$$ plain form
38916 56467928 47783792 41023031 33880914 28733023 27654282 27901893 25843748 22361929
38908 22361929 20849810 21898809 23240606 23584320 23493297 23206202 22207778 20757969 19914404
38899 19914404 20078655 20720038 21159966 20740033 18997219 16631847 15395183 16024118 17227624
38890 17227624 17621788 17506028 17707542 17996990 17936009 18020300 18531011 18464045 17215073 16203878
38880 16203878 16990945 18668408 19093984 18164020 17891773 19401274 21577805 22792545 22618764
38871 22618764 21743652 21196365 21635754 22709479 23492486 24065780 25661727 28429662 30536349
38862 30536349 31040870 32263145 37086338 44822635 52241860 58270031 65110997 74755114
38854 74755114 87051798 101873206 120880482 145941145 176860097 210720215 242039443
38847B42039443K2372961J0802582M019291N024527P081743Q44218j3858001k7790622
38839B50536142l3628260l2488727k8489816k2589900j4889642q346854n567279
38832A04535664m499402j669492K108169L641986L712004O597991J3327723K0195381
38824A47950024K4768687K8436525L1151400K8847309K0034749J1022535R183068
38817C01394297J2753969J2551378L580601r361696j7559832j5768815m325411
38810B83264491J0469309J7124693O585228j7013223l7467976m2369938l4620391
38803A85972193k5057775j8536499j2893315p474812m455553k661707K125207
38796A17017739R903530J6268128K0413963K5735275K9992076K3235357J462773
$$ plain form
38847 242039443 264412404 275214986 279234277 284258804 291340547 292184765 278326764 250536142
38839 250536142 216907882 184419155 155929339 133339439 118449797 110102943 104535664
38832 104535664 100036262 98366770 100474939 104116925 107828929 114426920 127754643 147950024
38824 147950024 172718711 201155236 232306636 261153945 281188694 292211229 301394297
38817 301394297 314148266 326699644 330280245 320918549 303358717 287589902 283264491
38810 283264491 293733800 310858493 317443721 300430498 262962522 220592584 185972193
38803 185972193 160914418 142377919 129484604 122009792 117554239 114892532 117017739
38796 117017739 126921269 143189397 163603360 189338635 219330711 242566068 244028841
38789B44028841k3678399l6171837l3319180k5461084k0762996j8098025j4448634
38782G2088686j1092889r715656q364221n123558k045273j814519l148177k994894
38774B7789499j539675j509069l261507l940352j932242N27972N06307j568080
38766A5072853k700591j511387J82137K75588o83003o79251N30617J099556j2777
38757A1573742j498997j661824n86782M59786P62133M47766r8685l92723j97995
38748H806421j61002j056879k088648j497897N42697J599571O33317j24532J354120
38739H007168L527482L622928J730347O5990n78113j021795j345778j080851r88772
38730A1938606j904878k433545o82072K146682K918350J157392n55471p55640
$$ plain form
38789 244028841 220350442 184178605 150859425 125398341 104635345 86537320 72088686
38782 72088686 60995797 51280141 42915920 37792362 35747089 33932570 30784393 27789499
38774 27789499 26249824 24740755 21479248 17538896 15606654 16134626 16640933 15072853
38766 15072853 12372262 10860875 11043012 11318600 10635597 9956346 10486963 11586519 11573742
38757 11573742 10074745 8412921 7826139 8285925 9048058 9495824 9397139 9004416 8806421
38748 8806421 8645419 7588540 5499892 4001995 4544692 6144263 6777580 6653048 8007168
38739 8007168 11534650 15157578 16887925 16953915 16375802 15354007 14008229 12927378 11938606
38730 11938606 10033728 7600183 6918111 9064793 11983143 13140535 12585064 11829424
38722A1829424n15690n08032J5649P09709o4285j919311k120489J00195J905903
38713I433073J095729p83061j292523n48353K3144J19592m0845p35695j566934
38704E704127j271685k4828L25282m96290m88501P10769O14033j370909j796722
38695A905276J127832L414651J085007l016950l303542j76120J035243j108279
38687I63118k376399l80581J750464J001040q11949m89653J659537K918668J963711
38678F197956l86424k513863k767033o03868K031966K319908L45372q34697K71679
38669D060996J465794N64944j221788j483955k22000P60544O78704J30375l10289
38660D423325l30150L41859J138793O99074j113517k370901j493011N66511J710000
$$ plain form
38722 11829424 11313734 10805702 10821351 11531060 11466775 9547464 7426975 7527170 9433073
38713 9433073 10528802 9745741 8453218 7904865 7928009 8047601 8006756 7271061 5704127
38704 5704127 4432442 4407614 4732896 4236606 3748105 4458874 5072907 3701998 1905276
38695 1905276 3033108 6447759 7532766 4515816 1212274 1036154 2071397 963118
38687 963118 -1413281 -1793862 -43398 957642 145693 -343960 1315577 4234245 6197956
38678 6197956 5811532 3297669 530636 -73232 1958734 4278642 4624014 3789317 4060996
38669 4060996 5526790 6091734 4869946 3385991 3163991 3924535 4603239 4733614 4423325
38660 4423325 4093175 4435034 5573827 6272901 5159384 2788483 1295472 1861983 3571983
38651C571983J216572j85782j588876k136905j223822L64533P28550n74491j580414
38642a408652p52227P61770J174084P81113Q25798J065912N51705k97648m77779
38633B224076k83812m01807j88297R61380J666290N50121q00429J48800K464983
38624F341305K593855l48297l294888l685087k197970l97468J286537K188752
38616B486739J050142j419713k285058m37165J494418J086452m26185p28552r6807
38607G24271K6184M330O60154P71146q33150k145557n99084K200305K378407q676
38597C178330j078229K70262O38566j518851k663248j90655K544536J374784j660974
38588H94521j480136J665083K542252n17491k964080j364085J474489J484834
$$ plain form
38651 3571983 4788555 4602773 3013897 876992 -346830 17703 746253 171762 -1408652
38642 -1408652 -2160879 -1399109 -225025 556088 1381886 2447798 2999503 2701855 2224076
38633 2224076 1940264 1538457 1350160 2311540 3977830 4527951 3727522 3876322 6341305
38624 6341305 8935160 8586863 5291975 1606888 -591082 -988550 297987 2486739
38616 2486739 3536881 2117168 -167890 -605055 889363 1975815 1549630 821078 724271
38607 724271 750455 754785 1414939 2186085 1352935 -792622 -1391706 808599 3187006 3178330
38597 3178330 2100101 2370363 3008929 1490078 -1173170 -1363825 1180711 2555495 894521
38588 894521 -585615 1079468 3621720 3104229 140149 -1223936 250553 1735387
38580A735387l14583j35853K219713L216225R87433k367741l859604k562558M62995
38571f18586L093055L071651J27430k766741k270886J034716L267905K356292
38563G294836K76310l69702L73655J107014J492859J759099J413579J85616r13859
38554A2619407j013997q08544j119959j206965j86024R10120M41440j180365k096190
38545F358923j771680j216316p97744P0013J101618J104681R4139m42808J01620
38536D602446N41325n4090r50909j122297o79778j89257K63686O07494M16491
38527C435111l46937j088603j450712j474922q01185R24457K610839K368520J88890
38518D365458j677445j762819j073441q22192m07557Q92471J955327J428570O6462
$$ plain form
38580 1735387 1420804 1284951 3504664 6720889 7708322 5340581 1480977 -1081581 -618586
38571 -618586 2474469 5546120 5673550 2906809 635923 1670639 4938544 7294836
38563 7294836 7571146 7201444 7575099 8682113 10174972 11934071 13347650 13533266 12619407
38554 12619407 11605410 10796866 9676907 8469942 8283918 9194038 9635478 8455113 6358923
38545 6358923 4587243 3370927 2573183 2643196 3744814 4849495 4943634 4500826 4602446
38536 4602446 5143771 5089681 4138772 3016475 2336697 2147440 2411126 3018620 3435111
38527 3435111 3088174 1999571 548859 -926063 -1727248 -802791 1808048 4176568 4365458
38518 4365458 2688013 925194 -148247 -970439 -1377996 -485525 1469802 2898372 2964834
38509B964834m09810J71466P51261Q84672N56471p20838k615635k889285p6856
38500a383720L464401L923330J207015j066439q96417k17910j009798j973280
38492B047182r53557J304848K055177L66351j774823k077475n50824P29927J65541
38483A312347j241403r13980J670880L540741J976121j287489k135240o0786J080085
38474C941276r17997l109099j916256J461971K972685J458734m91624q16217l12135
38465B271338m68422j161055j312824n86837L57204Q17462Q68870J172654J797227
38456C755617J645007M3249j477678q53762R76874P57738j974622l428680j176624
38447a732881J692481J147949j427636j511646J309618K907703J235752j061239
$$ plain form
38509 2964834 2555024 2726490 3477751 4362423 4918894 4198056 1582421 -1306864 -1383720
38500 -1383720 2080681 6004011 7211026 6144587 5248170 5030260 4020462 2047182
38492 2047182 1093625 2398473 4453650 4820001 3045178 967703 416879 1146806 1312347
38483 1312347 70944 -843036 827844 4368585 6344706 5057217 2921977 2861191 3941276
38474 3941276 3023279 -85820 -2002076 -540105 2432580 3891314 3399690 2583473 2271338
38465 2271338 1802916 641861 -670963 -1257800 -900596 -83134 785736 1958390 3755617
38456 3755617 5400624 5443873 3966195 3112433 4089307 4847045 2872423 -556257 -1732881
38447 -1732881 -40400 1107549 -320087 -1831733 -522115 2385588 3621340 2560101
38439B560101j425766p36073m67418p6992R22062J312209O11232M95078J720837
38430D915270K167196K57892j998586k006113o01676k42828q69162o68086K77424
38421A231331L75828j74814K25473J165411N33850j472500j938246K12586K216906
38412B375825J590597k18824l34733J184965J825601N24512j152222j572231r06638
38403C316852j32450L70881N90291K85471n17349j036083o59545r4997n68010
38394A555061j794908j921550j25994J793771J633377j53625j176847n35999L36322
38385c90392L37951J13765J71658k77054j356097j383625N32477K396513J965737
38376B110933K26098k02361P42274P39314p55642j403020K79760K442322K421358
$$ plain form
38439 2560101 1134335 398262 -69156 -146148 775914 2088123 2699355 3194433 4915270
38430 4915270 7082466 7340358 5341772 3335659 2733983 2491155 1621993 953907 1231331
38421 1231331 1607159 1432345 1657818 2823229 3357079 1884579 -53667 158919 2375825
38412 2375825 3966422 3747598 3412865 4597830 6423431 6947943 5795721 4223490 3316852
38403 3316852 3184402 3555283 4145574 4431045 3913696 2877613 2218068 2123071 1555061
38394 1555061 -239847 -2161397 -2287391 -493620 1139757 986132 -190715 -726714 -390392
38385 -390392 -52441 61324 232982 -44072 -1400169 -2783794 -2251317 145196 2110933
38376 2110933 2337031 2134670 2876944 3616258 2860616 1457596 1737356 4179678 6601036
38367F601036K11444j776460j547422O49205K679820K389781k05193k582553k429537
38358C990121m64820O55503l9947r75768q16280k12393k28653p31942j126497
38349D9324j278241r97416K8423J129984R82933j81110l08288J428796K865694
38340C720099J643649j353092k997974j749146R29426K624597K300212P30366
38332E848137n60706q03718o56340j023045j408685n53594J276124K208189J425712
38323E752074K31624k51454n94064j216174j019261N19556J657364P95240q30249
38314E044656r84476K30231J078067J122590J039454M66895j205788k528364j486782
38305B776483Q05006R95160j516118l470461k506649j94894R93624J148035J526441
$$ plain form
38367 6601036 6812480 5036020 3488598 4137803 6817623 9207404 9002211 6419658 3990121
38358 3990121 3525301 4180804 4140857 3165089 2348809 2136416 1907763 1175821 49324
38349 49324 -1228917 -2226333 -2197910 -1067926 -84993 -266103 -574391 854405 3720099
38340 3720099 5363748 4010656 1012682 -736464 192962 2817559 5117771 5848137
38332 5848137 5287431 4483713 3827373 2804328 1395643 842049 2118173 4326362 5752074
38323 5752074 5983698 5732244 5138180 3922006 2902745 3422301 5079665 5874905 5044656
38314 5044656 4060180 4290411 5368478 6491068 7530522 7997417 6791629 4263265 2776483
38305 2776483 3581489 4576649 3060531 -409930 -2916579 -3111473 -2117849 -969814 556627
38296E56627J820850J028000k54037m77647N73260J697436J906945R89062p97313
38287G043183k448271k480916p00909J067692J209854M21694K94880P87594Q01425
38278E996226M78866Q40384J456623P28518j253105k256946j083511O24011Q21788
38269F352854j65319o27720q9699N32115O71661N58353L16989l7843K7896Q74157
38259H413444J533555O98780j099798j855042r14717J95090L63054M84569J328047
38250I146982J629716J96136j450246r01452J343002K390741J116776o15058j091035
38241A1765562o87299j47545O44315J292438O76477p20401o47313J292649K317444
38232A5786327O70472j350169j097576O9685n40033j845538o90211K286090K960226
$$ plain form
38296 556627 2377477 3405477 3151440 2673793 3247053 4944489 6851434 7840496 7043183
38287 7043183 4594912 2113996 1413087 2480779 3690633 4112327 4407207 5194801 5996226
38278 5996226 6475092 7315476 8772099 9500617 8247512 5990566 4907055 5531066 6352854
38269 6352854 6187535 5559815 5470116 6002231 6673892 7232245 7549234 7511391 7539287 8413444
38259 8413444 9946999 10645779 9545981 7690939 6776222 6971312 7334366 7818935 9146982
38250 9146982 10776698 10972834 9522588 8621136 9964138 12354879 13471655 12856597 11765562
38241 11765562 11078263 10930718 11575033 12867471 13543948 12823547 12176234 13468883 15786327
38232 15786327 16456799 15106630 14009054 14078739 13538706 11693168 11002957 13289047 16249273
38223A6249273J73399k357616j730604K73176Q02829K47488N56974J536208J391753
38214A7142880k14323j715086j715792l47844R56497O43385j137026k060385n52258
38205A1000048J294833L24811k387776k526184M85535J883970r19854l650944
38197E504439j664413K539582L133226j07217k071079n13189J341039O54317j261635
38188G555070k070979j427672K71557K712668M128284K286542j669895l585365
38180H200210j951339J8099l16841j088404J89938J960720J289084j017549j744633
38171E539285n07682R9517p80518j019647M75021J622631M56076j661809j909106
38162B313768R0154J963287J863518O16117K01048J016495J604104R09670l50760
$$ plain form
38223 16249273 16422672 14065056 12334452 12607628 13410457 13657945 14214919 15751127 17142880
38214 17142880 16928557 15213471 13497679 13149835 14106332 14749717 13612691 11552306 11000048
38205 11000048 12294881 12619692 10231916 7705732 8191267 10075237 9155383 5504439
38197 5504439 3840026 6379608 9512834 9405617 7334538 6821349 8162388 8816705 7555070
38188 7555070 5484091 4056419 4327976 7040644 11168928 13455470 11785575 8200210
38180 8200210 6248871 6266970 5950129 4861725 5051663 7012383 8301467 7283918 5539285
38171 5539285 5031603 5131120 4350602 3330955 3805976 5428607 5884683 4222874 2313768
38162 2313768 2403922 4367209 6230727 6846844 7047892 8064387 9668491 10578161 10227401
38153A0227401j101052j510406k019723j824433k05501J316558O38547j238157
38145D283234j096895J357591K507297M26904j840412j112523Q26290M57818j390097
38136D419207j001846J780827L120794J309301r05336j089059m55517q04477j334445
38127E039449o56156M51770N85604K53465O97114J469471J219043P844r37994
38118H129610j165794j160977j074710o48488j08340m0710n20046j020211r59382
38109A430952p6953J175082J594842N67116o09534j98147J125285R29291r95432
38100D942502j794958R6656K269672J940625N5554o33316J64368O45559K51034
38091G937696j69622o07722j534803j981639p29389J129390J576532J054711J460910
$$ plain form
38153 10227401 9126349 7615943 5596220 3771787 3566286 4882844 5521391 4283234
38145 4283234 3186339 4543930 7051227 7478131 5637719 4525196 5351486 5809304 4419207
38136 4419207 3417361 5198188 8318982 9628283 8722947 7633888 7178371 6373894 5039449
38127 5039449 4383293 4835063 5420667 5674132 6371246 7840717 9059760 9067604 8129610
38118 8129610 6963816 5802839 4728129 4079641 3971301 3930591 3410545 2390334 1430952
38109 1430952 1353999 2529081 4123923 4691039 4081505 3883358 5008643 5937934 4942502
38100 4942502 3147544 3244200 5513872 7454497 7510051 6876735 7041103 7686662 7937696
38091 7937696 7768074 7160352 5625549 3643910 2914521 4043911 5620443 6675154 8136064
38082H136064K228757R39488k047215l315151j594924K99226R7432o76253O7368
38073D134792J452963J610041Q16648L33875k7870r38791j691154j372735n62830
38064C754939q8524M50112J217471R49914p48502j663602L2555K483956K526819
38055H915138L11337j194819o28061N76633J056133R23513L03326j057192k376218
38046F829790k162191m48997R97203J101016O17980N40472P33592N44736k36017
38037H517584j233949j638149p36200J042076K195488J957008J133143M52409
38029A1689410m69164j473489j102115P91614J689930m267j966937j389051M14382
38020H180313L01301j288611j268843O38511J693542J083381P15888R68617J24196
$$ plain form
38082 8136064 10364821 11304309 9257094 5941943 4347019 4646245 4743677 4067424 4134792
38073 4134792 5587755 7197796 8014444 8348319 8320449 7381658 5690504 4317769 3754939
38064 3754939 3666415 4116527 5333998 6283912 5535410 3871808 3904363 6388319 8915138
38055 8915138 9226475 8031656 7403595 7980228 9036361 9959874 10263200 9206008 6829790
38046 6829790 4667599 4218602 5215805 6316821 6934801 7475273 8208865 8753601 8517584
38037 8517584 7283635 5645486 4909286 5951362 8146850 10103858 11237001 11689410
38029 11689410 11220246 9746757 8644642 9436256 11126186 11121919 9154982 7765931 8180313
38020 8180313 8481614 7193003 5924160 6562671 8256213 9339594 10055482 11024099 11148295
38011A1148295j392025p86583J964239L181954J248423q85059p11211L96352P01810
38002A4866195R83603J726781J535251P09926K144997N978109P964445O567860
37994D2477167O828410J2641225J9652233K1323617J8159646J4476017R250662
37987A44808977j839500j6277886k4678097k2378579j4852987r606672p927317
37980D7247939p004080n642443m644904m235027l765965k700156q67091Q93825
37972A9282098N63021k367725m670035k998676P60869J695288o48026j649406
37964I967408O50132K329682M02903j901841l94726L036846L122267q46359m057657
37955A2308655k893539Q20571K975053K284647R28292R80473J637008Q05579j117669
$$ plain form
38011 11148295 9756270 8969687 10933926 14115880 15364303 14479244 13768033 14164385 14866195
38002 14866195 15849798 17576579 19111830 19821756 21966753 27944862 35909307 42477167
37994 42477167 49305577 61946802 81599035 102922652 121082298 135558315 144808977
37987 144808977 142969477 126691591 102013494 79634915 64781928 55175256 47247939
37980 47247939 40243859 34601416 29956512 25721485 21955520 19255364 18388273 19282098
37972 19282098 19845119 17477394 12807359 9808683 10569552 12264840 11616814 9967408
37964 9967408 10617540 12947222 13350125 11448284 11053558 14090404 17212671 16366312 12308655
37955 12308655 9415116 10235687 13210740 15495387 16423679 17404152 19041160 19846739 18729070
37946A8729070j141631J635400L616330J581797j939579j971990J296558K804062
37938B4610017N85279j469369j18804K632948L687298L501163L764129L881634
37930D1074295K939320K458783M068597O529818P769872P847212P478628N897710
37922H6064235K789349J31970n96099r03050k310819l238539j818726N19487J557005
37913H2194813K079081L552212M300934K302752n754J437833N614915P433650
37905A08910436N279907K908721L386893N515280P176105Q188523Q428964O606174
37897A56401003K642906j396462m198815o711161r638550j1753426j1908054j0731162
37889A02706279r292163p888884o880636o780069o839293n544640l183660j875046
$$ plain form
37946 18729070 17587439 19222839 22839169 24420966 22481387 20509397 21805955 24610017
37938 24610017 25195296 23725927 23607123 26240071 29927369 33428532 37192661 41074295
37930 41074295 44013615 46472398 50540995 57070813 64840685 72687897 80166525 86064235
37922 86064235 88853584 88985554 88389455 87486405 85175586 81937047 80118321 80637808 82194813
37913 82194813 84273894 87826106 92127040 94429792 94424038 95861871 101476786 108910436
37905 108910436 114190343 117099064 120485957 126001237 133177342 141365865 149794829 156401003
37897 156401003 159043909 157647447 153448632 146737471 137098921 125345495 113437441 102706279
37889 102706279 93414116 85525232 78644596 71864527 65025234 59480594 56296934 54421888
37881E4421888k383396l048755k637915k042157k221993k686206l092115m109121
37873C2200230n346907m648860j266088K063774K255441j36450j997335j804543
37865B1319262p42789j21730L49334J284180J936893Q58634j833454l690551k425545
37856A6934234Q47176K313172K52087k397690j961943P74121J794686k77926k401378
37847A5876539j630257J063102K525678J299817j207297k402913r56726J614323
37839A6182266K167847j06827j945843k50232L003979L159500k44774k680921
37831A9284995j299274J321225J608790r5644j260429j217895r80434p29778R6971
37822A6728527J161911J533258J071226L24439l24160o44948m39021J23749P90439
$$ plain form
37881 54421888 52038492 48989737 46351822 44309665 42087672 39401466 36309351 32200230
37873 32200230 26853323 22204463 20938375 23002149 25257590 25121140 23123805 21319262
37865 21319262 20576473 20454743 20804077 22088257 24025150 24883784 23050330 19359779 16934234
37856 16934234 17781410 20094582 20346669 17948979 15987036 16761157 18555843 18277917 15876539
37847 15876539 14246282 15309384 17835062 19134879 17927582 15524669 14567943 16182266
37839 16182266 18350113 18243286 16297443 16047211 19051190 22210690 21965916 19284995
37831 19284995 17985721 19306946 20915736 20820092 19559663 18341768 17361334 16631556 16728527
37822 16728527 17890438 19423696 20494922 20819361 20495201 19850253 19411232 19534981 20325420
37813B0325420J726962K674725K315811K87323j094615K23222K179045J157012
37805B9794905k032382k956637o13898J020045l83461k158999j788347o33320
37797B0247906j27890J005086K812992K264868j001861j967195K131849N995930
37789C1361685L650678k215756m547201k518891j090783k052569k573328j728405
37781A8285430j592080j923145k47742K386255J993851j229921k463658j28333
37773A5080657J726553N27661j111568q99543n77116j565318k025765j064285
37765A0091276j022880k620809k621440L01340K114305j91616l173990k447653
37757D28533K61074O24694r54903j023776L01901J25964j228825o84372J607005
$$ plain form
37813 20325420 22052382 24727107 27042918 27330241 26235626 26458848 28637893 29794905
37805 29794905 27762523 24805886 24191988 25212033 24828572 22669573 20881226 20247906
37797 20247906 20120016 21125102 23938094 26202962 25201101 23233906 25365755 31361685
37789 31361685 35012363 32796607 28249406 25730515 24639732 22587163 20013835 18285430
37781 18285430 16693350 14770205 14522463 16908718 18902569 17672648 15208990 15080657
37773 15080657 16807210 17334871 16223303 15323760 14746644 13181326 11155561 10091276
37765 10091276 9068396 6447587 3826147 4127487 6241792 6050176 2876186 428533
37757 428533 689607 1314301 359398 -664378 -362477 -236513 -1465338 -2149710 -542705
37748e42705K086446q1632j526902k26598J659861J764012P18449j1958m13153
37739C425820n89106J28096J259317Q29928j474920k985125j616035J044483K065947
37730B088405J183083N10495J092941J669284P95576j183225k607987k316706
37722A231866p69770M71873M25290k83869m21909Q2138J65609n81875j188719
37713h69366p86186O9315L21881R3549M56855J593571K141334R41004j076940
37704B885017j676323j15710J743544J783414L26607o38557m51514l81180j093907
37695B381391j309697P6423J926254K275003J016111j52727o9114O96982P85114
37686G625740n47327k644169l628171k114248O82217J702243p8894j865561p74717
$$ plain form
37748 -542705 1543741 1462109 -64793 -291391 1368470 3132482 3850931 3838973 3425820
37739 3425820 2836714 2964810 4224127 5054055 3579135 594010 -1022025 22458 2088405
37730 2088405 3271488 3781983 4874924 6544208 7339784 6156559 3548572 1231866
37722 1231866 462096 933969 1359259 1075390 653481 735619 901228 319353 -869366
37713 -869366 -1655552 -1586237 -1264356 -1170807 -713952 879619 3020953 3961957 2885017
37704 2885017 1208694 1092984 2836528 4619942 4946549 4307992 3856478 3475298 2381391
37695 2381391 1071694 1148117 3074371 5349374 6365485 6212758 6143644 6840626 7625740
37686 7625740 7078413 4434244 806073 -1308175 -625958 1076285 997391 -868170 -1642887
37677a642887J881944K453666M23304r77623L4860J135006k8665j772370j042552
37668D64683J464324K048302l86269k556095j563360J067371J898977M46876p58158
37659B126651k31208P71083P71340O6281n95967j388669k168418j567721Q21236
37650a395392K618754J365513j518167k070680O97786L158410J961266j473988
37642C343502k975140q80716K368701L389795J333814j675076k819293j318629
37634G66958R34978J712602J074152P37606J225064J346965O51002K72883N51043
37625I273253k0951j992266l119909j472992J113487J241394j148441k660665
37617A212910j163574J676529L003633K098635M47234k77685K52358Q22411J6693
$$ plain form
37677 -1642887 239057 2692723 3116027 2138404 2173264 3308270 3279605 1507235 464683
37668 464683 1929007 3977309 3591040 1034945 -528415 538956 2437933 2884809 2126651
37659 2126651 1895443 2666526 3437866 3504147 2908180 1519511 -648907 -2216628 -1395392
37650 -1395392 1223362 2588875 1070708 -999972 -302186 2856224 4817490 3343502
37642 3343502 368362 -512354 1856347 5246142 6579956 4904880 2085587 766958
37634 766958 1701936 3414538 4488690 5226296 6451360 7798325 8449327 8722210 9273253
37625 9273253 9252302 7260036 4140127 2667135 3780622 5022016 3873575 1212910
37617 1212910 49336 1725865 4729498 6828133 7275367 6997682 7250040 8072451 8089144
37608H089144j675534j878820L67294K423012J290218j685264k257389M35562
37600E108223K322106M44524k557566k519953J2147J029879n26161j377420O14402
37591B550181K961901K298921p15187k588649j848268k47905M76034O35355R06394
37582D428777O93056o13948k047848k088305o12324J197375K304890K304345J184295
37573F750313l36229r14595j77320M68168j49637r86660m72655O19576J96253
37564D997214j616612k430107j276998J40284M91834O95472J731918K743955K561782
37555H038742J328281m44193k536633l731871k138177J667689L980693K357347
37547H521878j117008k793798j942443l75935N98824P39745N960p95136j35273
$$ plain form
37608 8089144 6413610 4534790 4902084 7325096 8615314 6930050 4672661 5108223
37600 5108223 7430329 7874853 5317287 2797334 2809481 3839360 3313199 1935779 2550181
37591 2550181 5512082 7811003 7095816 4507167 2658899 2410994 2887028 3522383 4428777
37582 4428777 5121833 4507885 2460037 371732 -240592 956783 3261673 5566018 6750313
37573 6750313 6414084 5499489 5322169 5790337 5640700 4654040 4181385 4800961 4997214
37564 4997214 3380602 950495 -326503 -186219 305615 1001087 2733005 5476960 8038742
37555 8038742 9367023 8922830 6386197 2654326 516149 2183838 6164531 8521878
37547 8521878 7404870 4611072 2668629 2292694 2891518 3631263 3637223 2842087 2706814
37538B706814J567770J549417q66692k168773k3040K227560O59606k275244j368525
37529B008893K447634L246412o5134j860613Q01536L361583J350226k678131l758864
37520D853542j789414J06695J142302K271999K494398L98010k040227j554172
37512E883133J239337K668923J581564K98756M9481o52778k256821k417613J74976
37503F568958K878933K390634n19806j918469O6432K919390L106587M60086j868308
37494A4084437j434543P26491J844688R93519k21593k02843P71923J448901J218727
37485A9229707L76461l84126l79579M05723R39097L12127p21086n55401R26741
37476B0149664K299054K935448L557767M113493L361568J529983J095659L321791
$$ plain form
37538 2706814 4274584 5824001 4957309 2788536 2765496 4993056 5652662 3377418 2008893
37529 2008893 4456527 7702939 7637805 5777192 6578728 9940311 11290537 8612406 4853542
37520 4853542 3064128 3170823 4313125 6585124 9079522 9477532 7437305 5883133
37512 5883133 7122470 9791393 11372957 11671713 11721194 11068416 8811595 6393982 6568958
37503 6568958 9447891 11838525 11318719 9400250 9466682 12386072 15492659 15952745 14084437
37494 14084437 12649894 13376385 15221073 16214592 15992999 15790156 16562079 18010980 19229707
37485 19229707 19606168 19222042 18842463 19248186 20187283 20499410 19778324 19222923 20149664
37476 20149664 22448718 25384166 28941933 33055426 36416994 37946977 39042636 42364427
37468D2364427O012925O690922O266862P178997R284629J0524753J1101076J3944694
37460A13369285K0528582K8498458L4107986L4993959K9801438J7480566p11975
37453B78068299j9319212l1279512l3497459k9089973k3508177j9204080j5072381
37446A07097505j0298748o437194m844639m115469k071311Q78198K692084L350498
37438H6250924M887685P798562J0188097J1159327J2531804J6182980K1816255
37431A70815634K8072508L3161407L3251431K3607631M279354j7160416l1389678
37424B44637871l5140315l1764155k5943225k0384413j6316326j3945156j2168457
37417H8975824r786059p127231n349540m710285m692781m947605m930096l839735
$$ plain form
37468 42364427 48377352 55068274 61335136 68514133 77798762 88323515 99424591 113369285
37460 113369285 133897867 162396325 196504311 231498270 261299708 278780274 278068299
37453 278068299 258749087 227469575 193972116 164882143 141373966 122169886 107097505
37446 107097505 96798757 90361563 85516924 81401455 79330144 80208342 82900426 86250924
37438 86250924 91138609 98937171 109125268 120284595 132816399 148999379 170815634
37431 170815634 198888142 232049549 265300980 288908611 293187965 276027549 244637871
37424 244637871 209497556 177733401 151790176 131405763 115089437 101144281 88975824
37417 88975824 79189765 72062534 66712994 62002709 57309928 52362323 47432227 43592492
37409D3592492k239953k154918l893096m603474k203006J040053J560559l91683
37401C0706974j764104j584338j385266j514435p18878O57331O14704r07672j555913
37392B2548403l43463R80524J097799R15199J267958J353957N70193k12357k49042
37383B7929171k1615J811L7469j8224n26894q65972j93741N53070k51091j819117
37373B4824867j686528J54402R02880n22087j750945j016114J03308k68526j206558
37364A9534699j013416j60104o6267o18267q21313o01603m39747m37167p97207
37355A4579608j767339k370311j149829J079158J664835K76420k37871J429642
37347A3504313K665895J405787k42613K38526J303916K82551j504561p57534K019819
$$ plain form
37409 43592492 41352539 39197621 35304525 30701051 28498045 29538098 31098657 30706974
37401 30706974 28942870 27358532 25973266 24458831 23739953 24397284 25011988 24104316 22548403
37392 22548403 22204940 23185464 24283263 25198462 26466420 27820377 28390570 28178213 27929171
37383 27929171 27907556 27909367 27946836 27928612 27401718 26535746 26342005 26895075 26643984 24824867
37373 24824867 23138339 23292741 24195621 23673534 21922589 20906475 21009783 20741257 19534699
37364 19534699 18521283 18361179 18294912 17676645 16855332 16253729 15813982 15376815 14579608
37355 14579608 12812269 10441958 9292129 10371287 12036122 12312542 12074671 13504313
37347 13504313 16170208 17575995 17333382 17571908 18875824 19158375 17653814 16896280 18916099
37338A8916099L045870J196250n41935P3972J614583J828337Q65005N48006J986548
37329B9532735M552008O269870N318445K006606j377899l488248n240511p030292
37321C0542714o895265l839938q58485j298468l681934l841000j218055R09411
37313I818980R10227L05115j00602j178492k112438o00622K469095K997224j659
37304A2506828k371173j268053O47623L04409o70096L28224J675363N77569j419988
37295A0310706r83223Q31733K91869k057906j804962J629390L258907K68538l348890
37286H396162k768183P67260K514342J175440m70128n47021n2084k9800J04461
37277I090449P44273Q81113k20734j584327j793872q72309p3219k82547j190776
$$ plain form
37338 18916099 21961969 23158219 22616284 22690256 24304839 26133176 26998181 27546187 29532735
37329 29532735 34084743 40354613 45673058 47679664 46301765 42813517 37573006 30542714
37321 30542714 23647449 19807511 18949026 17650558 13968624 10127624 8909569 9818980
37313 9818980 10729207 11034322 10933720 9755228 7642790 7042168 9511263 12508487 12506828
37304 12506828 10135655 8867602 9515225 9819634 9149538 9477762 11153125 11730694 10310706
37295 10310706 9327483 10159216 10451085 8393179 6588217 8217607 11476514 11745052 8396162
37286 8396162 5627979 6395239 8909581 10085021 9614893 9067872 9015788 8985988 9090449
37277 9090449 9834722 10715835 10495101 8910774 7116902 6244593 6171374 5888827 4698051
37268D698051j750480j123576N50102K105699K310867J006246q41860k080453
37260D874596k072405q20350Q96655J674252P14210r39218j321881k9571J202262
37251D178550R38362J8584J34626J252292J742270P54449p53525j371233p18845
37242F175530M17329P55051m06588k056892k017357K79422K292368J374617j234820
37233E578660j754423P00466K726333J655688p08557j269754k91928k08705j230793
37224E196987j267575J45698Q78109k49385j446939p27076J074040J624748M91173
37215E719780m47240R7191Q96391L5375j972319k395581j77791J932419R91653
37206D679878j408837j000696K494177M245900J451046k144625j956250L95421
$$ plain form
37268 4698051 2947571 1823995 2374097 4479796 6790663 7796909 6955049 4874596
37260 4874596 2802191 1981841 2878496 4552748 5266958 4327740 3005859 2976288 4178550
37251 4178550 5116912 5135496 5270122 6522414 8264684 9019133 8265608 6894375 6175530
37242 6175530 6592859 7347910 6941322 4884430 2867073 3146495 5438863 6813480 5578660
37233 5578660 3824237 4524703 7251036 8906724 8198167 6928413 6636485 6427780 5196987
37224 5196987 3929412 4075110 4953219 4703834 3256895 2529819 3603859 5228607 5719780
37215 5719780 5272540 5369731 6266122 6301497 4329178 1933597 1755806 3688225 4679878
37206 4679878 3271041 2270345 4764522 9010422 10461468 8316843 6360593 6756014
37198F756014J91904k355461k635828L55026K244983N38949j635154j163942L26400
37189B622891L04903j21658R21476J919453O88934j197829q99383N81010J15501
37180D935298j854311j846281P35134K545081J620300j96579j048418j593626
37172C296598k372453k013329J5016J618654J154557L8783J47354O25553k82280
37163B228453j766137j499501O09359K182179J716735J73171q43465q58198k95349
37154A647247K56860L39874L8454J3209M21152L56344o32659j262765l18594R25170
37144A784292K39394j757833j947617M47500K105345M57433k055771j400332J793279
37135c34310K896962J59171k623281j615903J781719L410270K068471K5245j046881
$$ plain form
37198 6756014 6947918 4592457 1956629 2311655 4556638 5095587 3460433 2296491 2622891
37189 2622891 2927794 2806136 3727612 5647065 6335999 5138170 4238787 4819797 4935298
37180 4935298 3080987 1234706 1969840 4514921 6135221 5938642 4890224 3296598
37172 3296598 924145 -1089184 -1074168 544486 1699043 1737826 1885180 2510733 2228453
37163 2228453 462316 -1037185 -427826 1754353 3471088 3644259 2800794 1942596 1647247
37154 1647247 1904107 2243981 2282435 2295644 2716796 3073140 2440481 1177716 859122 1784292
37144 1784292 2023686 265853 -1681764 -1234264 871081 1328514 -727257 -2127589 -334310
37135 -334310 2562652 2721823 98542 -1517361 264358 3674628 5743099 5768344 4721463
37126D721463j674257k284580k115708j069848l93975n51784k81348J158940K469545
37117b1552K240793R51507j84513r36899j296448n38689J216413J910041J44390
37108C485043k180904k194168k74278O43494l57772j110063j58337J105781J016109
37099b5095K7570o62518r96905j251680q83969M62303J899822K329431J641866
37090B540825K70904j295609k090753j293884J06640P3793j245481j182748J256289
37081b860024L172242J832267j040605j751435n6067R57164j35991j288098n30002
37072a700549J221966J866199R34256k71134m12557O27400J727519J622063L03934
37063E919097j013796j529474j496700r48038N42629K000598J173561j824914
$$ plain form
37126 4721463 3047206 762626 -1353082 -2422930 -2816905 -3368689 -3650037 -2491097 -21552
37117 -21552 2219241 3170748 2986235 2049336 752888 214199 1430612 3340653 3485043
37108 3485043 1304139 -890029 -1164307 -520813 -878585 -1988648 -2146985 -1041204 -25095
37099 -25095 2475 -660043 -1656948 -2908628 -3792597 -3330294 -1430472 898959 2540825
37090 2540825 2811729 1516120 -574633 -1868517 -1761877 -1688084 -2933565 -4116313 -2860024
37081 -2860024 312218 2144485 1103880 -647555 -703622 253542 117551 -1170547 -1700549
37072 -1700549 -478583 1387616 2321872 2050738 1638181 2265581 3993100 5615163 5919097
37063 5919097 4905301 3375827 1879127 931089 1473718 3474316 4647877 2822963
37055B822963l363927j274451J359177P52500j391237p19941K202781K671747
37047C059612P563j048068J529947L382061J042080k316464k305097k10667J51594
37038C292561q48553k50776J385040Q70618j551796k201131q6745J586302Q16101
37029C011621l92683J1551Q43665K34196j134888j364111k13667J069291J688244
37020C753219J727322J367709O22994m90066j793300k599451j936344O893J307398
37011A966374O10412n49289L93786L067144M188995J904124j866745m049227l691351
37002A974223j882978L2081J162749J117430L39397j86098n0157K84292L95448
36993C186387L70881L40557K89961K44429k199q54380j824825j414173O39401
$$ plain form
37055 2822963 -540964 -1815415 -456238 296262 -1094975 -1814916 387865 3059612
37047 3059612 3067175 2019107 3549054 6931115 7973195 5656731 3351634 3140967 3292561
37038 3292561 2444008 2193232 3578272 4448890 2897094 695963 609218 2195520 3011621
37029 3011621 2618938 2630489 3474154 3708350 2573462 1209351 995684 2064975 3753219
37020 3753219 5480541 6848250 7471244 6981178 5187878 2588427 652083 658976 1966374
37011 1966374 2576786 2027497 2421283 5488427 9677422 11581546 9714801 5665574 1974223
37002 1974223 91245 123326 1286075 2403505 2742902 2556804 2506647 2790939 3186387
36993 3186387 3557268 3897825 4187786 4432215 4430016 3575636 1750811 336638 976039
36984I76039K093387J025110j100856j497245k93149J29306n44230l01475J039600
36975A526487J065601r11118k199912r29196J102148J551351Q47166M67966L21841
36966B842334j16611j77761M76750O06916m57704j306479q13631K6033K98873
36957A378720P85661J465136K92160k889239m180896r34003L308103L386632J39435
36948B751709j261274O11580K141508J265403J89635N71186P14043o19675j598163
36939D765952p80366J07032o72937j662495q28780P56781O73485q60915j506080
36930h323n28622M69845L35770k35045l07945q1273r0856j29318L08113R90432
36920G22778J099133M81854J28433P50594J288719J30196k026818k326544J68848
$$ plain form
36984 976039 3069426 4094536 2993680 1496435 1203286 1332592 788362 486887 1526487
36975 1526487 2592088 1680970 -518942 -1448138 -345990 1205361 2052527 2520493 2842334
36966 2842334 2725723 2547962 3024712 3631628 3173924 1867445 1053814 1079847 1378720
36957 1378720 2164381 3629517 3921677 1032438 -3148458 -4082461 -774358 2612274 2751709
36948 2751709 1490435 2102015 4243523 5508926 5698561 6269747 6983790 6364115 4765952
36939 4765952 3985586 4092618 3419681 1757186 928406 1685187 2358672 1497757 -8323
36930 -8323 -536945 -67100 268670 33625 -274320 -355593 -446449 -575767 -267654 722778
36920 722778 1821911 2303765 2432198 3182792 4471511 4601707 2574889 248345 417193
36911D17193K394339J240513j847669k851923r13298R32119O14520m90080n34516
36902a038802J93088O89761Q44050N11435p79934k109314j462179R78186K205951
36893C2242O24268j451339j417822j84174N3875k65056O20080K009410J575011
36884A596495o26519k063365j579848n67253j04423M15386J251506J362247M13176
36875I7402l26468j65925k43976j345497k102124r88759J041408J723558P07767
36866a602614j47892L52592J244462J264032Q04363R45275J389146Q08571q63419
36857D194516j950074j376556k52762r8605n19739j80338N56275m129j795439
36848a426851k436292o55136J586212J788486K84842p68071o73735n02509p07837
$$ plain form
36911 417193 2811532 4052045 2204376 -647547 -1560845 -628726 -14206 -504286 -1038802
36902 -1038802 -845714 -155953 688097 1199532 419598 -1689716 -3151895 -2173709 32242
36893 32242 656510 -794829 -2212651 -2396825 -2342950 -2608006 -1987926 21484 1596495
36884 1596495 969976 -1093389 -2673237 -3240490 -3344913 -2929527 -1678021 -315774 97402
36875 97402 -229066 -394991 -638967 -1984464 -4086588 -5075347 -4033939 -2310381 -1602614
36866 -1602614 -1750506 -1397914 -153452 1110580 1914943 2860218 4249364 5057935 4194516
36857 4194516 2244442 867886 615124 516519 -3220 -183558 372717 368588 -1426851
36848 -1426851 -3863143 -4518279 -2932067 -1143581 -858739 -1626810 -2300545 -2803054 -3510891
36839c510891n14024L15595R47093J028893J163470J378828P15294q97365j812110
36830a185217q90933N18678K71749j483733k412262j151105R89495J896072J173837
36821b273419J02369k39733N6913L79955M22490K86403K43434M58726O77078L89273
36811E03489l04890m66452K72549O25026o31090k149014j279070J756373L349024
36802A675945J475037j187243j284673K03472R5661j399197j184397J091702K198586
36793A684893P85695m83323J94902O91432q70805k391276j396752N06363M36165
36784h42706p01658K8485K203960K616058O38341j021285r48841n82090o98941
36775F91323n3760J491563J868439K48075j345230j379055j025775j353194j028800
$$ plain form
36839 -3510891 -4024915 -3709320 -2762227 -1733334 -569864 808964 1524258 626893 -1185217
36830 -1185217 -2076150 -1557472 -1285723 -2769456 -5181718 -6332823 -5343328 -3447256 -2273419
36821 -2273419 -2171050 -2410783 -2353870 -1973915 -1551425 -1265022 -1021588 -562862 114216 503489
36811 503489 198599 -267853 4696 629722 -1368 -2150382 -3429452 -1673079 1675945
36802 1675945 3150982 1963739 679066 882538 978199 -420998 -1605395 -513693 1684893
36793 1684893 2470588 1987265 2182167 2873599 2002794 -388482 -1785234 -1278871 -842706
36784 -842706 -1544364 -1515879 688081 3304139 3942480 2921195 1972354 1390264 691323
36775 691323 637563 2129126 3997565 4245640 2900410 1521355 495580 -857614 -1886414
36766a886414R54554K584676J538256r93859j888805n62894O61659K34717q51996
36757b10106j077814m20439R2401r1873l49527L92617J936589K231636q6740k782685
36747c65941k077411J772594L995865K061421m31698L93984K180476L39155l563331
36738D305114l428123J507578M650020J727230l042721l684744q24699Q91043
36730B100698L31847l7269M38032J30086p40688j99262J259569R32794j021479
36721C194328j082256J680975L226274N09736l473075l750077k82951K490878
36713B513832J862010n09020j819931j336576r1325O67732K75202q00852j046111
36704b85039L69085K085016K026111K34120j195128j042692k75223j6827K33152
$$ plain form
36766 -1886414 -931860 1652816 3191072 2197213 308408 -254486 407173 641890 -210106
36757 -210106 -1287920 -1708359 -1615958 -1707831 -2057358 -1664741 271848 2503484 2416744 -365941
36747 -365941 -2443352 -670758 3325107 5386528 4954830 5348814 7529290 7868445 4305114
36738 4305114 876991 2384569 7034589 8761819 5719098 2034354 1209655 2100698
36730 2100698 2432545 2395276 2833308 2963394 2222706 2023444 3283013 4215807 3194328
36721 3194328 2112072 3793047 7019321 7529057 4055982 305905 22954 2513832
36713 2513832 4375842 3866822 2046891 710315 618990 1286722 1561924 761072 -285039
36704 -285039 84046 2169062 4195173 4429293 3234165 2191473 1916250 1899423 2132575
36695B132575J335747K498292J909849p21646l298631l445781j066931J717713
36687A061187L026766K838335J908849K30386k163564l657876k431180N26914
36679A339817K003963Q73267m67021j30349L34741q57711k019924o35528J857619
36670B298874J675956j391223l375269j850135J063945K379495K023287J556355
36662D381285J432235J106135L44798p24509j738661j843504o60128N54329N10539
36653C362519K54293J410480K542047Q29266k510573k869243N44002K842504J007633
36644G412928j487604r34180L64916j197395l438472j889660K064102K910092
36636C804727j36734k224322q96757Q79243P27659L93135J375396J854178M69998
$$ plain form
36695 2132575 3468322 5966614 7876463 7154817 3856186 410405 -656526 1061187
36687 1061187 4087953 6926288 8835137 9065523 6901959 3244083 812903 1339817
36679 1339817 3343780 4217047 3750026 3619677 3954418 3096707 1076783 441255 2298874
36670 2298874 3974830 2583607 -791662 -2641797 -1577852 801643 2824930 4381285
36662 4381285 5813520 6919655 7264453 6539944 4801283 2957779 2297651 2851980 3362519
36653 3362519 3616812 5027292 7569339 8398605 5888032 3018789 3562791 6405295 7412928
36644 7412928 5925324 4991144 5356060 4158665 720193 -1169467 894635 3804727
36636 3804727 3667993 1443671 546914 1426157 2153816 2546951 3922347 5776525 6246523
36627F246523p83331j36213P25316l17201k211561k678913j579166j67807R61647
36618E9294J328334J62275j612630j370120J263120K957664J436658r49002j094834
36609B180759N5015n5396o98342M98805K570859K320450j88101j549983n09969
36600D624097N63687K69713K57066J502562K158941R21146n44854n80464k63177
36591H908717r41135j475000n27338M39510n59145k199199j548545J089728K328450
36582E516043P95471r99126p14680N72735N98635o54935j508609j228068l59933
36573B017533P32044J956237K522614J507481n15155j668293r53471N70112J083194
36564G252296n9633j852705k688577j859108l08765L00225m44562j183299p23623
$$ plain form
36627 6246523 5463192 5326979 6052295 5735094 3523533 844620 -734546 -902353 59294
36618 59294 1387628 1549903 -62727 -1432847 -169727 2787937 4224595 3275593 2180759
36609 2180759 2235774 2180378 1482036 1980841 4551700 6872150 6684049 5134066 4624097
36600 4624097 5187784 5457497 5714563 7217125 9376066 10297212 9752358 9171894 8908717
36591 8908717 7967582 6492582 5965244 6404754 5845609 3646410 2097865 3187593 5516043
36582 5516043 6311514 5312388 4597708 5170443 5769078 5114143 3605534 2377466 2017533
36573 2017533 2749577 4705814 7228428 8735909 8220754 6552461 5598990 6169102 7252296
36564 7252296 7192663 5339958 2651381 792273 483508 783733 339171 -844128 -1567751
36555a567751K81365N65244L73942Q51976J762698J678145M64662l53317j05673
36546C951291P8934m76199p72559k10985M5364p71090j279502j52342J424032
36537A836944J518572M78419J7702K60157L0505n57984k52510Q40271J204871
36528E376947M02845m26913o09034n86978n48908k33307J804k61417k22750Q15557
36518C707846J450758Q1350j765315j247362Q64512R24078j499095k578821o05105
36509f67154J120454J38302q38534J006652L076581J561912j673826j758209J184869
36500C151047K257018k40117k448616j541904J88116j46757j365614p97097J228056
36491B84132K282939J558629K64659n62944o77680N0548J189349J387043N9716
$$ plain form
36555 -1567751 -1286386 -721142 -347200 504776 2267474 3945619 4410281 4056964 3951291
36546 3951291 4030225 3554026 2781467 2570482 2615846 1844756 565254 412912 1836944
36537 1836944 3355516 3833935 3851637 4111794 4142299 3584315 3331805 4172076 5376947
36528 5376947 5779792 5352879 4743845 4156867 3607959 3374652 3376456 3115039 2892289 3707846
36518 3707846 5158604 5239954 3474639 2227277 3091789 4015867 2516772 -62049 -667154
36509 -667154 453300 591602 -246932 759720 3836301 5398213 3724387 1966178 3151047
36500 3151047 5408065 5167948 2719332 1177428 1365544 1218787 -146827 -943924 284132
36491 284132 2567071 4125700 4390359 3827415 3149735 3200283 4389632 5776675 5836391
36482E836391j241563p54300P48801Q97946p53533j986051j138888N22007P17494
36473B848304n97991j361243n32080M17360k23244j756749j965543k26339J680689
36464a716836K061665J284487O56963M78339J73835m16197r24986j167823j117292
36455f87845o48333n4119j49343r46812r97441P00369K742147K789772P56785
36446C505180j024756r05051K43019O21693k58611j443095j763077p82144Q61288
36437i45554J841370J411465K76381l46185k49311l3021K09746Q17005J364813
36428D346709R35171l00355j100564j033689r92186j374133j153691L52429J907009
36419A586700J722475j31557j721170j488186K05165J704307J716471K98246j447549
$$ plain form
36482 5836391 4594828 3840528 4589329 5487275 4733742 2747691 1608803 2130810 2848304
36473 2848304 2250313 889070 356990 774350 551106 -1205643 -3171186 -3397525 -1716836
36464 -1716836 344829 1629316 2286279 2764618 2938453 2522256 1597270 429447 -687845
36455 -687845 -1336178 -1390297 -1539640 -2486452 -3483893 -2783524 -41377 2748395 3505180
36446 3505180 2480424 1575373 1818392 2440085 2181474 738379 -1024698 -1806842 -945554
36437 -945554 895816 2307281 2583662 2237477 1988166 1955145 2164891 2981896 4346709
36428 4346709 5281880 4981525 3880961 2847272 1855086 480953 -672738 -320309 1586700
36419 1586700 3309175 3177618 1456448 -31738 173427 1877734 3594205 3892451 2444902
36410B444902k396632k077659o32838J267001K366196J582002n28441j813053
36402B11478r45257Q32849J424530O52006p0258k66150p55293j540726j332077
36393a788898K52671J712648J781425J153582J072952J305857P19821p84818k039472
36384C385768k040525q64260O36073J483288J130934j18967j246309j299109j55705
36375I11188J315754J769357M88848j627765k636921j616688L09354J527254J768234
36366B208615J628272J188469L21991m12130n91561r53094k075000k790344j718223
36357c193005L05686J382264J514752K065687K750376J954757k2147r82540m04164
36348E371666j03509q42925j262544q59579q84987j370068n90865J298730J618377
$$ plain form
36410 2444902 48270 -2029389 -2662227 -1395226 970970 2552972 2024531 211478
36402 211478 -733779 99070 1523600 2175606 2105348 1839198 1083905 -456821 -1788898
36393 -1788898 -1536227 176421 1957846 3111428 4184380 5490237 6210058 5425240 3385768
36384 3385768 1345243 480983 1117056 2600344 3731278 3612311 2366002 1066893 911188
36375 911188 2226942 3996299 4485147 2857382 220461 -1396227 -1086873 440381 2208615
36366 2208615 3836887 5025356 5347347 4935217 4343656 3390562 1315562 -1474782 -3193005
36357 -3193005 -2887319 -1505055 9697 2075384 4825760 6780517 6758370 5775830 5371666
36348 5371666 5268157 4425232 3162688 2303109 1418122 48054 -542811 755919 2374296
36339B374296k67846j390919j90875P55165l87341j082316Q72329K762816J361043
36330D806352j297789j375056J96607p3939j537643p85205J538880J517575p50230
36321B239552r69152J574435K338259o01041k905321j071758J892987J516041
36313D014002j385250k886536k010484p94071k47409L15708J035676J297343J057570
36304C96549O27182J5974m38553j82866J27410o29195j321244M32497L535321
36295B563075L454199r67183m668486l433460p8941M55811j081489m89753K085766
36286b160461K473509n3719j382573O15662K878407K394509N13295j30308K31327
36277E379648j65429j321829j765069q96128M84388J188565M85500j100860j702832
$$ plain form
36339 2374296 2106450 715531 524656 1279821 892480 -189836 682493 3445309 4806352
36330 4806352 3508563 2133507 2330114 2256175 718532 -66673 1472207 2989782 2239552
36321 2239552 1270400 2844835 5183094 4582053 1676732 604974 2497961 4014002
36313 4014002 2628752 -257784 -2268268 -3062339 -3309748 -2994040 -1958364 -661021 396549
36304 396549 1023731 1039705 601152 418286 545696 -83499 -1404743 -972246 2563075
36295 2563075 6017274 5050091 381605 -3051855 -3130796 -2674985 -3756474 -4246227 -2160461
36286 -2160461 313048 259329 -1123244 -507582 2370825 4765334 5278629 5148321 5379648
36277 5379648 5214219 3892390 2127321 1231193 1715581 2904146 3389646 2288786 585954
36268E85954k22431J543390Q32591j927770l232912j324627J472702K214177R26197
36259H67271n01256j012793n29005Q87260K432564K487254O14466j450618j996363
36250A798780j367510p34160k01237N33428R15033M39107j62061l6172L71807
36241A557015K65626j15366k83710n48295r26837l43152J382937K143555M31065
36232C562838j532455m90117K496064K771427j198181n085166m390617l17620
36224d183827K448773K077231P92607M89603L29387o69348j353924m35898R61311
36215D55915Q19002n92476j159601k50526N73526L81315J70477N58747L98360
36206A354739q93845j685969q01422J628j177219k624367j367371J571197K182757
$$ plain form
36268 585954 363523 1906913 2739504 811734 -2421178 -3745805 -2273103 -58926 867271
36259 867271 366015 -646778 -1175783 -288523 2144041 4631295 5245761 3795143 1798780
36250 1798780 431270 -302890 -504127 29301 944334 1383441 1221380 1185208 1557015
36241 1557015 1822641 1707275 1423565 875270 -51567 -394719 988218 3131773 3562838
36232 3562838 2030383 1540266 4036330 6807757 5609576 524410 -3866207 -4183827
36224 -4183827 -1735054 342177 1134784 1624387 1953774 1284426 -69498 -505396 455915
36215 455915 1274917 682441 -477160 -727686 -154160 227155 397632 956379 1354739
36206 1354739 460894 -1225075 -2026497 -2024869 -3202088 -5826455 -7193826 -5622629 -3439872
36197c439872j38647j338864R56421L757711L520155J239733o9887j94399p20007
$$ plain form
36197 -3439872 -3578519 -4917383 -3960962 -203251 3316904 4556637 4486750 4292351 3572344
$$ [...]
##END NTUPLES=NMR SPECTRUM
##END=
