##TITLE=31Pdec_SR118_3
 , 24 sc
 4.4.2022
##JCAMPDX= 6.0         $$ Bruker NMR JCAMP-DX V2.0
##DATA TYPE= NMR SPECTRUM
##DATA CLASS= NTUPLES
##ORIGIN= UXNMR, Bruker Analytische Messtechnik GmbH
##OWNER= root
$$ XWIN-NMR		Version 3.5
$$ Mon Apr  4 14:52:53 2022 Russian Standard Time (UT+4h)  she@DPX200
##.OBSERVE FREQUENCY= 81.013821
##.OBSERVE NUCLEUS= ^31P
##.ACQUISITION MODE= SIMULTANEOUS
##.ACQUISITION SCHEME= undefined
##.AVERAGES= 24
##.DIGITISER RES= 16
##SPECTROMETER/DATA SYSTEM= spect
##.PULSE SEQUENCE= zgpg30
##.SOLVENT NAME= CDCl3
##.SHIFT REFERENCE= (INTERNAL, CDCl3, 0, 248.564)
##AUDIT TRAIL= $$ (NUMBER, WHEN, WHO, WHERE, WHAT)
$$ ##TITLE= Audit trail, XWIN-NMR		Version 3.5
$$ ##JCAMPDX= 5.01
$$ ##ORIGIN= Bruker BioSpin GmbH
$$ ##OWNER= she
$$ F:/spectra/data/she/nmr/P31/1/pdata/1/auditp.txt
$$ ##AUDIT TRAIL=  $$ (NUMBER, WHEN, WHO, WHERE, WHAT)
(   1,<2022-04-04 14:51:49.48 +0400>,<she>,<DPX200>,
      <created by zg, POWCHK disabled, PULCHK disabled
       configuration hash MD5:
       00 E9 B6 7A A2 85 ED C7 34 08 36 98 17 FE 4E 26
       data hash MD5: 32K
       EC 7F DC 18 74 BC 83 F7 21 B7 E3 A5 CD 95 7C 9F>)
(   2,<2022-04-04 14:51:51.93 +0400>,<she>,<DPX200>,
      <Start of raw data processing
       efp BC_mod = 2 LB = 1 FT_mod = 6 PKNL = 1 PHC0 = -9544.35 PHC1 = 88.87561 SI = 64K 
       data hash MD5: 64K
       5E 88 71 EF E4 57 E1 26 53 CB 12 88 23 71 C5 F1>)
(   3,<2022-04-04 14:52:11.82 +0400>,<she>,<DPX200>,
      <pk PHC0 = -0.8799248 PHC1 = 11.4 
       data hash MD5: 64K
       B3 0A 98 AE F2 3B 12 60 93 E6 1A C2 E3 F9 8A D0>)
$$ ##END=
$$ 
$$ hash MD5
$$ 9A E8 63 0D 68 D0 71 82 56 11 E0 94 53 9C 9E C1
##$RELAX= 
##$RELAX= 
##$RELAX= 
##$RELAX= 
##$RELAX= 
##$RELAX= 
##$RELAX= 
##$RELAX= 
$$ Bruker specific parameters
$$ --------------------------
##$DU= <F:/spectra>
##$EXPNO= 1
##$NAME= <P31>
##$PROCNO= 1
##$TYPE= <nmr>
##$USER= <she>
##$AMP= (0..31)
100 100 100 100 100 100 100 100 100 100 100 100 100 100 100 100 100 100 
100 100 100 100 100 100 100 100 100 100 100 100 100 100 
##$AQSEQ= 0
##$AQ_mod= 1
##$AUNM= <au_zg>
##$AUTOPOS= <>
##$BF1= 81.014009
##$BF2= 200.13
##$BF3= 200.13
##$BF4= 200.13
##$BF5= 200.13
##$BF6= 200.13
##$BF7= 200.13
##$BF8= 200.13
##$BYTORDA= 1
##$CFDGTYP= 0
##$CFRGTYP= 5
##$CHEMSTR= <none>
##$CNST= (0..31)
1 1 145 1 1 1 1 1 1 1 1 1 1 1 1 1 1 1 1 1 1 1 1 1 1 1 1 1 1 1 1 1 
##$CPDPRG= <waltz16>
##$CPDPRG1= <>
##$CPDPRG2= <waltz16>
##$CPDPRG3= <>
##$CPDPRG4= <mlev>
##$CPDPRG5= <mlev>
##$CPDPRG6= <mlev>
##$CPDPRG7= <mlev>
##$CPDPRG8= <mlev>
##$CPDPRGB= <>
##$CPDPRGT= <>
##$D= (0..31)
0 1 0 0 0 0 0 0 0 0 0 0.03 2e-05 3e-06 0 0 0 0 0 0 0 0 0 0 0 0 0 0 0 0 
0 0 
##$DATE= 1649069508
##$DBL= (0..7)
120 120 120 11 120 120 24 19 
##$DBP= (0..7)
150 150 150 150 150 150 150 150 
##$DBP07= 0
##$DBPNAM0= <>
##$DBPNAM1= <>
##$DBPNAM2= <>
##$DBPNAM3= <>
##$DBPNAM4= <>
##$DBPNAM5= <>
##$DBPNAM6= <>
##$DBPNAM7= <>
##$DBPOAL= (0..7)
0.5 0.5 0.5 0.5 0.5 0.5 0.5 0.5 
##$DBPOFFS= (0..7)
0 0 0 0 0 0 0 0 
$$ [...]
##$SUBNAM2= <"">
##$SUBNAM3= <"">
##$SUBNAM4= <"">
##$SUBNAM5= <"">
##$SUBNAM6= <"">
##$SUBNAM7= <"">
##$SUBNAM8= <"">
##$SUBNAM9= <"">
##$SW= 501.771253377433
##$SWIBOX= (0..15)
0 1 3 0 0 0 0 0 0 0 0 0 0 0 0 0 
##$SW_h= 40650.406504065
##$TD= 32768
##$TD0= 1
##$TE= 0
##$TE2= 300
##$TE3= 300
##$TEG= 300
##$TL= (0..7)
0 120 53 12 22 120 120 120 
##$TP= (0..7)
150 150 150 150 150 150 150 150 
##$TP07= 0
##$TPNAME0= <>
##$TPNAME1= <>
##$TPNAME2= <>
##$TPNAME3= <>
##$TPNAME4= <>
##$TPNAME5= <>
##$TPNAME6= <>
##$TPNAME7= <>
##$TPOAL= (0..7)
0.5 0.5 0.5 0.5 0.5 0.5 0.5 0.5 
##$TPOFFS= (0..7)
0 0 0 0 0 0 0 0 
##$TUNHIN= 0
##$TUNHOUT= 0
##$TUNXOUT= 0
##$USERA1= <user>
##$USERA2= <user>
##$USERA3= <user>
##$USERA4= <user>
##$USERA5= <user>
##$V9= 5
##$VALIST= <valist>
##$VCLIST= <CCCCCCCCCCCCCCC>
##$VD= 0
##$VDLIST= <DDDDDDDDDDDDDDD>
##$VPLIST= <PPPPPPPPPPPPPPP>
##$VTLIST= <TTTTTTTTTTTTTTT>
##$WBST= 1024
##$WBSW= 4
##$XGAIN= (0..3)
0 0 0 0 
##$XL= 0
##$YL= 0
##$YMAX_a= 16863
##$YMIN_a= -25107
##$ZGOPTNS= <>
##$ZL1= 120
##$ZL2= 120
##$ZL3= 120
##$ZL4= 120
##$ABSF1= 0
##$ABSF2= 0
##$ABSG= 0
##$ABSL= 0
##$ALPHA= 0
##$AQORDER= 0
##$ASSFAC= 0
##$ASSFACI= 0
##$ASSFACX= 0
##$ASSWID= 0
##$AUNMP= <proc_1d>
##$AZFE= 0.1
##$AZFW= 0.5
##$BCFW= 0
##$BC_mod= 2
##$BYTORDP= 0
##$COROFFS= 0
##$CY= -3
##$DATMOD= 1
##$DC= 0
##$DFILT= <>
##$DTYPP= 0
##$F1P= 0
##$F2P= 0
##$FCOR= 1
##$FTSIZE= 65536
##$FT_mod= 6
##$GAMMA= 0
##$GB= 0
##$INTBC= 1
##$INTSCL= 5.30512e-09
##$ISEN= 30
##$LB= 1
##$LEV0= 0
##$LPBIN= 0
##$MAXI= 10000
##$MC2= 0
##$MEAN= 0
##$ME_mod= 0
##$MI= 50
##$NCOEF= 0
##$NC_proc= -6
##$NLEV= 6
##$NOISF1= 182.463
##$NOISF2= 159.3651
##$NSP= 0
##$NTH_PI= 0
##$NZP= 0
##$OFFSET= 248.5645
##$PC= 4
##$PHC0= -9545.229
##$PHC1= 100.2756
##$PH_mod= 1
##$PKNL= yes
##$PPARMOD= 0
##$PSCAL= 0
##$PSIGN= 0
##$REVERSE= no
##$SF= 81.014009
##$SI= 65536
##$SIGF1= 159.3651
##$SIGF2= -187.1042
##$SINO= 113.3802
##$SIOLD= 16384
##$SREGLST= <1H.CDCl3>
##$SSB= 0
##$STSI= 65536
##$STSR= 0
##$SW_p= 40650.406504065
##$SYMM= 0
##$S_DEV= 0
##$TDeff= 32768
##$TDoff= 0
##$TI= <>
##$TILT= no
##$TM1= 0
##$TM2= 0
##$TOPLEV= 0
##$USERP1= <user>
##$USERP2= <user>
##$USERP3= <user>
##$USERP4= <user>
##$USERP5= <user>
##$WDW= 1
##$XDIM= 65536
##$YMAX_p= 322203682
##$YMIN_p= -53279556
$$ End of Bruker specific parameters
$$ ---------------------------------
##NTUPLES= NMR SPECTRUM
##VAR_NAME=  FREQUENCY,     SPECTRUM/REAL,   SPECTRUM/IMAG
##SYMBOL=    X,             R,               I
##VAR_TYPE=  INDEPENDENT,   DEPENDENT,       DEPENDENT
##VAR_FORM=  AFFN,          ASDF,            ASDF
##VAR_DIM=   65536,         65536,           65536
##UNITS=     HZ,            ARBITRARY UNITS, ARBITRARY UNITS
##FACTOR=    0.620285442955139, 1,           1
##FIRST=     20137.2065510759, 0,            0
##LAST=      -20513.1999529892, 0,           0
##MIN=       -20513.1999529892, -53279556,   0
##MAX=       20137.2065510759, 322203682,    0
$$ Real data points
##PAGE= N=1
##DATA TABLE= (X++(R..R)), XYDATA
$$ [...]
$$ plain form
40652 1135769 2256244 2527576 1371050 -172106 -643747 72196 780765 638620 96731
40643 96731 7353 458953 962691 1280748 1430286 1212609 504040 -132268 45989 768750
40633 768750 882931 -56225 -1077189 -1131770 -491146 -159335 -351982 -347715 278304 986147
40623 986147 967239 76340 -1042782 -1497273 -838875 487582 1442539 1434210 960249 874186
40613 874186 1194622 1167440 438161 -464536 -914275 -860725 -539949 -108690 160489 -84022
40603 -84022 -650509 -765231 -121447 557421 558779 255642 398046 762851 472251 -487804
40593 -487804 -1074816 -681321 33898 146510 -346789 -717701 -414218 518221 1519004
40584 1519004 1812155 1088330 102908 61592 1080060 1771534 848272 -1229222 -2728551
$$ packed form
40652A135769J120475K71332j156526j543156m71641P15943P08569j42145n41889
40643I6731q9378M51600N03738L18057J49538k17677p08569o36308J78257P22761
40633G68750J14181r39156j020964n4581O40624L31811j92647M267O26019P07843
40623I86147j8908q90899j119122m54491O58398J326457R54957q329m73961q6063
40613H74186L20436k7182p29279r02697m49739N3550L20776M31259K69179k44511
40603h4022n66487j14722O43784O78868J358l03137J42404L64805k90600r60055
40593d87804n87012L93495P15219J12612m93299l70912L03483R32439J000783
40584A519004K93151p23825r85422m1316J018468O91474r23262k077494j499329
$$ plain form
40575 -2728551 -2597320 -1476062 -769536 -1035164 -1456019 -918183 490876 1410498 877109
40566 877109 -377233 -920370 -584879 -513442 -1320707 -2304052 -2715318 -2705261 -2517207 -1822502
40556 -1822502 -602475 247683 110224 -306049 -54106 570753 664351 285556 282335 879722
40546 879722 1486257 1695065 1558971 1109699 490216 284759 818360 1448440 1466930 1262072
40536 1262072 1507068 1716391 1000599 -120569 -294613 389106 447204 -518090 -1178708
40527 -1178708 -761197 -203100 -310966 -424767 116763 673048 585599 426090 721222 661412
40517 661412 -483923 -1689236 -1509989 -379863 41345 -643698 -1314274 -1326979 -1222126
40508 -1222126 -1401235 -1481767 -1206982 -865099 -534388 112153 974513 1371146 1028603 501889
$$ packed form
40575b728551J31231J121258P06526k65628m20855N37836J409059R19622n33389
40566H77109j254342n43137L35491P1437q07265r83345m11266J0057J88054O94705
40556a822502J220027Q50158j37459m16273K51943O24859R3598l78795l221N97387
40546H79722O06535K08808j36094m49272o19483k05457N33601O30080J8490k04858
40536A262072K44996K09323p15792j121168j74044O83719N8098r65294o60618
40527a178708M17511N58097j07866j13801N41530N56285q7449j59509K95132n9810
40517F61412j145335j205313J79247J130126M21208o85043o70576j2705J04853
40508a222126j79109q0532K74785L41883L30711O46541Q62360L96633l42543n26714
$$ plain form
40498 501889 330357 413379 486852 642928 1056372 1561334 1724636 1188544 33434 -1010486
40488 -1010486 -1080544 -311000 47741 -730458 -1650324 -1377607 -313649 15716 -572834
40479 -572834 -623463 530851 1591894 1273657 168008 -369225 -211444 -172759 -391871
40470 -391871 -264986 281555 618668 542116 598098 1069129 1408597 1030258 139671 -559002
40460 -559002 -659759 -316798 37743 49768 -293834 -642458 -689839 -621169 -882894 -1471809
40450 -1471809 -1828699 -1599193 -1101929 -751118 -428607 70823 309919 -302389 -1333786
40441 -1333786 -1516613 -431764 780571 956032 465927 438045 958704 1138445 761744
40432 761744 655342 1216623 1695407 1428398 858535 685001 754655 533304 92682 -154064
$$ packed form
40498E01889j71532Q3022P3473J56076M13444N04962J63302n36092j155110j043920
40488a010486p0058P69544L58741p78199r19866K72717J063958L29365n88550
40479e72834n0629J154314J061043l18237j105649n37233J57781L8685k19112
40470c91871J26885N46541L37113p6552N5982M71031L39468l78339q90587o98673
40460e59002j00757L42961L54541J2025l43602l48624m7381O8670k61725n88915
40450a471809l56890K29506M97264L50811L22511M99430K39096o12308j031397
40441a333786j82827J084849J212335J75461m90105k7882N20659J79741l76701
40432G61744j06402N61281M78784k67009n69863j73534O9654k21351m40622k46746
$$ plain form
40422 -154064 -293211 -741966 -1504077 -2208481 -2632627 -2674780 -2192422 -1465057 -1379080 -2377279
40412 -2377279 -3524825 -3427991 -1912766 -71490 1145543 1603716 1449487 820616 142511
40403 142511 -43588 320671 871925 1356281 1577915 1179419 260127 -154816 699570 1908640
40393 1908640 1846599 505819 -463967 -212417 217263 -245713 -1037304 -995933 -125216 568765
40383 568765 437307 -270804 -798783 -446296 720291 1537259 887795 -661012 -1381221
40374 -1381221 -819466 -457704 -1382649 -2635672 -2795160 -1983493 -1173388 -577965 -14592
40365 -14592 78010 -571976 -1015044 -305190 831102 1066265 631230 701114 1069476 423807
40355 423807 -1087606 -1625341 -469905 763545 508412 -678912 -1363214 -1268231 -984963
$$ packed form
40422a54064j39147m48755p62111p04404m24146m2153M82358P27365Q5977r98199
40412b377279j147546R6834J515225J841276J217033M58173j54229o28871o78105
40403A42511j86099L64259N51254M84356K21634l98496r19292m14943Q54386J209070
40393A908640o2041j340780r69786K51550M29680m62976p91591M1371Q70717O93981
40383E68765j31458p08111n27979L52487J166587Q16968o49464j548807p20209
40374a381221N61755L61762r24945j253023j59488Q11667Q10105N95423N63373
40365a4592R2602o49986m43068P09854J136292K35163m35035O9884L68362o45669
40355D23807j511413n37735J155436J233450k55133j187324o84302R4983K83268
$$ plain form
40346 -984963 -606200 191523 1242152 2017325 2361503 2449507 2298917 1818778 1094294 339235
40336 339235 -136892 117202 1193002 2252445 2275434 1510556 1227761 1796165 2153889
40327 2153889 1662007 1230840 1759235 2574450 2537701 1845268 1529104 1793372 2041116 2090051
40317 2090051 2207811 2290331 2095788 1982107 2350050 2669476 2156887 1122084 493658
40308 493658 312104 -21605 -263739 387515 1551240 1837852 1042862 559126 1072244
40299 1072244 1435715 692727 -228476 6787 1100317 1812990 1807809 1513630 890583 -231423
40289 -231423 -1043700 -500775 912390 1524009 736304 -261866 -328769 202031 421348 220858
40279 220858 63393 17935 -206574 -568155 -692202 -490944 -309995 -435883 -776805 -1080604
$$ packed form
40346i84963L78763P97723J050629P75173L44178Q8004j50590m80139p24484p55059
40336C39235m76127K54094J075800J059443K2989p64878k82795N68404L57724
40327B153889m91882m31167N28395Q15215l6749o92433l16164K64268K47744M8935
40317B090051J17760Q2520j94543j13681L67943L19426n12589j034803o28426
40308D93658j81554l33709k42134O51254J163725K86612p94990m83736N13118
40299A072244L63471p42988r21203K35263J093530P12673n181k94179o23047j122006
40289b31423q12277N42925J413165O11619p87705r98170o6903N30800K19317k00490
40279B20858j57465m5458k24509l61581j24047K01258J80949j25888l40922l03799
$$ plain form
40269 -1080604 -1243503 -1323438 -1388655 -1457092 -1526034 -1546508 -1375656 -934094 -514591 -678026
40259 -678026 -1493208 -2058973 -1378193 221001 1232146 898128 314071 930790 2462333
40250 2462333 3227881 2433497 1122980 639856 1002256 1303083 1103274 740079 528391
40241 528391 368785 242022 541756 1518855 2608158 2817220 1955803 1062978 1149091 1750774
40231 1750774 1433755 -225469 -1967111 -2490745 -1944850 -1156120 -205332 1171399 2324729
40222 2324729 2220251 1156000 590322 988255 1142325 208073 -813174 -587399 472444
40213 472444 847397 150209 -516184 -357779 77918 -56177 -689965 -1154157 -1200274 -1161833
40203 -1161833 -1287803 -1374068 -1131312 -647192 -268150 -109956 4958 19033 -536368 -1739023
$$ packed form
40269a080604j62899p9935o5217o8437o8942k0474J70852M41562M19503j63435
40259f78026q15182n65765O80780J599194J011145l34018n84057O16719J531543
40250B462333P65548p94384j310517m83124L62400L00827j99809l63195k11688
40241E28391j59606j26763K99734R77099J089303K09062q61417q92825Q6113O01683
40231A750774l17019j659224j741642n23634N45895P88730R50788J376731J153330
40222B324729j04478j064251n65678L97933J54070r34252j021247K25775J059843
40213D72444L74953o97188o66393J58405M35697j34095o33788m64192m6117L8441
40203a161833j25970q6265K42756M84120L79042J58194J14914J4075n55401j202655
$$ plain form
40193 -1739023 -2615710 -2083624 -592923 73062 -945302 -2344099 -2379488 -1166673 -267723
40184 -267723 -355114 -482099 211474 1183583 1410141 829063 161787 -219716 -484299 -632083
40174 -632083 -397620 51927 31329 -688067 -1316890 -974475 102733 851441 759499 308805
40164 308805 -6487 -347168 -860336 -1071102 -630197 -162793 -496093 -1286788 -1359511 -395752
40154 -395752 655969 1019721 1000880 1081533 995654 347364 -478117 -733316 -283667 397866
40144 397866 911463 1119436 936115 390370 -299174 -1009403 -1781136 -2387897 -2325387 -1567355
40134 -1567355 -799926 -494277 -326711 -3452 26859 -598045 -1227759 -999708 -146297 390797
40124 390797 299282 -70900 -674563 -1689329 -2600503 -2483507 -1336258 -216820 125259
$$ packed form
40193a739023q76687N32086J490701O65985j018364j398797l5389J212815Q98950
40184b67723q7391j26985O93573R72109K26558n81078o67276l81503k64583j47784
40174f32083K34463M49547k0598p19396o28823L42415J077208P48708r1942m50694
40164C08805l15292l40681n13168k10766M40905M67404l33300p90695p2723R63759
40154c95752J051721L63752j8841Q0653q5879o48290q25481k55199M49649O81533
40144C97866N13597K07973j83321n45745o89544p10229p71733o06761O2510P58032
40134a567355P67429L05649J67566L23259L0311o24904o29714K28051Q53411N37094
40124C90797r1515l70182o03663j014766r11174J16996J147249J119438L42079
$$ plain form
40115 125259 -12370 -33118 205812 510852 588833 163455 -523039 -518235 696381 2084147
40105 2084147 2139875 997909 237914 562862 1078720 1155881 1444620 2339703 2882253 2240052
40095 2240052 1137883 663468 607445 251130 16521 882099 2558023 3622923 3374546
40086 3374546 2383110 1250192 -39445 -1361639 -2052858 -1687060 -692174 82853 113641
40077 113641 -458502 -899853 -480356 633220 1386359 1141049 465286 67139 -321268
40068 -321268 -1041191 -1250467 -48198 1560547 1618520 192541 -485892 658512 1988686
40059 1988686 1866580 1077158 1060317 1319843 624549 -299200 324675 2145149 2891652
40050 2891652 1946082 1295084 2171870 3032477 2235992 807571 668720 1520774 1641125
$$ packed form
40115A25259j37629k0748K38930L05040P7981m25378o86494M804J214616J387766
40105B084147N5728j141966p59995L24948N15858P7161K88739Q95083N42550o42201
40095B240052j102169m74415n6023l56315k34609Q65578J675924J064900k48377
40086C374546r91436j132918j289637j322194o91219L65798R94886P75027L0788
40077A13641n72143m41351M19497J113576P53139k45310o75763l98147l88407
40068c21268p19923k09276J202269J608745N7973j425979o78433J144404J330174
40059A988686j22106p89422j6841K59526o95294r23749O23875J820474P46503
40050B891652r45570o50998Q76786Q60607p96485j428421j38851Q52054J20351
$$ plain form
40041 1641125 922989 828170 1617012 1907470 1201981 733926 1216408 1690054 1479125 1476597
40031 1476597 2274917 2638613 1404615 -349846 -782766 -23986 383381 133323 282588
40022 282588 988291 1133343 424034 53992 748863 1652509 1787206 1342038 889130 523140
40012 523140 447596 1242974 2730476 3575687 2882850 1340606 47027 -837259 -1404233
40003 -1404233 -1040676 582997 2319830 2733897 2074173 1760110 2172591 2333218 1787628
39994 1787628 1421818 1960417 2723800 2578166 1514131 613428 683064 1418457 1944019
39985 1944019 1906617 1784844 2022673 2160596 1380538 -113760 -1045311 -726443 1523
39976 1523 72736 -295830 -236452 243203 444366 344107 601025 1234515 1430337 889244
$$ packed form
40041A641125p18136r4819P88842K90458p05489m68055M82482M73646k10929k528
40031A476597P98320L63696j233998j754461m32920P58780M07367k50058J49265
40022B82588P05703J45052p09309l70042O94871R03646J34697m45168m52908l65990
40012E23140p5544P95378J487502Q45211o92837j542244j293579q84286n66974
40003a404233L63557J623673J736833M14067o59724l14063M12481J60627n45590
39994A787628l65810N38599P63383j45634j064035r00703O9636P35393N25562
39985A944019l7402j21773K37829J37923p80058j494298r31551L18868P27966
39976A523P1213l68566N9378M79655K01163j00259K56918O33490J95822n41093
$$ plain form
39966 889244 398313 671879 1395388 1870800 2013774 2223298 2650340 3040469 3145943 3055190
39956 3055190 3171416 3837067 4828989 5402123 5113039 4361832 3758960 3316015 2821611
39947 2821611 2614537 3131915 3908568 3999994 3369089 2862503 2764323 2491699 1957209 1995013
39937 1995013 2857250 3441481 2896168 2059430 2207655 3021057 3012770 1712531 284057
39928 284057 -67948 610485 1484790 1959515 2001637 1932532 2099221 2471369 2589093 2214475
39918 2214475 1843381 2103690 2854829 3501041 4010897 4791096 5564390 5410860 4299950
39909 4299950 3601677 4338013 5648721 5921027 4999345 4268381 4745714 6153057 7929736
39900 7929736 10057636 12471550 14645782 16518013 19125312 23386563 28592920 33054447
$$ packed form
39966H89244m90931K73566P23509M75412J42974K09524M27042L90129J05474r0753
39956C055190J16226O65651R91922N73134k89084p51207o02872m42945m94404
39947B821611k07074N17378P76653R1426o30905n06586r8180k72624n34490L7804
39937A995013Q62237N84231n45313q36738J48225Q13402q287j300239j428474
39928B84057l52005O78433Q74305M74725M2122o9105J66689L72148J17724l74618
39918B214475l71094K60309P51139O46212N09856P80199P73294j53530j110910
39909D299950o98273P36336J310708K72306r21682p30964M77333J407343J776679
39900G929736K127900K413914K174232J872231K607299M261251N206357M461527
$$ plain form
39892 33054447 36236654 39437365 44073062 49778711 54492961 56299724 55270015 53684410
39884 53684410 54097281 56662221 58634269 57199822 52656257 48078021 46027143 46532526
39876 46532526 48176914 49814390 50843072 51188023 51914531 54718678 59574397 63643738
39868 63643738 63941442 60858673 57850681 57609069 59440654 60396660 58122696 52578453
39860 52578453 45810632 40254952 36711225 33887922 30246108 25920572 22197214 19601169
39852 19601169 17582544 15861559 14807017 14347073 13733497 12788626 12308320 12686447 13098704
39843 13098704 12716061 11893967 11370718 10973672 10074921 8955896 8738516 9915993 11619677
39834 11619677 12526737 12152343 11162877 10664213 11273815 12768318 14511858 16072074 17306637
$$ packed form
39892C3054447L182207L200711M635697N705649M714250J806763j029709j585605
39884E3684410M12871K564940J972048j434447m543565m578236k050878N05383
39876D6532526J644388J637476J028682L44951P26508K804147M855719M069341
39868F3643738K97704l082769l007992k41612J831585R56006k273964n544243
39860E2578453o767821n555680l543727k823303l641814m325536l723358k596045
39852A9601169k018625j720985j054542m59944o13576r44871m80306L78127M12257
39843A3098704l82643q22094n23249l97046q98751j119025k17380J177477J703684
39834A1619677R07060l74394r89466m98664O09602J494503J743540J560216J234563
$$ plain form
39825 17306637 18067256 18212621 17949198 17875076 18597924 20384133 23025193 25902831 28472271
39816 28472271 30884873 33700992 36757689 39140972 40946912 44092506 50019507 57128537
39808 57128537 62060290 63355409 62347982 60741691 59414711 59815654 63895314 71161665
39800 71161665 77674792 79821787 78004739 75185317 73203091 72482666 74112252 79349349
39792 79349349 86931436 93160344 95434594 94431461 92620946 92155442 94457237 99861797
39784 99861797 106337527 109737538 106963943 98968653 90083554 84505246 83449537 84859674
39776 84859674 85156591 81743352 74729018 66533571 59776916 55598461 53725111 53394811
39768 53394811 53867651 54536546 55015193 55052994 54466967 53711262 54502703 58853439 66692165
$$ packed form
39825A7306637P60619J45365k63423p4122P22848J786209K641060K877638K569440
39816B8472271K412602K816119L056697K383283J805940L145594N927001P109030
39808E7128537M931753J295119j007427j606291j326980M00943M079660P266351
39800G1161665O513127K146995j817048k819422j982226p20425J629586N237097
39792G9349349P582087O228908K274250j003133j810515m65504K301795N404560
39784I9861797O475730L400011k773595p995290q885099n578308j055709J410137
39776H4859674K96917l413239p014334q195447o756655m178455j873350l30300
39768E3394811M72840O68895M78647L7801n86027p55705P91441M350736P838726
$$ plain form
39759 66692165 74920501 79712769 79858196 77567611 76281461 78091112 82794207 88431616
39751 88431616 92559621 93836398 92989309 92013461 92139567 92820203 92825122 91788395 90246034
39742 90246034 88689657 87350829 86558118 86223346 84984559 81200861 75436699 70811076
39734 70811076 69773396 71257572 72230641 71488464 70466820 70602362 71635098 72771491
39726 72771491 73865202 74814679 75293651 75954682 78457398 83008526 86977057 87512031 84980205
39717 84980205 82434121 82015704 83075919 83496460 81634653 77210012 71538947 66847396
39709 66847396 64240217 62399125 59304853 55014550 51450301 49534588 48046933 45624195
39701 45624195 42491135 39622109 37354112 35556208 34289080 33581180 33151102 32812703
$$ packed form
39759F6692165Q228336M792268J45427k290585j286150J809651M703095N637409
39751H8431616M128005J276777q47089r75848J26106O80636M919j036727j542361
39742I0246034j556377j338828p92711l34772j238787l783698n764162m625623
39734G0811076j037680J484176R73069p42177j021644J35542J032736J136393
39726G2771491J093711R49477M78972O61031K502716M551128L968531N34974k531826
39717H4980205k546084m18417J060215M20541j861807m424641n671065m691551
39709F6847396k607179j841092l094272m290303l564249j915713j487655k422738
39701D5624195l133060k869026k267997j797904j267128p07900m30078l38399
$$ plain form
39693 32812703 32561066 32015608 30624090 28772309 27751304 28084499 28744392 28610434 27850549
39684 27850549 27188911 26659410 25935508 25196764 24743912 24273990 23424081 22611366 22484864
39675 22484864 22906956 23287322 23558519 23971223 24274160 24058850 23696975 23923899 24562036
39666 24562036 24692398 24202908 24134350 25134148 26493925 27338364 28075107 29793975 32420488
39657 32420488 34260364 33681737 30947978 28077703 26902842 27453132 28315276 28316190 27492151
39648 27492151 26495557 25630287 24793133 23977513 23350224 22944730 22662730 22553868 22788426
39639 22788426 23323085 23811511 23915168 23624719 23261329 23148618 23223801 23062371 22440419
39630 22440419 21694968 21202924 20721308 19830754 18926042 18924543 19791998 20254094 19476263 18226460
$$ packed form
39693C2812703k51637n45458j391518j851781j021005L33195O59893j33958p59885
39684B7850549o61638n29501p23902p38744m52852m69922q49909q12715j26502
39675B2484864M22092L80366K71197M12704L02937k15310l61875K26924O38137
39666B4562036J30362m89490o8558R99798J359777Q44439P36743J718868K626513
39657C2420488J839876n78627k733759k870275j174861N50290Q62144R14q24039
39648B7492151r96594q65270q37154q15620o27289m05494k82000j08862K34558
39639B2788426N34659M88426J03657k90449l63390j12711P5183j61430o21952
39630B2440419p45451m92044m81616q90554r04712j499Q67455M62096p77831j249803
$$ plain form
39620 18226460 17656700 17639088 17276004 16581956 16484790 17200880 17696024 17096043 15889699
39611 15889699 15287530 15787147 16733931 17158750 16877162 16710180 17443323 18595389 18782911
39602 18782911 17610907 16490532 16855724 18166392 18728366 18140107 17647049 18043611 18538247
39593 18538247 18133680 17050532 16176756 15951687 16378749 17332087 18188148 17931682 16438690
39584 16438690 15010631 14774561 15160128 14972198 14421479 14766138 16141221 17211494 17234082
39575 17234082 17079988 17557687 17927639 17132929 15708493 15233759 16227969 17749214 18979084
39566 18979084 20010648 20853393 20851591 19770193 18599438 18401879 18883336 19003643 18651293
39557 18651293 18699339 19492101 20361979 20928361 21932199 24231577 27652164 31433950 35240875
$$ packed form
39620A8226460n69760j7612l63084o94048r7166P16090M95144n99981j206344
39611A5889699o02169M99617R46784M24819k81588j66982P33143J152066J87522
39602A8782911j172004j120375L65192J310668N61974n88259m93058L96562M94636
39593A8538247m04567j083148q73776k25069M27062R53338Q56061k56466j492992
39584A6438690j428059k36070L85567j87930n50719L44659J375083J070273K2588
39575A7234082j54094M77699L69952p94710j424436m74734R94210J521245J229870
39566A8979084J031564Q42745j802j081398j170755j97559M81457J20307l52350
39557A8651293M8046P92762Q69878N66382J003838K299378L420587L781786L806925
$$ plain form
39548 35240875 39023683 42396171 45157551 48315183 53451035 60504328 66804330 69139886
39540 69139886 66955533 63181756 61604611 63279626 65555356 64722701 59582450 52261496
39532 52261496 45725849 41094245 37567045 34207230 30924676 27920609 25099710 22368655
39524 22368655 19989356 18231877 16913539 15589317 14108319 12794773 12114233 12243074
39516 12243074 12906315 13551937 13690792 13160922 12234394 11567854 11821665 12964392 14035963
39507 14035963 14061644 13212247 12515468 12383769 12224655 11780598 11848697 12914781 13950691
39498 13950691 13713214 12691085 12444221 13226672 13649112 12832073 11592742 11080486 11338852
39489 11338852 11770528 12095609 12208721 11822480 10902472 9939004 9319068 8929759 8688849
$$ packed form
39548C5240875L782808L372488K761380L157632N135852P053293O300002K335556
39540F9139886k184353l773777j577145J675015K275730q32655n140251p320954
39532E2261496o535647m631604l527200l359815l282554l004067k820899k731055
39524B2368655k379299j757479j318338j324222j480998j313546o80540J28841
39516A2243074O63241O45622J38855n29870r26528o66540K53811J142727J071571
39507A4035963K5681q49397o96779j31699j59114m44057O8099J066084J035910
39498A3950691k37477j022129k46864P82451M22440q17039j239331n12256K58366
39489A1338852M31676L25081J13112l86241r20008r63468o19936l89309k40910
$$ plain form
39480 8688849 8808595 9212160 9466596 9678450 10550541 12027407 12904379 12565893 12130250
39471 12130250 12875734 14466708 15995260 17964745 21623546 26686933 31324420 34391031
39463 34391031 36290597 37749017 39436747 43025195 50571577 61540731 71572883 75689863
39455 75689863 72666685 65897400 60656797 60824443 66761743 74648374 78308596 73623754
39447 73623754 62151916 49942181 42317656 39910489 39535581 37994717 34475455 29898933
39439 29898933 25181559 20733134 17091506 14986054 14360915 13937591 12439110 10053732
39431 10053732 8063317 7146782 6771416 6261341 5618831 5049175 4532380 4329058 5083092
39422 5083092 6695222 7759319 7051514 5207030 3990882 4111042 4677851 4735949 4332570
$$ packed form
39480H688849J19746M03565K54436K11854Q72091J476866Q76972l38486m35643
39471A2130250P45484J590974J528552J969485L658801N063387M637487L066611
39463C4391031J899566J458420J687730L588448P546382J0969154J0032152M116980
39455G5689863l023178o769285n240603J67646N937300P886631L660222m684842
39447G3623754j1471838j2209735p624525k407167l74908j540864l519262m576522
39439B9898933m717374m448425l641628k105452o25139m23324j498481k385378
39431A0053732j990415r16535l75366n10075o42510n69656n16795k03322P54034
39422E083092J612130J064097p07805j844484j216148J20160N66809N8098m03379
$$ plain form
39413 4332570 3927984 3704503 3825940 4577852 5761103 6577671 6617359 6412449 6524492
39404 6524492 6661411 6329313 5823736 5756392 5971139 5868594 5603815 5868395 6390253 5827943
39394 5827943 3702628 1475364 872713 1790948 2773908 3080056 3162610 3290574 2980281
39385 2980281 2148863 1759566 2592790 4019723 4739327 4349869 3526021 2938974 2706322
39376 2706322 2760715 3054653 3362744 3448317 3471621 3712136 3886177 3386769 2337186 1696936
39366 1696936 1950112 2313586 1825359 783368 392414 1140529 2209286 2565738 2074106
39357 2074106 1318628 786602 586874 709722 1121150 1589128 1753897 1550204 1384743
39348 1384743 1651274 2111730 2055759 1219330 289268 171955 862007 1434894 1231092 644253
$$ packed form
39413D332570m04586k23481J21437P51912J183251Q16568L9688k04910J12043
39404F524492J36919l32098n05577o7344K14747j02545k64779K64580N21858n62310
39394E827943k125315k227264o02651R18235R82960L06148Q2554J27964l10293
39385B980281q31418l89297Q33224J426933P19604l89458q23848n87047k32652
39376B706322N4393K93938L08091Q5573K3304K40515J74041m99408j049583o40250
39366A696936K53176L63474m88227j041991l90954P48115J068757L56452m91632
39357B074106p55478n32026j99728J22848M11428M67978J64769k03693j65461
39348A384743K66531M60456n5971q36429r30062j17313O90052N72887k03802n86839
$$ plain form
39338 644253 483317 876042 1229463 1154612 929792 888721 759099 43585 -1035776 -1470877
39328 -1470877 -622096 849938 1665493 1492228 1305527 1990436 3117888 3606525 3239138
39319 3239138 2825836 2947673 3268181 3256187 2939248 2594982 2212843 1709228 1310988 1253035
39309 1253035 1328187 1174472 853088 745185 983915 1332917 1520872 1388305 865883 180629
39299 180629 -71632 474182 1332822 1624044 1175962 702745 790769 1218947 1526041 1749403
39289 1749403 2123120 2359925 1886361 823922 127130 392250 937247 649591 -361698
39280 -361698 -674322 580290 2350064 2805339 1551998 -65240 -814258 -842324 -792826
39271 -792826 -508292 636790 2515255 4141633 4777551 4655493 4579715 5126308 6205389
$$ packed form
39338F44253j60936L92725L53421p4851k24820m1071j29622p15514j079361m35101
39328a470877Q48781J472034Q15555j73265j86701O84909J127452M88637l67387
39319C239138m13302J21837L20508j1994l16939l44266l82139n03615l98240n7953
39309A253035P5152j53715l21384j07903K38730L49002J87955j32567n22422o85254
39299A80629k52261N45814Q58640K91222m48082m73217Q8024M28178L07094K23362
39289A749403L73717K36805m73564j062439o96792K65120N44997k87656j011289
39280c61698l12624J254612J769774M55275j253341j617238p49018k8066M9498
39271g92826K84534J145082J878465J626378O35918j22058p5778N46593J079081
$$ plain form
39262 6205389 7174284 7472140 7309657 7509993 8468322 9599810 10125597 10051399 9971535 10248684
39252 10248684 10835298 11543005 11964847 11510857 10160360 8851838 8444275 8628668 8612768
39243 8612768 8434960 8558256 8516860 7341081 5352753 4113033 4223484 4508982 3955162
39234 3955162 3185885 3198426 3752069 4032926 4026638 4131874 4130815 3720813 3530895 4353432
39224 4353432 5638038 5960666 4952411 3696791 3127951 2986617 2569004 1714675 759925
39215 759925 68627 -173652 -92382 -109861 -453315 -772009 -616273 -71308 539113 1233950
39205 1233950 2034786 2423965 1988403 1348325 1487287 2284658 2728735 2552392 2538337 3057183
39195 3057183 3458817 3275756 2954319 2895267 2760259 2329493 2138986 2564313 3044230 2932591
$$ packed form
39262F205389R68895K97856j62483K00336R58329J131488N25787p4198p9864K77149
39252A0248684N86614P07707M21842m53990j350497j308522m07563J84393j5900
39243H612768j77808J23296m1396j175779j988328j239720J10451K85498n53820
39234C955162p69277J2541N53643K80857o288J05236j059m10002j89918Q22537
39224D353432J284606L22628j008255j255620n68840j41334m17613q54329r54750
39215G59925o91298k42279Q1270j7479l43454l18694J55736N44965O10421O94837
39205A233950Q00836L89179m35562o40078J38962P97371M44077j76343j4055N18846
39195C057183M01634j83061l21437n9052j35008m30766j90507M25327M79917j11639
$$ plain form
39185 2932591 2445088 2081100 1805253 1544237 1777829 2719235 3481710 3067537 1832228
39176 1832228 1049284 1292281 2067173 2729607 2908998 2339148 1208637 456869 789634
39167 789634 1591108 1741199 1266933 1104884 1421947 1455279 1046053 959763 1375670 1379013
39157 1379013 494647 -457747 -701609 -623240 -798664 -890939 -402273 305284 649204 751585
39147 751585 836940 485243 -479224 -1100944 -530727 461070 606700 305572 1014527 2609602
39137 2609602 3186097 1898029 303768 31082 504889 186815 -922907 -1421408 -678257
39128 -678257 449740 1065562 1312321 1714030 2198289 2268429 1824816 1372911 1369441 1563867
39118 1563867 1226291 118714 -1026507 -1340690 -942357 -694988 -905668 -957459 -398230
$$ packed form
39185B932591m87503l63988k75847k61016K33592R41406P62475m14173j235309
39176A832228p82944K42997P74892O62434J79391n69850j130511p51768L32765
39167G89634Q01474J50091m74266j62049L17063L3332m09226q6290M15907L343
39157A379013q84366r52394k43862P8369j75424r2275M88666P07557L43920J02381
39147G51585Q5355l51697r64467o21720N70217R91797J45630l01128P08955J595075
39137B609602N76495j288068j594261k72686M73807l18074j109722m98501P43151
39128f78257J127997O15822K46759M01709M84259P0140m43613m51905l470J94426
39118A563867l37576j107577j145221l14183L98333K47369k10680n1791N59229
$$ plain form
39109 -398230 322159 565027 326412 -80035 -546675 -851616 -432593 809285 1953210
39100 1953210 2076976 1478121 1111974 1156779 1029396 594883 354145 452551 503556 539423
39090 539423 1144236 2294071 2977040 2540052 1730510 1731859 2596496 3295451 3130970 2538712
39080 2538712 2456306 3217778 4200167 4553978 4259353 4221281 5078141 6237581 6675738 6547344
39070 6547344 7227493 9584434 12872738 15590489 16809359 16358607 14407083 11491073
39062 11491073 8569879 6437331 5152240 4320819 3721551 3402764 3413595 3677452 3927978
39053 3927978 3696014 2738511 1577897 1107407 1447745 1717831 1223695 352080 -64825
39044 -64825 217956 836405 1376528 1585646 1428304 1214737 1246616 1203999 544320 -349613
$$ packed form
39109c98230P20389K42868k38615m06447m66640l04941M19023J241878J143925
39100A953210J23766n98855l66147M4805j27383m34513k40738R8406N1005L5867
39090E39423O04813J149835O82969m36988q09542J349Q64637O98955j64481n92258
39080B538712q2406P61472R82389L53811k94625l8072Q56860J159440M38157j28394
39070F547344O80149K356941L288304K717751J218870m50752j951524k916010
39062A1491073k921194k132548j285091q31421n99268l18787J0831K63857K50526
39053C927978k31964r57503j160614m70490L40338K70086m94136q71615m16905
39044f4825K82781O18449N40123K09118j57342k13567L1879m2617o59679q93933
$$ plain form
39034 -349613 -382858 506140 927212 73218 -938560 -769498 106840 347249 -120045 -380730
39024 -380730 -354645 -679241 -1066357 -480659 971875 1883169 1541476 753766 393254 410924
39014 410924 623110 1203188 1921365 2065327 1649797 1652177 2518487 3421666 3509465 2930901
39004 2930901 2164757 1360919 863779 1295172 2442149 3059221 2484226 1527689 1117994
38995 1117994 1105551 1158860 1713474 2999247 4062824 3868796 2665998 1341552 246269
38986 246269 -398899 60947 1636141 2936322 2844080 2154822 2160730 2496261 2109994 1575785
38976 1575785 2290961 3761098 4030051 2907838 2388799 3288750 3802069 2534357 911551
38967 911551 931272 2048498 2220274 1141030 476357 1156372 2181146 2348680 1841629
$$ packed form
39034c49613l3245Q88998M21072q53994j011778J69062Q76338K40409m67294k60685
39024c80730K6085l24596l87116N85698J452534R11294l41693p87710l60512J7670
39014D10924K12186N80078P18177J43962m15530K380Q66310R03179Q7799n78564
39004B930901p66144q03838m97140M31393J146977O17072n74995r56537m09695
38995A117994j2443N3309N54614J285773J063577j94028j202798j324446j095283
38986B46269o45168M59846J575194J300181r2242o89258N908L35531l86267n34209
38976A575785P15176J470137K68953j122213n19039Q99951N13319j267712j622806
38967I11551J9721J117226J71776j079244o64673O80015J024774J67534n07051
$$ plain form
38958 1841629 1580713 1851112 2153804 2034310 1638834 1529591 2082753 3050933 3786632
38949 3786632 3952058 3847031 3943367 4309613 4644727 4684571 4414333 4038079 3880743 4212573
38939 4212573 5072606 6258030 7365993 7826868 7299872 6319645 6071881 7025029 8301539
38930 8301539 9099666 10098953 12378920 15572690 18649760 22082743 27171681 33435337
38922 33435337 39690500 48528894 65703843 91367801 114129241 119034127 102584687
38915 102584687 76572642 55715927 44458092 37769311 31436864 26841332 26073418 27244899
38907 27244899 27296386 26903208 29240323 34766697 40964800 48090522 61231591 82891076
38899 82891076 105091579 113699109 102299959 78960114 57358141 43730537 35050233
$$ packed form
38958A841629k60916K70399L02692j19494l95476j09243N53162R68180P35699
38949C786632J65426j05027R6336L66246L35114L9844k70238l76254j57336L31830
38939D212573Q60033J185424J107963M60875n26996r80227k47764R53148J276510
38930H301539P98127R99287K279967L193770L077070L432983N088938O263656
38922C3435337O255163Q838394J7174949K5663958K2761440M904886j6449440
38915A02584687k6012045k0856715j1257835o688781o332447m595532p67914J171481
38907B7244899N1487l93178K337115N526374O198103P125722J3141069K1659485
38899H2891076K2200503Q607530j1399150k3339845k1601973j3627604q680304
$$ plain form
38892 35050233 27413003 21350866 18631126 18157112 17375216 15531386 13480841 11685025
38884 11685025 10169970 9423659 9695218 10111128 9832318 9384712 9577504 9875150 9272137
38875 9272137 8147395 7708333 8006648 8039640 7567776 7306734 7419926 7321650 6996483 7027040
38865 7027040 7178173 6463052 4931611 3936426 4155312 4731543 4943106 5342147 6455508
38856 6455508 7620079 8083927 8227644 8675898 9082972 8871702 8461655 8656262 9291508
38847 9291508 9493708 8954767 8141364 7563986 7525968 8208028 9337990 10162923 10329887
38838 10329887 10360537 10787987 11460067 12221767 13504763 15573117 17970659 20399880 23304914
38829 23304914 26957320 31037181 35800304 42358778 51202237 62381859 77846557 100050305
$$ packed form
38892C5050233p637230o062137k719740m74014p81896j843830k050545j795816
38884A1685025j515055p46311K71559M15910k78810m47606J92792K97646o03013
38875I272137j124742m39062K98315L2992m71864k61042J13192r8276l25167L0557
38865G027040J51133p15121j531441r95185K18886N76231K11563L99041J113361
38856F455508J164571M63848J43717M48254M07074k11270m10047J94607O35246
38847I291508K02200n38941q13403n77378l8018O82060J129962Q24933J66964
38838A0329887L0650M27450O72080P61700J282996K068354K397542K429221K905034
38829B3304914L652406M079861M763123O558474Q843459J1179622J5464698K2203748
$$ plain form
38821 100050305 125434615 142886646 144151706 134582047 127737812 128847290 129280709 119115879
38813 119115879 99515302 79236395 63716044 52556608 44671569 40220244 38221683
38806 38221683 36785943 35869874 36733779 39121106 41941621 46034426 53132154 62981321
38798 62981321 74971426 91285995 113255252 134533965 144087359 138782645 128396109
38791 128396109 124254817 125951446 123334349 109681164 88664962 68884222 55427578
38784 55427578 47677705 42603092 38280826 34846857 33219286 33595838 35542115 38974457
38776 38974457 44010261 50454911 59190874 73193449 93531552 113572099 121414467 111294995
38768 111294995 90205808 70335660 57279541 48860665 42643719 39140482 38259657 38052107
$$ packed form
38821A00050305K5384310J7452031J265060r569659o844235J109478M33419j0164830
38813A19115879j9600577k0278907j5520351j1159436p885039m451325j998561
38806C8221683j435740r16069Q63905K387327K820515M092805P097728R849167
38798F2981321J1990105J6314569K1969257K1278713R553394n304714j0386536
38791A28396109m141292J696629k617097j3653185k1016202j9780740j3456644
38784E5427578p749873n074613m322266l433969j627571L76552J946277L432342
38776C8974457N035804O444650Q735963J4002575K0338103K0040547P842368j0119472
38768A11294995k1089187j9870148j3056119q418876o216946l503237q80825k07550
$$ plain form
38760 38052107 38173896 40575827 45701134 51960536 60224755 74173663 93088997 107862865
38752 107862865 108465653 94205519 73668779 55723001 43403077 35416039 29805021
38745 29805021 25292578 21389730 18432749 16749702 15684407 14231008 12293922 10376307
38737 10376307 8557164 6893264 6199439 7041691 8409144 8780060 8106891 7363102 6640195
38728 6640195 5359149 3995718 3691680 4198843 4136941 3479962 3790626 5460101 6682009
38719 6682009 6112567 4840697 4505289 4878715 4749700 4142720 4072647 4650015 4928233
38710 4928233 4557391 4427052 5448150 7372403 9008079 9289876 8138364 6442612 5134309
38701 5134309 4357593 3820538 3617115 3913159 4045798 3146488 1810661 1792821 3531857
$$ packed form
38760C8052107J21789K401931N125307O259402Q264219J3948908J8915334J4773868
38752A07862865O02788j4260134k0536740j7945778j2319924p987038n611018
38745B9805021m512443l902848k956981j683047j065295j453399j937086j917615
38737A0376307j819143j663900o93825Q42252J367453L70916o73169p43789p22907
38728F640195j281046j363431l04038N07163o1902o56979L10664J669475J221908
38719F682009n69442j271870l35408L73426j29015o06980p0073N77368K78218
38710D928233l70842j30339J021098J924253J635676K81797j151512j695752j308303
38701E134309p76716n37055k03423K96044J32639q99310j335827j7840J739036
$$ plain form
38692 3531857 5329295 5766602 5592593 6117677 6999180 7067485 6361436 5716086 5054829
38683 5054829 3822232 2617384 2553675 3185004 2898248 1425898 205029 28977 122520
38674 122520 -34040 232114 1177508 1772368 1402638 969659 1229552 1442962 941225 706363
38664 706363 1784337 3144079 2965823 1504455 799519 1660236 2692028 2568287 1736094
38655 1736094 1303950 1417042 1470129 1209884 986648 1240858 2003128 2648314 2276421 854229
38645 854229 -283383 93340 1306853 1534455 421381 -348421 482281 1982402 2555593
38636 2555593 2151862 1833343 1894346 1769022 1509928 1967402 3258659 4148426 3519955
38627 3519955 1833785 564932 525311 1235624 1819887 2034263 2206280 2392120 2048489
$$ packed form
38692C531857J797438M37307j74009N25084Q81503O8305p06049o45350o61257
38683E054829j232597j204848o3709O31329k86756j472350j220869j76052R3543
38674A22520j56560K66154R45394N94860l69730m32979K59893K13410n01737k34862
38664G06363J077974J359742j78256j461368p04936Q60717J031792j23741q32193
38655A736094m32144J13092N3087k60245k23236K54210P62270O45186l71893j422192
38645H54229j137612L76723J213513K27602j113074p69802Q30702J500121N73191
38636B555593m03731l18519O1003j25324k59094M57474J291257Q89767o28471
38627C519955j686170j268853l9621P10313N84263K14376J72017J85840l43631
$$ plain form
38618 2048489 820767 -602969 -1009272 -151684 826354 799484 12825 -464295 -231357
38609 -231357 170384 266160 169801 57184 -199867 -661063 -1099839 -1397286 -1737305 -2185514
38599 -2185514 -2432964 -2156370 -1318594 -22139 1481654 2495677 2200282 698618 -716459
38590 -716459 -851600 121239 1111276 1457177 1277993 809357 150113 -384596 -384733 23106
38580 23106 219064 -55194 -354177 -219831 217804 523634 453906 18656 -521400 -568694
38570 -568694 355038 1768100 2411215 1751797 813207 866990 1687470 1940249 1163671 401087
38560 401087 598328 1218719 1099550 209145 -258703 480506 1770404 2420942 2174101
38551 2174101 1762028 1747595 1988140 2337131 3110204 4320253 5047328 4451634 3154585
$$ packed form
38618B048489j227722j423736m06303Q57588R78038k6870p86659m77120K32938
38609b31357M01741R5776r6359j12617k57051m61196m38776k97447l40019m48209
38599b185514k47450K76594Q37776J296455J503793J014023k95395j501664j415077
38590g16459j35141R72839R90037L45901j79184m68636o59244n34709j37M07839
38580B3106J95958k74258k98983J34346M37635L05830o9728m35250n40056m7294
38570e68694R23732J413062O43115o59418r38590N3783Q20480K52779p76578p62584
38560D01087J97241O20391j19169q90405m67848P39209J289898O50538k46841
38551B174101m12073j4433K40545L48991P73073J210049P27075n95694j297049
$$ plain form
38542 3154585 2606151 3070690 3343551 2743870 2170183 2494783 3099140 3156439 3427130 5201879
38532 5201879 7877319 9274765 8493228 6954519 6221916 6126061 5687191 4730776 3736806
38523 3736806 2953954 2542224 2922985 4086142 5020872 4714134 3474268 2569000 2740961
38514 2740961 3638075 4477245 4721351 4279747 3506535 2859297 2301785 1410268 336369
38505 336369 34496 964890 2143949 2250667 1287199 360689 129237 298729 469906
38496 469906 622764 758389 780360 796611 987405 1189835 1107216 828721 642768 495302
38486 495302 158592 -244652 -394780 -206173 355516 1420020 2575347 2749713 1660372
38477 1660372 710573 1195805 2220306 2017549 940559 1087605 2842870 4038034 3306376
$$ packed form
38542C154585n48434M64539K72861n99681n73687L24600O04357N7299K70691J774749
38532E201879K675440J397446p81537j538709p32603r5855m38870r56415r93970
38523C736806p82852m11730L80761J163157R34730l06738j239866r05268J71961
38514B740961Q97114Q39170K44106m41604p73212o47238n57512q91517j073899
38505C36369l01873R30394J179059J06718r63468r26510k31452J69492J71177
38496D69906J52858J35625K1971J6251J90794K02430q2619k78495j85953j47466
38486D95302l36710m03244j50128J88607N61689J064504J155327J74366j089341
38477A660372r49799M85232J024501k02757j076990J47046J755265J195164p31658
$$ plain form
38468 3306376 2126654 2218941 2782950 2144886 760045 441978 1382424 2098417 2072596
38459 2072596 2352122 3298248 3630772 2409341 547553 -481051 -411286 133828 854829
38450 854829 1745583 2421858 2426665 2000272 1800756 1927889 1859657 1395024 1057111 1306579
38440 1306579 1815048 1979938 1944151 2487682 3745613 4623638 4052472 2513676 1550842
38431 1550842 1742342 1970288 1045915 -651182 -1746236 -1576312 -626836 423614 1314943
38422 1314943 1905303 1973120 1548704 1031925 757369 643228 389038 -72366 -357501 65364
38412 65364 1149674 1942801 1517782 362621 143072 1645756 3643010 4480640 4151967
38403 4151967 3843145 3923683 3658530 2807134 2172833 2258576 2518149 2417504 2222426 2135731
$$ packed form
38468C306376j179722R2287N64009o38064j384841l18067R40446P15993k5821
38459B072596K79526R46126L32524j221431j861788j028604O9765N45114P21001
38450H54829Q90754O76275M807m26393j99516J27133o8232m64633l37913K49468
38440A306579N08469J64890l5787N43531J257931Q78025n71166j538796r62834
38431A550842J91500K27946r24373j697097j095054J69924R49476J050450Q91329
38422A314943N90360O7817m24416n16779k74556j14141k54190m61404k85135M22865
38412F5364J084310P93127m25019j155161k19549J502684J997254Q37630l28673
38403D151967l08822Q0538k65153q51396o34301Q5743K59573j00645j95078q6695
$$ plain form
38393 2135731 1628823 471114 -367878 127198 1468552 2334754 2493909 2931647 4071556
38384 4071556 4988486 4751278 3679076 2739929 2323316 2184472 2167560 2347199 2628459
38375 2628459 2737115 2596505 2387854 2290607 2403274 2766911 3186689 3238833 2817735 2443931
38365 2443931 2554924 2743545 2380322 1816994 2030343 2978519 3414086 2804558 2339599
38356 2339599 3151823 4462602 4724769 4032934 4032784 5681257 8429587 11484717 14341454
38347 14341454 15881232 14643069 10831331 6837403 4824931 4637877 4775676 4394255
38339 4394255 3463031 2026042 557481 264875 1663988 3325245 3358118 1851245 591225
38330 591225 583123 1152532 1449047 1495048 1494308 1246717 673820 114878 -198126 -304266 -81843
$$ packed form
38393B135731n06908j157709q38992M95076J341354Q66202J59155M37738J139909
38384D071556R16930k37208j072202r39147m16613j38844j6912J79639K81260
38375B628459J08656j40610k08651r7247J12667L63637M19778N2144m21098l73804
38365B443931J10993J88621l63223n63328K13349R48176M35567o09528m64959
38356B339599Q12224J310779K62167o91835j50J648473K748330L055130K856737
38347A4341454J539778j238163l811738l993928k012472j87054J37799l81421
38339D394255r31224j436989j468561k92606J399113J661257L2873j506873j260020
38330E91225q102N69409K96515M6001p40k47591n72897n58942l13004j06140K22423
$$ plain form
38319 -81843 586141 1194153 1050148 430305 371693 1130521 1786049 1656232 1194851 1112949
38309 1112949 1435168 1817634 2053706 1913826 1212064 337481 -22055 84256 -35473
38300 -35473 -383509 -126628 807530 1200815 362205 -606926 -347977 788451 1354003 769485
38290 769485 -304061 -1070652 -1152236 -450212 676997 1424341 1436590 1287067 1458466 1518819
38280 1518819 1119464 1027481 1994403 3175001 3024287 1503956 126640 -41374 796382
38271 796382 2158232 3697792 4581750 3937234 2330430 1521520 2188108 3006107 2638987
38262 2638987 1608564 1325588 2009540 2531933 1996110 729601 -191320 1543 1033492
38253 1033492 1695190 965185 -805828 -2155280 -2055253 -823830 501058 1132051 846243
$$ packed form
38319h1843O67984O08012j44005o19843n8612P58828O55528j29817m61381q1902
38309A112949L22219L82466K36072j39880p01762q74583l59536J06311j19729
38300c5473l48036K56881R34158L93285q38610r69131K58949J136428N65552n84518
38290G69485j073546p66591q1584P02024J127209P47344J2249j49523J71399O0353
38280A518819l99355r1983R66922J180598j50714j520331j377316j68014Q37756
38271G96382J361850J539560Q83958o44516j606804q08910O66588Q17999l67120
38262B638987j030423k82976O83952N22393n35823j266509r20921J92863J031949
38253A033492O61698p30005j771013j349452J00027J231423J324888O30993k85808
$$ plain form
38244 846243 73423 -116982 1112561 3132942 4179868 3360459 1689169 670316 547440
38235 547440 586478 464139 524547 954481 1466321 1746023 1734069 1544232 1415177 1564675
38225 1564675 1872177 1980650 1839596 1705123 1527929 1054516 706496 1351589 2726179
38216 2726179 3254660 2329138 1612912 2722548 4542263 4604318 2659952 936582 850057
38207 850057 1430896 1488424 1460908 2108752 2834013 2582490 1490082 493060 33679 170028
38197 170028 1177719 2810359 3607094 2428711 449186 110404 1940498 3797656 3732229
38188 3732229 2345602 1519015 1831321 2390694 2643309 2974894 3472987 3368255 2349585
38179 2349585 1572150 2356055 4188778 5070601 4015019 2283733 1621674 2020092 2084531
$$ packed form
38244H46243p72820j90405J229543K020381J046926q19409j671290j018853j22876
38235E47440L9038j22339O0408M29934N11840K79702j1954j89837j29055J49498
38225A564675L07502J08473j41054j34473j77194m73413l48020O45093J374590
38216B726179N28481r25522p16226J109636J819715O2055j944366j723370q6525
38207H50057N80839N7528k7516O47844P25261k51523j092408r97022m59381J36349
38197A70028J007691J632640P96735j178383j979525l38782J830094J857158o5427
38188C732229j386627q26587L12306N59373K52615L31585M98093j04732j018670
38179B349585p77435P83905J832723Q81823j055582j731286o62059L98418O4439
$$ plain form
38170 2084531 1187922 188595 -5969 432589 926616 1440692 2118137 2544614 2171238
38161 2171238 1279617 811041 1144276 1561570 1197982 258131 -82886 893752 2359934
38152 2359934 2724218 1633730 632056 1261794 2960001 3792143 3166513 2643884 3668866
38143 3668866 5578900 6645416 6326564 5551740 5199643 5199910 5017725 4366467 3472921 2982256
38133 2982256 3357235 4126400 4246050 3547382 3081209 3458953 3731116 2833122 1346726
38124 1346726 627881 791694 904497 717535 722756 779587 324040 -123232 597188 2132042
38114 2132042 2701923 1830820 1205570 1985762 2934344 2404389 797003 -320644 -464101
38105 -464101 -192486 332343 1306972 2358222 2950916 3313213 3840340 4070464 3443715
$$ packed form
38170B084531q96609r99327j94564M38558M94027N14076O77445M26477l73376
38161B171238q91621m68576L33235M17294l63588r39851l41017R76638J466182
38152B359934L64284j090488j001674O29738J698207Q32142o25630n22629J024982
38143C668866J910034J066516l18852p74824l52097K67j82185o51258q93546m90665
38133B982256L74979P69165J19650o98668m66173L77744K72163q97994j486396
38124A346726p18845J63813J12803j86962N221N6831m55547m47272P20420J534854
38114B132042N69881q71103o25250P80192R48582n29955j607386j117647j43457
38105d64101K71615N24829R74629J051250N92694L62297N27127K30124o26749
$$ plain form
38096 3443715 2639123 2869939 4093487 5114694 5267778 4837637 4030579 2813816 1749067
38087 1749067 1719979 2653886 3551228 3870088 3864100 3574509 2738370 1871137 2104578 3446881
38077 3446881 4338993 3574218 1763910 344884 2206 629526 1916385 3192276 3435353
38068 3435353 2323430 836729 133734 274706 672826 1230519 2160626 3062809 3183180
38059 3183180 2584367 2213950 2601086 3123062 2918589 2127943 1763484 2395142 3348907
38050 3348907 3500553 2754222 2270228 2989929 4381760 5193900 5167138 5260008 6211546 7660218
38040 7660218 8862928 9566540 9847838 9702621 9184992 8492541 7607007 6300410 4729165
38031 4729165 3480337 2763110 2150112 1425188 1011972 1153598 1395512 1448719 1862039
$$ packed form
38096C443715q04592K30816J223548J021207J53084m30141q07058j216763j064749
38087A749067k9088R33907Q97342L18860n988k89591q36139q67233K33441J342303
38077C446881Q92112p64775j810308j419026l42678O27320J286859J275891K43077
38068C435353j111923j486701p02995J40972L98120N57693R30107R02183J20371
38059C183180n98813l70417L87136N21976k04473p90646l64459O31658R53765
38050C348907J51646p46331m83994P19701J391831Q12140k6762R2870R51538J448672
38040G660218J202710P03612K81298j45217n17629o92451q85534j306597j571245
38031D729165j248828p17227o12998p24924m13216J41626K41914N3207M13320
$$ plain form
38022 1862039 3117146 4670554 5714733 6365474 7189267 8011530 8272383 8337772 9314003
38013 9314003 11448671 13621705 14591978 14016004 12182432 9608954 7158638 5786398
38005 5786398 5746162 6485097 7496265 8783875 10382276 11996166 13272197 13890512 13354930
37996 13354930 11433906 8971189 7432240 7287754 7570759 7370389 6922347 6723415 6462415
37987 6462415 5609165 4365116 3210082 2144039 1246701 1283931 2602367 3963552 3852587
37978 3852587 2682258 2262459 3172820 4243611 4801285 5645648 7139125 8054980 7499243
37969 7499243 6575974 6692438 7323972 7153145 6613721 7319512 9246618 10506496 10177103
37960 10177103 9535251 9863588 10662853 11009505 11372189 12814890 15202506 17464203 19282680
$$ packed form
38022A862039J255107J553408J044179O50741Q23793Q22263K60853O5389R76231
38013I314003K134668K173034R70273n75974j833572k573478k450316j372240
38005E786398m0236P38935J011168J287610J598401J613890J276031O18315n35582
37996A3354930j921024k462717j538949j44486K83005k00370m48042j98932k61000
37987F462415q53250j244049j155034j066043q97338L7230J318436J361185j10965
37978C852587j170329m19799R10361J070791N57674Q44363J493477R15855n55737
37969G499243r23269J16464O31534j70827n39424P05791J927106J259878l29393
37960A0177103o41852L28337P99265L46652L62684J442701K387616K261697J818477
$$ plain form
37951 19282680 21477195 24827907 29340448 34718868 41030348 48831574 58887700 71750251
37943 71750251 87731492 107838208 134696507 171252192 217063511 265419869 304489800
37936 304489800 322203682 312041024 276793474 227857756 179301690 140251796 111857504
37929 111857504 90835541 74506063 61939023 52281027 44407807 38088748 33835057
37922 33835057 31427350 29735041 28007653 26308499 24733675 23212838 21960918 21116707
37914 21116707 20165570 18823392 18098489 18994598 20392476 20011354 17640427 15605341 15574030
37905 15574030 16696977 17629068 18574210 20164081 21836573 22723184 22986683 22927380 21852524
37896 21852524 19372156 16938833 16352517 17184453 17375273 16263776 15442617 16453941 19059305
$$ packed form
37951A9282680K194515L350712M512541N378420O311480P801226J0056126J2862551
37943G1750251J5981241K0106716K6858299L6555685M5811319M8356358L9069931
37936C04489800J7713882j0162658l5247550m8935718m8556066l9049894k8394292
37929A11857504k1021963j6329478j2567040r657996p873220o319059m253691
37922C3835057k407707j692309j727388j699154j574824j520837j251920q44211
37914B1116707r51137j342178p24903Q96109J397878l81122k370927k035086l1311
37905A5574030J122947R32091R45142J589871J672492Q86611K63499n9303j074856
37896B1852524k480368k433323n86316Q31936J90820j111497q21159J011324K605364
$$ plain form
37887 19059305 22202592 25444907 28707465 31403325 32693099 32374589 30979571 29058373
37879 29058373 26747485 24127487 21742384 20399760 20331535 20894019 21462258 22287771 23847187
37870 23847187 25637537 26612674 26821022 27443261 28879323 30052630 30321433 30879800 33115645
37861 33115645 36421947 38963582 40190813 41363342 43752858 47352327 51207424 54012740
37853 54012740 54450668 51985948 47563742 42860126 38746064 34988462 31259374 27672041
37845 27672041 24388207 21493143 19330931 18263603 17984314 17665420 16885736 15922264 15157962
37836 15157962 14743158 14749409 14993785 14737032 13294122 11065901 9289764 8591477 8426637
37827 8426637 8162323 7983424 8255624 8585663 8288788 7658603 8002344 10007605 12447583
$$ packed form
37887A9059305L143287L242315L262558K695860J289774l18510j395018j921198
37879B9058373k310888k619998k385103j342624o8225N62484N68239Q25513J559416
37870B3847187J790350R75137K08348O22239J436062J173307K68803N58367K235845
37861C3115645L306302K541635J227231J172529K389516L599469L855097K805316
37853E4012740M37928k464720m422206m703616m114062l757602l729088l587333
37845B7672041l283834k895064k162212j067328k79289l18894p79684r63472p64302
37836A5157962m14804O251K44376k56753j442910k228221j776137o98287j64840
37827H426637k64314j78899K72200L30039k96875o30185L43741K005261K439978
$$ plain form
37818 12447583 13182329 11600688 9456342 8756029 9328599 9399883 8307950 7344102 7613554
37809 7613554 8388012 8389374 7662769 7119789 6986100 6870475 6871625 7423349 8286396 8766369
37799 8766369 8807007 8945749 9363243 9912403 10890631 12711554 14821032 15970746 15724221
37790 15724221 14856073 14173431 13770018 13522774 13437347 13275448 12616381 11586232 10936190
37781 10936190 11173955 12093796 13262906 14506783 15868062 17461919 19249308 20600165
37773 20600165 20495429 18784554 16807413 15968586 16088024 16010459 15294996 14144984 12228739
37764 12228739 9213158 6334020 5648786 7374534 9515308 10558071 10962527 11401434
37756 11401434 11292308 10229627 9394191 9963300 11020567 10632944 8552123 6407446 5393589
$$ packed form
37818A2447583P34746j581641k144346p00313N72570P1284j091933r63848K69452
37809G613554P74458J362p26605n42980j33689j15625J150N51724Q63047M79973
37799H766369M0638J38742M17494N49160R78228J820923K109478J149714k46525
37790A5724221q68148o82642m03413k47244q5427j61899o59067j030149o50042
37781A0936190K37765R19841J169110J243877J361279J593857J787389J350857
37773B0600165j04736j710875j977141q38827J19438p7565p15463j150012j916245
37764A2228739l015581k879138o85234J725748K140774J042763M04456M38907
37756A1401434j09126j062681q35436N69109J057267l87623k080821k144677j013857
$$ plain form
37747 5393589 5096655 4720917 4284947 4119663 3988084 3389301 2462963 2026204 2581863
37738 2581863 3556505 3833484 3067140 2127831 2016437 2675231 3252519 3192690 2508656 1318553
37728 1318553 -85656 -884087 -392168 834855 1437881 985633 442184 669195 1328178
37719 1328178 1671643 1638145 1622286 1742213 1857171 1908799 1878036 1755334 1734248 1982541
37709 1982541 2138977 1666611 839036 627779 1348199 2171496 2324213 2014728 1735162
37700 1735162 1393287 733151 46152 -147003 243134 947360 1679415 2093936 1893335
37691 1893335 1325341 1090062 1406760 1658774 1309776 681234 443783 760136 1263136
37682 1263136 1511508 1246766 602047 184937 475126 1081120 1187275 766998 608715
$$ packed form
37747E393589k96934l75738m35970j65284j31579n98783r26338m36759N55659
37738B581863R74642K76979p66344r39309j11394O58794N77288n9829o84034j190103
37728A318553j404209p98431M91919J227023O03026m52248n43449K27011O58983
37719A328178L43465l3498j5859J19927J14958N1628l0763j22702k1086K48293
37709A982541J56436m72366q27575k11257P20420Q23297J52717l09485k79566
37700A735162l41875o60136o86999j93155L90137P04226P32055M14521k00601
37691A893335n67994k35279L16698K52014l48998o28542k37451L16353N03000
37682A263136K48372k64742o44719m17110K90189O05994J06155m20277j58283
$$ plain form
37673 608715 1055747 1586227 1838949 2131447 2625988 2869433 2576202 2074465 1622751 1111242
37663 1111242 754481 1126016 2086596 2643107 2342130 1830154 1572590 1143789 417134
37654 417134 266793 1173931 2138407 1979258 924743 12700 -298159 -38795 893914
37645 893914 2240003 2957513 2348430 1095866 334711 259083 412400 652616 978063
37636 978063 1076021 880870 896523 1224420 1143081 461745 226383 1035120 1767360 1295822
37626 1295822 416149 537105 1346145 1483653 851341 468395 533619 442767 378283 1022439
37616 1022439 1875646 1753103 952753 1007655 2056217 2403615 1290912 324916 1188733
37607 1188733 3256217 4535677 4111693 2742285 1618584 1291274 1545385 1878418 2148901
$$ packed form
37673F08715M47032N30480K52722K92498M94541K43445k93231n01737m51714n11509
37663A111242l56761L71535R60580N56511l00977n11976k57564m28801p26655
37654D17134j50341R07138R64476j59149j054515r12043l10859K59364R32709
37645H93914J346089P17510o09083j252564p61155p5628J53317K40216L25447
37636I78063R7958j95151J5653L27897q1339o81336k35362Q08737P32240m71538
37626A295822q79673J20956Q09040J37508o32312l82946O5224r0852o4484O44156
37616A022439Q53207j22543q00350N4902J048562L47398j112703r65996Q63817
37607A188733K067484J279460m23984j369408j123701l27310K54111L33033K70483
$$ plain form
37598 2148901 2667209 3413407 3606038 2678358 1269836 448835 350516 471523 807300
37589 807300 1545544 2072329 1656157 860295 838104 1405166 1378305 767958 877918 1981830
37579 1981830 2662084 2009776 896864 390437 371953 481501 1004370 1893387 2192972
37570 2192972 1498821 931401 1565824 2749762 3051100 2223128 1273051 1099163 1840988
37561 1840988 3062801 3909334 3628029 2530890 1837570 2062366 2351055 2011335 1730674
37552 1730674 2366935 3399349 3719961 3330794 3040514 2910840 2295397 1268181 753603
37543 753603 1083009 1488426 1363803 1149897 1468124 2015069 1962515 1198966 585103 875378
37533 875378 1728446 2080823 1464849 648976 744905 1841062 2843035 2671256 1377996
$$ packed form
37598B148901N18308P46198J92631r27680j408522q21001r8319J21007L35777
37589H07300P38244N26785m16172p95862k2191N67062k6861o10347J09960J103912
37579A981830O80254o52308j112912n06427j8484J09548N22869Q89017K99585
37570B192972o94151n67420O34423J183938L01338q27972r50077j73888P41825
37561A840988J221813Q46533k81305j097139o93320K24796K88689l39720k80661
37552A730674O36261J032414L20612l89167k90280j29674o15443j027216n14578
37543G53603L29406M05417j24623k13906L18227N46945n2554p63549o13863K90275
37533H75378Q53068L52377o15974q15873R5929J096157J001973j71779j293260
$$ plain form
37524 1377996 68611 -116917 970334 2281458 2531179 1579781 620827 735104 1642568
37515 1642568 2327107 2441109 2374857 2267623 1864464 1293079 1113293 1481109 1949200 2144701
37505 2144701 2005526 1426493 460359 -164035 380189 1796795 2819143 2686973 1718309
37496 1718309 456645 -763862 -1327842 -546931 1272753 2899251 3631451 3787340 3538988
37487 3538988 2461628 775548 -148345 568975 1971074 2475386 1892055 1416441 1933508
37478 1933508 3017493 3538125 2927149 1889385 1770469 2930135 4109611 4090487 3504710
37469 3504710 3836362 4963962 5295223 4377872 3530192 3395960 2822378 1196750 110503
37460 110503 1166544 3429926 4705321 4440027 3770719 3399844 3064829 2725893 2755757
$$ packed form
37524A377996j309385j85528J087251J311124K49721r51398r58954J14277R07464
37515A642568O84539J14002o6252j07234m03159n71385j79786L67816M68091J95501
37505B144701j39175n79033r66134o24394N44224J416606J022348j32170r68664
37496A718309j261664j220507n63980P80911J819684J626498P32200J55889k48352
37487C538988j077360j686080r23893P17320J402099N04312n83331m75614N17067
37478A933508J083985N20632o10976j037764j18916J159666J179476j9124n85777
37469C504710L31652J127600L31261r17351q47680j34232n73582j625628j086247
37460A10503J056041K263382J275395k65294o69308l70875l35015l38936K9864
$$ plain form
37451 2755757 3060240 3234409 3478208 4280033 5345448 5883663 5840172 5864102 6145957 6221221
37441 6221221 5889076 5501493 5378893 5624954 6341004 7315442 7785690 7364443 6971342
37432 6971342 7875757 9894906 11562500 12235060 13047143 15281553 18491082 21084719 22825266
37423 22825266 26042857 33398126 44003676 52583387 53795505 47444453 38336879 31007331
37415 31007331 26078878 22065146 18603870 16391064 15347960 14723255 14350333 14315110 14034622
37406 14034622 13160361 12768941 14006498 15976571 16692131 15966112 15738288 17545707 21148095
37397 21148095 25617498 30253906 34407428 38048655 42699829 49974566 58485963 63719580
37389 63719580 62035125 54050307 43629855 34540425 28519578 25286670 23298413 21012188
$$ packed form
37451B755757L04483J74169K43799Q01825J065415N38215m3491K3930K81855P5264
37441F221221l32145l87583j22600K46061P16050R74438M70248m21247l93101
37432F971342R04415K019149J667594O72560Q12083K234410L209529K593637J740547
37423B2825266L217591P355269J0605550Q579711J212118o351052r107574p329548
37415C1007331m928453m013732l461276k212806j043104o24705l72922l5223k80488
37406A4034622q74261l91420J237557J970073P15560p26019k27824J807419L602388
37397B1148095M469403M636408M153522L641227M651174P274737Q511397N233617
37389F3719580j684455p984818j0420452r089430o020847l232908j988257k286225
$$ plain form
37381 21012188 18180059 15686583 14017670 12644761 11138976 9901525 9256095 8711270
37373 8711270 7832706 7137726 7349434 8257866 9032335 9295969 9254222 9056077 8658448 8203444
37363 8203444 8043925 8395855 9182885 10094415 10661009 10548779 10020060 9881913 10717600
37354 10717600 12279506 13798161 14767831 15283248 15694560 16118772 16405689 16537262 16740138
37345 16740138 16895808 16159317 13883707 10891501 8924066 8544335 8481196 7496486 5956602
37336 5956602 4932089 4715043 5024276 5687015 6176286 5551868 4041321 3539899 5039191
37327 5039191 6698140 6366024 4972431 5006803 6367660 6643795 5421114 5112952 6762353
37318 6762353 8063377 7041860 5134086 4687489 5446862 5673350 5219615 5238887 5819695
$$ packed form
37381B1012188k832129k493476j668913j372909j505785j237451o45430n44825
37373H711270q78564o94980K11708R08432P74469K63634m1747j98145l97629m55004
37363H203444j59519L51930P87030R11530N66594j12230n28719j38147Q35687
37354A0717600J561906J518655R69670N15417M11312M24212K86917J31573K02876
37345A6740138J55670p36491k275610k992206j967435l79731o3139r84710j539884
37336E956602j024513k17046L09233O62739M89271o24418j510547n01422J499292
37327E039191J658949l32116j393593L4372J360857K76135j222681l08162J649401
37318F762353J301024j021517j907774m46597P59373K26488m53735J9272N80808
$$ plain form
37309 5819695 6026452 5736879 5636101 5781148 5725429 5678417 6092212 6487601 6118975 5438617
37299 5438617 5430331 5765338 5168582 3577722 2458832 2790557 4005571 5166984 6007051
37290 6007051 6444444 6155160 5207078 4417976 4554382 5548042 6761167 7706837 8402112
37281 8402112 9298517 10851196 12888410 14523398 14941753 14074759 12335141 10154855 8071155
37272 8071155 6644439 5811961 4947933 4056413 4064579 5195714 6011628 5212600 3606076
37263 3606076 2934980 3373289 3727803 3683145 4065016 4939512 5261751 4715691 4254750 4347389
37253 4347389 4263815 3737791 3757010 4732212 5260371 3982644 1717825 463878 913658
37244 913658 2145246 3293836 4305019 5190378 5627495 5470883 5005407 4585115 4408577
$$ packed form
37309E819695K06757k89573j00778J45047n5719m7012M13795L95389l68626o80358
37299E438617q286L35007n96756j590860j118890L31725J215014J161413Q40067
37290F007051M37393k89284r48082p89102J36406R93660J213125R45670O95275
37281H402112Q96405J552679K037214J634988M18355q66994j739618k180286k083700
37272H071155j426716q32478q64028q91520Q166J131135Q15914p99028j606524
37263C606076o71096M38309L54514m4658L81871Q74496L22239n46060m60941R2639
37253D347389q3574n26024J9219R75202N28159j277727k264819j253947M49780
37244I13658J231588J148590J011183Q85359M37117j56612m65476m20292j76538
$$ plain form
37235 4408577 4546541 4803571 4714873 4065747 3264794 2908999 3191785 3940386 4836821 5329440
37225 5329440 4869311 3718127 3061364 3784041 5527166 7414300 9126422 10573196 11108737
37216 11108737 10112204 8111592 6376302 5493500 5169785 5192762 5505250 5425718 4119305
37207 4119305 2163364 1404087 2630452 4439826 5208434 5262018 6050385 7845391 9515423
37198 9515423 10334846 10770991 11315184 11594570 11139375 10321449 9879629 9781136 9087609 7032657
37188 7032657 4062566 1702714 1251343 2479616 3771705 3764881 2692070 1829580 1862975
37179 1862975 2324183 2568231 2652253 3019610 3812259 4832383 5855979 6672226 7064920
37170 7064920 7050257 6951599 7009272 7105590 7077038 7055824 7219518 7379394 7123918 6316914
$$ packed form
37235D408577J37964K57030q8698o49126q00953l55795K82786P48601Q96435M92619
37225E329440m60129j151184o56763P22677J743125J887134J712122J446774N35541
37216A1108737r96533k000612j735290q82802l23715K2977L12488p9532j306413
37207D119305j955941p59277J226365J809374P68608N3584P88367J795006J670032
37198I515423Q19423M36145N44193K79386m55195q17926m41820r8493o93527k054952
37188G032657k970091k359852m51371J228273J292089o824j072811q62490L3395
37179A862975M61208K44048Q4022L67357P92649J020124J023596Q16247L92694
37170G064920j4663r8658N7673R6318k8552k1214J63694J59876k55476q07004
$$ plain form
37160 6316914 5278440 4546007 4504872 5009721 5279109 4545000 3061824 2091176 2497669
37151 2497669 3672269 4302977 3952703 3355424 3354001 4133046 5374102 6496910 6731606
37142 6731606 5661611 3923148 2787715 2747318 2971623 2454418 1249609 222980 -13183
37133 -13183 506787 1433340 2304233 2582742 2026847 1079784 536504 702773 1079601 961435
37123 961435 234683 -475801 -444492 350122 1122373 1131997 565085 268953 641215 1248689
37113 1248689 1662736 2050221 2527814 2565378 1808400 1069420 1439653 2467699 2403783 635813
37103 635813 -1241420 -1568945 -894717 -952321 -1991795 -2595128 -2036494 -1267009 -1133773
37094 -1133773 -1061457 -371497 290565 75156 -379419 165066 1425956 1917095 1287176
$$ packed form
37160F316914j038474p32433m1135N04849K69388p34109j483176r70648M06493
37151B497669J174600O30708l50274n97279j423P79045J241056J122808K34696
37142F731606j069995j738463j135433m0397K24305n17205j204809j026629k36163
37133a3183N19970R26553Q70893K78509n55895r47063n43280J66269L76828j18166
37123I61435p26752p10484L1309P94614P72251R624n66912k96132L72262O07474
37113A248689M14047L87485M77593L7564p56978p38980L70233J028046o3916j767970
37103F35813j877233l27525O74228n7604j039474o03333N58634P69485J33236
37094a133773P2316O89960O62062k15409m54575N44485J260890M91139o29919
$$ plain form
37085 1287176 768554 1054798 1297232 832258 445582 900741 1390175 760613 -479266
37076 -479266 -744150 413929 1906851 2724417 2806972 2392973 1622971 922834 827738 1217397
37066 1217397 1476865 1486311 1650713 1912320 1688188 1001395 720711 1281004 1996412 2114054
37056 2114054 1832128 1788241 2182807 2879159 3722359 4240822 3699541 2119648 700346
37047 700346 486239 1014019 1020804 183170 -630361 -676537 -142115 376561 555637 406670
37037 406670 158940 190190 693092 1349557 1663678 1613035 1618859 1883571 2141251 2097229
37027 2097229 1757571 1290667 919720 965417 1562394 2256854 2378515 2001911 2003609 2794917
37017 2794917 3519184 3139426 1982956 1371924 1763019 2172376 1749830 1045117 1047781 1648208
$$ packed form
37085A287176n18622K86244K42434m64974l86676M55159M89434o29562j239879
37076d79266k64884J158079J492922Q17566Q2555m13999p70002p00137r5096L89659
37066A217397K59468R446J64402K61607k24132o86793k80684N60293P15408J17642
37056B114054k81926m3887L94566O96352Q43200N18463n41281j579893j419302
37047G00346k14107N27780O785q37634q13531m6176N34422N18676J79076j48967
37037D06670k47730L1250N02902O56465L14121n0643N824K64712K57680m4022
37027B097229l39658m66904l70947M5697N96977O94460J21661l76604J698P91308
37017B794917P24267l79758j156470o11032L91095M09357m22546p04713K664O00427
$$ plain form
37007 1648208 1986154 1940696 2176569 2751587 2809550 1979404 1103409 1038170 1508809 1753170
36997 1753170 1638725 1494630 1423187 1462255 1896016 2681114 3067293 2566975 1835319 1764541
36987 1764541 2173234 2310888 2189624 2313553 2443701 1892073 918909 588919 1211856
36978 1211856 2109577 2964325 4100644 5231531 5274449 3884641 2037071 632482 -382401
36969 -382401 -1090362 -1034781 -227262 384574 204391 -203735 -249646 -248885 -499435 -478459 168440
36958 168440 804425 889052 951125 1496581 1899190 1515240 1020276 1350321 2064939 2160042
36948 2160042 1900141 2320492 3270901 3500024 2603147 1488013 857364 515715 329083
36939 329083 668594 1590608 2530681 3091876 3378861 3442149 3163527 2752513 2594092 2598078
$$ packed form
37007A648208L37946m5458K35873N75018N7963q30146q75995o5239M70639K44361
36997A753170j14445j44095p1443L9068M33761P85098L86179n00318p31656p0778
36987A764541M08693J37654j21264J23929J30148n51628r73164l29990O22937
36978A211856Q97721Q54748J136319J130887M2918j389808j847570j404589j014883
36969c82401p07961N5581Q07519O11836j80183m08126m5911P61k50550K0976O46899
36958A68440O35985Q4627O2073N45456M02609l83950m94964L30045P14618R5103
36948B160042k59901M20351R50409K29123q96877j115134o30649l41649j86632
36939C29083L39511R22014R40073N61195K86985O3288k78622m11014j58421L986
$$ plain form
36929 2598078 2457956 2442281 3007680 3691327 3456166 2282915 1409686 1705835 2661235
36920 2661235 3262035 3108496 2446614 1808252 1757572 2270987 2351303 1133949 -609280
36911 -609280 -1144668 -132528 852016 541442 -445566 -871794 -666605 -588448 -895267 -1265363
36901 -1265363 -1529789 -1667104 -1414443 -576960 488402 1183757 1257052 814939 137357
36892 137357 -296741 -150226 122281 -366431 -1538612 -2087032 -1216977 86258 357600
36883 357600 -362002 -811148 -423618 83661 -5869 -464000 -664758 -417169 22286 369050
36873 369050 539748 683332 1037785 1595894 1989393 1882940 1361870 798352 569235 1017366
36863 1017366 2222165 3465176 3442898 1670026 -577606 -1389625 -249723 1556495 2456350
$$ packed form
36929B598078j40122j5675N65399O83647k35161j173251q73229K96149R55400
36920B661235O00800j53539o61882o38362n0680N13415Q0316j217354j743229
36911f09280n35388J012140R84544l10574r87008m26228K05189P8157l06819l70096
36901a265363k64426j37315K52661Q37483J065362O95355P3295m42113o77582
36892A37357m34098J46515K72507m88712j172181n48420Q70055J303235K71342
36883C57600p19602m49146L87530N07279q9530m58131k00758K47589M39455L46764
36873C69050J70698J43584L54453N58109L93499j06453n21070n63518k29117M48131
36863A017366J204799J243011k2278j772872k247632q12019J139902J806218Q99855
$$ plain form
36854 2456350 1986245 780009 -189420 -251307 539693 1403393 1564844 1046017 443906
36845 443906 48679 -298875 -530011 -248026 469990 843844 409334 -235011 -230614 361520
36835 361520 780599 723564 603455 696769 743043 604306 700359 1341382 2041576 2066411
36825 2066411 1485105 1093004 1281447 1584770 1566232 1569805 2087443 2784302 2888337 2460908
36815 2460908 2468006 3324670 4097826 3720403 2465354 1453044 1018636 506616 -357058
36806 -357058 -945037 -891520 -742646 -812957 -367673 1057037 2337924 2151891 1173365 1201599
36796 1201599 2220093 2310183 934279 140696 1284056 2554367 1740133 -103189 -307563
36787 -307563 993149 1082054 -764081 -2002195 -976985 484848 254239 -651966 8750
$$ packed form
36854B456350m70105j206236r69429o1887P91000Q63700J61451n18827o02111
36845D43906l95227l47554k31136K81985P18016L73854m34510o44345M397N92134
36835C61520M19079n7035j20109R3314M6274j38737R6053O41023P00194K4835
36825B066411n81306l92101J88443L03323j8538L573N17638O96859J04035m27429
36815B460908P098Q56664P73156l77423j255049j012310m34408n12020q63674
36806c57058n87979N3517J48874p0311M45284J424710J280887j86033r78526K8234
36796A201599J018494R0090j375904p93583J143360J270311q14234j843322k04374
36787c07563J300712Q8905j846135j238114J025210J461833k30609r06205O60716
$$ plain form
36778 8750 1949810 2952503 2338775 1494827 1237603 805107 -362967 -1589548 -2102090
36769 -2102090 -1930582 -1382951 -681706 -228233 -185793 197626 1704973 3576883 4085244
36760 4085244 2838005 1251281 481799 220323 -29814 142817 1074274 2045079 2232585
36751 2232585 1888944 1710143 1636702 1125057 199834 -512135 -550047 112551 1272752 2476326
36741 2476326 3069884 2775917 2072133 1649195 1631536 1578228 1081060 162716 -754608 -1139730
36731 -1139730 -751518 200598 1368179 2545156 3444848 3590568 2920343 2159537 1954770
36722 1954770 1948052 1477279 883532 1104933 2067203 2583386 2025672 1125991 854328 1325491
36712 1325491 2036268 2442746 2195611 1546619 1470434 2507999 3655598 3521130 2428050
$$ packed form
36778H750J941060J002693o13728q43948k57224m32496j168074j226581n12542
36769b102090J71508N47631P01245M53473M2440L83419J507347J871910N08361
36760D085244j247239j586724p69482k61476k50137J72631R31457R70805J87506
36751B232585l43641j78801p3441n11645r25223p11969l7912O62598J160201J203574
36741B476326N93558k93967p03784m22938j7659n3308m97168r18344r17324l85122
36731a139730L88212R52116J167581J176977Q99692J45720o70225p60806k04767
36722A954770o718m70773n93747K21401R62270N16183n57714q99681k71663M71163
36712A325491P10777M06478k47135o48992p6185J037565J147599j34468j093080
$$ plain form
36703 2428050 1989935 2619679 3058500 2570341 1884136 1550628 1160842 798530 1376354
36694 1376354 2670779 2958347 1747894 968834 2044484 3641635 3970508 3482576 3319522
36685 3319522 2869050 1295925 15344 823546 2571592 2668408 1297931 1036112 2411484
36676 2411484 3059069 1780204 405241 580647 1373352 1459952 1407851 2100259 2706164
36667 2706164 2040169 684973 85876 429994 879160 1183297 1716193 2411981 2813138
36658 2813138 2833977 2642199 2209872 1671287 1569495 2051697 2416720 2162383 1831262 2030249
36648 2030249 2254422 1635317 433752 -141723 580345 2104668 3413960 3724992 2926054
36639 2926054 1785863 1410772 2045543 2789355 2875165 2652387 2760753 2947333 2484200
$$ packed form
36703B428050m38115O29744M38821m88159o86205l33508l89786l62312N77824
36694A376354J294425K87568j210453p79060J075650J597151L28873m87932j63054
36685C319522m50472j573125j280581Q08202J748046R6816j370477k61819J375372
36676B411484O47585j278865j374963J75406P92705Q6600n2101O92408O05905
36667B706164o65995j355196n99097L44118M49166L04137N32896O95788M01157
36658B813138K0839j91778m32327n38585j01792M82202L65023k54337l31121J98987
36648B030249K24173o19105j201565n75475P22068J524323J309292L11032p98938
36639B926054j140191l75091O34771P43812Q5810k22778J08366J86580m63133
$$ plain form
36630 2484200 1381387 432929 257700 854854 1865872 2776870 3128407 2967412 2802814
36621 2802814 2810398 2605367 2197520 2448869 3856358 5444820 5718222 4377921 2413122
36612 2413122 917729 546712 1595448 3577673 5015794 4743785 3403576 2730317 3331629
36603 3331629 4046286 3604726 2121258 740264 438393 1342268 2702392 3430140 3083477
36594 3083477 2299373 1880568 1730929 1273841 574636 201285 188656 120072 166893 970785
36584 970785 2355467 3232550 3139743 2909220 3326059 3942523 3780603 2600389 1028203
36575 1028203 -26882 190911 1714659 3383111 3723199 2728615 1952913 2375968 3135896
36566 3135896 3058866 2431502 2232023 2451288 2455508 2447340 3149928 4262385 4611312 3899167
$$ packed form
36630B484200j102813r48458j75229N97154J011018R10998L51537j60995j64598
36621B802814P584k05031m07847K51349J407489J588462K73402j340301j964799
36612B413122j495393l71017J048736J982225J438121k72009j340209o73259O01312
36603C331629P14657m41560j483468j380994l01871R03875J360124P27748l46663
36594C083477p84104m18805j49639m57088o99205l73351j2629o8584M6821Q03892
36584I70785J384682Q77083r2807k30523M16839O16464j61920j180214j572186
36575A028203j055085K17793J523748J668452L40088r94584p75702M23055P59928
36566C135896p7030o27364j99479K19265M220q168P02588J112457L48927p12145
$$ plain form
36556 3899167 3079502 2829557 2816605 2754304 3002246 3591026 3709641 2928066 2161376 2577911
36546 2577911 3997358 5087941 4882623 3576469 2103888 1395993 1797002 2782978 3429143
36537 3429143 3382480 3067523 2830107 2510616 2161087 2368470 3216655 3665621 2872980 1589304
36527 1589304 1214970 1875210 2567123 2918660 3439948 4036954 3782534 2608262 1856926
36518 1856926 2399677 3342888 3493056 3063205 2822412 2493892 1482595 639877 1553718
36509 1553718 3981437 5568231 4712048 2529467 1214198 1353502 1809715 1681669 1302818
36500 1302818 1337543 1739805 1955759 1809389 1835431 2625821 3872209 4341954 3204517
36491 3204517 1258991 217369 670528 1512853 1702615 1696766 2396604 3479677 3966477
$$ packed form
36556C899167q19665k49945j2952o2301K47942N88780J18615p81575p66690M16535
36546B577911J419447J090583k05318j306154j472581p07895M01009R85976O46165
36537C429143m6663l14957k37416l19491l49529K07383Q48185M48966p92641j283676
36527A589304l74334O60240O91913L51537N21288N97006k54420j174272p51336
36518A856926N42751R43211J50168m29851k40793l28520j011297q42718R13841
36509A553718K427719J586794q56183k182581j315269J39304M56213j28046l78851
36500A302818L4725M02262K15954j46370K6042P90390J246388M69745j137437
36491C204517j945526j041622M53159Q42325J89762n849O99838J083073M86800
$$ plain form
36482 3966477 3988611 4541743 5474240 5262645 3330111 1235903 635252 1106768 1119006
36473 1119006 321242 -446220 -848656 -1243810 -1365484 -410295 1301676 2185967 1480997
36464 1480997 292379 -119659 -7092 -237291 -691074 -655815 -198379 -24962 -276857
36455 -276857 -407333 -58287 703131 1746628 2746748 3062789 2562811 2145062 2498230
36446 2498230 2808023 1885514 204308 -656544 -482920 -674207 -1758228 -2369482 -1438753
36437 -1438753 88503 745982 576952 549666 895490 1216740 1529974 2027623 2335579
36428 2335579 2088785 1756876 1848281 1818869 958666 -81867 -16945 1021279 1565136 1029201
36418 1029201 503490 988913 2008393 2510286 2256270 1745888 1424462 1443905 1683957
$$ packed form
36482C966477K2134N53132R32497k11595j932534k094208o00651M71516J2238
36473A119006p97764p67462m02436l95154j21674R55189J711971Q84291p04970
36464A480997j188618m12038J12567k30199m53783L5259M57436J73417k51895
36455b76857j30476L49046P61418J043497J000120L16041m99978m17749L53168
36446B498230L09793r22509j681206q60852J73624j91287j084021o11254R30729
36437a438753J527256O57479j69030k7286L45824L21250L13234M97649L07956
36428B335579k46794l31909R1405k9412q60203j040533O4922J038224N43857n35935
36418A029201n25711M85423J019480N01893k54016n10382l21426J9443K40052
$$ plain form
36409 1683957 1670539 995413 72995 -123353 614746 1285409 944227 -127696 -935848
36400 -935848 -956354 -371266 422535 1034385 1144389 843293 685534 973651 1187851 592220
36390 592220 -652950 -1420499 -820262 708552 1721350 1295949 156275 -42322 1319493
36381 1319493 2995685 3404116 2545592 1693628 1466798 1203561 323849 -725791 -1312890
36372 -1312890 -1533930 -1672870 -1443956 -545075 484513 765304 237479 -378442 -689986
36363 -689986 -1026330 -1621737 -1967975 -1318008 359476 2184869 3177685 3215907 3085298
36354 3085298 3506786 4290199 4669532 4260437 3278734 2006508 690139 -43348 525741
36345 525741 2170108 3584203 3707151 2724729 1481479 506193 17201 205178 838509
$$ packed form
36409A683957j3418o75126r22418j96348P38099O70663l41182j071923q08152
36400i35848k0506N85088P93801O11850J10004l01096j57759K88117K14200n95631
36390E92220j245170p67549O00237J528814J012798m25401j139674j98597J361815
36381A319493J676192M08431q58524q51964k26830k63237q79712j049640n87099
36372a312890k21040j38940K28914Q98881J029588K80791n27825o15921l11544
36363f89986l36344n95407l46238O49967J677484J825393R92816L8222j30609
36354C085298M21488P83413L79333m09095r81703j272226j316369p33487N69089
36345E25741J644367J414095J22948r82422j243250r75286m88992J87977O33331
$$ plain form
36336 838509 1071145 368569 -664953 -999665 -450697 328338 819663 1016723 1103896 1334602
36326 1334602 1928346 2549560 2350843 1237802 541601 1427021 3050995 3537428 2585250
36317 2585250 1731059 1962847 2549487 2621866 2439798 2353761 1854741 705691 -78305 386493
36307 386493 1327934 1486970 1114152 1290300 1719675 992230 -877247 -1940606 -965448
36298 -965448 842800 1643996 1328713 1012985 1072919 969546 537236 138004 -327420 -1340956
36288 -1340956 -2582486 -2943059 -2069508 -924465 -324975 140227 996538 1534713 743680
36279 743680 -790903 -1271282 -191406 739331 -109087 -1903852 -2312629 -540799 1705736
36270 1705736 2476341 1803467 1068999 887444 638705 -89319 -688872 -523471 74913
$$ packed form
36336H38509K32636p02576j033522l34712N48968P79035M91325J97060Q7173K30706
36326A334602N93744O21214j98717j113041o96201Q85420J623974M86433r52178
36317B585250q54191K31788N86640P2379j82068q6037m99020j149050p83996M64798
36307C86493R41441J59036l72818J76148M29375p27445j869477j063359R75158
36298i65448J808248Q01196l15283l15728N9934j03373m32310l99232m65424j013536
36288a340956j241530l60573Q73551J145043N99490M65202Q56311N38175p91033
36279G43680j534583m80379J079876R30737q48418j794765m08777J771830K246535
36270A705736P70605o72874p34468j81555k48739p28024n99553J65401N98384
$$ plain form
36261 74913 394135 376069 383401 358329 50821 -157348 345167 1142169 1023829 -139136
36251 -139136 -805424 195155 1865804 2313403 1275705 214017 137922 609576 988895
36242 988895 1335375 1558604 890451 -820621 -2119383 -1475759 524520 1724656 1169350
36233 1169350 211373 476946 1711977 2396578 1860617 854100 261733 201297 494195
36224 494195 1141718 1889056 1976650 988994 -380816 -1040567 -785381 -281611 65513 481418
36214 481418 1025479 1232109 875208 443331 405536 506241 270833 -211731 -539769 -691476
36204 -691476 -892093 -1003565 -616935 297506 1243825 1676618 1414069 783874 526787 1127858
36194 1127858 1965306 1724413 154165 -1263399 -1155149 -114468 323656 28547 221923
$$ packed form
36261G4913L19222j8066P332k5072l07508k08169N02515P97002j18340j162965
36251a39136o66288J000579J670649M47599j037698j061688p6095M71654L79319
36242I88895L46480K23229o68153j711072j298762O43624K000279J200136n55306
36233A169350r57977K65573J235031O84601n35961j006517n92367o0436K92898
36224D94195O47523P47338Q7594r87656j369810o59751K55186N03770L47124M15905
36214D81418N44061K06630l56901m31877l7795J00705k35408m82564l28038j51707
36204f91476k00617j11472L86630R14441R46319M32793k62549o30195k57087O01071
36194A127858Q37448k40893j570248j417564J08250J040681M38124k95109J93376
$$ plain form
36185 221923 1252489 1927275 1361247 186637 -604096 -919401 -1053444 -864583 -203175
36176 -203175 533154 926299 1098586 1310520 1578420 2005276 2750667 3367085 3110751 2335355
36166 2335355 2431137 3671431 4348235 3153700 1333998 1021282 2185328 2880143 2138653
36157 2138653 950431 361916 167862 -160492 -514987 -613254 -492475 -159201 448199
36148 448199 886489 461486 -623595 -1222195 -757996 -16717 39764 -435190 -597966 -100719
36138 -100719 646944 1004941 517749 -789309 -2186240 -2708202 -2172291 -1369336 -1025209
36129 -1025209 -1041154 -1011421 -894421 -709841 -98390 1158979 2439370 2729434 1790005
36120 1790005 480359 -124932 261270 998269 1247728 848146 411440 440465 593110
$$ packed form
36185B21923J030566O74786n66028j174610p90733l15305j34043J88861O61408
36176b03175P36329L93145J72287K11934K67900M26856P45391O16418k56334p75396
36166B335355R5782J240294O76804j194535j819702l12716J164046O94815p41490
36157B138653j188222n88515j94054l28354l54495r8267J20779L33274O07400
36148D48199M38290m25003j085081n98600M64199P41279N6481m74954j62776M97247
36138a00719P47663L57997m87192j307058j396931n21962N35911Q02955L44127
36129a025209j5945K9733J17000J84580O11451J257369J280391K90064r39429
36120A790005j309646o05291L86202P36999K49459l99582m36706K9025J52645
$$ plain form
36111 593110 255127 -334685 -253191 699162 1516760 1285144 315356 -490375 -811672 -837239
36101 -837239 -532040 220035 988494 1119951 687954 451614 778144 1199020 1223410 1063290
36091 1063290 1196683 1537248 1479834 756387 -64376 -127490 711302 1636967 1734961 954792
36081 954792 39328 -339870 -78861 566275 1227560 1519453 1398063 1409838 1974449 2438756
36071 2438756 1725139 133174 -586624 424361 1770387 1772096 882996 773107 1628694
36062 1628694 2059015 1565688 1319935 2061330 2820815 2542456 1688827 1253147 1229562 1167973
36052 1167973 1359788 2169535 2802044 2192193 907143 743819 2293271 4148446 4876311
36043 4876311 4650102 4343061 3978330 3003520 1597435 727781 897628 1500324 1648862
$$ packed form
36111E93110l37983n89812Q1494R52353Q17598k31616r69788q05731l21297k5567
36101h37239L05199P52075P68459J31457m31997k36340L26530M20876K4390j60120
36091A063290J33393L40565n7414p23447q20763o3114Q38792R25665R7994p80169
36081I54792r15464l79198K61009O45136O61285K91893j21390J1775N64611M64307
36071B438756p13617j591965p19798J010985J346026J709q89100j09889Q55587
36062A628694M30321m93327k45753P41395P59485k78359q53629m35680k3585o1589
36052A167973J91815Q09747O32509o09851j285050j63324J549452J855175P27865
36043D876311k26209l07041l64731r74810j406085q69654J69847O02696J48538
$$ plain form
36034 1648862 1283743 1150217 1762320 2702505 3154770 2942698 2611187 2490043 2289775
36025 2289775 1874534 1710402 1969052 1911822 1094300 563406 1538530 3215562 3475932
36016 3475932 1903903 434145 491044 1180961 1269729 1302675 2241573 3264956 2846425
36007 2846425 1379571 816685 1838120 3040187 3012165 1811422 306175 -624561 -232537
35998 -232537 1346905 2462046 1615656 -141633 -280051 1444096 2389441 1021700 -681592
35989 -681592 -345902 1168656 1376944 139165 -400217 681609 1968522 2162407 1648414
35980 1648414 1191641 751848 237373 123381 600204 1048521 932774 456334 -30627
35971 -30627 -458799 -577199 10569 947889 1189803 452697 -311938 -443516 -583821 -1366686
$$ packed form
36034A648862l65119j33526O12103R40185M52265k12072l31511j21144k00268
36025B289775m15241j64132K58650n7230q17522n30894R75124J677032K60370
36016C475932j572029j469758N6899O89917Q8768L2946R38898J023383m18531
36007B846425j466854n62886J021435J202067k8022j200743j505247r30736L92024
35998b32537J579442J115141q46390j757289j38418J724147R45345j367741j703292
35989f81592L35690J514558K08288j237779n39382J081826J286913J93885n13993
35980A648414m56773m39793n14475j13992M76823M48317j15747m76440m86961
35971c0627m28172j18400N87768R37320K41914p37106p64635j31578j40305p82865
$$ plain form
35961 -1366686 -2024041 -1425280 77451 1051828 960484 562318 403139 122938 -434192
35952 -434192 -532679 327756 1331405 1268229 217966 -526535 -198945 543426 697073 222122
35942 222122 -221460 -370043 -470429 -489070 -41345 738204 1051041 612277 329173 1124190
35932 1124190 2483711 2965755 2030942 647348 20047 317412 784771 631636 -330127
35923 -330127 -1514956 -1918311 -1030847 500731 1468272 1388469 827865 488041 489585 636109
35913 636109 822884 946456 842133 551431 321562 199384 -13345 -295112 -304159 126131
35903 126131 765757 1316171 1536586 1090730 -98516 -1306773 -1603974 -1175545 -1172744 -1893186
35893 -1893186 -2097024 -828718 947609 1507719 602606 -479065 -747500 -410521 -78463
$$ packed form
35961a366686o57355N98761J502731R74377r1344l98166j59179k80201n57130
35952d34192r8487Q60435J003649o3176j050263p44501L27590P42371J53647m74951
35942B22122m43582j48583j00386j8641M47725P79549L12837m38764k83104P95017
35932A124190J359521M82044r34813j383594o27301K97365M67359j53135r61763
35923c30127j184829m03355Q87464J531578R67541p9803n60604l39824J544J46524
35913F36109J86775J23572j04323k90702k29869j22178k12729k81767r047M30290
35903A26131O39626N50414K20415m45856j189246j208257k97201M28429K801p20442
35893a893186k03838J268306J776327N60110r05113j081671k68435L36979L32058
$$ plain form
35884 -78463 -18100 -276915 -828481 -1474811 -2055093 -2620785 -2957070 -2362195 -693703 780033
35874 780033 698809 -384325 -599772 550067 1521638 1194940 537520 873829 1758904
35865 1758904 1940615 1588747 1933743 2976214 3182351 1717672 -329219 -1452825 -1425749
35856 -1425749 -910509 -312257 165158 327 -1091326 -2314324 -2398336 -1118466 407713
35847 407713 1032667 680323 47589 -279962 -182970 147742 433519 530097 554169 666114
35837 666114 790254 844666 1144734 2030794 3011939 2967204 1598057 85460 -309195 149312
35827 149312 204250 -560065 -1313952 -1343374 -871408 -343490 190834 592669 394676 -342326
35817 -342326 -676264 -71365 581903 209804 -647080 -515889 647434 1177034 171928
$$ packed form
35884g8463O0363k58815n51566o46330n80282n65692l36285N94875J668492J473736
35874G80033q1224j083134k15447J149839R71571l26698o57420L36309Q85075
35865A758904J81711l51868L44996J042471K06137j464679k046891j123606K7076
35856a425749N15240N98252M77415j64831j091653j222998q4012J279870J526179
35847D07713O24954l52344o32734l27551R6992L30712K85777R6578K4072J11945
35837F66114J24140N4412L00068Q86060R81145m4735j369147j512597l94655M58507
35827A49312N4938p64315p53887k9422M71966N27918N34324M01835j97993p37002
35817c42326l33938O04899O53268l72099q56884J31191J163323N29600j005106
$$ plain form
35808 171928 -1043120 -818495 396682 731298 -442971 -1761384 -1801005 -694272 500376
35799 500376 1152430 1220758 661245 -603043 -2257153 -3617739 -4105189 -3537212 -2155326
35790 -2155326 -612635 267551 94434 -707863 -1290685 -1124131 -297482 707897 1358329
35781 1358329 1367667 908333 455439 305502 384250 549855 741928 715486 123039 -811014
35771 -811014 -1189200 -512474 549385 1013527 814523 535467 340767 48696 -35622 595376
35761 595376 1610605 2131140 2091445 2208889 2472381 1927122 388220 -876971 -886890 -306394
35751 -306394 -259061 -725831 -1025698 -1033738 -927057 -476440 345520 736017 198798 -291961
35741 -291961 447917 1828987 2156774 1088139 45731 153593 1021269 1739954 1933422
$$ packed form
35808A71928j215048K24625J215177L34616j174269j318413l9621J106733J194648
35799E00376O52054O8328n59513j264288j654110j360586m87450N67977J381886
35790b155326J542691Q80186j73117q02297n82822J66554Q26649J005379O50432
35781A358329R338m59334m52894j49937P8748J65605J92073k6442n92447r34053
35771h11014l78186O76726J061859M64142j99004k79056j94700k92071q4318O30998
35761E95376J015229N20535l9695J17444K63492n45259j538902j265191r919N80496
35751c06394M7333m66770k99867q040J06681M50617Q21960L90497n37219m90759
35741b91961P39878J381070L27787j068635j042408J07862Q67676P18685J93468
$$ plain form
35732 1933422 1563330 716457 -99514 -290846 -24569 30729 -125104 203921 1195806 2213491
35722 2213491 2816611 3078220 2810559 1640689 114464 -492973 61649 534157 34301
35713 34301 -772080 -943897 -675474 -605665 -627619 -289787 324113 944623 1692251 2502119
35703 2502119 2622645 1583969 178158 -378550 102499 874279 1382908 1596821 1598228
35694 1598228 1545719 1725939 2061907 1959620 1196281 484855 548159 1122337 1507214 1569386
35684 1569386 1506671 1184419 523194 65869 322138 963582 1439980 1878915 2508707 2764954
35674 2764954 2049328 934546 460014 568392 450869 162695 522624 1466983 1931284
35665 1931284 1585380 1362445 1869923 2486545 2584773 2580384 3081699 3843795 4282939 4395523
$$ packed form
35732A933422l70092q46873q15971j91332K66277N5298j55833L29025R91885J017685
35722B213491O03120K61609k67661j169870j526225o07437N54622M72508m99856
35713C4301q06381j71817K68423O9809k1954L37832O13900O20510P47628Q09868
35703B502119J20526j038676j405811n56708M81049P71780N08629K13913J407
35694A598228n2509J80220L35968j02287p63339p11426O3304N74178L84877O2172
35684A569386o2715l22252o61225m57325K56269O41444M76398M38935O29792K56247
35674B764954p15626j114782m74532J08378j17523k88174L59929R44359M64301
35665A931284l45904k22935N07478O16622R8228m389N01315P62096M39144J12584
$$ plain form
35655 4395523 4519733 4677970 4696402 4555881 4214236 3546169 2812031 2607162 2910214 2830479
35645 2830479 1934699 1234335 1964242 3682303 4568194 3684078 2077381 1294354 1492236
35636 1492236 1642189 1211965 836702 1251087 2282866 3323088 4250166 5215754 5835688
35627 5835688 5488248 4461233 3911327 4343657 4884628 4532075 3463164 2542512 2128279
35618 2128279 2011566 2036151 2096858 1942354 1622699 1702762 2412233 3117371 3333465 3603096
35608 3603096 4448312 5120069 4590591 3286497 2481693 2312866 1881863 1144809 1046376
35599 1046376 1669183 1945364 1607243 1760561 2830193 3508466 2757098 1543206 1373866
35590 1373866 2083787 2340403 1689823 916328 754813 1219016 1932147 2369905 2088233
$$ packed form
35655D395523J24210J58237J8432j40521l41645o68067p34138k04869L03052p9735
35645B830479q95780p00364P29907J718061Q85891q84116j606697p83027J97882
35636A492236J49953m30224l75263M14385J031779J040222R27078R65588O19934
35627E835688l47440j027015n49906M32330N40971l52553j068911r20652m14233
35618B128279j16713K4585O0707j54504l19655Q0063P09471P05138K16094K69631
35608C603096Q45216O71757n29478j304094q04804j68827m31003p37054r8433
35599A046376O22807K76181l38121J53318J069632O78273p51368j213892j69340
35590A373866P09921K56616o50580p73495j61515M64203P13131M37758k81672
$$ plain form
35581 2088233 1341078 1085690 1812060 2860809 3451757 3726146 4069457 4151959 3606545
35572 3606545 3013744 3049062 3102873 2044628 172748 -921301 -527662 376239 788909
35563 788909 986310 1572773 2178246 1969809 995021 215931 307163 966427 1445601 1401825
35553 1401825 1111266 1014993 1183519 1264945 974086 554080 600411 1382549 2461804 3112936
35543 3112936 3100972 2850967 2718814 2346187 1227327 -103376 -217575 1383251 3227056
35534 3227056 3457328 2042685 479448 -348976 -800786 -1107770 -886040 -347487 -509322
35525 -509322 -1471982 -1823012 -727719 585085 624079 -115978 -138320 609792 883356 281508
35515 281508 -398931 -803156 -1401668 -2094560 -1941826 -718381 508051 882158 819200
$$ packed form
35581B088233p47155k55388P26370J048749N90948K74389L43311Q2502n45414
35572C606545n92801L5318N3811j058245j871880j094049L93639R03901M12670
35563G88909J97401N86463O05473k08437r74788p79090R1232O59264M79174m3776
35553A401825k90559r6273J68526Q1426k90859m20006M6331P82138J079255O51132
35543C112936j1964k50005j32153l72627j118860j330703j14199J600826J843805
35534C227056K30272j414643j563237q28424m51810l06984K21730N38553j61835
35525e09322r62660l51030J095293J312804L8994p40057k2342P48112K73564o01848
35515B81508o80439m04225n98512o92892J52734J223445J226432L74107o2958
$$ plain form
35506 819200 1040042 1479121 1746412 1905108 2157873 2313688 2096154 1558050 831418 -75508
35496 -75508 -927521 -1196144 -664763 300750 1268269 2058349 2459556 2284383 1913200 2070794
35486 2070794 2742076 3008526 2356540 1457590 1171388 1445757 1782024 2155150 2733404
35477 2733404 3139422 2791281 1799042 912949 691272 1126885 1864935 2386722 2249051
35468 2249051 1542914 845456 419836 -77718 -722518 -814057 66568 1062723 1012930 49812
35458 49812 -724016 -890823 -983285 -1197430 -1014839 -308505 261319 352183 490859 1038134
35448 1038134 1487337 1391600 1176036 1311667 1426879 1096897 839631 1242432 1589402 685610
35438 685610 -1061494 -1780363 -679619 800237 1033082 347934 172298 793154 1164448
$$ packed form
35506H19200K20842M39079K67291J58696K52765J55815k17534n38104p26632r06926
35496g5508q52013k68623N31381R65513R67519P90080M01207j75173l71183J57594
35486B070794O71282K66450o51986q98950k86202K74369L36267L73126N78254
35477B733404M06018l48141r92239q86093k21677M35613P38050N21787j37671
35468B249051p06137o97458m25620m97554o44800r1539Q80625R96155m9793r63118
35458D9812p73828j66807r2462k14145J82591P06334N69824R0864J38676N47275
35448A038134M49203r5737k15564J35631J15212l29982k57266M02801L46970r03792
35438F85610j747104p18869J100744J479856K32845o85148j75636O20856L71294
$$ plain form
35429 1164448 667503 -77993 -251170 234551 1036443 1813186 2050097 1248973 -174062
35420 -174062 -812254 193225 1885488 2479292 1476455 125233 -254678 211984 332138
35411 332138 -690639 -2445785 -3751188 -3711063 -2481700 -1102394 -496936 -671843 -1011925
35402 -1011925 -1172395 -1305672 -1489334 -1464651 -1122122 -795421 -757548 -751743 -383482 256348
35392 256348 743546 933837 1016072 1045918 893511 702741 913257 1561715 1932780 1342488
35382 1342488 134254 -567147 -181726 629057 827137 266920 -279131 -223629 183913
35373 183913 387578 255572 18853 -172196 -267072 -132920 231105 448380 188486 -221648
35363 -221648 -83862 735343 1609217 1980287 1912103 1641810 1087621 162961 -774255 -1202208
$$ packed form
35429A164448m96945p45496j73177M85721Q01892P76743K36911q01124j423035
35420a74062o38192J005479J692263N93804j002837j351222l79911M66662J20154
35411C32138j022777j755146j305403M0125J229363J379306O05458j74907l40082
35402a011925j60470j33277j83662K4683L42529L26701L7873N805L68261O39830
35392B56348M87198J90291Q2235K9846j52407j90770K10516O48458L71065n90292
35382A342488j208234p01401L85421Q10783J98080n60217n46051N5502M07542
35373A83913K03665j32006k36719j91049r4876J34152L64025K17275k59894m10134
35363b21648J37786Q19205Q73874L71070o8184k70293n54189r24660r37216m27953
$$ plain form
35353 -1202208 -989334 -381896 354876 1003724 1333980 1308296 1193751 1194523 1170242 973827
35343 973827 765858 633251 251505 -538121 -1130737 -874707 -251734 -479486 -1787345
35334 -1787345 -2895784 -2594859 -1217149 -93269 -37070 -828053 -1758487 -2174315 -1797226
35325 -1797226 -1020661 -648653 -911548 -1048708 -360961 680392 1055421 679435 439475
35316 439475 777067 1103227 856440 370493 260185 523584 745356 774370 719277 583772
35306 583772 352385 176842 61955 -352509 -1214952 -1913502 -1685030 -661907 271717
35297 271717 638603 763148 929606 845744 306851 -171495 41061 737736 1107857 829527
35287 829527 385328 235251 201085 -79597 -506935 -732959 -779467 -948818 -1152340 -829933
$$ packed form
35353a202208K12874O07438P36772O48848L30256k5684j14545P72k4281j96415
35343I73827k07969j32607l81746p89626n92616K56030O22973k27752j307859
35334a787345j108439L00925J377710J123880N6199p90983r30434m15828L77089
35325a797226P76565L72008k62895j37160O87747J041353L75029l75986k39960
35316D39475L37592L26160k46787m85947j10308K63399K21772K9014n5093j35505
35306E83772k31387j75543j14887m14464q62443o98550K28472J023123R33624
35297B71717L66886J24545J66458q3862n38893m78346K12556O96675L70121k78330
35287H29527m44199j50077l4166k80682m27338k26024m6508j69351k03522L22407
$$ plain form
35277 -829933 271284 1615011 2449005 2574790 2235712 1542033 519975 -396661 -549940
35268 -549940 107781 853469 1125283 1213670 1692870 2488637 2940231 2642374 1833263 969039
35258 969039 222274 -522275 -1314544 -1843407 -1565954 -328055 1161725 1844257 1450363
35249 1450363 766458 544341 581873 273473 -345248 -689600 -523783 -147194 214750 598444
35239 598444 876386 720982 120931 -498626 -772432 -678869 -369503 -124489 -368344 -1157097
35229 -1157097 -1687968 -1023605 557634 1642554 1391936 495278 27527 25689 -166521
35220 -166521 -623000 -712571 -148885 513041 585070 57290 -478785 -516425 -86860 412204
35210 412204 688242 708797 434144 -246238 -1083311 -1356140 -665510 428574 1119901 1424345
$$ packed form
35277h29933J101217J343727Q33994J25785l39078o93679j022058r16636j53279
35268e49940O57721P45688K71814Q8387M79200P95767M51594k97857q09111q64224
35258I69039p46765p44549p92269n28863K77453J237899J489780O82532l93894
35249A450363o83905k22117L7532l08400o18721l44352J65817L76589L61944L83694
35239E98444K77942j55404o00051o19557k73806R3563L09366K45014k43855p88753
35229a157097n30871O64363J581239J084920k50618q96658m67751j838j92210
35220a66521m56479q9571N63686O61926P2029n27780n36075l7640M29565M99064
35210D12204K76038K0555k74653o80382q37073k72829O90630J094084O91327L04444
$$ plain form
35200 1424345 1810883 2072462 1645285 991437 1320843 2566924 2998869 1633406 -154958
35191 -154958 -502413 408591 930053 395957 -349915 -516607 -188929 277065 589849 350355
35181 350355 -470241 -1021699 -523325 471752 814657 528611 591695 1094680 1072847 299903
35171 299903 -251660 -91318 144620 250698 1079036 2735351 3627084 2548630 562499
35162 562499 -530630 -617952 -706402 -769621 64492 1532331 2218054 1646269 930637 1062053
35152 1062053 1798329 2546252 3133099 3297042 2589317 1369466 848309 1431042 1935150
$$ packed form
35200A424345L86538K61579m27177o53848L29406J246081M31945j365463j788364
35191a54958l47455R11004N21462n34096p45872j66692L27678M65994L12784k39494
35181C50355q20596n51458M98374R95077L42905k86046O3084N02985k1833p72944
35171B99903n51563J60342K35938J06078Q28338J656315Q91733j078454j986131
35162E62499j093129q7322q8450o3219Q34113J467839O85723n71785p15632J31416
35152A062053P36276P47923N86847J63943p07725j219851n21157N82733N04108
$$ [...]
##END NTUPLES=NMR SPECTRUM
##END=
