##TITLE=31Pdec_SR118_2
 , 24 sc
 4.4.2022
##JCAMPDX= 6.0         $$ Bruker NMR JCAMP-DX V2.0
##DATA TYPE= NMR SPECTRUM
##DATA CLASS= NTUPLES
##ORIGIN= UXNMR, Bruker Analytische Messtechnik GmbH
##OWNER= root
$$ XWIN-NMR		Version 3.5
$$ Mon Apr  4 13:49:38 2022 Russian Standard Time (UT+4h)  she@DPX200
##.OBSERVE FREQUENCY= 81.013821
##.OBSERVE NUCLEUS= ^31P
##.ACQUISITION MODE= SIMULTANEOUS
##.ACQUISITION SCHEME= undefined
##.AVERAGES= 24
##.DIGITISER RES= 16
##SPECTROMETER/DATA SYSTEM= spect
##.PULSE SEQUENCE= zgpg30
##.SOLVENT NAME= CDCl3
##.SHIFT REFERENCE= (INTERNAL, CDCl3, 0, 248.564)
##AUDIT TRAIL= $$ (NUMBER, WHEN, WHO, WHERE, WHAT)
$$ ##TITLE= Audit trail, XWIN-NMR		Version 3.5
$$ ##JCAMPDX= 5.01
$$ ##ORIGIN= Bruker BioSpin GmbH
$$ ##OWNER= she
$$ F:/spectra/data/she/nmr/P31/1/pdata/1/auditp.txt
$$ ##AUDIT TRAIL=  $$ (NUMBER, WHEN, WHO, WHERE, WHAT)
(   1,<2022-04-04 13:48:37.43 +0400>,<she>,<DPX200>,
      <created by zg, POWCHK disabled, PULCHK disabled
       configuration hash MD5:
       00 E9 B6 7A A2 85 ED C7 34 08 36 98 17 FE 4E 26
       data hash MD5: 32K
       2B A6 4F 0B 9E E9 98 B5 14 72 4A 70 69 93 89 49>)
(   2,<2022-04-04 13:48:39.78 +0400>,<she>,<DPX200>,
      <Start of raw data processing
       efp BC_mod = 2 LB = 1 FT_mod = 6 PKNL = 1 PHC0 = -9542.513 PHC1 = 88.87561 SI = 64K 
       data hash MD5: 64K
       48 91 9C 74 45 46 41 75 37 39 73 99 D9 94 3B 3E>)
(   3,<2022-04-04 13:49:08.64 +0400>,<she>,<DPX200>,
      <pk PHC0 = -1.83738 PHC1 = 0 
       data hash MD5: 64K
       8A 12 D5 70 60 AD 51 D9 83 D0 52 72 AE 7D 06 93>)
(   4,<2022-04-04 13:49:12.84 +0400>,<she>,<DPX200>,
      <abs ABSG = 5 
       data hash MD5: 64K
       E0 5F C5 3E C1 AE 87 06 7E 04 B8 CD E5 3A 86 26>)
$$ ##END=
$$ 
$$ hash MD5
$$ C8 AB 5D 15 3E AB 54 CC 3F E6 55 27 64 87 E1 AB
##$RELAX= 
##$RELAX= 
##$RELAX= 
##$RELAX= 
##$RELAX= 
##$RELAX= 
##$RELAX= 
##$RELAX= 
$$ Bruker specific parameters
$$ --------------------------
##$DU= <F:/spectra>
##$EXPNO= 1
##$NAME= <P31>
##$PROCNO= 1
##$TYPE= <nmr>
##$USER= <she>
##$AMP= (0..31)
100 100 100 100 100 100 100 100 100 100 100 100 100 100 100 100 100 100 
100 100 100 100 100 100 100 100 100 100 100 100 100 100 
##$AQSEQ= 0
##$AQ_mod= 1
##$AUNM= <au_zg>
##$AUTOPOS= <>
##$BF1= 81.014009
##$BF2= 200.13
##$BF3= 200.13
##$BF4= 200.13
##$BF5= 200.13
##$BF6= 200.13
##$BF7= 200.13
##$BF8= 200.13
##$BYTORDA= 1
##$CFDGTYP= 0
##$CFRGTYP= 5
##$CHEMSTR= <none>
##$CNST= (0..31)
1 1 145 1 1 1 1 1 1 1 1 1 1 1 1 1 1 1 1 1 1 1 1 1 1 1 1 1 1 1 1 1 
##$CPDPRG= <waltz16>
##$CPDPRG1= <>
##$CPDPRG2= <waltz16>
##$CPDPRG3= <>
##$CPDPRG4= <mlev>
##$CPDPRG5= <mlev>
##$CPDPRG6= <mlev>
##$CPDPRG7= <mlev>
##$CPDPRG8= <mlev>
##$CPDPRGB= <>
##$CPDPRGT= <>
##$D= (0..31)
0 1 0 0 0 0 0 0 0 0 0 0.03 2e-05 3e-06 0 0 0 0 0 0 0 0 0 0 0 0 0 0 0 0 
0 0 
##$DATE= 1649065716
##$DBL= (0..7)
120 120 120 11 120 120 24 19 
##$DBP= (0..7)
150 150 150 150 150 150 150 150 
##$DBP07= 0
##$DBPNAM0= <>
##$DBPNAM1= <>
##$DBPNAM2= <>
##$DBPNAM3= <>
$$ [...]
##$SUBNAM3= <"">
##$SUBNAM4= <"">
##$SUBNAM5= <"">
##$SUBNAM6= <"">
##$SUBNAM7= <"">
##$SUBNAM8= <"">
##$SUBNAM9= <"">
##$SW= 501.771253377433
##$SWIBOX= (0..15)
0 1 3 0 0 0 0 0 0 0 0 0 0 0 0 0 
##$SW_h= 40650.406504065
##$TD= 32768
##$TD0= 1
##$TE= 0
##$TE2= 300
##$TE3= 300
##$TEG= 300
##$TL= (0..7)
0 120 53 12 22 120 120 120 
##$TP= (0..7)
150 150 150 150 150 150 150 150 
##$TP07= 0
##$TPNAME0= <>
##$TPNAME1= <>
##$TPNAME2= <>
##$TPNAME3= <>
##$TPNAME4= <>
##$TPNAME5= <>
##$TPNAME6= <>
##$TPNAME7= <>
##$TPOAL= (0..7)
0.5 0.5 0.5 0.5 0.5 0.5 0.5 0.5 
##$TPOFFS= (0..7)
0 0 0 0 0 0 0 0 
##$TUNHIN= 0
##$TUNHOUT= 0
##$TUNXOUT= 0
##$USERA1= <user>
##$USERA2= <user>
##$USERA3= <user>
##$USERA4= <user>
##$USERA5= <user>
##$V9= 5
##$VALIST= <valist>
##$VCLIST= <CCCCCCCCCCCCCCC>
##$VD= 0
##$VDLIST= <DDDDDDDDDDDDDDD>
##$VPLIST= <PPPPPPPPPPPPPPP>
##$VTLIST= <TTTTTTTTTTTTTTT>
##$WBST= 1024
##$WBSW= 4
##$XGAIN= (0..3)
0 0 0 0 
##$XL= 0
##$YL= 0
##$YMAX_a= 14058
##$YMIN_a= -22249
##$ZGOPTNS= <>
##$ZL1= 120
##$ZL2= 120
##$ZL3= 120
##$ZL4= 120
##$ABSF1= 248.5645
##$ABSF2= -253.2056
##$ABSG= 5
##$ABSL= 3
##$ALPHA= 0
##$AQORDER= 0
##$ASSFAC= 0
##$ASSFACI= 0
##$ASSFACX= 0
##$ASSWID= 0
##$AUNMP= <proc_1d>
##$AZFE= 0.1
##$AZFW= 0.5
##$BCFW= 0
##$BC_mod= 2
##$BYTORDP= 0
##$COROFFS= 0
##$CY= -3
##$DATMOD= 1
##$DC= 0
##$DFILT= <>
##$DTYPP= 0
##$F1P= 0
##$F2P= 0
##$FCOR= 1
##$FTSIZE= 65536
##$FT_mod= 6
##$GAMMA= 0
##$GB= 0
##$INTBC= 1
##$INTSCL= 5.30512e-09
##$ISEN= 30
##$LB= 1
##$LEV0= 0
##$LPBIN= 0
##$MAXI= 10000
##$MC2= 0
##$MEAN= 0
##$ME_mod= 0
##$MI= 50
##$NCOEF= 0
##$NC_proc= -6
##$NLEV= 6
##$NOISF1= 182.463
##$NOISF2= 159.3651
##$NSP= 0
##$NTH_PI= 0
##$NZP= 0
##$OFFSET= 248.5645
##$PC= 4
##$PHC0= -9544.35
##$PHC1= 88.87561
##$PH_mod= 1
##$PKNL= yes
##$PPARMOD= 0
##$PSCAL= 0
##$PSIGN= 0
##$REVERSE= no
##$SF= 81.014009
##$SI= 65536
##$SIGF1= 159.3651
##$SIGF2= -187.1042
##$SINO= 113.3802
##$SIOLD= 16384
##$SREGLST= <1H.CDCl3>
##$SSB= 0
##$STSI= 65536
##$STSR= 0
##$SW_p= 40650.406504065
##$SYMM= 0
##$S_DEV= 0
##$TDeff= 32768
##$TDoff= 0
##$TI= <>
##$TILT= no
##$TM1= 0
##$TM2= 0
##$TOPLEV= 0
##$USERP1= <user>
##$USERP2= <user>
##$USERP3= <user>
##$USERP4= <user>
##$USERP5= <user>
##$WDW= 1
##$XDIM= 65536
##$YMAX_p= 268235784
##$YMIN_p= -31127502
$$ End of Bruker specific parameters
$$ ---------------------------------
##NTUPLES= NMR SPECTRUM
##VAR_NAME=  FREQUENCY,     SPECTRUM/REAL,   SPECTRUM/IMAG
##SYMBOL=    X,             R,               I
##VAR_TYPE=  INDEPENDENT,   DEPENDENT,       DEPENDENT
##VAR_FORM=  AFFN,          ASDF,            ASDF
##VAR_DIM=   65536,         65536,           65536
##UNITS=     HZ,            ARBITRARY UNITS, ARBITRARY UNITS
##FACTOR=    0.620285442955139, 1,           1
##FIRST=     20137.2065510759, 0,            0
##LAST=      -20513.1999529892, 0,           0
##MIN=       -20513.1999529892, -31127502,   0
##MAX=       20137.2065510759, 268235784,    0
$$ Real data points
##PAGE= N=1
##DATA TABLE= (X++(R..R)), XYDATA
$$ [...]
47193 1545159 1023902 713411 780984 644656 -62627 -707807 -691022 -616097 -1289370 -2045873
47183 -2045873 -1486880 275733 1579585 1509793 778987 56597 -992395 -2358815 -2896608
47174 -2896608 -1942824 -600541 -265613 -753835 -1029074 -1001725 -1306813 -1844937 -1930299 -1665369
47164 -1665369 -1846634 -2449163 -2389384 -1113770 478670 1121303 586331 -352626 -927695
47155 -927695 -989990 -824453 -642875 -376592 -35248 -60147 -809909 -1668358 -1417952 111018
47145 111018 1477414 1304494 -105676 -1476129 -2162312 -2186955 -1407347 77443 1116420
47136 1116420 574518 -822446 -1143229 28912 965641 416498 -528945 -203107 1056030
47127 1056030 1433407 330007 -800882 -487203 880810 1748649 1445594 824790 880381
47118 880381 1393264 1439977 889655 584615 940766 1228257 717025 -208833 -774142 -991994
47108 -991994 -1236822 -1221474 -531151 218868 76402 -567478 -449212 335523 196038 -1334225
47098 -1334225 -2432432 -1464841 606502 1568568 857694 -227781 -660166 -589669 -259449
47089 -259449 595704 1892337 2710259 2252745 856695 -353357 -599825 -43403 555668
47080 555668 585134 72315 -455681 -545932 -187764 339312 783831 1043324 1154199 1225668
47070 1225668 1265704 1130668 811105 574350 506395 182355 -650135 -1271192 -676033 886742
47060 886742 1882221 1252509 -465711 -2017863 -2706103 -2509329 -1723801 -946051 -742183
47051 -742183 -859092 -376613 941820 2165236 2557896 2634884 3150936 3747317 3509538
47042 3509538 2413940 1309652 678312 174375 -673262 -1821302 -2688143 -2517845 -1093529
47033 -1093529 704106 1567883 1228483 598515 263509 -196467 -980998 -1378705 -1079693
47024 -1079693 -982340 -1643836 -2084821 -1446281 -734867 -1288965 -2422207 -2495842 -1687410 -1563719
47014 -1563719 -2194884 -1982078 -542507 473980 81866 -545103 -245374 195433 -450004
47005 -450004 -1686123 -2001463 -997773 313589 893693 538790 -279331 -856676 -829203
46996 -829203 -556936 -542048 -525957 55240 784153 568074 -586787 -1349510 -999654 -328210
46986 -328210 -87790 118552 643220 801579 109025 -573708 -256398 681255 1249188 1280188
46976 1280188 1078972 509641 -413547 -836028 -238256 388038 -130393 -1244228 -1515481
46967 -1515481 -840712 -301347 -153899 318665 985964 663445 -870896 -2177321 -2129793
46958 -2129793 -1358746 -965188 -846175 -268580 569402 603156 -607908 -2171000 -2760679
46949 -2760679 -1947287 -580559 89751 -288933 -855066 -657622 147969 597516 206072
46940 206072 -558193 -1010557 -932112 -528178 -229638 -547317 -1547423 -2375111 -1926271 -282197
46930 -282197 1052338 776380 -678164 -1715166 -1496811 -761724 -620462 -1043385 -1071519
46921 -1071519 -393488 36502 -616013 -1642217 -1595038 -319599 800327 757153 82386
46912 82386 -314239 -495202 -959872 -1524504 -1629733 -1273496 -796712 -143304 821544 1589228
46902 1589228 1484986 674108 -94024 -549195 -934770 -1197477 -996421 -423750 61960
46893 61960 320478 425416 107852 -806278 -1585453 -1256384 -83705 620378 245864 -554708
46883 -554708 -1155063 -1674304 -2102581 -1863962 -857810 6367 29735 -270652 -113566 243624
46873 243624 22848 -663721 -840129 -50898 1013925 1452597 1241871 1108481 1500239
46864 1500239 2006978 1944724 1304504 707021 419782 44437 -531552 -619899 165812 977641
46854 977641 903433 560536 1245890 2729344 3364312 2543715 1555415 1489078 1696762 1188457
46844 1188457 377504 288763 794272 835992 67299 -717300 -687601 173308 1221434 1668349
46834 1668349 1144279 165602 -204720 469990 1449958 1727204 1084278 -24310 -1077406
46825 -1077406 -1561406 -1071338 50251 689311 230954 -581648 -690250 -132550 336055
46816 336055 540894 844683 1097904 698792 -307385 -1158922 -1527386 -1820603 -2121827
46807 -2121827 -1804591 -721141 91982 -254088 -997846 -599061 993803 2040743 1362009
46798 1362009 41222 -95659 900868 1277863 329646 -479458 193873 1421160 1392233
46789 1392233 153194 -603129 -193056 259772 -120142 -671244 -596432 -354842 -726088
46780 -726088 -1389116 -1414930 -644124 226748 571375 275231 -370896 -782074 -509092 119060
46770 119060 301543 -75665 -326865 -233206 -401943 -915274 -800672 358011 1389987
46761 1389987 1158271 271049 23107 444143 642057 392774 81429 -342860 -976488
46752 -976488 -1020321 303358 2193411 3064148 2721323 2381803 2685971 3096951 3184512 3048310
46742 3048310 2450650 1022624 -515960 -832819 27285 545533 -22731 -706957 -572120
46733 -572120 609 378987 671459 908713 474557 -767732 -1814976 -1848933 -1320971
46724 -1320971 -953429 -605211 45072 629616 845857 1223684 2109505 2628810 1798395
46715 1798395 152532 -846308 -681817 -75008 322282 533126 648809 504264 85231
46706 85231 -296601 -330019 54693 645241 1002857 901588 814723 1372986 2179336 2023743
46696 2023743 674324 -530433 -545328 -82987 -297958 -949870 -1081641 -775920 -830340
46687 -830340 -1169282 -1067206 -724836 -1117317 -2235947 -2899988 -2548233 -1924721 -1657194
46678 -1657194 -1401148 -876417 -591129 -868439 -1107429 -744042 -205737 -225529 -812577 -1481457
46668 -1481457 -1894369 -1743397 -707010 802621 1544435 938045 70657 274983 1193176
46659 1193176 1397008 671900 354183 1206465 2194906 1976560 684587 -529762 -1086137
46650 -1086137 -1247041 -1190799 -743955 -5277 543104 699337 726477 733788 470304 -39931
46640 -39931 -278314 -38677 120463 -215808 -468735 104979 1071445 1281145 647327 413086
46630 413086 1284925 2251039 1985569 780081 144770 739255 1617679 1620389 758358 -97121
46620 -97121 -355708 -107381 295576 582694 576747 256178 -127923 -271895 -255680 -505014
46610 -505014 -1134993 -1564183 -1115454 89091 1206006 1661451 1680162 1732744 1889179 1965770
46600 1965770 1949430 1967128 2089673 2356717 2649381 2436616 1296931 -30180 -16465 1561890
46590 1561890 2829168 2156749 470225 -192121 270090 267975 -488044 -485276 735076 1448253
46580 1448253 459908 -1007281 -1505645 -1718120 -2861085 -4090884 -3622588 -1694560 -304956
46571 -304956 -245986 -365558 113410 358077 -469453 -1786222 -2486407 -2347179 -1925793 -1650273
46561 -1650273 -1452776 -976701 -29585 912295 905337 -283411 -1579495 -1839000 -1267300
46552 -1267300 -814842 -652365 -304759 78573 -145961 -824587 -1064916 -627508 -170505
46543 -170505 -103401 -280861 -773866 -1725377 -2436696 -1924595 -533833 317277 185802 49653
46533 49653 492786 915189 907634 889942 891228 274728 -681810 -587813 795412 1723771 1018337
46522 1018337 -121322 -184383 275200 -26614 -695932 -538153 62469 -285503 -1486290
46513 -1486290 -2016492 -1363511 -610352 -494443 -524381 -326929 -428668 -1195096 -2065847 -2307684
46503 -2307684 -1774141 -722127 399406 945792 647740 156757 210917 401190 -246967
46494 -246967 -1574164 -2337310 -2048949 -1570575 -1577883 -1580121 -977227 -137738 200653 -63853
46484 -63853 -494139 -678110 -361117 419466 1061311 861439 4031 -543317 -335691 76883
46474 76883 256518 595883 1389687 1941703 1380076 -33800 -1125748 -1196665 -675659 -416153
46464 -416153 -664531 -790454 -24730 1482891 2573164 2388097 1510077 1179538 1544580
46455 1544580 1534797 545804 -694475 -1314946 -1517211 -1998348 -2747762 -3093153 -2660744 -1790124
46445 -1790124 -1153040 -1228115 -1921563 -2535836 -2409659 -1684525 -1059696 -788752 -508787 -122068
46435 -122068 -49592 -319379 -240912 471442 971935 386257 -879903 -1679147 -1623280 -1316498
46425 -1316498 -1271517 -1288782 -983706 -477931 -358582 -974516 -1770170 -1584386 -54921 1493268
46415 1493268 1360657 -302648 -1547393 -1151381 -7087 555772 670073 1159501 1789835
46406 1789835 1608227 594982 -263945 -434240 -348737 -499236 -865850 -1249674 -1482459
46397 -1482459 -1379562 -1077068 -1176902 -1895550 -2397219 -1773956 -386217 648826 998353
46388 998353 1135806 1085236 357691 -844200 -1533879 -1272643 -619612 -97046 313783 507091
46378 507091 156196 -460036 -575778 -180548 -104640 -571111 -820508 -592336 -709854 -1521853
46368 -1521853 -2006290 -1361591 -428363 -448029 -1264637 -1873433 -2024558 -2117710 -2108444 -1741634
46358 -1741634 -1442433 -1766797 -2240857 -1881882 -689614 420374 965110 1132281 899788
46349 899788 85224 -807958 -954968 -431200 39177 496469 1576684 2804981 2587526
46340 2587526 509292 -1680182 -2233765 -1515662 -1013482 -1133088 -1092465 -459825 333453
46331 333453 835672 1031572 978127 654314 197281 -190504 -557255 -1069051 -1624644 -1881346
46321 -1881346 -1582348 -718421 412985 1205186 1173461 570913 178241 320987 582880
46312 582880 632633 642837 604362 54404 -983074 -1593305 -1220997 -603957 -652698 -1091110
46302 -1091110 -1133414 -833451 -670603 -420488 274056 720658 62923 -963104 -818408
46293 -818408 343755 753107 -132129 -691109 249311 1561683 1643897 732192 161434
46284 161434 367115 864522 1371189 1711622 1297773 -50424 -1300968 -1418350 -922771
46275 -922771 -1070096 -1884585 -2250205 -1703205 -908198 -472799 -418922 -716575 -1217157 -1177803
46265 -1177803 -68451 1190849 1107444 -167560 -870195 -169463 707677 456276 -498392
46256 -498392 -983952 -801718 -521948 -372170 -278789 -408410 -777169 -809448 -123532 664051
46246 664051 743789 363520 407308 936190 1021550 70361 -1351380 -2151046 -1759047 -525345
46236 -525345 621526 956373 613462 322607 400056 418422 86557 -174023 -44429 -96803
46226 -96803 -981268 -2215049 -2676698 -2148264 -1484049 -1225249 -888895 128435 1582337
46217 1582337 2634816 2704654 1900292 900819 436402 595102 724079 311431 -317018
46208 -317018 -660013 -989410 -1799975 -2588028 -2323500 -1201418 -662310 -1234811 -1601918
46199 -1601918 -634203 734675 847935 -208945 -883391 -550065 -140939 -286671 -271700
46190 -271700 574392 1580864 1710202 1099991 695518 767506 744153 384941 223549 672652
46180 672652 1367771 1717327 1669364 1618697 1814212 2098910 2082713 1468402 393031 -525836
46170 -525836 -767736 -574270 -664051 -1184239 -1430826 -906706 -201419 -321619 -1394660 -2529040
46160 -2529040 -2849661 -2272490 -1373498 -888355 -1228649 -2069420 -2475558 -1823205 -533667
46151 -533667 445692 720974 590962 347605 58071 -82555 94092 189534 -431901 -1636722
46141 -1636722 -2510342 -2503922 -1928671 -1186962 -329751 365059 298210 -451686 -859055 -325987
46131 -325987 401971 403614 -41363 -92312 271887 525735 763489 1434203 2156511 2007762
46121 2007762 1035104 366763 593055 1030127 945197 602071 554451 633474 333816 -203156
46111 -203156 -259141 500837 1559284 2053034 1579121 557915 -119311 90428 854058
46102 854058 1329523 1032837 246136 -333822 -223886 408367 789320 279649 -720053 -982107
46092 -982107 37934 1284455 1279579 -39343 -1342861 -1666778 -1427493 -1569829 -2284896
46083 -2284896 -2827914 -2342205 -801932 713769 896467 -384539 -1884059 -2500551 -2442896
46074 -2442896 -2366752 -2108055 -1258785 -393862 -418263 -997546 -1023400 -502403 -475461 -1011346
46064 -1011346 -941578 40817 684540 229411 -436525 -524362 -695058 -1537035 -2136269 -1584317
46054 -1584317 -719925 -777412 -1245310 -795376 316898 581738 -342611 -1225826 -1223567 -739155
46044 -739155 -294504 82786 243673 -62453 -467049 -441430 -427675 -1213695 -2231276 -2016778
46034 -2016778 -560509 424534 46416 -545247 -200434 485236 466927 -12650 -179100
46025 -179100 -186463 -545304 -856853 -387742 611145 1300234 1524516 1616744 1364405 350494
46015 350494 -917201 -1368219 -819733 -100521 233006 407038 692772 1018233 1297773
46006 1297773 1368318 738577 -698737 -1867477 -1530767 -140817 496243 -396188 -1674186
45997 -1674186 -2078032 -1714520 -1227174 -718330 -282587 -496783 -1367663 -1723961 -806421
45988 -806421 308630 156893 -853451 -1087500 -244566 320766 -129201 -703369 -566377
45979 -566377 -225689 -390414 -664433 -326151 336143 427841 -229078 -973279 -1253255 -1084804
45969 -1084804 -777673 -687518 -983279 -1256752 -735426 643380 1786062 1663300 621225
45960 621225 -187999 -375109 -531278 -1034162 -1483660 -1439398 -1048110 -742226 -791127 -1239924
45950 -1239924 -1821771 -1899095 -1060218 100072 385026 -544819 -1611511 -1594409 -615738
45941 -615738 85999 -264714 -1031841 -947572 296875 1518104 1358965 21480 -863638
45932 -863638 -305793 749163 780805 -168761 -644957 96975 1130953 1253929 521595
45923 521595 -66008 95341 649954 833661 305572 -502049 -838275 -487812 79388 557916
45913 557916 1235359 2090437 2204036 1057307 -173457 12352 1089771 1171892 42314
45904 42314 -364630 946297 2371502 2227502 1246762 1045662 1434426 1070526 -80310
45895 -80310 -850765 -992337 -1323426 -1861876 -1589588 -324558 723367 710481 170987 -219334
45885 -219334 -683952 -1490751 -2066117 -1773758 -917911 -255856 20715 215932 413797 392397
45875 392397 54436 -462478 -989561 -1407354 -1651002 -1763134 -1810615 -1734663 -1451406 -1017417
45865 -1017417 -473909 282947 1135137 1489028 897667 -208810 -938085 -955191 -579626
45856 -579626 -100547 322279 279151 -500984 -1409886 -1503385 -878731 -604415 -1090096 -1481094
45846 -1481094 -1039654 -219130 164837 55908 -143711 -329890 -517692 -453305 -42368 263784
45836 263784 75179 -350560 -634186 -893168 -1226413 -1095423 -59873 1159250 1285554
45827 1285554 193800 -791544 -562234 421767 875700 428004 35807 570887 1456790
45818 1456790 1271137 -298718 -1795233 -1774865 -701799 -225238 -894268 -1702215 -1904952
45809 -1904952 -2006083 -2485591 -2774001 -2325630 -1722020 -1673448 -1718510 -1124610 -471354 -874902
45799 -874902 -1849288 -1511311 738360 3048252 3332395 1762941 248146 -34343 250038
45790 250038 -188879 -1573570 -2769116 -2492075 -710811 1201973 1790659 907521 -347584
45781 -347584 -870630 -412912 599407 1543637 1856852 1359028 533009 79160 7060 -403074
45771 -403074 -1491992 -2537329 -2602930 -1753354 -916990 -686424 -763964 -619076 -234089 9668
45761 9668 -82130 -278818 -180099 406262 1247622 1768182 1494583 582789 -198760 -232023
45751 -232023 223742 318464 -304767 -998962 -924371 -151153 437737 283024 -283789 -747140
45741 -747140 -1179351 -1862395 -2442198 -2119403 -786818 550864 829058 107981 -642584
45732 -642584 -754896 -443723 -224577 -227580 -281559 -318062 -358463 -289378 2721 342545 412074
45721 412074 163291 -162304 -368174 -394655 -202504 49100 -165421 -1145240 -2178793 -2072736
45711 -2072736 -746764 405412 247646 -643507 -957799 -557237 -438406 -995047 -1378920
45702 -1378920 -829920 185786 633604 205551 -514996 -929002 -1047932 -1258430 -1691296
45693 -1691296 -1972866 -1684932 -992382 -537254 -657845 -1066031 -1392363 -1539292 -1292332
45684 -1292332 -295494 1094409 1665756 824782 -417578 -808325 -562190 -621607 -851821
45675 -851821 -447984 223684 -87601 -1343203 -2037913 -1546748 -1027306 -1426273 -2119646
45666 -2119646 -2236957 -1872154 -1186575 186249 1849459 2263851 935937 -358258 22715
45657 22715 1181194 1293524 494710 225028 533124 207552 -756959 -1008690 -251753 193311
45647 193311 -332831 -761138 -191877 611557 501855 -344799 -868596 -589476 46451 345430
45637 345430 -13258 -700298 -980932 -626015 -398305 -992618 -1758650 -1407670 119658
45628 119658 1487523 1656315 772980 -555047 -1754417 -2057207 -1038945 422759 921216
45619 921216 418477 83890 113815 -618987 -2228862 -2953565 -1722070 -40663 130130
45610 130130 -788200 -906431 151517 901688 397820 -525496 -587871 374808 1420184
45601 1420184 1493008 381145 -968391 -1325260 -629888 -25874 -122218 -137215 537406 968729
45591 968729 89279 -1302967 -1439952 -99660 1266512 1786822 2030545 2467483 2556360
45582 2556360 1906153 1164204 1046578 1304196 1265807 767439 37607 -765352 -1450307 -1748781
45572 -1748781 -1750475 -1846546 -1897984 -1121691 656472 2232413 2279905 1100865 353733 997886
45562 997886 2117808 2089040 598551 -943120 -1117965 -266452 -2315 -981107 -1939058
45553 -1939058 -1449930 86915 1128261 1148501 889875 663898 -68401 -1100074 -1024845
45544 -1024845 705047 2474511 2443482 937182 -340925 -775127 -1048836 -1318028 -885998
45535 -885998 158133 573552 -161652 -879011 -415345 712636 1233898 927099 449499
45526 449499 -83566 -1136753 -2511439 -3209311 -2770260 -1873003 -1265760 -851311 -316849
45517 -316849 -33433 -597628 -1756654 -2509703 -2299591 -1560297 -980965 -721625 -578534
45508 -578534 -487179 -483354 -443265 -269333 -140480 -147369 117701 985077 1782802 1307988 -493346
45497 -493346 -2115662 -2333618 -1754704 -1721709 -2253700 -2221251 -1311617 -499713 -399895 -416617
45487 -416617 -13435 317035 63780 -296277 -147804 241342 466381 953858 2074488
45478 2074488 2956867 2483389 1052967 47355 -149519 -230597 -320560 139782 814727
45469 814727 476967 -973526 -2032147 -1747449 -938757 -556597 -272076 361895 731763
45460 731763 369553 160856 939016 1797125 1324152 -112116 -843233 -287820 559905
45451 559905 816727 558280 53603 -640645 -1255043 -1430138 -1276355 -1089898 -781595 -351009
45441 -351009 -419910 -1304986 -2118376 -1958221 -1398943 -1427084 -1543506 -662774 594142 588787
45431 588787 -513221 -867172 -81354 153821 -848896 -1475816 -642217 361600 276085
45422 276085 37650 775798 1477065 738888 -585198 -756805 -111863 -302434 -1272124
45413 -1272124 -1389339 -339674 413085 145070 -262886 -294689 -640988 -1477840 -1699519
45404 -1699519 -742195 280560 232890 -413559 -593411 -353958 -493655 -1112432 -1526749
45395 -1526749 -1350333 -888772 -569284 -503156 -552161 -499566 -219555 153827 327202 162999
45385 162999 -243748 -710419 -945004 -567031 428026 1344386 1400228 625696 -241137 -614198
45375 -614198 -407755 190578 715004 480519 -622105 -1621439 -1564593 -887055 -722455 -1054161
45365 -1054161 -794327 239148 801840 115060 -956292 -1260984 -845248 -387483 -129516
45356 -129516 -130136 -637407 -1345556 -1203033 21124 850654 9127 -1524867 -1836405 -964913
45346 -964913 -791248 -2080717 -3357577 -3206404 -2236327 -1911693 -2462480 -2903759 -2496708
45337 -2496708 -1359509 -48374 789134 704784 -8298 -408222 -71450 262060 -184450
45328 -184450 -972198 -1182782 -975862 -1255450 -1909986 -1726856 -392627 698456 371364
45319 371364 -628047 -834629 -172774 303949 256835 325298 710178 796492 337513 -130280
45309 -130280 -313089 -516777 -661410 -116559 917327 1042974 -415761 -2088207 -2247569
45300 -2247569 -1136726 -436593 -878461 -1601317 -1686138 -1176661 -536563 -43648 163754
45291 163754 182900 505634 1405215 2277948 2340007 1804093 1492906 1453146 990993 36911
45281 36911 -665334 -839062 -961721 -1025621 -270685 1325849 2459287 2136005 962682
45272 962682 60786 -410418 -807839 -922026 -388333 375980 687897 721168 1162980 1934449
45262 1934449 2117462 1154938 -476566 -1738638 -1763240 -389858 1522064 2607963 2354492
45253 2354492 1641678 1441394 1459716 807650 -426025 -1272671 -1385811 -1399051 -1668173 -1628785
45243 -1628785 -821800 136503 168177 -960202 -2305999 -2646670 -1623882 -109931 603550
45234 603550 117146 -713792 -870695 -321624 205685 227951 -183475 -780662 -1251845 -1182234
45224 -1182234 -527554 1083 -365305 -1441209 -2316632 -2475714 -2112968 -1517213 -852427
45215 -852427 -442556 -486237 -497600 166282 1181341 1516826 941310 352742 347047 399872
45205 399872 -77214 -740089 -992047 -959060 -1103905 -1380587 -1400576 -1043778 -404829 438774
45195 438774 1165162 1248008 757024 537647 1017173 1466828 1163568 622529 739177 1268850
45185 1268850 1290038 810617 662912 938961 828650 127539 -349157 -184943 -56946 -549170
45175 -549170 -1261231 -1582488 -1421346 -718056 696163 2147573 2205855 644135 -771574
45166 -771574 -596240 217088 -6468 -837963 -511838 950651 1573495 537441 -661610
45157 -661610 -783333 -567698 -853898 -841958 221138 1109079 291303 -1417310 -1917518
45148 -1917518 -1030060 -576681 -1358695 -2116430 -1869205 -1387461 -1547831 -1811109 -1379380
45139 -1379380 -643754 -364402 -344076 -14464 412627 463776 431419 757803 900708 25476
45129 25476 -1425685 -2015421 -1137387 388983 1524475 1930082 1721844 1221711 1010018
45120 1010018 1384980 1740570 1349165 721206 1052219 2138608 2180061 324609 -1773286
45111 -1773286 -2008705 -642735 191070 -573396 -1772585 -1882904 -951537 -175555 -248766
45102 -248766 -752303 -941620 -641183 -299351 -371755 -790783 -1105306 -1114880 -1148351 -1519527
45092 -1519527 -1873306 -1446714 -45038 1572464 2512349 2749430 2973197 3474386 3634665
45083 3634665 2825601 1488671 710834 704918 423971 -883047 -2329706 -2398295 -1029137
45074 -1029137 224695 220806 -508758 -896148 -874765 -1020733 -1226380 -740354 509636 1481465
45064 1481465 1206189 -56370 -1124299 -1091695 -62312 1070595 1413950 805299 -120603
45055 -120603 -659336 -784047 -989713 -1481203 -1873220 -1783567 -1379271 -1107467 -1118230 -1211190
45045 -1211190 -1193800 -1019401 -671966 -205087 146685 202499 194619 548372 1198210 1507952
45035 1507952 1125259 528492 274607 36078 -884533 -2156164 -2452280 -1238768 291343
45026 291343 743818 341159 293233 773654 720627 -306646 -1264102 -1081890 -56583 847594
45016 847594 1330298 1604608 1499692 683548 -445509 -998049 -742743 -278628 -6864
45007 -6864 303054 696763 568020 -399053 -1297147 -821964 922499 2136251 1333770 -662993
44997 -662993 -1452022 58948 2189185 2535564 972062 -439863 -399633 134838 -117070
44988 -117070 -684465 -384824 464296 414253 -827032 -1967085 -2092155 -1721568 -1567198
44979 -1567198 -1464320 -1092404 -703995 -438836 192929 1345414 2096192 1557903 198899
44970 198899 -803549 -1098797 -1180226 -1208501 -781915 185618 1178272 1741917 1846012 1607400
44960 1607400 1198366 942327 946562 787748 185683 -222004 378753 1530754 1796172 710976
44950 710976 -518932 -733019 -359013 -547357 -1421120 -2056704 -1883859 -1263482 -743360
44941 -743360 -486930 -564659 -1173641 -2224069 -3085462 -3149173 -2539501 -1976057 -1929115 -2138084
44931 -2138084 -2044804 -1497183 -815895 -299767 -13150 -72816 -677422 -1566235 -1841537 -837641
44921 -837641 975776 2408959 2785621 2348370 1590523 793841 257509 322680 866406
44912 866406 1193558 727227 -423183 -1665143 -2399344 -2326430 -1717907 -1347006 -1613380
44903 -1613380 -1814319 -1020770 376333 1022705 654799 508084 1134134 1244143 -153973
44894 -153973 -1713100 -1447279 315684 1454004 1102241 334841 -61868 -510782 -1047746
44885 -1047746 -783456 303152 797427 60224 -583000 -21418 795514 615502 62435
44876 62435 288297 670184 14115 -798684 115596 2209385 2800657 1146962 -370403
44867 -370403 -40432 653444 -172504 -1572165 -1422044 104688 990807 544212 -59474
44858 -59474 -89410 -93549 -397938 -582482 -666500 -1175646 -1734175 -1207893 295604 1156114
44848 1156114 619411 -67214 266035 945031 840384 227542 -23977 -39278 -315361 -423190
44838 -423190 138352 536359 -246849 -1348154 -941861 932782 2319826 2273098 1968799
44829 1968799 2376161 2621662 1681605 266768 -277127 -9470 -41821 -701652 -1238575
44820 -1238575 -1133289 -727292 -561327 -745736 -998724 -931849 -431284 9205 -320892 -1358502
44810 -1358502 -2137663 -1999361 -1397418 -1064171 -972815 -738608 -505696 -655250 -968118 -845497
44800 -845497 -205609 447873 697749 462007 -175919 -876612 -1070066 -606662 -107315 -164048
44790 -164048 -533757 -645746 -477085 -299568 -18997 484873 787561 534114 262410 704236
44780 704236 1543354 1797233 1220488 422403 -183362 -601712 -665451 -229560 240900 270079
44770 270079 269525 747160 1040502 236082 -1010966 -1282416 -833261 -1224211 -2424527 -2571246
44760 -2571246 -1201419 -317621 -1079309 -1762882 -747913 536036 -63788 -1696926 -1756250
44751 -1756250 2817 1264224 826036 -38458 -120782 98270 10026 156749 1003414
44742 1003414 1813526 1694732 824928 -60518 -608600 -760510 -494990 -109439 -74888 -319259
44732 -319259 -363645 -297198 -694971 -1405465 -1532520 -960663 -704768 -1203677 -1491510 -861353
44722 -861353 -190698 -533350 -1343688 -1378729 -710749 -492303 -1077524 -1694614 -1866478 -1903679
44712 -1903679 -1904362 -1461584 -688363 -470677 -1138493 -1696444 -1076779 347511 1191885 750575
44702 750575 -335872 -1003417 -826063 -102368 661260 1098296 1061808 698427 436027 614739
44692 614739 1008339 961904 250290 -422858 -199542 771083 1505038 1555515 1498909 1755387
44682 1755387 1757969 1040761 458381 1128772 2439352 2547998 1146495 274607 1518128
44673 1518128 3589620 4047374 2687904 1572572 1832177 2206501 1303157 -192302 -635933
44664 -635933 212302 1164301 1414776 1185269 788294 211296 -278544 -114368 679359 1304359
44654 1304359 1194894 629417 124670 -188745 -347090 -296179 -151583 -200679 -373553 -241260
44644 -241260 181780 237529 -363504 -898986 -559529 387043 932140 591995 -150550 -535718
44634 -535718 -307064 100820 -11585 -817414 -1602689 -1599574 -1139783 -1295699 -2264365 -2976451
44624 -2976451 -2661273 -1879531 -1422515 -1084337 -336153 529933 839908 541493 -46821
44615 -46821 -844322 -1515334 -1160220 386141 1673022 1358417 185165 -235758 -32327
44606 -32327 -658647 -2166374 -2933073 -2314432 -1574640 -1593803 -1508557 -554234 363153 118279
44596 118279 -860814 -1469703 -1570781 -1593909 -1374179 -625102 73352 -32709 -608987 -720637
44586 -720637 -246192 162784 254066 377751 694657 1024455 1385131 1938238 2430574 2327857
44576 2327857 1546286 616485 128201 272560 768729 1017483 585822 -269955 -895883
44567 -895883 -1141222 -1411623 -1693678 -1331012 -163473 922088 1149170 835875 626386
44558 626386 504298 292540 374611 1018584 1594602 1397557 747511 392260 351305 290665
44548 290665 475582 1234101 1919929 1633011 714315 309250 577438 556499 -166930 -819406
44538 -819406 -666629 113404 1003352 1734858 2108192 1992528 1670217 1513079 1285646 483285
44528 483285 -666295 -1337582 -1246548 -853684 -448507 96502 633047 714082 377527 106913
44518 106913 -53420 -460091 -932551 -883610 -491639 -607558 -1236178 -1306411 -432350 250244
44508 250244 -279009 -1408167 -1845949 -1377298 -828627 -766669 -996803 -1101512 -935051 -725505
44498 -725505 -897971 -1511802 -1865388 -1213506 107891 1010940 1160899 1218193 1407920 1002922
44488 1002922 -249138 -1280815 -1075700 -42468 753428 968376 819096 304453 -523430
44479 -523430 -1126488 -1181831 -1176223 -1519971 -1686665 -1095973 -227265 108048 20483 41957
44469 41957 -25928 -538768 -778168 251133 1963375 2609558 1692709 606169 521172 901049
44459 901049 706857 35795 -227884 273311 1133189 1865802 2261478 2286292 1998070 1446425
44449 1446425 601173 -343492 -711132 17577 1287410 1921262 1679328 1559491 2136611
44440 2136611 2455498 1388746 -460876 -1261534 -295151 1120004 1331428 304448 -612831
44431 -612831 -484314 265316 671672 455613 122256 115870 302914 304098 -5549 -479477
44421 -479477 -955300 -1335542 -1523962 -1429007 -1004827 -295367 452895 805819 525022 -103652
44411 -103652 -634401 -1083294 -1734058 -2376926 -2429155 -1979016 -1916742 -2587438 -3075218 -2501822
44401 -2501822 -1379255 -804540 -827553 -670505 -270232 -398419 -1183479 -1654675 -1149832
44392 -1149832 -290868 -38765 -417110 -708665 -489394 9789 319015 186554 -202792
44383 -202792 -350182 -35974 242317 -111453 -743819 -601446 559519 1636910 1606401
44374 1606401 857393 483464 710916 800414 299048 -381187 -675734 -531810 -205816 98218
44364 98218 169822 -192588 -779465 -889354 -60302 1241055 2049120 1998109 1596386 1329979
44354 1329979 977067 162627 -790670 -1152681 -804363 -356960 -212252 -125805 102949 133132
44344 133132 -343065 -1027591 -1451781 -1567174 -1476017 -1015536 -144288 614879 675536 69749
44334 69749 -797950 -1667791 -2211044 -1875604 -701702 198990 -117185 -1089637 -1506415 -1284441
44324 -1284441 -1234223 -1360704 -833629 324302 991894 719722 400856 705452 1113248
44315 1113248 1079418 938008 960596 708959 119452 40315 724287 952685 -126808 -1314901
44305 -1314901 -958495 524566 1290397 779006 154988 162440 131849 -563628 -1328162 -1165322
44295 -1165322 80182 1670384 2658460 2533604 1676168 1104273 1279689 1446275 789971
44286 789971 -189504 -429629 -77655 -281788 -1274260 -1961410 -1655426 -995919 -697563 -458562
44276 -458562 245529 1098187 1357286 842165 33711 -456850 -333908 48740 -139926 -1067853
44266 -1067853 -1510950 -330991 1436127 1451345 -665520 -2579080 -2505296 -1600437 -1806447
44257 -1806447 -2732701 -2501853 -874226 453168 473694 22043 92586 469413 452674 -156479
44247 -156479 -1180268 -2258662 -2657091 -1816105 -385376 225304 -331137 -917359 -726931
44238 -726931 -469660 -1034291 -1918018 -2021954 -1417536 -1188949 -1729459 -2239397 -2008091 -1345297
44228 -1345297 -958820 -1013484 -1158448 -1115294 -919340 -756701 -738475 -712824 -281892 744652
44218 744652 1863155 2180104 1397664 213033 -530006 -816023 -1167768 -1564220 -1304296
44209 -1304296 -158761 922358 795550 -449854 -1629287 -1931056 -1626846 -1257295 -821317
44200 -821317 -166930 360276 252778 -427812 -1164216 -1655504 -1909873 -1847621 -1376581 -825148
44190 -825148 -747076 -1190521 -1576604 -1395102 -685707 163857 701995 533085 -332998 -1183999
44180 -1183999 -1175014 -340312 421352 476001 51133 -411054 -849373 -1232650 -1219160 -613590
44170 -613590 261876 1017445 1601979 1975237 1914840 1514705 1294654 1394673 1310481 917500
44160 917500 949924 1724108 2233527 1577750 583472 694948 1755664 2365772 2119739 1810645
44150 1810645 1484482 222791 -1712933 -2456924 -1211612 302298 298451 -572323 -620826
44141 -620826 160819 507135 210862 183467 544444 471065 -39314 49452 971429 1598686
44131 1598686 1221448 592522 559302 762492 457219 -249674 -791126 -1110067 -1438620 -1557657
44121 -1557657 -1037558 -18867 809833 938523 440972 -197621 -481219 -340901 -249840
44112 -249840 -624849 -1173058 -1315993 -1200516 -1572129 -2530192 -3216673 -3060168 -2562901 -2406198
44102 -2406198 -2469933 -2257003 -1665942 -806590 340705 1501604 1948379 1429721 734373
44093 734373 649417 855315 562420 -251216 -1024775 -1600346 -2188266 -2690240 -2857884 -2799822
44083 -2799822 -2583797 -1801346 -418200 501544 121172 -547225 184768 2033793 2896527
44074 2896527 1869203 461688 184484 482394 98092 -778777 -1061968 -644973 -335787
44065 -335787 -352102 -206694 54750 -236990 -1073449 -1485517 -982354 -385614 -591395 -1119608
44055 -1119608 -732658 710774 1890289 1750839 893943 632078 1061245 985121 -179808
44046 -179808 -1402506 -1500354 -830689 -627167 -1112826 -1348170 -847316 -260890 -238269 -542750
44036 -542750 -695174 -757278 -997688 -1303769 -1354785 -1042912 -509875 -116850 -382874 -1392244
44026 -1392244 -2275815 -2035623 -965318 -393148 -870187 -1613420 -2000969 -2429256 -3145890
44017 -3145890 -3454519 -2927199 -2328464 -2337420 -2325204 -1520438 -501012 -281660 -694513 -987834
44007 -987834 -1281669 -1966172 -2372768 -1755499 -1020040 -1510087 -2413896 -1619542 772190
43998 772190 2162091 1246451 -215085 -422642 -103629 -544623 -1006622 -162715 1186045
43989 1186045 1044835 -759481 -2459511 -2920462 -2590025 -2069819 -1406860 -815922 -603565
43980 -603565 -301284 726732 1786959 1483257 -4561 -880118 -353040 332699 121003
43971 121003 -267652 34529 364003 -132649 -679781 -15740 1436319 2176465 1890422
43962 1890422 1467345 1081312 4992 -1633242 -2610315 -2470124 -2104273 -2030724 -1620815
43953 -1620815 -686492 -265361 -805090 -989135 286561 1949310 2338202 1804537 1878108
43944 1878108 2469192 2052843 572887 -74841 952304 1948627 1253335 -263967 -722217
43935 -722217 -77150 167190 -519605 -1064145 -606142 357939 883202 717653 241076 -135164
43925 -135164 -253937 -219807 -186949 4905 710973 1743047 2236345 1761615 1080793 1105070
43915 1105070 1557406 1550487 1131129 1150535 1692095 1786868 912718 -223456 -743381 -580458
43905 -580458 -50222 717022 1440330 1552700 1004433 618705 1051937 1869019 2211822 1956028
43895 1956028 1602526 1353518 939299 233109 -472529 -782926 -514201 182510 804836
43886 804836 849607 404630 94309 200566 227073 -320934 -1129617 -1518176 -1360489 -1035924
43876 -1035924 -709004 -249525 245535 438976 288825 106724 7746 -257084 -769153 -1101447
43866 -1101447 -749103 248197 1252559 1537140 860743 -313953 -1134103 -1014853 -99094
43857 -99094 890092 1238131 761970 -104717 -718412 -782760 -469250 -7573 520585 787675
43847 787675 144720 -1404469 -2516457 -1804182 165492 1260400 483930 -826615 -1096985
43838 -1096985 -657531 -749689 -1344076 -1406130 -861986 -694600 -1046714 -774521 577871 1619380
43828 1619380 832314 -1297176 -2824258 -2719307 -1881185 -1756488 -2558128 -3182702 -2686512
43819 -2686512 -1433146 -541690 -444862 -557700 -408686 -307407 -457328 -259716 609521
43810 609521 1121862 163550 -1477914 -1870676 -691460 333064 86950 -442159 -104254
43801 -104254 511526 367220 -50725 345490 1086893 653323 -1074300 -2479961 -2502357
43792 -2502357 -1894751 -1819355 -2322328 -2733046 -2705272 -2314327 -1758629 -1389519 -1472486 -1615321
43782 -1615321 -1078826 24085 581033 6613 -806174 -709375 137291 711310 669431 521705
43772 521705 480347 131330 -581422 -873025 -90810 1263574 1966489 1414422 213898
43763 213898 -594540 -673612 -544100 -648593 -652738 -57958 737733 704458 -331975 -1161799
43753 -1161799 -623055 926630 2115767 2165641 1413887 550436 8132 -37056 292030
43744 292030 547689 450511 295207 427364 606735 489708 388384 724781 1044090 638750
43734 638750 -10829 282517 1376989 1679618 547762 -588875 -347174 619363 878124
43725 878124 436947 330172 673351 618449 -37025 -576772 -678259 -802356 -1167014 -1371453
43715 -1371453 -1217075 -1011771 -893187 -661396 -435320 -700751 -1524754 -2383208 -2855300
43706 -2855300 -2852223 -2223406 -954488 252014 509925 -30743 -377543 -177408 -5862
43697 -5862 -55306 285301 1165040 1751716 1566755 1290298 1540052 1814866 1456831 808898
43687 808898 545799 592353 581961 693492 1098286 1209021 489377 -502641 -887314 -812029
43677 -812029 -982019 -1277701 -1030626 -429317 -395654 -1051602 -1472828 -1159113 -728730 -847998
43667 -847998 -1336765 -1704148 -1873440 -1990395 -2020894 -1856549 -1499151 -1038942 -730578 -927743
43657 -927743 -1487838 -1533734 -526214 667915 717994 -239007 -690646 83534 1091011
43648 1091011 1290108 1028535 1051032 1012858 66419 -1541863 -2514928 -2071301 -708558
43639 -708558 595308 1322105 1491977 1326193 1041440 752000 478360 305124 386805 671545
43629 671545 853420 803876 772682 872503 688795 -126564 -1097793 -1369400 -891144 -545006
43619 -545006 -918097 -1513201 -1534117 -1004524 -591835 -579144 -607439 -404858 -206267 -307325
43609 -307325 -669897 -1167715 -1770842 -2219188 -2003992 -1107486 -319950 -255757 -452405 -173658
43599 -173658 242082 -159978 -1232457 -1632458 -751425 348041 498068 -35070 -366099
43590 -366099 -516363 -1067920 -1791385 -1779227 -877103 -18858 23755 -465411 -699046 -345889
43580 -345889 249542 530501 319766 32036 161790 541699 513691 -55829 -530510 -523811
43570 -523811 -430591 -523555 -366785 235602 613180 419700 510950 1473158 2176273 1321813
43560 1321813 -250641 -613640 276659 677821 98586 19585 1042584 1489049 27834
43551 27834 -1988275 -2296034 -726060 943091 1336778 446757 -1105463 -2540548 -3055801
43542 -3055801 -2532721 -1847280 -1720959 -1723612 -1210711 -659464 -996699 -1952615 -2232053 -1293918
43532 -1293918 -1770 605877 436439 83680 16940 179353 64467 -762037 -1956186
43523 -1956186 -2496287 -1909196 -1050963 -1057807 -1779969 -2009982 -1214285 -254308 -148025 -720283
43513 -720283 -941634 -345027 397107 454559 72438 300373 1379787 2075859 1286297 -180255
43503 -180255 -538307 380794 824946 -228006 -1524833 -1526630 -722640 -611985 -1165442 -899133
43493 -899133 721018 2419851 2879134 2211222 1290722 536627 -119693 -663385 -915065
43484 -915065 -754812 -192701 538907 919693 564057 -186704 -501456 -51473 607730 848161
43474 848161 776343 849309 924701 276048 -1258002 -2611909 -2554250 -1295657 -308446 -327739
43464 -327739 -393378 450857 1360727 844919 -767051 -1635740 -1237757 -1109181 -2130692
43455 -2130692 -2764100 -1270256 1497740 3035654 2315715 622967 -401914 -362017 120567
43446 120567 251249 -308903 -1054301 -1094608 -432783 -178620 -891539 -1558136 -1147145 -305499
43436 -305499 -252286 -748642 -707650 -280655 -561513 -1398032 -1342250 2893 1280198 1470700
43426 1470700 1169711 1174745 1192717 748032 224993 110733 50859 -522409 -1457127 -2213779
43416 -2213779 -2550874 -2401253 -1721374 -929190 -790046 -1352534 -1682998 -1196867 -552950
43407 -552950 -582328 -973934 -813214 -3594 639027 534894 -43137 -468200 -455964 -234548
43397 -234548 -205543 -451638 -661613 -680203 -834877 -1295365 -1473809 -803920 146744 315218
43387 315218 -213006 -343540 159568 254656 -535296 -1194432 -860484 -216925 -282817 -799843
43377 -799843 -936347 -834564 -1247460 -2107785 -2593793 -2339747 -1606925 -534371 795771
43368 795771 1762603 1701876 976616 672284 1188195 1876183 2051309 1616193 735736 -283449
43358 -283449 -760584 -156035 997186 1463237 843386 -3434 -348127 -556813 -1156553
43349 -1156553 -1716833 -1495811 -756642 -505205 -997744 -1371094 -962589 -279769 -212945 -767000
43339 -767000 -1147790 -884846 -300745 86698 90904 -281576 -963315 -1620451 -1795492 -1536149
43329 -1536149 -1442048 -1769156 -1970527 -1557047 -908014 -626474 -547606 -152999 390073 522825
43319 522825 423085 806598 1593183 1837727 1213547 531676 387041 291163 -238018 -640946
43309 -640946 -248034 395770 152291 -1036263 -2036829 -2096183 -1711455 -1665053 -1793724 -1267513
43299 -1267513 51787 1100351 809578 -468157 -1355672 -1319141 -1332296 -2202783 -3064428
43290 -3064428 -2517826 -776297 513786 445400 -311244 -844425 -994070 -827278 -256708
43281 -256708 478176 895667 1056940 1315881 1278355 313159 -800084 -405742 1353820
43272 1353820 2173673 779272 -1231961 -1905690 -1584588 -1510985 -1376781 -302488 890252
43263 890252 658017 -623144 -1168406 -618413 -259740 -508707 -288694 818738 1725078
43254 1725078 1628368 1005364 322643 -648927 -1649256 -1631581 -460483 457584 129123
43245 129123 -655541 -837631 -803219 -1416680 -2267407 -2227867 -1277235 -528310 -601770 -1009247
43235 -1009247 -1176931 -1224220 -1509014 -1981414 -2282028 -2204768 -1861514 -1505440 -1318374 -1357741
43225 -1357741 -1602096 -1911650 -1998814 -1728065 -1479868 -1781360 -2424570 -2545370 -1913707 -1411650
43215 -1411650 -1620625 -1735537 -856782 336409 510629 -163195 -288652 437947 794618
43206 794618 161582 -459660 -119154 706179 1126225 1153566 1273754 1559980 1824359 1884153
43196 1884153 1295171 -219954 -1719651 -1637581 -6623 1203598 747782 -251020 -346599
43187 -346599 -51702 -590407 -1510029 -1372668 -207989 542291 292856 -120697 -99398 36968
43177 36968 152382 642431 1358251 1431259 614617 -217459 -343645 -106069 -155889 -562358
43167 -562358 -1064646 -1561709 -2004350 -2302409 -2503722 -2568728 -2029309 -610696 858536
43158 858536 1133403 316057 -81842 802762 2044232 2364136 1793367 1209561 974992
43149 974992 845562 712292 652184 582250 503673 757280 1434874 1872921 1367306 136565
43139 136565 -1009310 -1697504 -2101122 -2301251 -2226973 -2064927 -2052637 -1969694 -1491259 -932940
43129 -932940 -894872 -1206117 -1090872 -528561 -513348 -1521868 -2551149 -2369960 -1143932
43120 -1143932 -61010 223028 -62417 -656218 -1442278 -1852495 -1251095 -210540 -265663
43111 -265663 -1737056 -2846894 -2060625 -477296 -410883 -1994259 -2971651 -2070746 -736926
43102 -736926 -662480 -1268428 -1110252 -504315 -776960 -1551759 -1019971 982300 2293802
43093 2293802 1543068 135582 -14316 703482 528416 -861966 -2085501 -2224307 -1833933
43084 -1833933 -1776335 -2127425 -2379717 -1999954 -812050 562919 901059 -249280 -1699791
43075 -1699791 -2010958 -1416378 -1276479 -1888861 -2228593 -1903514 -1841786 -2574404 -3237194 -3030234
43065 -3030234 -2471735 -2305780 -2212753 -1638254 -1005941 -939058 -990132 -414741 308569 91216
43055 91216 -905228 -1406775 -1022195 -770031 -1366102 -2202091 -2497935 -2416921 -2379142 -2109999
43045 -2109999 -1194778 -70647 357234 -79690 -608714 -496032 178223 733446 604846
43036 604846 -154588 -906503 -976992 -303434 479717 670228 179035 -472384 -801223 -904593
43026 -904593 -1224660 -1780947 -1955135 -1358359 -617845 -634725 -1123487 -791311 743059 2174987
43016 2174987 2291738 1630010 1427619 1691612 1557430 1087617 1257592 2200483 2824873
43007 2824873 2402198 1386870 404387 -470384 -1091185 -967182 -92122 807947 1239974
42998 1239974 1383374 1384891 1170402 1113752 1714374 2351643 1755276 195308 -365780 852752
42988 852752 2006790 1294306 -363080 -891311 -182213 188704 -373053 -997229 -1202307
42979 -1202307 -1445058 -1817378 -1714651 -936087 97442 1197905 2311077 2743541 1850808
42970 1850808 423696 -47349 466201 579306 -168944 -630720 -100363 533551 380205
42961 380205 -93994 -147089 -39293 -318165 -775469 -1000006 -1179318 -1547360 -1753906 -1518322
42951 -1518322 -1203127 -1042256 -554322 518729 1440868 1498747 1106015 987492 895683 168469
42941 168469 -910706 -1404294 -1130016 -782468 -766579 -829242 -843649 -1106578 -1683733 -2083974
42931 -2083974 -1806305 -877498 200246 813517 678978 139483 -199966 -271190 -540467
42922 -540467 -1036663 -1105262 -579008 -366855 -1092837 -1884995 -1564405 -489914 -651 -340530
42912 -340530 -462573 125021 612198 236023 -709731 -1537016 -1920659 -1749155 -1139877 -803243
42902 -803243 -1352009 -1998719 -1179184 1037743 2519290 1901114 533429 342020 906593
42893 906593 424234 -1101984 -1734255 -722985 250994 -303615 -1453775 -1431707 -354111
42884 -354111 121428 -614780 -1347709 -987449 -103602 87162 -457614 -621436 200632 1207306
42874 1207306 1299664 642509 478383 1350700 2180795 1621164 -79323 -1330256 -1273988
42865 -1273988 -783428 -1065253 -1951292 -2212444 -1271151 14535 304243 -796902 -2289899
42856 -2289899 -2683659 -1495380 123153 553005 -486894 -1760455 -2153718 -1747766 -1026719
42847 -1026719 -1682 1188761 1707097 1101157 341290 607332 1479036 1581847 706174
42838 706174 -103453 -385143 -624219 -740788 69192 1572758 2276208 1685544 1192512
42829 1192512 1730554 2072106 785857 -1361061 -2496307 -2252956 -1760638 -1679486 -1745819
42820 -1745819 -1828703 -1998109 -1826363 -940845 -36726 -94176 -817872 -1080688 -679419 -373230
42810 -373230 -371383 -122740 454910 819117 852567 866168 662004 -144049 -1027513 -1180873
42800 -1180873 -1059275 -1699785 -2603464 -2180677 -477631 582749 183648 -252845 257460
42791 257460 580808 -247202 -1029271 -468723 344265 -428917 -2291946 -3083197 -2184537
42782 -2184537 -1092928 -979341 -1449076 -1809043 -2022226 -2104477 -1794134 -1173603 -711772
42773 -711772 -467341 -29917 638178 1060841 1030864 813605 503176 -121086 -984265 -1565839
42763 -1565839 -1460593 -642251 719451 2151699 2777171 2069428 697675 -91728 11293
42754 11293 160644 -281202 -901849 -1043123 -829855 -933404 -1598950 -2302439 -2355163 -1682517
42744 -1682517 -908422 -596405 -540589 -162481 429643 406800 -508208 -1432103 -1516363 -1125791
42734 -1125791 -1086952 -1274119 -880982 171311 1081518 1371683 1321502 1131986 574290 -263963
42724 -263963 -709547 -432809 -29059 -163565 -590983 -598585 -169211 -68819 -698184 -1360066
42714 -1360066 -1060750 125374 997642 735202 7507 45733 861733 1173860 193698
42705 193698 -1305401 -2065123 -1831943 -1290457 -1032776 -1122654 -1307657 -1222413 -733719 -403582
42695 -403582 -1093885 -2710459 -3926117 -3668960 -2330865 -991897 -129512 252213 -18
42686 -18 -706108 -864387 188816 1459224 1287457 -427977 -2002635 -1969412 -498350 1103908
42676 1103908 1529977 268559 -1854961 -3008617 -2070635 -3210 1185434 670326 -740625
42667 -740625 -2029161 -2805947 -2936319 -2477443 -2013851 -2057799 -2144330 -1523201 -613855 -548565
42657 -548565 -1279575 -1503191 -668115 323844 795391 1256809 2034092 2222169 969907
42648 969907 -1054765 -2382519 -2370539 -1498848 -599570 -288668 -616964 -901616 -444449
42639 -444449 412942 691815 316625 211440 637453 700482 26115 -391145 167914 844903
42629 844903 579345 -185210 -285906 404643 1049706 1070870 409743 -781665 -1876263
42620 -1876263 -1944936 -1056799 -544157 -1013662 -1142625 233606 1850323 1556163 -534378
42611 -534378 -2305961 -2713529 -2627463 -2633525 -2049730 -665932 336638 134500 -371882 84549
42601 84549 1327324 2147739 1866583 785709 -399713 -1092451 -1113674 -871118 -802137 -599339
42591 -599339 319962 1556427 1963034 1412822 1185261 1970534 2569803 1555726 -526144
42582 -526144 -1713951 -1041914 518648 1370516 834723 -506627 -1468644 -1359336 -723573
42573 -723573 -689144 -1345355 -1438478 -216541 1179058 1111892 -253102 -1165991 -607520 748803
42563 748803 1939027 2912170 3892254 4451878 3955650 2548651 1161099 636610 1060626
42554 1060626 1776561 1979090 1507090 1021530 1090471 1253269 591936 -763663 -1470648
42545 -1470648 -637194 1000883 2046216 2050304 1583783 1150451 797060 621390 860389
42536 860389 1336277 1450460 1012398 603219 767075 1220668 1334943 1159702 1347578 2031563
42526 2031563 2454553 2085829 1531110 1648117 2115162 1825593 682190 -95690 166857
42517 166857 518673 -76995 -1074855 -1294029 -763988 -305917 128829 1077931 1853720 1149153
42507 1149153 -488780 -852528 591633 1588885 474904 -1221143 -1223728 16516 417332
42498 417332 -241602 -314946 646765 1198292 529928 -336401 -337494 330480 1188431 2192875
42488 2192875 2898104 2360725 645342 -748553 -683019 360391 1298350 1625033 1112996
42479 1112996 -377915 -2086571 -2566730 -1567975 -604918 -796162 -1282579 -819752 189633
42470 189633 560547 336974 503313 1245876 1864954 2061273 2057416 1706340 701834 -445423
42460 -445423 -774825 -220339 373910 557875 666911 901378 936383 586897 79990 -488099
42450 -488099 -1271423 -2088034 -2354440 -1849754 -1070769 -603750 -489819 -393127 -144821 71396
42440 71396 30185 -116635 106481 841201 1509109 1516587 1137726 1024049 1009188 390624
42430 390624 -559066 -600938 514809 1301679 485305 -1273295 -2371268 -2128964 -996103
42421 -996103 154736 267787 -1235623 -3204365 -3395925 -1390888 446336 176364 -976155
42412 -976155 -781120 446548 673224 -363253 -963781 -464706 -28873 -294428 -384265
42403 -384265 305297 1158086 1696513 2312245 3123663 3479680 3098821 2561491 2348379 2406431
42393 2406431 2716712 3192793 3162585 2223222 1335804 1563110 2070617 1239492 -501054
42384 -501054 -1186445 -652754 -800475 -2067379 -2367414 -639289 1108604 903588 -227834
42375 -227834 -293935 486658 664760 333817 686359 1655990 2110185 1944724 2124167 2828093
42365 2828093 3156814 2663869 1874710 1240632 623668 -138179 -939041 -1612004 -1862065
42356 -1862065 -1312334 -192535 492622 147078 -569185 -761003 -575430 -648777 -869396
42347 -869396 -685768 -246209 -210814 -629851 -931563 -937565 -1068525 -1520364 -1905690 -1803932
42337 -1803932 -1215527 -442109 166645 390923 291000 94502 -147649 -576265 -1173168 -1715112
42327 -1715112 -2059737 -2095180 -1541374 -375355 679945 825672 292652 32437 436177
42318 436177 1216903 2291348 3569573 4057630 2758336 644493 28207 1417188 2653690
42309 2653690 2002670 510416 159179 1049412 1808656 1820347 1614542 1597103 1598108 1411603
42299 1411603 979021 317567 -254170 -268740 213358 679809 1012547 1379865 1328547 307784
42289 307784 -811383 -429910 1182104 1882853 948211 280684 1193786 2115309 1217208
42280 1217208 -474595 -709958 525317 1325710 822346 -116386 -555946 -182805 1125737
42271 1125737 2878505 3674204 2769604 1374322 1063929 1621827 1812668 1443318 1099517
42262 1099517 647278 -268272 -858503 -104432 1374787 2021457 1593033 1214052 1527067
42253 1527067 2241186 3137883 4070928 4335521 3478583 2398538 2285589 2891976 3204517
42244 3204517 3274497 3842551 4648002 4792983 4480766 4758641 5766376 6875508 8429722
42235 8429722 11659181 16694146 22049332 26268876 28931289 29955974 29076715 26297167
42227 26297167 22171651 17563930 13494428 10793468 9389024 8467307 7723706 7595410
42219 7595410 7861976 7306122 5514667 3701920 2896690 2708922 2726402 3407939 4498474
42210 4498474 4462948 2899652 1623868 1849050 2344637 2072547 2315729 4021532 5361906
42201 5361906 4565197 3094774 3181895 4104416 3894469 2987332 3077206 3903982 4214405 4427877
42191 4427877 5461798 6540940 6946204 7966322 10318660 12081733 12179833 12907963 15632911
42182 15632911 17673789 17474377 18521752 23247415 28196822 31387752 38314678 52627183
42174 52627183 68541744 84675720 117155623 178640698 245309045 268235784 227086209
42167 227086209 155109667 99611792 73209711 57925428 41964336 30642321 27169964
42160 27169964 24574628 18995550 15267133 15605413 14895367 10822448 8248141 9679121
42152 9679121 10456144 7387316 4155070 4059915 4548090 3161771 2462278 4551883 6343134
42143 6343134 4916518 2784734 3218359 4470004 3311838 914444 525118 1832242
42135 1832242 2078432 1032941 839378 2000822 2949996 2987942 2884750 2979424 2842768
42126 2842768 2466151 2206780 2056918 2079792 2727888 3792005 4164786 3569812 3191548
42117 3191548 3593760 3518399 2021827 399028 463460 1927947 2948861 2600096 1603226
42108 1603226 1073486 1453455 2350456 2882665 2510167 1656822 1032713 623310 244591
42099 244591 625006 2474248 4713592 5357180 4212369 2977868 2529479 1995253 880089
42090 880089 135357 387301 838972 825739 1031069 2287004 4303694 6224249 7404388
42081 7404388 7287431 5683579 3505464 2099193 1671186 1473944 1355408 1663777 1868963
42072 1868963 1089637 -103033 -347590 92580 -293163 -1423205 -1531045 -232078 745886
42063 745886 462473 31232 322511 740677 992571 1663221 2286626 1440542 -333236
42054 -333236 -520136 1241791 2003628 157065 -1745074 -1096063 574314 365923 -1216964
42045 -1216964 -1467497 -39067 886691 313133 -527558 -662382 -585539 -898343 -1461294
42036 -1461294 -1936993 -1985093 -1213299 113919 965431 1011850 1194158 1881254 1839104 324520
42026 324520 -1291800 -1630333 -1567259 -2458478 -3466959 -2951081 -1455545 -820695 -1014611
42017 -1014611 -456358 809774 902443 -706270 -2151031 -1953487 -942184 -623052 -1117910
42008 -1117910 -1560612 -1528001 -1338782 -1444362 -1860414 -1972017 -1136547 199963 661422
41999 661422 -164249 -881038 -298218 656543 353627 -1011003 -1845066 -1534223 -770640
41990 -770640 71283 1184858 2126761 2009508 962119 12965 -467853 -865856 -985667
41981 -985667 -169439 1134183 1459881 377795 -826103 -955839 -286526 298274 566786
41972 566786 809000 1137920 1374140 1266385 710232 31691 -148934 290726 696737 563349
41962 563349 147365 -308788 -1058737 -1813774 -1352075 641086 2398313 2239558 1006464
41953 1006464 639946 1192237 1269495 781788 907039 1565448 1372004 263607 -199244
41944 -199244 408113 623811 -177739 -539570 543112 1802086 1672622 466250 -676217
41935 -676217 -1514144 -2075704 -1662472 6720 1642684 1814218 864718 247920 586444
41926 586444 1394492 2055046 2099057 1195700 -146078 -500483 860251 2804897 3677175
41917 3677175 3239238 2459166 1999549 1848772 1891296 1884982 1319501 141892 -862364 -1175632
41907 -1175632 -1373268 -1962359 -2192934 -1240558 66462 155970 -952059 -1660532 -1117982
41898 -1117982 -211424 -94327 -854646 -1831471 -2272632 -1585113 56526 1299200 947931
41889 947931 -170991 5029 1808625 3139633 2464316 1072536 1083304 2282892 2579794
41880 2579794 1121518 -690248 -1322944 -802478 59323 845778 1289898 874789 -388743
41871 -388743 -1393890 -1105798 -17031 430839 -231641 -1007746 -941472 -300591 53758
41862 53758 -219761 -932368 -1880507 -2702743 -2606285 -1085633 1081005 2292623 1828612
41853 1828612 569801 -219527 -279526 -124430 35619 402639 808226 643478 -219790
41844 -219790 -1061190 -1232083 -980796 -925259 -1099600 -1100801 -917454 -906591 -1012711 -772147
41834 -772147 -231898 -85693 -535463 -761323 -144269 569359 157081 -1313747 -2457992
41825 -2457992 -2280482 -1173632 -111198 489997 839188 1168834 1398930 1265225 686983
41816 686983 36712 -174953 -41582 -272773 -1095974 -1671279 -1249862 -411691 -220127 -499496
41806 -499496 -107713 1165262 2192198 2168161 1536517 976599 566594 319631 459990
41797 459990 694348 255166 -810183 -1422884 -1068891 -509011 -311739 71241 954191
41788 954191 1433680 844607 23851 -129575 -237213 -1118379 -1912870 -1300662 124339
41779 124339 634565 146228 232591 1374426 2127450 1417958 28665 -763321 -700552 -184876
41769 -184876 395606 491407 -323117 -1403616 -1469428 -468548 120990 -565180 -1487536 -1343515
41759 -1343515 -446832 32448 -112450 -198292 -49470 -187033 -752283 -1178027 -1031649 -517908
41749 -517908 24165 633813 1465498 2249828 2344059 1464642 259638 -193325 371684 1031799
41739 1031799 875595 164944 -278099 -449496 -1026309 -1971854 -2328341 -1669595 -835934
41730 -835934 -700415 -910065 -533286 450068 1024677 489356 -551679 -787864 288433
41721 288433 1708360 2112585 1370234 545521 204955 -293333 -1286586 -1683785 -561356
41712 -561356 921151 861530 -454606 -836698 416736 1349531 354311 -1374511 -1689696
41703 -1689696 -561199 238760 -146903 -766321 -536715 414438 1287055 1680113 1817542
41694 1817542 2062226 2372205 2233742 1341782 301616 90110 669120 862297 -60
41685 -60 -1077041 -1285809 -885114 -924395 -1570040 -1965206 -1617990 -1030537 -840861 -1021760
41675 -1021760 -1133481 -921971 -509083 -267990 -513537 -1045021 -1109788 -217972 1061220
41666 1061220 1573616 925072 -69934 -463372 -302568 -316309 -719177 -912783 -510237 -69633
41656 -69633 -246210 -567558 59764 1582177 2575497 2291266 1938763 2983618 4916953
41647 4916953 5967283 5611207 4956949 4702681 4217775 3020840 1816330 1343236 1198363
41638 1198363 618527 -247441 -594279 -77069 831247 1285552 694173 -594451 -1189386
41629 -1189386 -24645 2054649 3034614 2296827 1331709 1476665 2179832 2247496 1641596
41620 1641596 1019518 445765 -282215 -727948 -388336 288999 420565 -206382 -1294548
41611 -1294548 -2639361 -3710706 -3439566 -1570420 434295 1060792 697039 607764 640079
41602 640079 -325148 -1967672 -2511859 -1331133 159610 697837 718792 1036746 1378964
41593 1378964 1183083 811627 943337 1423441 1603693 1349639 997577 753143 771282 1374340
41583 1374340 2485564 3202572 2687224 1316606 283197 119775 246997 29090 -335065
41574 -335065 -250813 360858 1006825 1346901 1593696 2097831 2793953 3263301 3216694 2709381
41564 2709381 1990352 1396738 1288350 1726453 2254836 2391298 2297637 2473088 2811203 2636957
41554 2636957 1813385 1039685 725250 369023 -410092 -984125 -598696 426289 1156518
41545 1156518 1255481 985771 437950 -402059 -1115682 -1180463 -640544 155608 1107939 2009864
41535 2009864 2186679 1358259 376831 162155 410590 402593 447766 1114259 1554974 424817
41525 424817 -1637873 -2402520 -1262464 -169199 -654392 -1717936 -1787888 -1226254 -1376875
41516 -1376875 -2152607 -2184044 -926222 710226 1662750 1658187 995811 215044 -122961 33938
41506 33938 54226 -529646 -1283283 -1495130 -1198369 -980202 -1054850 -1116924 -905608 -398491
41496 -398491 334398 998005 1067839 433669 -197893 -88999 500097 573562 -370414 -1748046
41486 -1748046 -2492193 -2049560 -901047 -149627 -329005 -693667 -213890 835395 1184958
41477 1184958 579219 280626 1041714 1817957 1451864 539520 350191 747056 656083 3415
41467 3415 -410386 -607082 -1297253 -2125682 -1807733 -290307 887882 914476 808709 1459502
41457 1459502 2054528 1543949 424525 -236217 -599190 -1425634 -2299869 -2077910 -923259
41448 -923259 -364135 -1080317 -1918357 -1625027 -548104 95125 -67829 -405371 -463782 -466531
41438 -466531 -638017 -736111 -549569 -397623 -670822 -1057340 -754019 428366 1592325
41429 1592325 1697307 719850 -475985 -1212134 -1482158 -1489605 -1298796 -1066934 -1095409 -1383049
41419 -1383049 -1510406 -1208594 -680694 -143824 482121 1076744 1010722 -43728 -1257488
41410 -1257488 -1303879 80378 1711687 2261793 1573307 573026 202732 585491 1040427
41401 1040427 807100 -140215 -1017809 -1096164 -512510 13173 119765 83207 221781 501400
41391 501400 838555 1335049 1929082 2129962 1469357 131247 -1105030 -1532679 -1051938
41382 -1051938 -181516 321040 -13542 -995938 -1918987 -2169808 -1713397 -961501 -285571
41373 -285571 188359 337011 -149544 -1427044 -2936887 -3541002 -2616019 -919275 112794
41364 112794 -9414 -448025 -457098 -436655 -999300 -1679462 -1557701 -805929 -459643 -708242
41354 -708242 -639439 67949 450548 -138940 -862103 -723561 -170796 -263700 -876005 -969476
41344 -969476 -384096 -130919 -837052 -1900216 -2392460 -2028104 -1068502 19171 622366
41335 622366 366139 -327091 -589680 -176290 326972 436342 317214 260807 220073 87829
41325 87829 -68514 -213320 -296991 45873 1110059 2320494 2574632 1661903 628830
41316 628830 385350 650238 680823 306225 -307606 -1204831 -2240831 -2716899 -2218309 -1419255
41306 -1419255 -1268804 -1677593 -1796728 -1373450 -996325 -1057969 -1265190 -1253379 -991608 -439969
41296 -439969 527139 1572450 1836821 901586 -446658 -856890 148921 1597113 2028404
41287 2028404 993481 -528043 -1239269 -873730 -225212 -27867 -266872 -607138 -948474
41278 -948474 -1276695 -1367803 -1000211 -254144 616998 1399218 1885255 1948050 1790689 1783828
41268 1783828 1916645 1774877 1187655 505034 140156 231516 706969 1133682 689924 -827196
41258 -827196 -2082335 -1505775 380752 1409710 914404 699759 2035934 3526321 3383684
41249 3383684 2145711 1266509 485714 -1081442 -2370063 -1636308 239025 603016 -818789
41240 -818789 -1517350 -395586 563275 -118642 -913742 -55032 1464399 1698061 846855
41231 846855 408938 472171 21568 -849027 -1096215 -665638 -433218 -460864 -6213 814265
41221 814265 940695 44435 -1044534 -1699140 -2086662 -2289922 -1997179 -1288617 -740951
41212 -740951 -547359 -398266 -308817 -614706 -1042633 -817405 42115 512763 35751 -677280
41202 -677280 -753774 -286570 164521 489529 816361 910745 476371 -209956 -524968 -240223
41192 -240223 345973 886245 1271706 1559844 1892749 2385282 2858059 2806868 1932792 670502
41182 670502 -108299 -24046 371272 249998 -498805 -1152774 -1039161 -292619 385298 488420
41172 488420 32969 -617957 -937186 -491158 509180 1072557 427022 -864378 -1398761
41163 -1398761 -639833 456476 691037 -29287 -761999 -488779 1049173 2952960 3660289
41154 3660289 2525553 794148 102310 195806 -502013 -2026827 -2428450 -863337 772038
41145 772038 606844 -456835 -475736 441461 860809 816910 1452569 2346243 1777896 -151293
41135 -151293 -1056650 372041 2535125 3356707 2879187 2376229 2290630 2290508 2383663 2752694
41125 2752694 3044734 2782698 2138351 1658991 1554049 1661823 1747105 1587228 1194643 1011079
41115 1011079 1300476 1443281 679256 -537017 -1006705 -618525 -439039 -833214 -948554
41106 -948554 -424499 -21246 87547 962326 2798461 3752071 2325512 -218724 -1362950
41097 -1362950 -451113 1125971 2182581 2706240 2989275 3151815 3371952 3584461 3203549
41088 3203549 1972978 645630 -6226 -245993 -528188 -373444 707671 1824621 1634895
41079 1634895 280992 -885468 -1177623 -928934 -352275 594919 1435984 1600158 1498041
41070 1498041 1959272 2774104 2998170 2485772 1890369 1414929 848203 496240 666245
41061 666245 627163 -316240 -1152286 -461406 965867 1048426 -156712 -509705 430710 512950
41051 512950 -1180334 -2429634 -1447653 96787 -237633 -1876842 -2521680 -1851803 -1455075
41042 -1455075 -1869512 -2066034 -1558370 -984302 -664271 -289760 -12911 -354529 -1050669
41033 -1050669 -1287670 -987842 -696028 -459217 -41949 112618 -493740 -1182608 -975959
41024 -975959 -367264 -532595 -1015633 -194226 1802478 2763702 1640735 188395 346728
41015 346728 1649757 2517014 2715518 2969601 3108385 2346143 998336 308505 529116
41006 529116 518879 -420458 -1397812 -1241508 -247522 184415 -543860 -1456377 -1407541 -713971
40996 -713971 -694927 -1661073 -2201238 -964880 1411124 2885107 2280936 317311 -1457673
40987 -1457673 -2062979 -1503219 -543433 -175548 -732279 -1459275 -1438911 -809933 -425183 -450387
40977 -450387 -178264 706631 1572267 1780747 1418594 862995 362346 238280 675685 1057546
40967 1057546 420648 -1019332 -1704633 -665788 1184580 2320412 2417884 2170387 1957276
40958 1957276 1597213 1045826 496332 -66656 -794099 -1567206 -2106359 -2324121 -2259241 -1925253
40948 -1925253 -1476269 -1147386 -807087 -83860 810756 1062670 448904 -194010 -216048 -58109
40938 -58109 -213091 -149325 708970 1627699 1455747 487658 113908 703574 1121117 546389
40928 546389 -364517 -560183 38656 745735 1058260 936491 561309 191447 10174 -73234
40918 -73234 -238689 -346918 -51889 646052 1307106 1549063 1323391 721842 -106753 -795907
40908 -795907 -858761 -98377 1144284 2077328 1833243 223020 -1649938 -2103760 -729129
40899 -729129 939596 1209067 212334 -634726 -685157 -547602 -758468 -1100190 -1322017 -1531320
40889 -1531320 -1646126 -1334672 -760578 -585715 -949698 -1216035 -1054002 -1007933 -1539072 -2135169
40879 -2135169 -1903328 -664511 922884 2046601 2348280 2136879 2041868 2152650 1731388
40870 1731388 355024 -1012710 -1088860 -228522 -10617 -758765 -1015504 -40373 796421
40861 796421 251490 -557406 204053 2079847 2811020 1528535 -317351 -1310356 -1640303
40852 -1640303 -1814207 -1379523 4526 1310513 1308755 518883 671333 2182773 3353784
40843 3353784 2613086 716101 -194912 585762 1433432 566665 -1667722 -3313485 -3193443
40834 -3193443 -2000075 -1045489 -698096 -418339 142141 626732 508271 -206886 -955490
40825 -955490 -1238555 -1135825 -1058704 -1054762 -710847 97251 764806 642638 -137115 -935096
40815 -935096 -1412633 -1603119 -1523034 -1312111 -1419479 -1913800 -1946668 -835196 590750 880661
40805 880661 105166 -245951 338153 622661 -172948 -941380 -506878 392775 341890 -411428
40795 -411428 -429727 514793 1108253 630255 41611 484546 1674773 2398775 2058749 1164045
40785 1164045 516838 339415 262497 -2703 -209966 37265 609217 941202 772920 349593
40775 349593 -113165 -607183 -936917 -844551 -664051 -1035676 -1706785 -1551320 -269231 871527
40765 871527 695649 -295344 -810030 -527156 -84014 114405 170562 186381 217021 319247
40755 319247 110616 -1041200 -2796850 -3716719 -3137724 -2154170 -1755176 -1204291 326353
40746 326353 1719587 1438234 241377 175310 1264872 1504029 149884 -1209897 -1226606
40737 -1226606 -369587 590445 1737085 2930019 3322542 2762110 2131178 1622191 338415
40728 338415 -1619402 -2471269 -1262027 582424 1416511 1531786 1796753 1708721 557840
40719 557840 -673971 -505887 697411 1344444 1030123 665354 630622 459682 141034
40710 141034 178015 406171 140571 -486686 -595555 -4320 538004 590749 404688 55285
40700 55285 -704177 -1611760 -1921576 -1422303 -616484 127087 777022 1089894 791558 267465
40690 267465 158099 350451 318435 272749 795327 1443676 1120542 -33744 -606721 -164491
40680 -164491 -11301 -958822 -1771154 -994080 721859 1486240 764155 -210339 -401759
40671 -401759 -164712 -300663 -782803 -837723 22773 1305906 1891997 1178670 -178064
40662 -178064 -984859 -935045 -763814 -926190 -951638 -532453 -367828 -1051520 -1740777 -1105594
40652 -1105594 569210 1447962 590766 -713027 -701244 533574 1391829 1080719 503934
40643 503934 672767 1222204 1198855 685304 628434 1235704 1670307 1598871 1902694 3092622
40633 3092622 3948804 2942533 566615 -1055053 -841139 192934 733326 760132 803828
40624 803828 743885 267970 -195152 8327 667813 978175 703177 365717 416349 825941
40614 825941 1370294 1732420 1466881 507739 -358119 -209607 754479 1327772 818146 -168865
40604 -168865 -732533 -829951 -918436 -918390 -296177 866412 1608177 1243558 355909 129803
40594 129803 834226 1523934 1364515 712919 491764 890304 1267162 1149522 674263 59563
40584 59563 -652164 -1146700 -830086 327083 1443436 1646611 948581 -106136 -1119791
40575 -1119791 -1717882 -1376010 -140376 881131 623425 -507608 -1136989 -768613 -263826
40566 -263826 -406411 -879012 -971172 -569553 -47202 251176 50848 -747950 -1584440 -1425016
40556 -1425016 -11890 1482281 1658195 502350 -730995 -997246 -239553 1080846 2456544
40547 2456544 3260882 2933555 1635419 326105 -173796 35242 358393 635404 1194314
40538 1194314 2047151 2539925 2070554 894207 -122678 -468392 -387422 -337148 -449277
40529 -449277 -690254 -1145063 -1763767 -2091839 -1722596 -917306 -355326 -347331 -708063 -1256204
40519 -1256204 -1852098 -2011611 -1240297 93503 964961 1048617 1108106 1640966 1983258 1441372
40509 1441372 555728 304049 576817 486748 -123961 -571555 -593979 -631345 -780540 -520107
40499 -520107 270484 926869 957694 618467 263221 -101073 -345949 -134687 346961 388492
40489 388492 -115500 -341066 222923 1035651 1477735 1668105 1756312 1391847 630612 342828
40479 342828 781379 768449 -521965 -1952766 -2033698 -1273183 -1181853 -1594956 -1086896 178899
40469 178899 334063 -1093359 -2182145 -1586284 -525083 -578100 -1190133 -952056 -99694
40460 -99694 31573 -710090 -1237438 -1053040 -627146 -152176 680631 1663462 2073883 1835424
40450 1835424 1634573 1724433 1557960 803377 -139381 -854259 -1353141 -1592325 -1328998 -745059
40440 -745059 -474075 -640249 -538628 284656 1213913 1359973 757660 208220 174726 383143
40430 383143 457368 450934 576505 710471 507403 34583 -28244 820005 2007502 2313824
40420 2313824 1375497 235496 -17520 337483 244188 -469810 -855610 -241124 901099
40411 901099 1658049 1639720 1025298 181159 -485979 -701609 -627902 -716086 -1077220 -1275831
40401 -1275831 -902529 -109341 544274 601914 74037 -503131 -498486 22636 155680 -722804
40391 -722804 -1927473 -2251198 -1652800 -1259694 -1572008 -1686201 -807877 364234 605305
40382 605305 -36936 -358889 255955 1074507 1136625 503418 51918 359874 1159830 1831736
40372 1831736 2112630 2127941 1913064 1339830 609585 309226 611238 894672 725316 729064
40362 729064 1618352 2701189 2569598 1301848 651689 1584030 2831105 2662134 1083695
40353 1083695 -625421 -1667745 -1902469 -1030927 950955 2777992 2864181 1420279 433578
40344 433578 1143034 2521406 2822917 1847377 912958 1008373 1741379 2079759 1568733 621324
40334 621324 -113440 -416536 -569277 -936379 -1569051 -2140605 -2184615 -1497400 -433938 339445
40324 339445 582196 768432 1339845 1942517 1913556 1295240 681452 215270 -388282 -839428
40314 -839428 -334795 1141864 2585763 3347634 3683074 3606385 2563575 915266 251576
40305 251576 1112827 1785569 813714 -581682 -417160 803645 1000571 33334 -199828
40296 -199828 895783 1701086 1281219 825951 1282168 1640362 853043 -217780 -180454
40287 -180454 831520 1805179 2466371 2970480 2924531 2029777 989867 620566 694746 670137
40277 670137 787908 1369330 1845688 1724308 1743411 2662728 3565865 2962294 1188135 64881
40267 64881 291286 778940 680176 514934 898677 1516105 1924391 2266929 2583982 2344768
40257 2344768 1321087 233353 -55835 518391 1476418 2427889 3072293 3121231 2667200
40248 2667200 2229441 2087958 1937340 1460389 840947 438087 325624 402765 612944 839289
40238 839289 916403 911608 1050397 1253127 1165571 780733 557388 728351 975794 1046898
40228 1046898 1195340 1640723 2016955 1846795 1327361 1163987 1663697 2336636 2461585
40219 2461585 1881649 1168572 1011316 1468317 1939572 1932703 1627053 1464104 1414893 1026307
40209 1026307 100877 -993961 -1632231 -1345953 -183918 1070021 1420239 837350 477375
40200 477375 1141763 2045845 1986409 1230837 1019594 1460475 1420603 630715 293824 1054299
40190 1054299 1877596 1838804 1658336 2254800 2906584 2351994 983693 362479 896997
40181 896997 1524618 1614294 1720334 2228268 2547162 2105206 1162682 202666 -625497 -1055436
40171 -1055436 -587874 615171 1487130 1356064 844945 785119 862846 287341 -604230 -587074
40161 -587074 541327 1419728 1022145 245385 723825 2478095 3770337 3386169 2134164
40152 2134164 1576836 1946807 2134337 1477244 655485 603504 1214975 1580099 1160303 289304
40142 289304 -359809 -459990 -171435 210253 658053 1406763 2477399 3358916 3435872 2688988
40132 2688988 1678458 870156 334835 87719 233606 623057 800942 533540 64933
40123 64933 -318469 -622688 -873094 -906509 -688812 -489800 -459963 -316582 278710 1228365
40113 1228365 2056381 2286253 1745269 759744 -14640 -313960 -642956 -1393382 -1857195
40104 -1857195 -1026258 695812 1694443 1264218 414921 231001 616844 1149444 1873153
40095 1873153 2530371 2341021 1497327 1534836 3034233 4309675 3858332 2773778 2842772
40086 2842772 3424927 2578396 550625 -482305 14027 249891 -703419 -1547085 -1256384
40077 -1256384 -660581 -580683 -460815 46245 77138 -568961 -375276 1532959 3537492
40068 3537492 3734481 2713899 2378763 3045292 3547483 3436654 3231588 2993525 2403997
40059 2403997 1927844 2243103 2736956 2194038 896606 434818 1323206 2333929 2485208
40050 2485208 2263709 2374694 2525713 2166624 1548521 1304007 1480651 1552927 1150554 499959
40040 499959 266687 891413 1886922 2142853 1329577 493314 607218 1113756 875844 78767
40030 78767 -86877 591898 1081440 869362 617835 784247 940205 925545 1369284 2367544
40020 2367544 2822238 1993887 770412 440858 988175 1584166 2081549 2853221 3576744
40011 3576744 3417840 2394865 1531787 1487305 1832778 1903497 1664463 1400971 1100848 593677
40001 593677 16123 -264406 -95461 353736 864690 1329463 1700478 2044508 2632741 3607116
39991 3607116 4417410 4071125 2422011 844820 863378 2207648 3114428 2657557 1753358
39982 1753358 1476363 1523860 1172079 764094 1104257 2046433 2847743 3373954 3784902 3644209
39972 3644209 2761055 2363927 3697275 5728041 6166767 4785129 3690633 4017848 4526205
39963 4526205 4172087 3827098 4219193 4231331 2946128 1721511 2278646 3934456 4719875
39954 4719875 4368025 4231945 4860586 5566839 5984869 6238120 5878752 4463508 2969986
39945 2969986 2824552 3622148 3658730 2733247 2434402 3360609 4096667 3639671 2968833 3200219
39935 3200219 3776393 3704326 3329130 3556557 4198878 4358266 3889443 3406806 3234563 3241030
39925 3241030 3405808 3813433 4320172 4751827 5140460 5408445 5284178 4882236 4768068
39916 4768068 5028435 4962775 4229222 3570868 3704094 4151515 4036214 3531878 3587132 4481807
39906 4481807 5515060 5998851 5839259 5242894 4530168 4194767 4521848 5103870 5227016
39897 5227016 4776253 4348457 4433689 4838132 5011168 4741431 4435213 4689249 5531537 6249399
39887 6249399 6261020 5969135 6237036 7154175 8021527 8506006 8921180 9286035 9198531 9001748
39877 9001748 9939152 12526162 15802396 18881341 22078802 25587933 28395064 30117835
39869 30117835 32937914 39499973 48802187 56010363 57163948 53252255 49188550 49198005
39861 49198005 53144065 56747114 55534657 49267011 42363772 39439976 40865150 43393313
39853 43393313 44332042 43766893 43338221 44668163 48816026 55155672 60293487 60226378 54960981
39844 54960981 49620717 49308137 53384902 56155479 53058462 45161066 37475177 33665940
39836 33665940 32872325 31475458 27423020 22233631 18695277 17480014 16899276 15473895
39828 15473895 13468412 11833868 10825417 10113068 9441285 8734955 8104520 7965697 8597417
39819 8597417 9495115 9793345 9365802 8835131 8543885 8310850 8152870 8345016 8748326
39810 8748326 8954816 9055689 9370228 9606230 9360131 9190004 9909659 11083232 11697353
39801 11697353 12005362 12890865 13703997 13070651 11911505 12912113 16300430 18927553 18760757
39792 18760757 17629795 17900296 18982219 19212070 18915072 19161246 19347381 18589635 18027476
39783 18027476 19183834 21258397 22497051 23101641 24371430 26147884 27668267 29801926
39775 29801926 33639630 37761697 39754588 39795338 40135161 41923476 45251096 51014260
39767 51014260 59160056 65984617 67262650 63960887 61113502 61317278 63495585 67755010
39759 67755010 75972141 86263495 92209017 90336467 84503426 80561571 80643579 85044534
39751 85044534 94855283 108391386 118519356 118621136 109893910 99424586 92985035 92775282
39743 92775282 99074190 108900831 114598533 109432799 95268720 81014750 73359265 72312722
39735 72312722 75109931 79746942 83829616 84336279 80863454 76837114 76207993 80688383
39727 80688383 90144926 102487662 112435155 114080775 107056957 98107149 94658613 98206302
39719 98206302 104833636 109799899 109976413 104207485 94121926 83868215 77067943 74205255
39711 74205255 73712243 74327500 75112725 74519498 71499299 67305738 64845169 66225147 71407923
39702 71407923 78467321 84308162 86045729 83167707 78425689 75873334 77773834 83082450
39694 83082450 88115556 88826123 83910679 76342371 70745595 68701176 67759821 65367804
39686 65367804 61904180 58897052 56295009 53352515 50713817 49409843 48704094 47165356
39678 47165356 45345729 45133319 46579542 47577792 46957134 45855012 45440765 45132424 43979556
39669 43979556 42280146 40713625 39037218 36805583 34511496 32846797 31460014 29596189
39661 29596189 27535781 26235505 25778785 25414524 25185608 26197254 28650129 30635252
39653 30635252 29967175 26835507 23608241 22020940 21539043 20801313 19710779 19256700 19788734
39644 19788734 20519904 20772833 20854832 21367095 22242612 22910958 23079491 22945520 22804664
39635 22804664 22780052 22881609 23086915 23318201 23444342 23382617 23228171 23213991 23407060 23535762
39625 23535762 23424174 23505414 24300507 25267971 25006906 23121609 21071680 20338012 20465113
39616 20465113 20030391 18944994 18321339 18327010 17865891 16602526 15646326 15606479 15440222
39607 15440222 14157981 12487728 11761397 12012215 12249990 11987484 11491491 11009818 10668190
39598 10668190 10743233 11223918 11466517 11008538 10313212 10009451 9913115 9629911 9592453 10433615
39588 10433615 11640445 11964810 11133499 10130588 9698411 9536990 9257713 9238308 9983150
39579 9983150 11168710 11903296 11762370 11185400 10876321 11058584 11413192 11621270 11709883
39570 11709883 11754942 11567858 11071591 10750967 11134439 11915113 12267083 12038533 11861417
39561 11861417 12001341 12012740 11781752 11920965 12667663 13323961 13357322 13170549 13190825 13150628
39551 13150628 12956734 13212912 13981368 14109886 12960233 11821306 12196083 13480425 13917626
39542 13917626 13278460 12893237 13328445 13769978 13719764 13686633 13960091 14087551 13845092 13526116
39532 13526116 13090500 12199885 11190325 10777418 10748661 10301361 9707119 10044473 11095381
39523 11095381 11332790 10502039 10277775 11443336 12342303 11558566 10490335 11395913 13977249
39514 13977249 15915272 16318474 16839321 19425527 24308489 30105891 34747551 36633182
39506 36633182 36370729 37319346 42708436 51557674 58652547 59530068 55076760 50679429
39498 50679429 51057122 55990311 60599583 59659288 52238392 42517092 35823426 33750930
39490 33750930 33386003 31091968 26286267 21321564 18462120 17672502 17145019 15436457
39482 15436457 12947030 11405485 11916894 13647682 14713465 14294374 13374292 13207402 13618061
39473 13618061 13435585 12419432 11944010 13324294 15888771 17477989 16981533 15653373
39465 15653373 15322884 15843245 15371776 13134286 10637924 9530585 9339910 8443048 6614876
39456 6614876 5264183 5319631 6190020 6971412 7485171 7746981 7505915 6896207 6641624
39447 6641624 6967269 7102313 6528883 5929422 6098408 6651195 6735948 6362930 5979627 5344219
39437 5344219 4112027 3145695 3781900 5819643 7569992 8005449 7599023 6953472 6074398
39428 6074398 5360033 5793537 7465827 9240936 10627116 12586460 15529907 17979592
39420 17979592 18688425 18994503 21388522 26334285 31939050 36213634 38339857 38567618
39412 38567618 38755109 42468517 52077129 65039773 74638624 75368687 67379513 56237329
39404 56237329 49400658 51685366 61273457 69692944 68302993 56348639 41495605 31903717
39396 31903717 29329548 30226109 30793159 29137294 24716116 18512135 13130590 10583924
39388 10583924 10111165 9488536 7901650 6159498 4826490 3828099 3446353 4029410 4914964
39379 4914964 5097465 4744000 4678274 4696261 3920960 2580635 1792226 1649914 1187335 299053
39369 299053 -17326 395727 392055 -449541 -916398 -69875 1275290 1889505 1869908 2096322
39359 2096322 2760410 3340976 3492205 3231626 2663631 2034002 1661793 1489639 1179691
39350 1179691 846201 1014638 1601236 1732737 1007235 199659 212966 973795 1862879 2600663
39340 2600663 3138239 3240649 2830833 2368939 2323370 2546087 2620188 2529252 2533631 2614458
39330 2614458 2474167 2009660 1520001 1467604 2069622 2999027 3573651 3476434 3130491 3041254
39320 3041254 3050137 2767358 2446122 2647310 3150847 3055822 2040265 764954 -60693 -289080
39310 -289080 14296 698762 1194854 892087 46404 -431546 -205768 232272 538743 800420
39300 800420 806765 156837 -707503 -739656 103606 640624 252669 -286160 -249192 2995
39290 2995 43467 216283 707598 959336 823017 1103298 2035749 2468538 1684682 831126
39280 831126 1173051 1991888 1780875 691904 120228 440797 838899 999709 1277935
39271 1277935 1387761 621922 -560733 -738660 419567 1657159 1979559 1769298 1717039
39262 1717039 1790394 1703314 1470276 1122076 671252 544276 1167983 2006822 2024597 1267996
39252 1267996 857839 1134217 1084734 154870 -654837 -363425 406760 507084 111861 279702
39242 279702 1144292 1737620 1458208 696084 11548 -415926 -440520 135619 1086000 1843887
39232 1843887 2296643 2930872 3917406 4584504 4197874 2891662 1432745 380147 -76392
39223 -76392 255178 1416715 2757030 3224258 2555597 1744539 1909059 3009499 4150700
39214 4150700 4847869 5288481 5429093 4761579 3402920 2668372 3726965 5945730 7401304
39205 7401304 7123840 6127584 5912477 6562959 6938042 6403606 5560969 5159447 5060389 4784933
39195 4784933 4553384 5002094 6041791 6813720 6875163 6656861 6495678 6019983 4987528
39186 4987528 3999504 3673263 3664609 3293053 2677052 2394065 2399698 2236338 2033364 2265424
39176 2265424 2671680 2498613 1794230 1379687 1484557 1521125 1324627 1417377 1800335 1758925
39166 1758925 1303422 1504818 2727704 3741058 3455738 2491743 2037598 2076162 1852787
39157 1852787 1380257 1290162 1631295 1896714 1971669 2128884 2297410 2151858 1762875 1491830
39147 1491830 1445586 1595338 2115863 3024020 3821061 4066633 3959202 3842842 3603124 3091435
39137 3091435 2589764 2222017 1503482 216243 -855805 -896823 -223602 375025 889662
39128 889662 1691782 2402273 2303026 1583371 1106770 1167433 1482969 2117998 3254251 4215713
39118 4215713 3965712 2647224 1531758 1303508 1397031 1171991 734686 360529 41355
39109 41355 -92247 255979 834008 886601 268912 -209424 34494 473006 265747 -530365
39099 -530365 -1096322 -969927 -534608 -335465 -220938 484821 1840511 2733751 2098632
39090 2098632 544284 -162806 547638 1279786 815517 -90167 -47216 782369 1158981
39081 1158981 816264 587209 754471 707953 280395 151512 694622 1443513 1936859 2232839
39071 2232839 2411065 2350334 2169318 2231590 2625605 3160812 3742441 4196857 4071225 3334729
39061 3334729 2868604 3415284 4560591 5790858 7856635 11477546 15050407 15625298 12527289
39052 12527289 8350699 5769975 4816208 4021398 2854357 1907679 1563880 1598655 1729938
39043 1729938 1820637 1783746 1708649 1788711 1900747 1667521 1101205 705488 779273 1091196
39033 1091196 1373490 1687776 2195691 2905703 3594144 3718152 2791268 1290534 601435
39024 601435 1336867 2346963 2334713 1740799 1774780 2273558 2177283 1691205 2033091 3060853
39014 3060853 3147772 1787933 494382 537804 1460371 2447702 3482725 4331584 4049486
39005 4049486 2603325 1591024 2138217 3228807 3334726 2689945 2629516 3411606 4037757
38996 4037757 3884424 3400222 3268038 3611834 3998735 3853956 3040236 2154476 1886756
38987 1886756 2102771 2145976 1965000 2108544 2621202 2937854 2947800 3073721 3153181 2455889
38977 2455889 1103632 229755 309631 561667 501311 813072 1972810 3148050 3312428
38968 3312428 2584433 1735350 1144742 886376 1134697 1860414 2614031 2976865 2839463
38959 2839463 2284750 1768623 2066554 3157620 3669148 2639925 1243664 1202843 2123561
38950 2123561 2394842 2172623 2947980 4339628 4207366 2345468 1177299 1962222 3033034
38941 3033034 2818999 2012954 1613372 1364688 1312213 2338498 3965850 4301866 3376969
38932 3376969 3616242 5665549 7016241 6428960 6137134 7503058 8288018 7035597 6334806
38923 6334806 8263590 10314678 9965167 9738414 12884861 17275655 19169307 20241317
38915 20241317 24587183 31311729 37848496 48995707 72430632 102800427 119867555
38908 119867555 109084455 78782551 50742351 37177390 33156054 29280452 23960690
38901 23960690 21211590 22097905 23370543 23223627 23963081 27648355 32603390 37865251
38893 37865251 48805478 71602836 100163445 115343434 103619061 73390130 46128510
38886 46128510 33140957 28271592 22544448 16374659 13968572 13956600 12162794 9060808
38878 9060808 8088685 9060169 8857626 7231082 6848892 8197588 8925811 8246490 8009053
38869 8009053 8892090 8992643 7209331 5276821 5145555 6297682 6924943 6447889 5750830
38860 5750830 5696999 6274533 6878832 6932542 6283570 5159710 3897912 2972777 3068119 4424420
38850 4424420 6113199 6790304 6329959 5901157 6291603 7044792 7402202 7175649 6563402
38841 6563402 6034293 6395622 7922424 9470146 9606038 8528840 7664276 7608004 7857072
38832 7857072 8235404 8958920 9585780 9601040 9687298 10715595 12127685 13202254 14888099
38823 14888099 18093742 21561850 24307707 28439707 36064250 45820478 57340087 75798456
38815 75798456 103594648 128681839 132043416 110043306 80215593 60561982 52016952
38808 52016952 46699297 43319165 45075124 50185427 55887080 66698611 86681659 106299317
38800 106299317 109343975 93122205 71357056 56599188 49732742 47447924 49150381
38793 49150381 53912131 60511352 73222773 97088162 123570724 132286280 114147846
38786 114147846 83801209 61604598 51628721 45771331 40970637 40648628 44485780 49271637
38778 49271637 57667188 74219718 92644386 98207782 85291061 63979766 46685442
38771 46685442 36017693 28738321 23906466 22165988 22188880 22511626 23731145 26071065
38763 26071065 28106774 29834613 33152772 38054285 43611008 54124600 76388586 105914746
38755 105914746 123455439 113880428 84670155 57322807 43117381 36407143 30121440
38748 30121440 26234760 27793124 30796086 30627812 29909322 33173671 39019516 45142615
38740 45142615 56772438 79921458 106643566 117261473 101433647 70484801 44360639
38733 44360639 31438709 26117677 21585000 17358979 15085432 13857298 12049112 9952778
38725 9952778 8414266 7164225 5943094 5315374 5194320 4398941 2802198 2140938 3422696
38716 3422696 5120786 5345139 4456967 4051535 4440938 4674261 4279162 3549461 2627016
38707 2627016 1545322 807649 903063 1598768 2474222 3593786 4900417 5691765 5600581
38698 5600581 5325206 5400108 5086951 3673802 2048693 1543021 1855284 1697232 1036873
38689 1036873 1000630 1776685 2387009 2599735 3317807 4714481 5596112 5208894 4312421
38680 4312421 3819640 3602704 3320067 3240640 3431477 3166066 2046776 871712 504052
38671 504052 632333 543193 419790 876009 1736505 2289434 2376445 2292884 1955482 1163813
38661 1163813 422356 413483 739579 317079 -857341 -1473213 -825595 89481 81508 -472842
38651 -472842 -292885 881794 2023495 2308158 1931585 1340544 538602 -428499 -968669
38642 -968669 -565578 404013 1056216 1066794 825773 592424 112033 -722852 -1335655 -1008004
38632 -1008004 257942 1760547 2836596 3241839 2916104 1868429 492990 -367111 -108219
38623 -108219 892646 1559032 1271574 496671 56293 28099 -202879 -888328 -1494677 -1544199
38613 -1544199 -1339020 -1398248 -1576424 -1360731 -837864 -659685 -1019550 -1323176 -1068190 -475467
38603 -475467 49663 579242 1350908 2109877 2230344 1435224 137749 -895949 -1123950
38594 -1123950 -600549 135388 650050 1053288 1634312 2184044 2127140 1363828 513934 207011
38584 207011 560125 1413113 2492070 3173887 2779506 1481926 328040 -56995 -177471
38575 -177471 -608557 -942086 -532139 289582 665609 512496 405956 379974 -132763 -1136197
38565 -1136197 -1811981 -1651902 -1055238 -519307 44740 801882 1381486 1265730 512449
38556 512449 -223717 -242998 685668 2093877 3080397 3103741 2463551 1713647 886909 -125566
38546 -125566 -750223 -254918 903086 1314844 498987 -456473 -561320 -176684 88448
38537 88448 683465 2224577 4045307 4952831 5079409 5650405 6930778 7671737 6902841
38528 6902841 5224415 3856588 3245362 3125232 3227913 3292285 2928267 2183850 1906131
38519 1906131 2808246 4260239 4638405 3053845 427017 -1316265 -1068810 394691 1168931
38510 1168931 205815 -1471095 -1903040 -593688 831867 728713 -442737 -867649 100286
38501 100286 1183999 1062454 51636 -604496 -442197 -32764 143507 256058 486991
38492 486991 536733 162741 -211728 12923 629215 723681 -55891 -867662 -763965 -27710
38482 -27710 255786 -208349 -613322 -448235 -249871 -471746 -513948 254721 1194461 1226131
38472 1226131 559250 350451 789226 880467 302159 86945 900830 1870249 1925029 1293224
38462 1293224 731677 155385 -838750 -1709216 -1469188 -198209 997008 1424117 1344234
38453 1344234 1216073 1240729 1546798 2042793 2200628 1702174 1065335 853238 645383 -169260
38443 -169260 -939042 -466893 881476 1315319 192794 -996644 -830154 198147 859874
38434 859874 1051597 1409306 1959472 2300352 2507654 2760768 2550851 1384709 -31208
38425 -31208 -438939 233019 824366 688008 472382 872590 1472416 1399731 645923 132030
38415 132030 568924 1655321 2478752 2476197 1807802 893980 -22081 -668166 -574665 304097
38405 304097 1077548 818833 -90166 -407640 105526 351102 -239562 -705017 -164772 670570
38395 670570 686940 189190 199101 503891 -85534 -1668339 -2872048 -2720052 -1687420 -618939
38385 -618939 295732 1037016 1232648 743573 113994 -99470 37113 235005 480679 744862
38375 744862 704300 204038 -367246 -524191 -197800 416474 1101695 1488333 1218162 599909
38365 599909 570812 1506769 2514138 2496365 1602229 971750 1235332 1935076 2393020 2485197
38355 2485197 2416527 2320950 2383394 2907391 3879787 4808473 5480538 6687398 9538719 13827090
38345 13827090 17510526 18265137 15536790 10921230 6686277 4115243 3048715 2562149
38337 2562149 1960153 1324156 1183157 1639604 2067999 1931312 1601952 1875938 2826409
38328 2826409 3708321 3934518 3550826 2818476 2068212 1971697 3039847 4612794 5249003
38319 5249003 4485819 3354385 2788912 2547871 2227292 2156250 2441748 2296149 1454674
38310 1454674 1158150 2260683 3296650 2247097 -325636 -1869364 -1390551 -431541 -344908
38301 -344908 -576052 -246868 334886 664613 1110069 1974675 2604127 2409834 1896285 1797273
38291 1797273 1978272 1976424 1855116 1769559 1461158 952392 962122 1784666 2479955 2102368
38281 2102368 1144005 833123 1462444 2273194 2606355 2379760 1769374 1122565 859793
38272 859793 888659 561322 -227226 -489046 589870 2339461 3299459 2821435 1408125
38263 1408125 -5950 -567298 -6342 756387 352291 -1008377 -1366409 160334 1705874
38254 1705874 1318505 46038 269777 1805158 2197254 729038 -484402 101929 1354986
38245 1354986 1722884 1559231 1907677 2589113 2907214 3031303 3339858 3408060 2922339 2675082
38235 2675082 3343099 4082577 3687357 2477062 1668129 1444008 1105769 708092 957330
38226 957330 1631819 1705354 1188554 1320716 2510305 3475361 3106894 2019774 1424299
38217 1424299 1434545 1484583 1650152 2341843 3056260 2712868 1358591 473192 1115620 2505225
38207 2505225 3060964 2393019 1537394 1352731 1457348 1053654 262030 21832 742388
38198 742388 1605909 1495459 367739 -646847 -518333 580671 1615490 1959943 1954640
38189 1954640 2077830 1996561 1031129 -515923 -1271458 -437285 1064171 1722606 1307206
38180 1307206 825121 897904 1180677 1403212 1855876 2430201 2228800 900824 -421647
38171 -421647 -450687 546849 1354844 1682845 2238833 3099471 3390505 2908743 2764245 3637667
38161 3637667 4415552 3678005 1966137 1285101 2411230 3905682 4189130 3578890 3468413
38152 3468413 4128734 4432854 3723563 2885255 3031382 3845134 4073661 3398516 2862600
38143 2862600 3256581 3937547 3830198 3036017 2649237 3166180 3870073 3897234 3249853 2481485
38133 2481485 1904002 1486448 1189136 1010516 898529 879964 1062674 1306979 1227045 808370
38123 808370 636273 1088089 1699190 1925093 2150319 3070597 4255841 4443190 3489563
38114 3489563 2905578 3784995 5116574 5122641 3693501 2385879 2243987 2737240 2933737
38105 2933737 2710172 2458642 2382609 2509644 2819969 3011429 2698202 2164730 2265286 3117474
38095 3117474 3592572 2800034 1480681 999171 1346695 1279268 397676 -134154 614248
38086 614248 1845384 2149428 1488970 1102129 1638503 2354884 2352501 1824029 1588639 1897778
38076 1897778 2324063 2594695 2853914 3069496 2837749 2072554 1382529 1336022 1709915 1935047
38066 1935047 1976002 2191264 2537302 2602169 2379431 2305387 2472563 2531111 2502340 2871799
38056 2871799 3567714 3713685 2954187 2237704 2511113 3276134 3387157 2855158 2802555 3757900
38046 3757900 4978760 5526112 5168766 4154859 2989087 2673729 4233537 7369955 10128294
38037 10128294 10571749 8643269 6015327 4299786 3775662 3755389 3724696 3811604 4204682
38028 4204682 4508716 4098728 3040302 2117511 1800941 1779435 1798815 2227734 3206082 3959094
38018 3959094 3833969 3412857 3515777 3616749 2633630 1022270 436330 1137899 1456387
38009 1456387 450537 -495074 195648 1854763 2665795 2365858 2350184 3409816 4745697
38000 4745697 5318418 5105905 4722904 4526489 4466792 4431174 4444476 4632791 5068231 5685175
37990 5685175 6478567 7653947 9171684 10224994 9853133 8241595 6707081 6091185 5892193
37981 5892193 5394328 4888750 5169178 6446275 8382634 10619285 12623136 13567592 13065246
37972 13065246 11625684 9921097 8181385 6731112 6215968 6581325 6751072 6211393 5968557
37963 5968557 6882015 8071141 8334812 8169459 8671823 9248400 8478246 6815055 6167118
37954 6167118 6772053 6774177 5367429 4193453 4756905 6313723 7369539 7686888 7714794
37945 7714794 7465162 7131848 7558466 8885640 9865319 9705250 9475308 10400564 11851975
37936 11851975 12523897 12696305 13687190 15695987 17835020 19866447 22280556 24929510
37928 24929510 27229118 29633078 33298607 38274654 43817571 50978724 63131994 82657028
37920 82657028 107647891 132346394 150071047 155688027 147204242 127047914 101771557
37913 101771557 78929475 62958879 53503701 47265970 41244991 34608714 28236820 23068037
37905 23068037 19138400 16052805 13803682 12662475 12531681 12971233 13790040 15037383
37897 15037383 16357066 16929978 16319688 15030481 14016084 13831674 14286418 14632157 14084879
37888 14084879 12522511 10757317 9841999 10060179 10798465 11268333 11029607 10063626 8926631
37879 8926631 8683056 9895735 11573017 11915463 10443197 8694749 8361897 9348218 10300621
37870 10300621 10610887 11078957 12630853 15034685 17158149 18254609 18773726 19831747
37862 19831747 21830981 23724696 23949872 22124232 19485477 17543309 16671944 16246489
37854 16246489 15793633 15615737 16394291 18395960 20970487 22798801 22967630 21970927 21328688
37845 21328688 22013450 23567640 24929413 25660011 26053507 26540202 27454217 28969198 30754118
37836 30754118 32155613 33373702 35916484 40760792 46119614 48230189 44906724 37712178
37828 37712178 30279659 25080006 22158485 20286992 18528171 16804140 15510058 14774230
37820 14774230 14139269 13145254 12074000 11578084 11560033 11141795 9977399 8801763 8238290
37811 8238290 7900488 7372213 7254937 8188699 9391662 9406236 8077405 6627585 5884072
37802 5884072 5641368 5754448 6459311 7296439 7112761 5794864 4831947 5384479 6827001
37793 6827001 8022671 8975903 10152614 11106756 11138703 10760955 11181501 12589646 14026138
37784 14026138 14637970 14068630 12134690 9399168 7616864 8069462 9646478 10167324 9516304
37775 9516304 9653555 11355868 13035330 13525946 13987771 15678388 17480706 17395440 15414293
37766 15414293 13149930 11347695 9562749 7893862 7160907 7262046 7004929 6010683 5443697
37757 5443697 6211928 7484207 7779947 6866597 5816351 5533520 5874350 6120761 5843542
37748 5843542 5195621 4553360 4005173 3271176 2172201 1068676 664739 1341930 2706066
37739 2706066 3771466 3687798 2468166 956522 -81939 -650331 -1049592 -1141343 -750871
37730 -750871 -470806 -1028648 -1898166 -1748778 -525028 214691 -430228 -1398838 -1444676 -940998
37720 -940998 -819722 -881504 -530067 -207188 -528050 -750363 184495 1607208 1897516 1003536
37710 1003536 384512 571958 661749 342116 522308 1525836 2416501 2697226 3045581
37701 3045581 3714936 3837823 3138573 2748302 3279320 3556470 2504544 1020267 563497
37692 563497 913883 814720 85082 -397711 -299176 15006 590931 1797419 3234297 3897404
37682 3897404 3437568 2352410 1091200 -74223 -495516 376087 1882619 2581596 2021057
37673 2021057 1218559 1112698 1392606 1280763 738083 281262 43618 -341545 -1027307
37664 -1027307 -1599810 -1551012 -886338 -118263 287130 311555 195889 57210 -83286 -52226
37654 -52226 317807 804570 959149 695608 356112 169609 42043 -127134 -393648 -1000490
37644 -1000490 -2063381 -3024046 -3148860 -2660330 -2520174 -2878163 -2738209 -1641620 -658747
37635 -658747 -888364 -1764505 -1844584 -793783 373741 766103 481308 121944 122002 525012
37625 525012 986482 1087181 862995 685066 458590 -362084 -1546760 -1733919 -142607
37616 -142607 1965671 2530030 1113726 -765399 -1530661 -996122 -40147 463363 346773
37607 346773 178750 532311 1126117 1156863 605573 374335 744888 754165 -150797 -901016
37597 -901016 -339919 917793 1437737 1084141 847797 1129684 1590733 2231094 3166549
37588 3166549 3748398 3427057 3069568 3688667 4225820 2728059 -208758 -1503418 225239
37579 225239 2684727 3259043 2464682 2504467 3788368 4772610 4556084 3843610 3422134
37570 3422134 3113316 2525407 1872791 1605852 1735673 1920647 2051993 2440775 3261804
37561 3261804 3929573 3472561 1775797 -6738 -735006 -506841 -99 788678 2133208
37552 2133208 3374953 3486186 2754539 2543274 3220679 3667807 3174072 2497670 2499769 2926536
37542 2926536 3227729 3543032 4121802 4595712 4511189 3911415 2942420 1663930 599794
37533 599794 490472 1054978 1073070 226950 -315761 172140 737140 365305 -351538 -332019
37523 -332019 217190 401181 190455 102151 49419 -192334 -32358 1020267 2025357 1711247
37513 1711247 590213 421727 1620771 2710676 2568256 1839898 1664909 2113457 2512265
37504 2512265 2537790 2367270 2201305 2102637 2084535 2141092 2324105 2743818 3290127 3549783
37494 3549783 3296138 2795261 2302211 1670581 930433 731794 1480311 2452521 2657840
37485 2657840 2294261 2362919 2993968 3277745 2873579 2651099 3275160 4077216 4004187 3072805
37475 3072805 2171512 1782457 1603061 1326729 1169524 1459766 2099887 2704177 3096017
37466 3096017 3404348 3722659 3968685 4160471 4517273 5051220 5323783 4951626 4166248
37457 4166248 3505677 3148049 2976359 3064537 3511625 3942226 3828348 3258472 2776990 2573019
37447 2573019 2509554 2770637 3589609 4427638 4436803 3768558 3366622 3408029 3177647 2705268
37437 2705268 3150151 4984356 6990978 7798057 7470486 6940541 6716551 6747701 6843590
37428 6843590 6826344 6929187 8053778 10654395 13510364 14946214 15139197 15622881 16743281
37419 16743281 17699513 18982817 22160346 26983357 31559057 35872561 42162332 51672690
37411 51672690 65000913 85497503 115403563 145625234 156913027 138639703 102672385
37404 102672385 71479650 55012162 46412121 37787118 30180281 26720561 25270286 22510675
37396 22510675 19436051 18333218 18363143 17799361 17299526 17824779 18258221 17728297 17513166
37387 17513166 18523383 19883546 21738003 25870747 31735024 36048655 38483572 43100677
37379 43100677 51812584 62395019 76521683 101896632 138393866 167728739 167986410
37372 167986410 138022003 98791777 70212989 54942251 45699794 38537317 33620900
37365 33620900 29905448 25955107 23074746 22650881 22497082 19837505 16009520 14385215
37357 14385215 15010212 14893312 12766244 10269697 8776082 7940114 7443812 7705584 8477084
37348 8477084 8637780 7843258 7000347 6831808 7148060 7734735 8834103 10370539 11531257
37339 11531257 11587696 10765437 10061634 10322639 11452974 12459891 12493090 11860563 11630551
37330 11630551 12238621 13087358 13575716 13700590 13366011 12043553 9789019 7887881 7619076
37321 7619076 8675230 9512555 9124707 7899199 6774410 6087604 5475836 4678931 4080215
37312 4080215 4208120 4848460 5189490 5023429 5144362 6042902 6856648 6473315 5248035
37303 5248035 4617106 5190193 6220096 6915444 7285215 7558992 7644407 7390475 6781087
37294 6781087 5829786 4834215 4518561 5170130 5879465 5543261 4424969 3743693 3912076
$$ [...]
##END NTUPLES=NMR SPECTRUM
##END=
