##TITLE=31Pdec_SR118_1
 , 24 sc
 4.4.2022
##JCAMPDX= 6.0         $$ Bruker NMR JCAMP-DX V2.0
##DATA TYPE= NMR SPECTRUM
##DATA CLASS= NTUPLES
##ORIGIN= UXNMR, Bruker Analytische Messtechnik GmbH
##OWNER= root
$$ XWIN-NMR		Version 3.5
$$ Mon Apr  4 11:46:58 2022 Russian Standard Time (UT+4h)  she@DPX200
##.OBSERVE FREQUENCY= 81.013821
##.OBSERVE NUCLEUS= ^31P
##.ACQUISITION MODE= SIMULTANEOUS
##.ACQUISITION SCHEME= undefined
##.AVERAGES= 24
##.DIGITISER RES= 16
##SPECTROMETER/DATA SYSTEM= spect
##.PULSE SEQUENCE= zgpg30
##.SOLVENT NAME= CDCl3
##.SHIFT REFERENCE= (INTERNAL, CDCl3, 0, 248.564)
##AUDIT TRAIL= $$ (NUMBER, WHEN, WHO, WHERE, WHAT)
$$ ##TITLE= Audit trail, XWIN-NMR		Version 3.5
$$ ##JCAMPDX= 5.01
$$ ##ORIGIN= Bruker BioSpin GmbH
$$ ##OWNER= she
$$ F:/spectra/data/she/nmr/P31/1/pdata/1/auditp.txt
$$ ##AUDIT TRAIL=  $$ (NUMBER, WHEN, WHO, WHERE, WHAT)
(   1,<2022-04-04 11:45:49.45 +0400>,<she>,<DPX200>,
      <created by zg, POWCHK disabled, PULCHK disabled
       configuration hash MD5:
       00 E9 B6 7A A2 85 ED C7 34 08 36 98 17 FE 4E 26
       data hash MD5: 32K
       8C 3A 85 59 95 DC 2B 5D B6 73 68 09 E6 09 D9 73>)
(   2,<2022-04-04 11:45:55.09 +0400>,<she>,<DPX200>,
      <Start of raw data processing
       efp BC_mod = 2 LB = 1 FT_mod = 6 PKNL = 1 PHC0 = -9562.121 PHC1 = 153.4756 SI = 64K 
       data hash MD5: 64K
       C3 6C 33 AC 9E A5 4C 9F 85 15 3D 35 4E A8 FF 63>)
(   3,<2022-04-04 11:46:17.93 +0400>,<she>,<DPX200>,
      <pk PHC0 = 19.60799 PHC1 = -64.59999 
       data hash MD5: 64K
       54 0E BD 95 4E E7 99 E4 59 80 CF 80 F7 77 17 89>)
$$ ##END=
$$ 
$$ hash MD5
$$ F4 92 19 51 E0 B8 EE EA 24 1F 94 22 69 28 A1 D8
##$RELAX= 
##$RELAX= 
##$RELAX= 
##$RELAX= 
##$RELAX= 
##$RELAX= 
##$RELAX= 
##$RELAX= 
$$ Bruker specific parameters
$$ --------------------------
##$DU= <F:/spectra>
##$EXPNO= 1
##$NAME= <P31>
##$PROCNO= 1
##$TYPE= <nmr>
##$USER= <she>
##$AMP= (0..31)
100 100 100 100 100 100 100 100 100 100 100 100 100 100 100 100 100 100 
100 100 100 100 100 100 100 100 100 100 100 100 100 100 
##$AQSEQ= 0
##$AQ_mod= 1
##$AUNM= <au_zg>
##$AUTOPOS= <>
##$BF1= 81.014009
##$BF2= 200.13
##$BF3= 200.13
##$BF4= 200.13
##$BF5= 200.13
##$BF6= 200.13
##$BF7= 200.13
##$BF8= 200.13
##$BYTORDA= 1
##$CFDGTYP= 0
##$CFRGTYP= 5
##$CHEMSTR= <none>
##$CNST= (0..31)
1 1 145 1 1 1 1 1 1 1 1 1 1 1 1 1 1 1 1 1 1 1 1 1 1 1 1 1 1 1 1 1 
##$CPDPRG= <waltz16>
##$CPDPRG1= <>
##$CPDPRG2= <waltz16>
##$CPDPRG3= <>
##$CPDPRG4= <mlev>
##$CPDPRG5= <mlev>
##$CPDPRG6= <mlev>
##$CPDPRG7= <mlev>
##$CPDPRG8= <mlev>
##$CPDPRGB= <>
##$CPDPRGT= <>
##$D= (0..31)
0 1 0 0 0 0 0 0 0 0 0 0.03 2e-05 3e-06 0 0 0 0 0 0 0 0 0 0 0 0 0 0 0 0 
0 0 
##$DATE= 1649058349
##$DBL= (0..7)
120 120 120 11 120 120 24 19 
##$DBP= (0..7)
150 150 150 150 150 150 150 150 
##$DBP07= 0
##$DBPNAM0= <>
##$DBPNAM1= <>
##$DBPNAM2= <>
##$DBPNAM3= <>
##$DBPNAM4= <>
##$DBPNAM5= <>
##$DBPNAM6= <>
##$DBPNAM7= <>
##$DBPOAL= (0..7)
0.5 0.5 0.5 0.5 0.5 0.5 0.5 0.5 
##$DBPOFFS= (0..7)
0 0 0 0 0 0 0 0 
$$ [...]
##$SUBNAM2= <"">
##$SUBNAM3= <"">
##$SUBNAM4= <"">
##$SUBNAM5= <"">
##$SUBNAM6= <"">
##$SUBNAM7= <"">
##$SUBNAM8= <"">
##$SUBNAM9= <"">
##$SW= 501.771253377433
##$SWIBOX= (0..15)
0 1 3 0 0 0 0 0 0 0 0 0 0 0 0 0 
##$SW_h= 40650.406504065
##$TD= 32768
##$TD0= 1
##$TE= 0
##$TE2= 300
##$TE3= 300
##$TEG= 300
##$TL= (0..7)
0 120 53 12 22 120 120 120 
##$TP= (0..7)
150 150 150 150 150 150 150 150 
##$TP07= 0
##$TPNAME0= <>
##$TPNAME1= <>
##$TPNAME2= <>
##$TPNAME3= <>
##$TPNAME4= <>
##$TPNAME5= <>
##$TPNAME6= <>
##$TPNAME7= <>
##$TPOAL= (0..7)
0.5 0.5 0.5 0.5 0.5 0.5 0.5 0.5 
##$TPOFFS= (0..7)
0 0 0 0 0 0 0 0 
##$TUNHIN= 0
##$TUNHOUT= 0
##$TUNXOUT= 0
##$USERA1= <user>
##$USERA2= <user>
##$USERA3= <user>
##$USERA4= <user>
##$USERA5= <user>
##$V9= 5
##$VALIST= <valist>
##$VCLIST= <CCCCCCCCCCCCCCC>
##$VD= 0
##$VDLIST= <DDDDDDDDDDDDDDD>
##$VPLIST= <PPPPPPPPPPPPPPP>
##$VTLIST= <TTTTTTTTTTTTTTT>
##$WBST= 1024
##$WBSW= 4
##$XGAIN= (0..3)
0 0 0 0 
##$XL= 0
##$YL= 0
##$YMAX_a= 11348
##$YMIN_a= -17528
##$ZGOPTNS= <>
##$ZL1= 120
##$ZL2= 120
##$ZL3= 120
##$ZL4= 120
##$ABSF1= 0
##$ABSF2= 0
##$ABSG= 0
##$ABSL= 0
##$ALPHA= 0
##$AQORDER= 0
##$ASSFAC= 0
##$ASSFACI= 0
##$ASSFACX= 0
##$ASSWID= 0
##$AUNMP= <proc_1d>
##$AZFE= 0.1
##$AZFW= 0.5
##$BCFW= 0
##$BC_mod= 2
##$BYTORDP= 0
##$COROFFS= 0
##$CY= -3
##$DATMOD= 1
##$DC= 0
##$DFILT= <>
##$DTYPP= 0
##$F1P= 0
##$F2P= 0
##$FCOR= 1
##$FTSIZE= 65536
##$FT_mod= 6
##$GAMMA= 0
##$GB= 0
##$INTBC= 1
##$INTSCL= 5.30512e-09
##$ISEN= 30
##$LB= 1
##$LEV0= 0
##$LPBIN= 0
##$MAXI= 10000
##$MC2= 0
##$MEAN= 0
##$ME_mod= 0
##$MI= 50
##$NCOEF= 0
##$NC_proc= -7
##$NLEV= 6
##$NOISF1= 182.463
##$NOISF2= 159.3651
##$NSP= 0
##$NTH_PI= 0
##$NZP= 0
##$OFFSET= 248.5645
##$PC= 4
##$PHC0= -9542.513
##$PHC1= 88.87561
##$PH_mod= 1
##$PKNL= yes
##$PPARMOD= 0
##$PSCAL= 0
##$PSIGN= 0
##$REVERSE= no
##$SF= 81.014009
##$SI= 65536
##$SIGF1= 159.3651
##$SIGF2= -187.1042
##$SINO= 113.3802
##$SIOLD= 16384
##$SREGLST= <1H.CDCl3>
##$SSB= 0
##$STSI= 65536
##$STSR= 0
##$SW_p= 40650.406504065
##$SYMM= 0
##$S_DEV= 0
##$TDeff= 32768
##$TDoff= 0
##$TI= <>
##$TILT= no
##$TM1= 0
##$TM2= 0
##$TOPLEV= 0
##$USERP1= <user>
##$USERP2= <user>
##$USERP3= <user>
##$USERP4= <user>
##$USERP5= <user>
##$WDW= 1
##$XDIM= 65536
##$YMAX_p= 498366968
##$YMIN_p= -15027935
$$ End of Bruker specific parameters
$$ ---------------------------------
##NTUPLES= NMR SPECTRUM
##VAR_NAME=  FREQUENCY,     SPECTRUM/REAL,   SPECTRUM/IMAG
##SYMBOL=    X,             R,               I
##VAR_TYPE=  INDEPENDENT,   DEPENDENT,       DEPENDENT
##VAR_FORM=  AFFN,          ASDF,            ASDF
##VAR_DIM=   65536,         65536,           65536
##UNITS=     HZ,            ARBITRARY UNITS, ARBITRARY UNITS
##FACTOR=    0.620285442955139, 1,           1
##FIRST=     20137.2065510759, 0,            0
##LAST=      -20513.1999529892, 0,           0
##MIN=       -20513.1999529892, -15027935,   0
##MAX=       20137.2065510759, 498366968,    0
$$ Real data points
##PAGE= N=1
##DATA TABLE= (X++(R..R)), XYDATA
$$ [...]
46976 -2189320 -2765512 -3656359 -3256417 -1714770 -297693 696320 1842063 2935656 3047466
46967 3047466 2182822 1509955 1713025 2180846 2021354 947790 -897206 -2899410 -3625495
46958 -3625495 -1872020 1356814 3139079 1845963 -757385 -1561208 340772 3035235
46950 3035235 4208513 3267648 1391298 320476 916151 2313292 2805517 1990178 1305389
46941 1305389 1755578 2152728 929183 -1205672 -2267498 -2141088 -2468911 -3332252 -2592646
46932 -2592646 459544 3092552 2573745 71471 -980007 436236 2013505 1708308
46924 1708308 245649 -458872 43731 510791 -217427 -1904743 -3248378 -3223140 -1991985
46915 -1991985 -414028 1050831 2323907 2811088 1778116 635 -382476 1361718
46907 1361718 3193082 3013886 1615364 1219207 1991104 2110224 888630 -405887 -853283
46898 -853283 -809278 -243156 1534145 3696436 3734924 904378 -1938171 -1663833 1201140
46889 1201140 3569485 3806768 2797053 1609919 114400 -1925947 -3901361 -5015052
46881 -5015052 -5088799 -4486300 -3794869 -3500971 -3389908 -2545980 -708145 762256 403535
46872 403535 -988804 -922549 1465467 3939225 3941091 1930792 682586 1596025 3090235
46863 3090235 2981805 1278761 -251645 -566540 -252901 -181901 -459530 -935703 -1683845
46854 -1683845 -2468311 -2604989 -1910429 -991520 -131627 1000645 1864768 821691 -2150035
46845 -2150035 -3938561 -1744209 2709434 4881426 3124635 200089 -1023300 -680201
46837 -680201 -67671 563315 1017261 281636 -1653355 -2948355 -2543944 -1910498 -2469241
46828 -2469241 -3063141 -2102006 -657448 -930129 -2661727 -3556971 -2653707 -985481 572557
46819 572557 1805704 1920259 245223 -1883204 -2266356 -1011921 -327680 -940336 -1151290
46810 -1151290 -152768 110903 -2174798 -5624061 -7124250 -5608609 -3099502 -2256385 -3594660
46801 -3594660 -5102480 -4528320 -2123888 -529221 -1383164 -3019472 -2783100 -713986 929673
46792 929673 1204810 1231170 1500606 965788 -587379 -1549840 -900928 260852 681655
46783 681655 770698 1291596 1748313 1377731 569131 103522 -24340 -33947 347045 1038439
46773 1038439 1068511 -139291 -1813705 -2923128 -3203916 -2467810 -253675 2853216 4865886
46764 4865886 4529075 2737231 895505 -751088 -2056691 -1971510 -381681 484865 -1281761
46755 -1281761 -4105823 -4721251 -2646411 -545946 -229702 -639987 -266478 597900 1039990
46746 1039990 1331857 2176415 3054293 2692472 958463 -759929 -1253684 -864666 -679421
46737 -679421 -756621 -42131 1724979 3012484 2350639 538923 -326882 283278 986326
46728 986326 923754 726233 727832 173310 -1028969 -1607016 -956506 -108195 341717 1269295
46718 1269295 2714540 2821727 972095 -313794 836198 2007184 -107323 -4147931
46710 -4147931 -5629055 -3310347 -247387 1308427 2065108 2303767 574292 -2628738
46702 -2628738 -3680835 -854322 2375824 1992176 -749067 -1431431 888340 2679852
46694 2679852 1481311 -783688 -1134942 130188 309350 -1492894 -2987386 -1840059
46686 -1840059 1149762 3065730 2505908 841139 -211240 -660439 -1067049 -878845 417635
46677 417635 1566774 1010649 -471829 -744612 288408 549808 -787379 -2052962 -1788548
46668 -1788548 -512668 929370 2567864 3904233 3549280 1601804 304500 757746
46660 757746 1011515 -640703 -2408559 -1576674 1036457 2038285 301740 -1859855 -2361356
46651 -2361356 -1775086 -1627801 -2236024 -2963774 -3208062 -2470952 -572929 1636094 2702821
46642 2702821 2229425 1395899 1419794 2108969 2348602 1576269 341039 -491272 -808470
46633 -808470 -1259971 -2069472 -2370139 -1502811 -526088 -999132 -2307312 -2109690 7970
46624 7970 1495027 654560 -734529 -548889 30431 -1235701 -3321626 -3275314 -1190814
46615 -1190814 -267126 -1799758 -3589940 -4030419 -4347447 -5378755 -5286938 -2662720 478941
46606 478941 1222499 -369862 -2109544 -3017371 -3539027 -3468730 -2018213 424375 2443032
46597 2443032 3204598 2550468 246290 -3159384 -5449016 -4749454 -2166649 -542973 -791335
46588 -791335 -1376775 -1291264 -1305082 -1892453 -2125247 -1559372 -1377635 -2411583 -3435174 -2812620
46578 -2812620 -891814 582379 856513 772776 1263583 2191965 2634749 1786486 -213042
46569 -213042 -1993350 -1941155 34599 2150682 2700068 1977229 1678458 2660644 3914577
46560 3914577 3777643 1859436 -291604 -557336 1408970 3434425 3085758 508557 -1950877
46551 -1950877 -2832376 -2817251 -2672660 -1885573 -426153 5655 -1627890 -3464960 -3220385
46542 -3220385 -1943103 -2533309 -4856171 -5510717 -3090565 -522228 -561714 -1735308 -1250969
46533 -1250969 136041 -580443 -3432747 -5024126 -3630809 -1686321 -1892492 -3264287
46525 -3264287 -3020056 -905726 629944 53600 -1520944 -2389936 -2344596 -2048008 -1631680
46516 -1631680 -948958 -488791 -917973 -1950741 -2611217 -2563855 -2295484 -1920540 -834203
46507 -834203 1047742 2722811 3540070 4293595 5712646 6552726 4881194 1228131 -1379134
46498 -1379134 -1206066 -13379 -269292 -1534922 -1478545 226538 1273554 249487 -1294676
46489 -1294676 -1398618 -753873 -1497939 -3703576 -5030934 -4072410 -2351192 -2109776 -3327171
46480 -3327171 -4265340 -4303683 -4533030 -5401191 -5446450 -3377331 -328619 1345700 1112762
46471 1112762 711002 1484688 2531080 2101441 89331 -1603823 -1042639 1660992 4192277
46462 4192277 4172826 1774121 -262621 105623 1565459 1354395 -616300 -1536017 98839
46453 98839 2246478 2440699 1225346 736689 1381647 2067898 2647986 3644281 4086117
46444 4086117 2353984 -633989 -1712499 240696 2613078 2844796 1818386 1817662 2852719
46435 2852719 3182376 2426098 1798103 1615995 912835 -167789 240320 2874894 5431928
46426 5431928 5008887 1733370 -1460060 -2429037 -1874069 -1640827 -2272945 -3045553 -3577941
46417 -3577941 -4185912 -4733126 -4279977 -2425693 -392662 -61753 -1941211 -4421316 -5146806
46408 -5146806 -3192003 -28536 1786219 1180777 -351855 -688715 295966 1009709 828783
46399 828783 922739 1873326 2157208 366350 -2266332 -3323964 -2517130 -1660215 -1603713
46390 -1603713 -1227547 135784 1150648 374433 -1486631 -2335839 -1147648 1086532 2505651
46381 2505651 1981633 -74766 -2107930 -2787945 -2085847 -838551 387311 1397538 1730654
46372 1730654 939066 -506829 -1540247 -1821078 -1948025 -2409128 -3180418 -4174891 -5031219
46363 -5031219 -4719346 -2736952 -558439 -256335 -1619156 -2464044 -2049590 -2024542 -3279773
46354 -3279773 -4135131 -2972727 -678985 1093795 2218628 2849409 1843373 -1084336
46346 -1084336 -3148075 -1472130 2406483 4065469 2140656 -237782 -369713 663203
46338 663203 800899 512854 1417047 3047576 3338595 1775785 133614 -49223 591598
46329 591598 262036 -1681342 -3801542 -3882546 -1276717 1999403 2946353 627013 -2895735
46320 -2895735 -4989960 -5269033 -5315100 -5971162 -5983748 -3774285 104416 3140617 3544458
46311 3544458 2081127 830042 674409 836452 652659 581186 963713 881915 -626134
46302 -626134 -2693384 -3223244 -1475407 919697 1889157 1138005 -35156 -593366 -733817
46293 -733817 -1126508 -1837501 -2347359 -2376290 -2242096 -2317129 -2494470 -2454722 -2178452 -1818114
46283 -1818114 -1290446 -483831 269477 458542 41108 -689275 -1678256 -2836069 -3383348
46274 -3383348 -2494800 -743829 65080 -1128353 -3518893 -5428883 -5674156 -4009268 -1310760
46265 -1310760 608208 594332 -300943 -209974 631006 234928 -1602438 -2535257 -1367306
46256 -1367306 60436 297157 979240 3601627 5819674 4301968 15591 -2776198
46248 -2776198 -2273994 -642723 91482 349555 784587 833885 404860 427379 721454 -369474
46238 -369474 -3141588 -5417178 -5377277 -3684743 -1876320 -533928 57464 -514885 -1468090
46229 -1468090 -1099329 427653 659639 -1401571 -3316304 -2775682 -1139346 -1200991 -3001769
46220 -3001769 -4203897 -3496632 -1458731 969636 2775213 2619200 494763 -1210759
46212 -1210759 -523584 1090625 914767 -601175 -479196 1990899 4108482 3805425 2066303
46203 2066303 533657 -764739 -2119975 -2685467 -1717004 182437 2036211 3326222
46195 3326222 3267027 1138941 -1765380 -2604794 -719580 1096398 622832 -577585 -69693
46186 -69693 1363939 1392446 380207 528937 1515233 735240 -1923112 -3308247 -2032090
46177 -2032090 -734158 -1560780 -2639332 -1597153 188811 133171 -821685 153230 2484838
46168 2484838 2628277 -252652 -2926747 -3166213 -2554825 -2810541 -2652384 -584336 1792343
46159 1792343 1920646 74137 -1435606 -1578543 -898462 387473 2298751 3909656 4347478
46150 4347478 4266071 4505812 4348557 3162490 2440960 3487938 4240215 1783554 -2532946
46141 -2532946 -4256826 -2270647 -243721 -810520 -2089851 -1604445 -195478 209021 -167551
46132 -167551 -473804 -1582797 -4177405 -6343044 -5838110 -3442955 -1584429 -872007 -421025
46123 -421025 -384376 -1461810 -2670160 -2213804 -215671 1547318 2122147 1661247 111507
46114 111507 -2145299 -3268248 -2135520 -756904 -1705273 -3835904 -3805403 -1509740 -339079
46105 -339079 -1682441 -2967921 -2236219 -1004076 -828954 -363162 1795737 4058780 4315785
46096 4315785 3288009 2715047 2075842 70175 -2087920 -2071810 -348725 422798 -437940
46087 -437940 -1078846 -738695 -845570 -1876806 -2062287 -530183 737553 -71749 -1451380
46078 -1451380 -564817 2677077 5569813 6174985 5109730 3848766 2873979 1925924 924954
46069 924954 12434 -730833 -1219282 -1403330 -1500984 -1747100 -1886903 -1462562 -603375 148156
46059 148156 791928 1670468 2081135 418169 -3323879 -6274586 -5513503 -1822105 967372
46050 967372 458737 -1970913 -3700341 -4161686 -4579805 -5516283 -6069780 -5248080 -3142784
46041 -3142784 -728455 985887 1709853 2052261 2662151 3123434 2410594 626395 -782345
46032 -782345 -1081122 -1298274 -2266353 -2848408 -1596839 729272 2073788 1997204 1838943
46023 1838943 2195204 2192360 1471951 1022696 1445229 1961362 1856536 1530359 1354344 797840
46013 797840 -333114 -855309 430208 2871543 4368718 3478641 794519 -1484310 -1447986
46004 -1447986 421713 1341550 -528451 -3327672 -3626290 -1131503 959759 683621 -211156
45995 -211156 313275 1267994 784111 -547213 -1070599 -1277891 -2740083 -4746213 -5026824
45986 -5026824 -3552079 -2678650 -3278316 -3498065 -2084288 -408228 -21573 -314424 -69304
45977 -69304 263049 -570823 -2499258 -4223777 -4795503 -4086332 -2313027 -43461 1716561
45968 1716561 2185987 1443560 256364 -384082 173127 1317336 1214795 -941880 -3130516
45959 -3130516 -2810662 -828087 -492606 -2427242 -3429357 -1745055 -167610 -1397244
45951 -1397244 -3261560 -2128387 1015460 2140050 729591 185207 1740902 2676415
45943 2676415 1646913 1280815 3300648 4968599 3400778 328534 -907948 -701581
45935 -701581 -1605688 -3099839 -2364991 175146 551124 -2673537 -5861855 -5536529 -3095195
45926 -3095195 -2098802 -3165317 -4157312 -4025147 -3725056 -3743953 -3157890 -1567543 -208392
45917 -208392 -318586 -1431174 -2109779 -1838771 -1383491 -1369605 -1283703 -440589 428338 -346469
45907 -346469 -2838436 -4588040 -3519176 -1140088 -951824 -3605056 -5754868 -4618593
45899 -4618593 -1709722 -392952 -1174599 -1598382 -177480 1824693 2677997 2352929 1772088
45890 1772088 1244360 445950 -799792 -2310424 -3713791 -4665985 -5242654 -5828529 -6055546
45881 -6055546 -4572445 -1119478 1828804 1457536 -1444708 -3201094 -2344811 -1449544 -2649881
45872 -2649881 -3979793 -2520744 801905 2601318 2029215 1034874 102387 -2442632 -6142147
45863 -6142147 -7221476 -3823091 466499 1150063 -1081215 -1946684 -123281 1301130
45855 1301130 -100427 -2858947 -4412461 -4481140 -4111843 -3355072 -1780014 -103400 487220
45846 487220 23620 -599610 -1093634 -1627137 -1831334 -1386857 -1163806 -2183280 -3544200
45837 -3544200 -3026802 -147387 2734266 3027491 765059 -1705700 -2238237 -668359 1372038
45828 1372038 2026977 882362 -849594 -1947552 -2445862 -2716971 -2237110 -708884 305412
45819 305412 -934342 -3088902 -2747027 567048 3077854 2061904 -37236 663336 3531730
45810 3531730 4487876 2206031 -226791 -141011 1333997 1777530 882158 -98615 -488799
45801 -488799 -319248 323033 811004 79603 -1582584 -2072994 -136895 2626827 3853773
45792 3853773 3493531 3230103 3710518 4121636 3928829 3247384 1933587 152031 -555962
45783 -555962 1082429 3471468 3594953 1402319 188348 1698528 3492460 2845732 882759
45774 882759 405035 1412959 1725535 988803 869599 1550250 1253846 -304640 -1053262
45765 -1053262 -161142 349628 -853722 -1865427 -695677 1155553 921817 -1075870 -2068160
45756 -2068160 -952209 945128 2640197 4194079 4834265 3367192 876917 156997
45748 156997 1603715 2380046 879217 -645776 280167 2404984 2791134 1186077 -116464
45739 -116464 233131 1606899 3162769 4413008 4468424 2920491 1365090 1950734 4217957
45730 4217957 5294586 3666749 1060800 -65640 519848 1193414 783936 -335048 -997784
45721 -997784 -616922 52977 -302640 -1656188 -2124260 -246773 2733565 4023820 2392673
45712 2392673 -983164 -4296578 -6291815 -6072989 -3597110 -567028 732206 -168447
45704 -168447 -1845287 -3122580 -3750305 -3272631 -1419020 239304 -512200 -3035712 -4053778
45695 -4053778 -2394981 -888044 -1863935 -3396087 -2580466 -491163 -561548 -3028512 -4472985
45686 -4472985 -3061455 -1169797 -1674756 -3845571 -4540330 -2405498 541639 1309865 -864564
45677 -864564 -3827448 -4810597 -3192665 -620192 1381101 2788870 3682629 2948316 -145967
45668 -145967 -3860860 -5202219 -3234936 11954 1919736 1514333 -533409 -2908608
45660 -2908608 -4408444 -4586643 -3968858 -3268187 -2583893 -1783422 -1109891 -722895 -293596
45651 -293596 117384 -371806 -1901958 -2847927 -1910080 -363294 -276593 -1175329 -863972
45642 -863972 708484 1155951 -411754 -1954435 -1954946 -1603307 -1989141 -1650755 768538
45633 768538 3334167 3098870 556883 -983600 -170519 950762 635591 83323 1168668
45624 1168668 3298540 4240119 3293770 1965323 1471116 1040258 -501252 -2402459 -2716468
45615 -2716468 -1360847 -815850 -2755431 -5250250 -5052735 -2024089 748105 1129076 24729
45606 24729 -1043402 -2006084 -2830815 -2382956 -480339 734245 -487610 -2796006 -3768044
45597 -3768044 -3291184 -2696444 -1866526 -16036 1557149 730900 -1634612 -2378391 -830063
45588 -830063 275976 -593092 -1512724 -823823 7459 -667033 -1531630 -727553 575582
45579 575582 -46237 -2145272 -2940849 -1457241 450464 1101443 787168 376423 -31797
45570 -31797 -664079 -1536217 -2526125 -3120972 -2481301 -756910 387340 -131543 -1060008
45561 -1060008 -779183 -33744 -501649 -1465465 -730076 1335029 1762844 -424051 -2505282
45552 -2505282 -2064421 -115384 1199200 1697812 2198072 2432727 1878648 1192644 1017483
45543 1017483 612272 -719157 -2133337 -2747114 -3193612 -3983630 -3932934 -2334433 -1118296
45534 -1118296 -2220919 -4054105 -3618862 -1349050 -529464 -2070182 -3310951 -2562233 -1514683
45525 -1514683 -1910014 -2747426 -2520343 -1813804 -1692173 -1460129 -204740 928773 325741
45516 325741 -1171897 -1217006 550461 2025772 1700954 479402 99754 1084282 2711510
45507 2711510 4033604 4413436 3714263 2450820 1504165 1509462 2596817 4419797 5991932
45498 5991932 5833140 3142516 -981064 -4112771 -4698225 -3414081 -2106859 -1718336 -1720720
45489 -1720720 -1430429 -1108586 -1329547 -1854614 -2017426 -2014224 -2684352 -3810651 -3882189 -2198306
45479 -2198306 -67653 968042 937184 358722 -1201359 -3642639 -4670985 -2336636 1247328
45470 1247328 1783135 -1234183 -3449237 -1661572 1945017 3376308 2136437 542089
45462 542089 -394985 -1517879 -2893349 -3401361 -2789961 -1936741 -1084422 265336 1718541
45453 1718541 2145858 1617601 1370229 1576907 996645 -613322 -1582193 -872594 -77783
45444 -77783 -1446232 -4686838 -7104057 -6732908 -4364943 -2376520 -2154690 -2908436 -2849413
45435 -2849413 -1396708 41519 -233660 -2015324 -3413248 -3318883 -2734191 -3094681 -4060324
45426 -4060324 -4052629 -2721149 -1545850 -1539908 -1583311 -217547 1664459 1651452 -642791 -2712281
45416 -2712281 -2573736 -1350453 -1168132 -1996094 -2400144 -2226829 -2255686 -1961719 -262267
45407 -262267 1736842 1499667 -1161789 -3696849 -4597911 -4759074 -4496343 -2550733 644482
45398 644482 2210928 1453253 1842580 5461461 8585788 6623794 1106649 -2531590 -2543113
45389 -2543113 -1712122 -1629680 -1073337 -124497 -942251 -3266110 -3528387 -338034 2787775
45380 2787775 2366996 -375965 -2087549 -2000715 -1622656 -1679207 -1813933 -1995921 -2184091
45371 -2184091 -1699051 -610608 -578258 -2692992 -5587249 -7187339 -7211467 -6497146 -5163078
45362 -5163078 -3174437 -1617054 -1494454 -1954279 -1404909 172315 1520186 2084148 2184881
45353 2184881 1787769 671005 -506368 -703590 109092 1088330 1655495 1595562 747744
45344 747744 -290882 -7296 2060308 3946178 3504591 1506986 674867 1808973 2738280
45335 2738280 1410186 -1509648 -3653594 -3514403 -1586166 296366 554427 -655429
45327 -655429 -1683026 -1546015 -1145350 -1459303 -1571487 -187375 1612618 1438916 -588269
45318 -588269 -1536885 55750 1844338 1043575 -1609193 -3103476 -2284569 -791839 -341359
45309 -341359 -893404 -1568891 -1853609 -1508126 -435147 885694 1675764 1924943 2350910
45300 2350910 2964132 2700685 1146324 -379432 -520470 112750 14798 -616454 -75087
45291 -75087 1985268 3711789 3776852 3278823 3732005 4540055 4084963 2396534 898956
45282 898956 -41540 -1413496 -3380511 -4574476 -4053500 -2657373 -1874531 -2285763 -3419902
45273 -3419902 -4272351 -3834181 -2007422 12380 1183290 2097230 3687857 4942261 3948454
45264 3948454 1232444 -359448 223857 667034 -898905 -2798530 -2495318 -669888 -226622
45255 -226622 -2031473 -3856247 -3487566 -1249281 796475 1190436 428012 271842 1496905
45246 1496905 2567086 1656868 -229526 -196157 2047057 3177845 1125623 -1619674 -1796078
45237 -1796078 -223615 89245 -981395 -1020671 328399 833482 -162704 -551995 733518
45228 733518 1825095 1245061 617025 2212931 5460544 7664305 7244754 4947488 2569015
45219 2569015 1507591 1987854 2936474 3039364 2231626 1495568 1166230 654121 183947
45210 183947 1268471 4335071 6944077 5928881 1219449 -3570016 -4720189 -2063371
45202 -2063371 1269427 2437257 1565683 609790 439079 344632 182038 1068846 3124209
45193 3124209 4232213 2560347 -862961 -3622032 -4878881 -5175009 -4413632 -2271216
45185 -2271216 51497 853751 440845 383712 549475 -632859 -2905858 -3866449 -2476927
45176 -2476927 -393611 1029297 2596737 4881123 6208391 4821951 1620674 -902425
45168 -902425 -1559622 -1122823 -895521 -1602080 -3036809 -4149351 -4039714 -3046311 -2068989
45159 -2068989 -1074718 374910 1424476 683552 -1297821 -2436531 -2184898 -1850662 -1586060
45150 -1586060 45966 2611146 3024057 -21803 -3506497 -4042105 -2112079 -257713
45142 -257713 714655 1270522 942102 -570333 -1577205 -482420 1418761 1786932 752634
45133 752634 -34932 -685054 -2343995 -3974021 -3158127 -81788 2271228 2225042 1107284
45124 1107284 441175 -41554 -835839 -1270533 -722136 192284 375743 -690359 -2671611
45115 -2671611 -4168435 -3319680 -143141 2361491 1482597 -1253501 -1792005 851132 3332675
45106 3332675 2836181 604933 -512005 82569 855153 700195 -124792 -907626 -1260697
45097 -1260697 -1272450 -1285360 -1318659 -991449 -487675 -755180 -1736746 -1565163 768771 3094143
45087 3094143 2760858 737633 92728 967618 601157 -1515421 -2404950 -607716 1263620
45078 1263620 768125 -764823 -984038 -27544 942858 2017968 2906976 1681676 -1938146
45069 -1938146 -4391288 -2664096 979926 2056061 86373 -1768739 -1926411 -1267027
45061 -1267027 258101 3458472 6383678 5479865 1198519 -1640271 -587511 1119594
45053 1119594 42390 -2204367 -2159262 -275805 132318 -1713970 -3256893 -2864598 -1841958
45044 -1841958 -1752184 -2146113 -1895250 -1137276 -786369 -985523 -950181 -17156 1612115 2977899
45034 2977899 3078333 1750003 -120315 -1497000 -2190484 -2634119 -2925541 -2719211 -2050024
45025 -2050024 -1547313 -1540834 -1543551 -1132884 -925256 -1882348 -3622937 -4251603 -2457484 611949
45015 611949 2307798 1311007 -1081141 -2562054 -2059797 -185244 1756756 2599627 1768902
45006 1768902 -213401 -1867993 -2152285 -1660780 -1789116 -2768193 -3277576 -2157496 154343
44997 154343 2165066 2784242 1942841 240953 -1525214 -2655848 -2829222 -2259401 -1456948
44988 -1456948 -702967 213746 1515022 2586080 2080145 -469259 -3379306 -4217984 -2713888
44979 -2713888 -1157814 -1327869 -2223554 -1941368 -704190 -335288 -1244549 -1838380 -1059583
44970 -1059583 172798 574962 196736 -134480 10832 685605 1863058 3112038 3719925
44961 3719925 3584529 3252046 2828442 1853721 563803 8377 282978 -54005 -1808492
44952 -1808492 -3477203 -2936652 -102605 3085398 4676532 3932142 1521837 -505687
44944 -505687 -62506 2349865 3454373 1272854 -1713064 -1647416 1247763 3040702 1823589
44935 1823589 47226 220795 1132819 342078 -1540324 -1634052 818918 3105542 2392615
44926 2392615 -917145 -3697648 -3449358 -903731 709481 -757630 -3774857 -5020274
44918 -5020274 -3700921 -2324777 -2643321 -2917194 -910410 2018383 2327599 -781129 -4294170
44909 -4294170 -5343205 -4096266 -2308551 -1002434 -373964 -332562 -183310 914764 2392786
44900 2392786 2523522 1005723 -227047 196814 1100633 963461 478772 968176 1616701
44891 1616701 801907 -596172 -19800 2692028 4815136 4800601 4105788 3934750 2826359
44882 2826359 -594246 -4488541 -5832697 -4433635 -2661616 -1917033 -1643203 -1502803 -2103120
44873 -2103120 -3154502 -3005965 -990203 1214182 1668687 738181 528800 2153155 4362375
44864 4362375 4964554 3314938 1153407 585542 1284280 770990 -1865691 -3936072 -2568833
44855 -2568833 766721 1627252 -1545386 -5471801 -6558011 -4896875 -2618677 -708457
44847 -708457 633882 478392 -1487801 -3259818 -2595163 -181675 1379828 1168824 363147
44838 363147 -412297 -1681911 -3094954 -3256989 -2044373 -997553 -886436 -849424 -488818
44829 -488818 -752354 -1928237 -2764302 -2597662 -2453970 -2839679 -2322133 166448 3209060
44820 3209060 4730418 4612994 3939311 3015281 1900018 1576444 2567916 3451302 2810783
44811 2810783 1663780 1714281 2217491 1275860 -492086 -757368 225422 -344288 -2824804
44802 -2824804 -3769866 -1228082 1738876 1329088 -1556694 -3032207 -1806686 40376
44794 40376 1040100 1874042 2792204 2434018 333796 -1486327 -935066 1278626 2516193
44785 2516193 1370577 -1052255 -2680087 -2477930 -1044161 100656 -271533 -2100756
44777 -2100756 -3965434 -4168796 -2194988 808669 3112570 4027584 4242049 4452298 4218700
44768 4218700 2848718 1011888 308076 1070303 1778684 1216205 154676 87734 1183096
44759 1183096 2449317 3151123 2981119 1570708 -839850 -2773323 -3001724 -2322072 -2350756
44750 -2350756 -2834276 -1975355 482939 2483189 2566265 1715744 1334924 1114765 325486
44741 325486 -230291 534181 1595111 720350 -2282779 -4938099 -5092533 -3237563 -1324876
44732 -1324876 -334891 180132 756047 1151174 846144 -172456 -1484305 -2907113 -4565475
44723 -4565475 -6025025 -5943791 -3491939 -20753 1759482 638314 -1915094 -3780158
44715 -3780158 -4363959 -4206955 -3652520 -2980347 -2839287 -3190828 -2620260 -254494 2239909
44706 2239909 2388900 393016 -1056871 -575311 303491 -96692 -1109121 -1145027 -107405
44697 -107405 1018501 1970903 3135545 4224108 4393779 3516202 2264096 1006786 -435944
44688 -435944 -1853029 -2303898 -1170855 776212 1796657 847669 -1213255 -2414752 -1823005
44679 -1823005 -405461 646284 1585659 2995822 3829730 2572130 292497 139615 2895076
44670 2895076 5249312 4129743 925418 -761593 -254209 -34533 -1350495 -2441140
44662 -2441140 -1733443 -425041 -469852 -1458837 -1216577 936004 2991651 2767186 813437
44653 813437 -136241 1249797 2920566 2198293 -107862 -419952 2336926 4561284 2802476
44644 2802476 -1118228 -2467877 -175928 1952932 773952 -2224535 -3556234 -2265480
44636 -2265480 -306037 388043 -237513 -939031 -650750 492576 1281113 810724 -364888
44627 -364888 -994999 -734379 -88825 931218 2826464 5248870 6890176 7000022 6049249
44618 6049249 4826411 3854953 3549375 3771318 3469365 2099288 972885 1457060 2342063
44609 2342063 1401056 -603073 -458984 2378468 4387451 3067161 439843 -523175 -252309
44600 -252309 -743181 -1587977 -967565 762933 1583653 1170840 913079 1012482 317951 -1043187
44590 -1043187 -1499486 -812105 -692566 -2072124 -3728365 -4333953 -4181597 -4031842 -3609396
44581 -3609396 -2244107 -225584 1284928 1420039 410943 -590102 -605305 68251 271697
44572 271697 -355964 -992367 -1214520 -1669955 -2453298 -2346145 -880018 386833 260438
44563 260438 87959 1538577 3546667 3886555 2831790 2646024 4003457 5430639 5848214
44554 5848214 5194492 3133228 -23908 -1661079 482958 4061547 4233984 581437
44546 581437 -1957222 -310238 2474931 2375145 255663 -487796 476650 726976 -508490
44537 -508490 -1682593 -2092050 -2736600 -3947939 -4532468 -3766354 -2629929 -2526356 -3698025
44528 -3698025 -5164410 -5722008 -5076156 -4168735 -3884211 -3479600 -1525423 1355453 2480103
44519 2480103 805074 -1125810 -499137 1920567 3178982 2393528 1508787 2141196 3598097
44510 3598097 4206084 3218977 1197386 -493726 -505493 1277915 3284913 3716674 2428289
44501 2428289 805643 -31516 -294262 -895972 -2225254 -3561333 -3678721 -2272143 -542175
44492 -542175 231525 288145 513425 476472 -909182 -2856031 -3009080 -814419 1522472
44483 1522472 2223575 1924149 1527935 550817 -890106 -946177 962923 2242293 788805
44474 788805 -1293389 -530211 2783992 5284810 5328580 4081037 2655588 1291032 836157
44465 836157 1848515 2473714 483499 -2591099 -2800873 330232 2768489 1828237 -301660
44456 -301660 -481286 936584 1702787 1338930 857554 475811 -149008 -502748 18197
44447 18197 679805 348025 -741676 -1414420 -1161894 -305148 756457 1561788 1621555 1237959
44437 1237959 1402123 2131428 2066262 699151 -275805 728575 2505281 2351775 -337822
44428 -337822 -3200928 -3551108 -942849 2705205 4791219 4170449 2276533 1652493 2852620
44419 2852620 3646241 2063775 -797348 -2213661 -1272746 495692 1325449 650666 -1151997
44410 -1151997 -2943692 -3106991 -1250260 569659 -18424 -2442996 -3871588 -3181176 -2118146
44401 -2118146 -2055995 -2038737 -1296102 -1352534 -3483913 -5806636 -5596111 -3544745 -2784544
44392 -2784544 -3927826 -4177372 -1963672 530247 909922 62057 67842 701630 538904
44383 538904 52230 681656 1611194 558474 -2266194 -3946923 -3101621 -1570772 -1001679
44374 -1001679 -471356 1030006 2194799 1499923 -95776 -664938 -151911 333922 808003
44365 808003 1733489 1994504 39898 -3259667 -5163713 -4520927 -2757208 -1339257 -164089
44356 -164089 1169663 2205624 2381596 1714356 297513 -1777914 -3651446 -3943396 -2300069
44347 -2300069 23551 1416335 1217750 -152826 -1671227 -2386436 -2219125 -1840719 -1342290
44338 -1342290 98477 2322012 3129069 836526 -2834557 -4461255 -3261292 -1682783
44330 -1682783 -1619691 -2206977 -1925143 -873589 111538 1079229 2421097 3619066 3748725
44321 3748725 2947619 2559551 3629126 5420162 5802218 3726859 1109759 863708 2764751
44312 2764751 3284825 655858 -2213869 -1986392 136446 716088 -390459 -569434 535849
44303 535849 811421 217674 1059247 3150133 3176171 172388 -2628475 -3196884 -3736990
44294 -3736990 -5897613 -7058687 -4759173 -1422304 -729307 -1844851 -1442633 286588
44286 286588 32281 -2904989 -5247672 -4341392 -1103679 2031143 3798032 4338403 4417155
44277 4417155 4610538 4399593 2753598 359014 -459319 546227 182243 -3421785 -6902280
44268 -6902280 -5898120 -1575410 1053224 414681 -404662 335526 500668 -1173601 -2091215
44259 -2091215 -76682 2440038 1577104 -2360474 -5203777 -4197629 -772404 1765679
44251 1765679 1622263 -588439 -3089370 -4430514 -4142341 -2595383 -695670 417984
44243 417984 173684 -627035 -642049 -52749 -632791 -2950151 -4864080 -4173751 -1576702
44234 -1576702 623950 1622519 2035277 1861652 886147 297512 1256019 2319760 1153417
44225 1153417 -1329645 -1625810 1150961 3833321 3939682 2872270 2845659 3288421 2456372
44216 2456372 708717 -186894 30783 -60352 -1283360 -2867448 -3496003 -2467287 -157787
44207 -157787 2157857 3428289 3892387 4242474 3997055 2270455 109714 -120943 1714487
44198 1714487 2867702 1662961 -184406 -733867 -964762 -2454821 -3823050 -2493316
44190 -2493316 894523 2832425 1651349 -652798 -1612094 -1098229 -336105 18409 -49073
44181 -49073 -367782 -309411 802717 2330046 2525620 955522 -375700 496859 2645991
44172 2645991 3292368 1438638 -1002876 -1966632 -1683132 -1494773 -1400134 -378996 1225897
44163 1225897 1528352 -138700 -1783353 -1156098 1374135 3437769 3401471 1431658 -1346938
44154 -1346938 -3444869 -3494801 -1692930 -220016 -621849 -1370029 -10878 2738724 3573893
44145 3573893 1395473 -1152695 -1624598 -647247 229484 956894 1656987 1307245 -138011
44136 -138011 -440263 1628368 3548681 2571889 490003 1276501 4563474 5491135 1813923
44127 1813923 -2491804 -2629307 706766 2957440 2027600 177841 -55348 716882 283929
44118 283929 -1703921 -3278516 -2923508 -1607046 -1385991 -2524003 -3079914 -1566534 1021229
44109 1021229 2581235 2534747 2027401 1968663 2130225 2159169 2286038 2685751 2977112 2679290
44099 2679290 1563774 -481625 -3130121 -5114107 -5094111 -3370756 -1760284 -1319610 -1178172
44090 -1178172 -213353 1181863 1933813 1966242 1818775 1245008 -343007 -2283008 -3052961
44081 -3052961 -2432313 -1864009 -2202300 -2409796 -1252374 822615 2444887 3038932 2778033
44072 2778033 1756295 503699 469126 2231964 3703052 2188118 -1666120 -4132922
44064 -4132922 -3204077 -1025737 -494774 -1491973 -2156819 -2114189 -2183775 -2077531 -911186
44055 -911186 538141 561030 -593175 -883614 297499 1339875 1241427 889608 775896
44046 775896 -212709 -2425602 -3948076 -3205205 -1510902 -1157803 -2076912 -2241810 -658371
44037 -658371 1728904 3562766 4001367 2681423 288957 -1304070 -1032409 -368574 -1437830
44028 -1437830 -3760781 -4767045 -3503550 -1744085 -962226 -323956 1174642 2352770
44020 2352770 1401748 -1141825 -2814200 -2416770 -1230308 -793599 -800787 19298 1715355
44011 1715355 2806546 2056713 -162786 -2391910 -3382905 -2683777 -626760 1593289 2252491
44002 2252491 503312 -2405990 -4075164 -3410433 -1567174 -263205 56907 -35706 -175703
43993 -175703 -363047 -493253 -626980 -1307696 -2635031 -3333925 -1954789 921687 2863601
43984 2863601 2401722 655101 -487554 -837061 -1456347 -2360457 -2224492 -640765 726559
43975 726559 201627 -1535037 -2388123 -1784351 -1218743 -1710352 -2257144 -1671441 -677682
43966 -677682 -787174 -1809578 -2080401 -1006354 98522 -61474 -1198618 -2103602 -1867540
43957 -1867540 -240881 2142354 3636151 2859506 552220 -972692 -739771 -274243 -1170749
43948 -1170749 -2768141 -3333745 -2588789 -1777841 -1753717 -2090166 -1820102 -332478 2051237
43939 2051237 3852046 3482566 1165266 -1016064 -1678588 -1703001 -2304648 -2837072 -2065049
43930 -2065049 -609333 -174751 -837838 -1039633 -106129 1065413 1801401 2284099 2290341
43921 2290341 1243850 -119241 -132740 1087509 1291799 -551219 -2497596 -2645141 -2074606
43912 -2074606 -2742223 -3812971 -2727890 480273 2601731 1546063 -925363 -1872552
43904 -1872552 -970077 -163586 -600623 -1643677 -2562280 -3421204 -3958502 -3178846 -1060648
43895 -1060648 455214 -366304 -2363902 -2536083 67720 2992849 3527249 1885154 228343
43886 228343 -372062 -502126 -590975 -319562 152780 46050 -513656 -316515 821337 1110731
43876 1110731 -865107 -3763480 -4804589 -3106842 -546113 530625 -556625 -2814983
43868 -2814983 -4676193 -5078818 -4337473 -3913163 -4513133 -4757030 -2999744 -182027 1057904
43859 1057904 399181 657916 3440815 6269372 6125020 3998596 3080171 3654839 3241735
43850 3241735 1442058 825900 2273237 3168840 1911761 823463 2080420 3630732
43842 3630732 2334549 -901517 -2533602 -1534446 192519 1456043 2360024 2051902 -324020
43833 -324020 -2678911 -1891801 1036830 1666502 -1233915 -3648493 -2394809 459044 1328943
43824 1328943 31480 -1458052 -2408643 -2854709 -1939863 615232 3065008 3868902 3735751
43815 3735751 3634522 2892295 1304496 703422 1915105 2614572 1137291 -85353 1558442
43806 1558442 3869642 3052569 89408 -1001376 -193461 -1310932 -4809248 -6227468
43798 -6227468 -3285476 294218 357921 -2120526 -3640638 -3304340 -2612851 -2318302 -2075109
43789 -2075109 -1905827 -2034843 -2165204 -2119209 -2188523 -2200832 -1606845 -860709 -922719 -1145159
43779 -1145159 10003 1741227 1280901 -1555758 -3309327 -1938683 138170 239965
43771 239965 -260760 1260570 3789844 3888651 595875 -3702788 -6453446 -6655631 -4419343
43762 -4419343 -1172929 532436 -347581 -1700241 -1188108 352936 702144 90076 381602
43753 381602 1408766 1384664 603367 1334735 3688424 4773306 2987341 507398 116919
43744 116919 1471681 1943887 25782 -3088980 -4633744 -2793609 1034728 2910076
43736 2910076 717927 -2662143 -2622280 1078130 4104036 3611333 1531036 805365 1303169
43727 1303169 1365119 1036859 1360724 2006520 1973710 1632043 1886913 2085845 901394 -1176518
43717 -1176518 -2288682 -1904617 -1108410 -303805 1257780 3348724 4261307 3329087 2252865
43708 2252865 2673589 3685551 3228870 1176992 -548338 -724042 -197873 -241571 -815115
43699 -815115 -1209864 -1491466 -2161558 -2745125 -2032566 -60435 1280494 506906 -1283300
43690 -1283300 -1683959 -184313 1252164 1067112 147671 83436 554416 11732 -1506681
43681 -1506681 -2022897 -426208 1861392 2853642 2496094 2069350 1917373 1243226 -71772
43672 -71772 -988056 -1029866 -1213669 -2434225 -3755932 -3359398 -950575 1597762 2091807
43663 2091807 102234 -2739283 -4210974 -3391865 -1410860 -285851 -932264 -2514023
43655 -2514023 -3662353 -3690660 -2487247 -178371 2449535 3979236 3677198 2245170 597032
43646 597032 -1245465 -3093806 -3591943 -1968608 27717 74786 -1253531 -1416504 -294470
43637 -294470 -684770 -3492932 -5464257 -3781948 -522162 271686 -1600048 -2770624 -1738970
43628 -1738970 -729642 -1695123 -3350304 -3492361 -2194372 -1024867 -399324 518247 1833881
43619 1833881 2475114 1860733 844856 453558 373490 -496722 -2161227 -3172325 -2681164
43610 -2681164 -1996726 -2891465 -4738617 -5048249 -3180241 -1632855 -2502233 -4327659 -4223954
43601 -4223954 -1935855 351499 1450677 2019933 2291295 1569070 322778 230095 1290575
43592 1290575 1311641 -441428 -1420339 434158 3030399 2817049 2090 -1738433 -507934
43583 -507934 1539139 1653409 -88041 -1841452 -2674237 -2782226 -2198677 -801011 866979
43574 866979 1961452 2349438 2444388 2302195 1708874 980228 792566 1154609 1240458 358537
43564 358537 -1425188 -3556574 -5219752 -5379855 -3559794 -855870 712956 359169 -721952
43555 -721952 -1215226 -1330376 -1777952 -2118507 -1483776 -296307 322449 519027 1263632
43546 1263632 1963414 718066 -2309748 -3954882 -2027585 1433775 2835898 1722716
43538 1722716 483601 143337 -729586 -2669898 -3676393 -2307484 -422240 -928017 -3815564
43529 -3815564 -6229630 -6080227 -4071093 -2229530 -1736071 -2388846 -3136393 -2773811 -913563
43520 -913563 1338609 2289505 1595660 733437 1150091 2512494 3335221 2851358 1507873
43511 1507873 -71737 -1606738 -2557544 -2103917 -421148 745939 -174930 -2424987 -3492396
43502 -3492396 -2111616 119897 710638 -626491 -1660191 -475675 2068566 3285990
43494 3285990 1906749 -317336 -701751 1123937 2963764 3092982 2404100 2769161 4189867
43485 4189867 4903367 3979045 2370027 1244257 613907 96322 -147251 26705 137020
43476 137020 -194345 -603437 -764913 -1103697 -1952210 -2654288 -2419461 -1604202 -1229523 -1509032
43466 -1509032 -1670957 -1073130 142995 1321209 1747624 1197890 454457 720750 2014386
43457 2014386 2885647 2425955 1655390 1854484 2362834 1507645 -749146 -2692213 -3304327
43448 -3304327 -3321582 -3593041 -3687794 -2663823 -437760 1956683 3046057 2019633 -293661
43439 -293661 -2017617 -2476643 -2940354 -3995563 -3562880 138452 4555059 5026092 1326713
43430 1326713 -1478174 -85159 2446085 1604502 -1779548 -3150780 -1149859 954003
43422 954003 625389 -713697 -765012 233883 788521 752739 759781 418872 -925415 -2356093
43412 -2356093 -2268852 -956753 -479338 -1541583 -2144018 -393972 2478320 3438378 1611639
43403 1611639 -660768 -1053086 -95713 195536 -505479 -557334 973915 2825699 3128419
43394 3128419 1477646 -1048304 -3082694 -3633009 -2383218 -198134 1131094 520306
43386 520306 -1129019 -1884277 -937206 647379 1185215 -75792 -2461085 -4375441 -4411390
43377 -4411390 -2570488 -475424 117396 -862041 -1890559 -1866546 -1462527 -2053714 -3712344
43368 -3712344 -4969553 -4632354 -3264568 -2487209 -3057332 -4035460 -3860231 -2053744 114552
43359 114552 622191 -1327299 -4073689 -4717162 -2179716 1271146 2341814 321904 -2562306
43350 -2562306 -4129831 -4163720 -3278121 -1673761 184366 1266213 1506898 2225479 3771432
43341 3771432 4326898 2736141 921462 1161428 2292995 1549603 -601952 -861566 1593496
43332 1593496 3600258 2659524 35957 -2020822 -3275817 -4049627 -3366722 -759262 1991826
43323 1991826 3069450 3096284 3522855 4034681 3510773 2198323 971239 -301850 -1726005
43314 -1726005 -2096270 -774525 494666 20154 -826811 256643 2330560 2210695 -698452
43305 -698452 -3497720 -3851717 -2394531 -850542 -108035 -451797 -1529789 -1817576 -155869
43296 -155869 2071261 2362225 605607 -1155780 -2242313 -3740641 -5310953 -4970632 -2895896
43287 -2895896 -2063243 -3606502 -4632784 -2621765 728045 2298782 1866304 1225291 990156
43278 990156 736074 688072 884079 164855 -1635307 -2031140 932469 5134797 6840810
43269 6840810 5731524 4578521 4633453 4455944 3138626 1681967 872816 423899 565192
43260 565192 1965623 3633157 3446531 1501309 490031 1794012 3526231 3683368 2998888
43251 2998888 2983428 3041647 1715639 -340790 -881262 688689 2328110 1863370 -583734
43242 -583734 -2927434 -3250292 -1405000 1179376 3041618 3854582 4018997 3696751 2900940
43233 2900940 2044905 1389238 268710 -1905598 -4063959 -4372724 -2822241 -1392578 -1299543
43224 -1299543 -1643558 -1367815 -936251 -1095770 -1363699 -970885 -306403 -225811 -617182 -653247
43214 -653247 72530 1341420 2548594 2636250 793630 -2109617 -3892699 -3636601 -2692844
43205 -2692844 -2298063 -1708193 -21750 1666220 1794451 863011 329057 -174863 -2147190
43196 -2147190 -5100258 -6582356 -5519140 -3339379 -1344065 839522 3290652 4381680
43188 4381680 2973295 727382 368533 2039790 2986238 1136927 -2113436 -3455859
43180 -3455859 -1586607 1352210 2563788 1929844 1419471 1684270 1213393 -614210 -1797031
43171 -1797031 -609654 1455087 1791001 532026 -170157 87090 -227709 -1204922 -974622
43162 -974622 922808 2473419 2432886 2040565 2352718 2443872 1762237 1734831 3037703 3572613
43152 3572613 1583075 -1165875 -2045751 -1754102 -2720652 -4496281 -4283984 -1748510 265216
43143 265216 294111 242914 1674558 2991009 2052977 -501139 -2384011 -2585083 -1540832
43134 -1540832 242677 1982331 2101785 -189405 -3295774 -4735572 -3871220 -1943905
43126 -1943905 -60063 1355029 1698669 678922 -465735 -147922 962333 487504 -1903933
43117 -1903933 -3380457 -1875115 737389 1405970 530197 1177086 4022998 5933737 4406930
43108 4406930 1035387 -1019307 -1222161 -1310380 -1901945 -1870832 -884672 -289135 -918701
43099 -918701 -1780688 -1755913 -1286128 -1438797 -2271798 -3005824 -3062945 -2229235 -607584 880511
43089 880511 893951 -520675 -1484466 -782059 196169 -404288 -1600316 -572224 3061824
43080 3061824 6243960 6552663 5328839 5277961 6372939 6154236 3626393 824877 57289
43071 57289 1100309 2070147 2096814 1862321 1765641 892077 -1584290 -4651114 -6009001
43062 -6009001 -4518707 -1681909 -338982 -1806336 -4377771 -4903005 -2080916 2009324
43054 2009324 4094318 3242868 1413043 447550 -108874 -1325432 -2404656 -1799103 -238627
43045 -238627 -285152 -2437447 -3916796 -2573667 -175699 60376 -1968280 -3372919 -2566512
43036 -2566512 -1184058 -1249912 -2286730 -2385663 -1068034 250599 344999 -365873 -667741
43027 -667741 -162539 462082 496291 -53388 -858111 -1741617 -2304951 -1717536 165356 1794853
43017 1794853 1276448 -1167723 -3321255 -3825462 -3457959 -2976589 -1491531 1501289 3911596
43008 3911596 3184993 194534 -1326193 370446 2736279 2411291 -454911 -2696299
43000 -2696299 -2145446 233392 2053850 2111766 889116 -636598 -1790754 -2105883 -1504966
42991 -1504966 -920099 -1749646 -3872752 -5004423 -3274759 78554 2139630 2122678 1813457
42982 1813457 2170587 1920449 379865 -812419 -445225 -75411 -1422184 -3138071 -2791658
42973 -2791658 -883163 -34994 -821702 -1355895 -939523 -1161777 -2748428 -3928046 -3092800
42964 -3092800 -1154216 -13499 -58754 -286961 23008 629438 814252 234266 -373864
42955 -373864 192331 1534963 1225093 -1981173 -5480228 -5688730 -3006296 -1165026 -1719638
42946 -1719638 -2292104 -908172 1093385 1860204 1924277 2429089 2754269 2010740 1144739
42937 1144739 1489868 2596291 3345936 3914327 4787184 5097714 3973465 2592719 2871539
42928 2871539 4667413 6031412 5767619 4186237 1815159 -995675 -3338527 -3994591
42920 -3994591 -2618067 -122430 1861387 1773719 -592337 -3163628 -3264204 -883900 1191390
42911 1191390 1195014 386525 185422 -302757 -1942912 -3004596 -1703908 300398 40234
42902 40234 -2154571 -3373974 -2885389 -2818927 -4027209 -4595215 -3341088 -1926017 -2058585
42893 -2058585 -2773880 -2129731 -192760 1169780 727357 -899327 -2016686 -1380478 591464
42884 591464 2034162 1675414 494005 467608 1891824 3075748 2650510 1012725 -654116
42875 -654116 -1758959 -2436926 -2951739 -3082914 -1982377 693861 3296350 3281921 664651
42866 664651 -1415222 -1049779 -438709 -2066204 -4047292 -2769102 1096704 3320875 2519073
42857 2519073 1570435 2192769 2448217 1054402 159936 1627582 3821144 4452553 3833893
42848 3833893 3000302 1373949 -1087328 -2022861 -10093 2319047 1662635 -1147155 -2867747
42839 -2867747 -2836512 -2876338 -3439762 -3448075 -3256686 -4135987 -5052668 -3591278 -289995 1460576
42829 1460576 481757 -587474 213215 1257448 517726 -1037340 -1185473 369453 2335802
42820 2335802 3783525 4258590 3436845 2027929 1556432 2011100 1384954 -1117672 -3377402
42811 -3377402 -3611576 -3249464 -4143326 -4813208 -2723635 877682 2195373 808001 453329
42802 453329 2990150 5270903 4046636 957883 -254175 504055 128504 -2224715 -3529962
42793 -3529962 -1381702 2455630 4330060 3039285 569950 -642237 755 1360607
42785 1360607 1992425 1350643 -75734 -1696897 -3588375 -5775111 -7021291 -5618600
42777 -5618600 -1946397 953989 613462 -1711813 -2616157 -1087911 251200 -996424
42769 -996424 -3522349 -4084307 -1865530 680546 1278289 479644 253487 1187002 2160671
42760 2160671 2148052 1249641 178359 -375896 28552 1194717 2183094 2337121 2266953
42751 2266953 2919631 3809163 3378968 1315146 -779185 -1516909 -1324971 -1239373 -1340980
42742 -1340980 -1352988 -1634713 -2327292 -2483249 -1484338 -515009 -1003681 -2231153 -2316145 -1199625
42732 -1199625 -634856 -1224926 -1566138 -760579 216224 460787 678789 1648536 2554676
42723 2554676 2170404 794352 -185034 -126082 339889 238420 -805225 -2125168 -2340742
42714 -2340742 -831002 1059048 1298505 -238207 -1689930 -1871390 -1488696 -1312314 -899392
42705 -899392 42524 684914 553984 502052 1077301 1363176 653786 -172643 -325522 -690671
42695 -690671 -2118223 -3415467 -2910580 -1098741 67537 -139098 -838347 -1232130 -1228231
42686 -1228231 -897756 -451306 -126017 606805 2450533 4197101 3329823 85166 -1581569
42677 -1581569 650589 3574973 2947437 -254464 -1777150 -699480 135158 -593815 -1429717
42668 -1429717 -1980223 -3526233 -5377308 -4999893 -2662454 -1694998 -2935263 -3275177 -1381705
42659 -1381705 -282918 -1715363 -2343321 749897 4498118 4186223 744571 -940933
42651 -940933 594504 2357192 2513431 2470179 3036667 2646108 671213 -728546 181863
42642 181863 1921726 1998973 407495 -761016 -359480 659635 957751 589702 662428
42633 662428 1572757 2195393 1299468 -511528 -1199261 211175 2539423 4210253 4886361
42624 4886361 4639073 2875094 -494220 -3666954 -4369780 -2536637 -438620 -158094 -1644235
42615 -1644235 -3084172 -2709944 -657675 667660 -1023888 -4714406 -6615861 -4820582
42607 -4820582 -1879318 -1214074 -2431780 -2451664 -361124 1527308 1318854 -355629 -2247569
42598 -2247569 -4011689 -4926181 -3455183 278412 3295018 3014531 773486 194364 2477755
42589 2477755 5113379 5305690 3062622 418934 -1086176 -1331128 -871680 -254303 170661
42580 170661 338815 289644 -211891 -1341635 -2348061 -2005835 -573138 -143979 -1791874
42571 -1791874 -3408808 -2307983 654850 1998582 620500 -889484 -613483 -54091
42563 -54091 -1033483 -2628949 -3366909 -3972034 -5244920 -5462778 -3153892 -572316 -651663
42554 -651663 -1982248 -1086223 1331078 1316271 -1353535 -2492852 -698106 254718 -1728745
42545 -1728745 -3040812 -514196 2891307 2753664 130696 -809998 269409 165054 -1880271
42536 -1880271 -3162629 -2349322 -1320389 -1680171 -2648393 -3180134 -3608397 -4272103 -4401381
42527 -4401381 -3232475 -1100453 966020 2022534 1770264 961294 660745 684347 19580
42518 19580 -716871 635058 4035220 6067742 4524249 1761738 957442 1456735 1064216
42509 1064216 604453 2053858 3872163 2974241 429701 115568 1887244 1502382 -1903946
42500 -1903946 -3846508 -1935091 -287 -1609395 -4005775 -2764178 793703 1648778
42492 1648778 -1219205 -3819789 -3300805 -1041281 674001 1567306 1990899 1433912 -81631
42483 -81631 -934079 192232 2300620 3237496 2320207 808198 58225 167965 494987
42474 494987 657406 577947 151416 -434564 -462060 307336 681904 -548297 -2220916 -1653571
42464 -1653571 1399224 3649093 2626095 227244 -317997 596696 95269 -1997660 -2774999
42455 -2774999 -1227821 76782 -529751 -1037252 531635 2431012 1909145 -312128 -1236057
42446 -1236057 -213292 544592 -234145 -1267914 -1307154 -1089024 -1762111 -2885695 -3084120
42437 -3084120 -1841746 177815 2015232 3011161 3068134 2870966 3279526 3895298 2955450
42428 2955450 -259983 -3431905 -3278437 158268 3123139 2982573 1581209 1928042 3200704
42419 3200704 2121379 -1295303 -3115471 -1424458 752189 457746 -516285 968344
42411 968344 3779012 4206074 2032781 817314 2222910 3918283 3889211 3372919 3931944
42402 3931944 4390195 2863980 137968 -1171501 -137242 1427008 1331072 -506725 -2087854
42393 -2087854 -1693477 -169177 -222829 -2858923 -5464559 -4818144 -1293965 1750414 2420462
42384 2420462 2042757 2414005 3454154 4222431 4451452 4208964 3406092 2404447 2037957
42375 2037957 2515507 3206447 3611266 3483653 2248579 -133185 -1886849 -947130 2042804
42366 2042804 4150159 3844004 2333757 996416 -193447 -996984 -122685 2583739 5097858
42357 5097858 5751222 5248462 4971648 4845747 4157242 3072526 2059698 984997 -174272
42348 -174272 -909227 -1271349 -1946870 -2494629 -1342875 1351028 2793650 1123623 -1735398
42339 -1735398 -2561415 -850822 1403418 2745446 3184142 2997995 2508591 2533117 3452694
42330 3452694 4179409 3347975 1185802 -827678 -1698849 -1507534 -955177 -1062831 -2402672
42321 -2402672 -3913007 -3670079 -1629574 -24951 113884 954998 4475335 8716205 9992118
42312 9992118 7928988 5598376 4919892 4626623 3205911 1427716 813135 1231182 1356213
42303 1356213 662775 -187926 -652155 -1102811 -2085941 -3151489 -3006011 -1194519 870104
42294 870104 1539110 1399743 2602663 5296260 6536044 4124864 146385 -1325751 615396
42285 615396 2980377 3279834 2451938 2566949 3430345 3153854 1307332 -365784 -600516
42276 -600516 -449519 -1508776 -3235385 -3429179 -1226546 1673461 3022020 2221138 289923
42267 289923 -1227102 -1052180 741854 2006755 515280 -2672020 -3829985 -1614187
42259 -1614187 843747 581752 -943137 -776228 674009 1029981 465352 1050703 2656219
42250 2656219 3334920 3094550 3463874 3877725 2514910 311350 -136124 639491 -34681
42241 -34681 -1315155 461615 4872519 6980106 5225069 3862963 5348102 6283909 4117566
42232 4117566 2068998 3247612 5069059 4321444 3164535 4749084 6875346 5890350
42224 5890350 3732380 4909276 8647230 10155335 8371344 6720901 7024675 8067567
42216 8067567 9657594 12772712 15767134 15511889 12629226 10957777 11468811 11287159 9264767
42207 9264767 7791926 7943159 7404615 5094586 3764661 5430666 7400142 5869506
42199 5869506 1528854 -1301220 -274877 2620841 4285057 4234007 4265506 5341084 6301001
42190 6301001 5992110 5143945 4839724 4531852 3663896 3893759 6633126 9427015 8761126
42181 8761126 5945929 5515947 7813957 8637237 6874590 6269041 8066337 8638359 6858558
42172 6858558 6808827 9929269 11834884 10868246 11949569 17115232 20650806 19497988 19547605
42163 19547605 24581801 28618401 27715120 28976747 37635150 46627427 51546133 63024409
42155 63024409 88280413 115959623 143233903 201846499 318025245 448117621 498366968
42148 498366968 426778639 293354815 188336684 139002949 112906624 85418102 63881481
42141 63881481 55081568 48553802 37933856 31313944 32345852 31516397 23657508 17069983
42133 17069983 17806210 19400279 15638642 10970336 10654348 11246298 8422907 5363120
42125 5363120 6132108 8051148 7209172 5418984 5893066 7321141 7255958 6573561 6355965
42116 6355965 5077258 2591097 2089327 4648656 6779501 6694168 7668619 11447105 13748517
42107 13748517 10858209 5888163 3660269 3571504 2537923 1338925 2641313 5291482
42099 5291482 5715446 3489340 1327050 768952 1338267 2667766 4390584 5210189 4702044
42090 4702044 4535249 5564264 5646663 2949948 -517287 -1509545 -35134 1487203 2049167
42081 2049167 2350759 2636833 2857870 3875566 6142508 8217303 8654169 8170811 8021479
42072 8021479 7716311 6461144 5249975 5118578 4826075 2969991 1196838 2405212 6409196
42063 6409196 10053815 11265890 10618622 9247377 7623384 6343609 5935852 5657087 4261552
42054 4261552 2134420 1104582 1981961 3640774 4677284 4804412 4510458 4300922 4284840
42045 4284840 3828692 2001161 -880281 -2830126 -2434615 -887612 -421091 -1154951 -1169072
42036 -1169072 261146 1245071 -103355 -2794776 -3954021 -2380347 31661 820416
42028 820416 -11005 -582450 -316740 -706406 -2272298 -2725972 -32860 3963098 5415281
42019 5415281 3493798 1047220 280920 358792 -191700 -1194738 -1954890 -2554923 -2885540
42010 -2885540 -2189293 -634061 383693 466140 890237 2057527 2382085 1117045 176597
42001 176597 1266782 2971560 2815306 903547 -570026 -432043 773761 2293848 3505997
41992 3505997 3517353 2221589 1175244 1819544 3378666 3935801 2940459 1321927 -49231
41983 -49231 -608601 209150 1894208 2393973 501018 -2066670 -2775058 -1718390 -1052840
41974 -1052840 -1688396 -2642089 -3185004 -3397275 -2793642 -648981 2171919 3732114 3590187
41965 3590187 3016743 2578485 1580493 199313 -102645 874704 1123940 -770818 -3437666
41956 -3437666 -4529446 -3499184 -1473824 460344 1651430 1595864 594214 -15414 504049
41947 504049 1047105 280587 -1155007 -1588413 -1064805 -1257142 -2392358 -2275758 459052
41938 459052 3674476 4129346 1790701 -306788 -405271 4668 -759359 -1757118 -1313351
41929 -1313351 -52862 227523 -212841 465903 2171474 2476910 292474 -2386546 -3375220
41920 -3375220 -2890087 -2033679 -671717 1439656 2965021 2529666 1062382 579196 1102076
41911 1102076 788012 -818825 -1486545 967634 5555316 8579042 7282826 2900867
41903 2900867 -306329 438904 3276500 4099741 1729389 -1084884 -1917172 -1517475 -1431632
41894 -1431632 -1264359 -233904 590345 45859 -642305 242731 1733406 1719378 699651
41885 699651 803180 1632424 737363 -1563868 -1715782 1482181 4378175 3679260 1201115
41876 1201115 643623 1841184 1565125 -1034053 -3182834 -2739521 -825400 549978 1171051
41867 1171051 1624678 1333129 -597518 -3235328 -4275544 -2862694 -774504 -209414 -1160905
41858 -1160905 -1805939 -1121571 -86550 -74066 -927747 -1316500 -579834 554907 1076486
41849 1076486 861295 469879 189743 -195440 -648827 -444039 905074 2457766 2559942
41840 2559942 1107878 22542 565782 1253995 -24668 -2603893 -3796719 -2728480
41832 -2728480 -1047161 291260 2179445 4467979 4807285 2138112 -1047167 -2050758
41824 -2050758 -1547477 -1535834 -1688072 -536310 1268123 1978330 1935854 2584598 3195406
41815 3195406 2012730 176371 773933 3790561 5612604 4245447 1650188 -21981
41807 -21981 -1124472 -2114835 -1791982 105568 1328214 303763 -1412802 -1938358 -2069091
41798 -2069091 -3230179 -4481838 -4144187 -2823057 -2231334 -2215249 -1475869 -318334 -226295
41789 -226295 -1305995 -2356355 -2967110 -3501822 -3504714 -2181301 -126447 1324443 2150279
41780 2150279 3265346 4486415 4744469 4028124 3295195 2726154 1851618 1038734 894416
41771 894416 550561 -1251443 -3543870 -4006792 -2579060 -1680008 -2363872 -2850340 -1821760
41762 -1821760 -660709 -927330 -1776578 -1716507 -1189785 -1357582 -1658660 -854177 263162
41753 263162 -488511 -3400252 -6122339 -6442268 -4380430 -1337486 1416867 2984208 2883574
41744 2883574 1662863 679415 583140 593506 -140750 -1075858 -966139 324773 1604155
41735 1604155 1964299 1827640 2075742 2723147 2956241 2205370 717305 -814858 -1825089
41726 -1825089 -2181171 -2259694 -2619598 -3295694 -3597059 -2981539 -1869792 -1056737 -595922
41717 -595922 -24315 497756 246121 -824859 -1880034 -2370960 -2385036 -1758908 -223172
41708 -223172 1243013 913815 -952213 -1643198 268676 2295365 1217516 -2177807 -4029936
41699 -4029936 -2708120 -625824 -391005 -1456333 -1623452 -196452 1621864 2482296 1980693
41690 1980693 572065 -863315 -1646763 -1734559 -1262707 -51634 1617973 2312512 1036085
41681 1036085 -746166 -597594 1175514 1459066 -1218243 -4299726 -4665024 -2637850 -682534
41672 -682534 436862 1885806 3895132 5054938 4542011 3185912 2026099 1319833 1231442
41663 1231442 1943697 2564986 1453520 -1399488 -3519982 -2822803 -624715 -205246 -2404536
41654 -2404536 -4279934 -2907809 768490 3327825 3392942 2771512 2933420 2661097 589612
41645 589612 -1824129 -2209185 -1089535 -1033805 -2298451 -2320619 -90386 2004693 2112849
41636 2112849 1927651 3532725 5424314 4584846 1315684 -999272 -617562 770359 1149937
41627 1149937 674173 398294 478789 572664 659100 602111 -84598 -1323585 -2158625 -1964881
41617 -1964881 -1292647 -996540 -1118119 -1112441 -730411 -233026 31315 -40794 -363967 -977416
41607 -977416 -2118105 -3604867 -4318571 -3181701 -831024 811738 1141947 1755385 3848408
41598 3848408 6084827 6394369 4761267 2691221 927981 -584454 -1400358 -1168919 -816111
41589 -816111 -1220180 -1467000 -442246 775573 530138 -363011 -112258 351511 -1180799
41580 -1180799 -3401701 -2471498 1548546 3776480 1754472 -671197 626051 3915089
41572 3915089 4918277 3314469 2122812 2652354 3851677 5285531 7128787 8107778
41564 8107778 6807879 4407282 3098481 2558896 1117075 -396998 407410 3022519
41556 3022519 4340654 3680137 3706736 5484771 6361656 4448195 1949622 1736824 3016991
41547 3016991 2900256 706076 -1554094 -2039727 -659155 1444895 2588007 1539181
41539 1539181 -878209 -1977472 -267944 2409165 3063035 1221489 -868970 -1181346
41531 -1181346 323881 2594165 4721651 6056317 6159642 5180031 3795758 2469603
41523 2469603 1063672 -615288 -2191462 -2982821 -2836930 -2349327 -2060037 -1768449 -1072570
41514 -1072570 -258534 94675 149846 336782 -65361 -2248411 -5355681 -6540014 -4612582
41505 -4612582 -1798995 -382305 453394 2304503 3972527 3230737 969530 153822 1103294
41496 1103294 1277460 -203006 -1348024 -1121406 -954521 -1455567 -1051925 640317 1393975
41487 1393975 181981 -672353 624483 2142678 1449245 -518355 -1525791 -1636367 -1766099
41478 -1766099 -896807 1794044 3867321 2613166 -86563 -20802 2757471 3864548 1387608
41469 1387608 -1416888 -1395752 237411 819107 431411 762572 1807506 2229192 1920711
41460 1920711 1966342 2454957 2175561 658612 -730507 -250586 2157032 4677429 5462357
41451 5462357 4391378 2696738 1107213 -689460 -2506770 -2881666 -877391 2223402
41443 2223402 4238858 4475721 3685858 2415771 828850 -385068 -454780 348586 1189199
41434 1189199 1763720 1804493 440356 -2317164 -4338222 -3599362 -995329 1050304 1983622
41425 1983622 2800577 3199144 2086487 601708 1264655 3773620 4955205 3609431 2076325
41416 2076325 1909054 1454968 -542130 -2237312 -1906646 -1016363 -1416305 -1930593 -692703
41407 -692703 1151160 1250396 55922 -186203 647310 889596 652152 1710274 3824702
41398 3824702 4332334 2145825 -325509 -349671 1680457 2979671 1634350 -1450789 -3450298
41389 -3450298 -2502465 103549 1396118 634411 125615 1295965 2209379 895906 -1086258
41380 -1086258 -1239102 -457299 -1302425 -3205482 -3320133 -1556536 -594863 -895380 -72782
41371 -72782 2105757 2596318 387683 -1380572 -652078 341668 -269034 -232763 2366965
41362 2366965 4502299 2545938 -1378979 -2328650 -193668 729963 -838959 -1498945 486907
41353 486907 2169139 1031085 -1016267 -1302217 -847623 -2073814 -4132029 -3767029 -125318
41344 -125318 3918165 5297796 3832945 1494930 -138854 -1128921 -2309770 -3601365
41336 -3601365 -3589165 -1271800 2105081 4023307 3607910 2434998 2094268 2196405 1548209
41327 1548209 227521 -599119 -337002 533333 1306561 1654177 1578149 1341428 1317216 1558082
41317 1558082 1706763 1527521 1193217 883961 544141 258441 424279 1257844 2384291
41308 2384291 3033702 2515212 819370 -857066 -792849 1192774 2966178 2627235 1279945
41299 1279945 1522919 3473413 4533971 3416590 1959320 1956873 2508202 2076917 1181459
41290 1181459 1057558 1203065 392085 -1046072 -2081123 -3047800 -4546975 -5166250 -3004694
41281 -3004694 774426 2618128 1199737 -960313 -1147368 339284 1567056 1779477
41273 1779477 1515937 1066999 187447 -973950 -1524012 -576452 1639832 3449778 3160285
41264 3160285 1250103 185918 1203283 2464054 1839483 256214 107838 1256743
41256 1256743 1327329 -356813 -2050668 -2936672 -4085700 -5359396 -4561421 -1188359 1805908
41247 1805908 1970949 700722 472621 981690 620441 -49354 608070 1850364 1417907
41238 1417907 -463570 -973177 990583 2926690 2086001 -1123905 -4077839 -4968002 -3964218
41229 -3964218 -2249714 -823453 33744 559694 773375 172456 -1433018 -3093576 -3359941
41220 -3359941 -1672486 1215686 3818346 4571219 2677821 -847849 -3508305 -3631036
41212 -3631036 -2042333 -693766 -160789 446261 1482731 2030241 1367465 191146 -150553
41203 -150553 724932 1728785 1484184 32459 -1013981 -557135 231986 -560650 -2566067
41194 -2566067 -3417761 -2339249 -1312057 -1703928 -1943087 -257487 2185370 3089154 2484949
41185 2484949 1914784 1380725 -36749 -1244001 -7622 3127266 4775040 3305109
41177 3305109 978929 470065 1418758 1789115 1015923 327938 849399 2446402 3934474
41168 3934474 3995551 2565381 1386500 2148634 4008454 4256862 1740971 -1663020 -3381876
41159 -3381876 -2737853 -825636 946354 1627159 1090256 225540 64079 513494 716106
41150 716106 535675 635916 1246510 2050315 3006881 3838744 3142246 35159 -3438741
41141 -3438741 -3933950 -1223462 1353330 1503567 585341 593268 1107014 928166 560303
41132 560303 920702 1179160 109550 -1460371 -1642279 -292325 964566 1077273 440875
41123 440875 -194686 -414282 -66693 504399 578245 114185 -48346 306470 201453 -709964
41113 -709964 -1112082 -112048 970176 563803 -498295 -218529 1391891 2363856 1657344
41104 1657344 175934 -955096 -1431458 -1103472 119066 1480849 1856689 1280576 862943
41095 862943 993258 787520 -277313 -1172625 -456899 1785819 3681310 3381085 1124437
41086 1124437 -806567 -594121 1037194 2100523 2237281 2726659 3673281 3401404 1454885
41077 1454885 4165 804248 2646641 3599914 4025751 5224214 6588236 6598565 5575255
41068 5575255 4877232 4178499 2228861 -180584 -797690 625623 2030097 2251122 1990217
41059 1990217 1496153 42834 -1741731 -1729242 531391 2788709 3270373 2747044 2365444
41050 2365444 1644223 85236 -1152090 -892430 207600 1037366 1936810 3588152 5127597
41041 5127597 5121682 3728822 2307665 1354973 300707 -891024 -1291786 -386710 954972
41032 954972 1240120 -55415 -1683645 -1750975 -164784 621212 -1428385 -4617938 -5161990
41023 -5161990 -2398395 -16284 -936042 -3194873 -2959128 -49958 2065557 1148418 -1378195
41014 -1378195 -2949545 -2783535 -1742118 -805829 -534662 -1203640 -2696368 -4421455 -5524387
41005 -5524387 -5207527 -3315780 -963827 102343 -465125 -826808 763764 3315673 4015829
40996 4015829 1746001 -1567909 -3399478 -3292546 -2518637 -1967570 -1335823 -189452 1002141
40987 1002141 1299454 548813 -281243 -320859 -16301 -447421 -1519578 -1847966 -820105
40978 -820105 324143 358514 83020 1143140 3382661 4951699 4980492 4503288 4337257
40969 4337257 3702107 1996535 669283 1702639 4635807 6612675 5640882 2735986
40961 2735986 399961 -161275 384303 1082188 1790221 2550406 2697550 1358311 -1169231
40952 -1169231 -3075596 -2541130 353546 3438262 4375631 2749282 134308 -1731977
40944 -1731977 -2414796 -2353755 -1646876 -25294 2075089 3290003 2684203 966804 -173427
40935 -173427 90529 898418 817046 -435146 -1669346 -1762824 -1178739 -1265332 -1993027 -1543581
40925 -1543581 906291 2979299 1474846 -3207649 -7003403 -7089369 -5000378 -3821075
40917 -3821075 -4069530 -4087116 -3194395 -2269037 -1728968 -1066067 -413727 -726160 -1997643
40908 -1997643 -2755231 -1845075 321975 2632003 4386686 5269406 5142137 4301880 3354740
40899 3354740 2660814 2302981 2323296 2371562 1617126 -96010 -1524703 -1461784 -260006
40890 -260006 1189306 3017873 5302030 6522532 5422588 3586340 3328982 3540993 1156209
40881 1156209 -3079406 -4422577 -1092291 2604650 2592179 926181 1923974 5089054 6092674
40872 6092674 3471113 247598 -840867 -207325 676785 1153512 690803 -960284 -2293215
40863 -2293215 -1186143 1744355 3240819 1785999 -291437 -283295 1355304 2547851 3023838
40854 3023838 4068981 5617320 5797447 3729309 1261265 923685 2661003 3646368 1733753
40845 1733753 -1612183 -2891921 -1006482 1247363 763334 -2084264 -4437028 -4705324
40837 -4705324 -3717959 -2746253 -2181721 -2048307 -2169467 -1710472 -4303 2055717 2834094
40828 2834094 2177198 1284832 391262 -1423592 -3662989 -3888393 -1065231 2300435 3084248
40819 3084248 1509729 448263 1372525 2764352 2564170 786184 -798353 -839841 201482
40810 201482 655551 -478268 -2240656 -2541875 -406038 2920357 5220228 5270526 3482146
40801 3482146 1251631 81218 737611 2551906 3712183 2860193 555681 -1089067
40793 -1089067 -394126 2219219 4547686 4747935 3216791 2026662 2363629 3146706 2736453
40784 2736453 1379224 912334 2237906 4163692 4864398 3597549 884905 -1968221
40776 -1968221 -3212520 -1628724 1965330 4731482 4258988 1076183 -1712755 -1490520
40768 -1490520 1243838 3449694 2823128 169825 -1970680 -2575152 -2701831 -2860976 -1869032
40759 -1869032 631246 2490664 1806449 -165435 -1156909 -1622742 -3404314 -5533382 -4954038
40750 -4954038 -1534969 1252331 1505828 1271264 2344573 3103187 1731285 -285365 -588082
40741 -588082 353078 722763 686107 1357904 1995003 1285759 333182 1204058 3161011 3473527
40731 3473527 1778435 630153 1495568 2931720 3233227 2454548 1156904 -666572 -2599767
40722 -2599767 -3524200 -3083502 -2046707 -901183 433596 1430170 1319532 830546 1605312
40713 1605312 3526164 4637269 4180603 3558214 3614951 3263914 1868985 746094 838942
40704 838942 927712 -91701 -910405 141450 2066630 2477357 1178560 317093 1095238
40695 1095238 2154709 1601696 -475296 -1964126 -898070 2284622 4739919 4203802
40687 4203802 1919743 1275642 3304610 5344215 4935833 3004435 1691922 1015662 -109809
40678 -109809 -1059457 -438998 978525 1113640 209374 798281 3595811 6004788 5752885
40669 5752885 3912416 2875490 2881152 2269937 429196 -1161689 -953229 565150 1328032
40660 1328032 205488 -1357844 -850215 2117971 5165816 6253437 6161309 6597801 7085696
40651 7085696 5843680 3150566 1347467 1348953 1523131 627595 -405705 -590930 -680016
40642 -680016 -1456663 -2016871 -1359646 -276019 8906 -108529 383467 1093905 1077707 917459
40632 917459 1960286 3864817 4847068 4317317 3506368 3321933 3214789 2527627 1534796
40623 1534796 646759 -232237 -1057032 -1373678 -1164689 -1069048 -1374700 -1668335 -1815946 -2288734
40613 -2288734 -3017864 -2943090 -1494914 221723 622608 -393675 -1473136 -1569503 -968071
40604 -968071 -569628 -739847 -1114021 -1289588 -1360725 -1597268 -1833218 -1705749 -1497509 -1900682
40594 -1900682 -2607096 -2265885 -733996 -88824 -1721855 -3493099 -2313242 824553 1556731
40585 1556731 -1434916 -4073340 -2831124 48749 333631 -1527256 -1592696 753194 1780975
40576 1780975 -203756 -1831119 -126552 2434328 1505622 -2499359 -4802426 -2647167
40568 -2647167 1741378 4767627 5429174 4800241 3621641 1967407 350052 -305435 300232
40559 300232 1613667 3001687 4212095 5088008 5363155 5000264 4441604 4149543 3981012
40550 3981012 3487391 2942504 3396800 5124461 6592947 5990583 3534375 1093693 -388287
40541 -388287 -1614290 -2858379 -3027229 -1716563 -401695 -39359 922133 3998470 7325425
40532 7325425 7585409 4895823 2900160 3574620 4692525 3592219 1093264 -89723
40524 -89723 807688 2208985 2654661 2027946 1003477 608304 1702982 3720961 4626227
40515 4626227 3316397 1309315 740372 1495878 1928655 1738029 2141972 3313794 3688410
40506 3688410 2368681 677237 523722 2214327 4503015 6074139 6483864 6163336 5784975
40497 5784975 5310803 3878463 1220561 -1273495 -1987604 -1241971 -654150 -490630 578636
40488 578636 2702879 3743173 2128388 -607720 -1753859 -1087910 -861409 -2250324 -3541017
40479 -3541017 -2573467 146269 2020242 1770752 997132 1837562 4150755 6149869 7087742
40470 7087742 7553324 7320896 5298778 2387919 1819966 4746808 7658045 6877120 3981405
40461 3981405 3396598 5575510 6517816 4151869 1177733 511289 1580007 2784267 4204518
40452 4204518 5647081 5140384 2235618 263771 2077904 5434941 5970245 3430149
40444 3430149 1509435 2222933 3779833 3936532 2549435 628380 -716821 -307903 1920937
40435 1920937 3892382 3734225 2804366 3803220 6137716 6262519 3045311 -311355 -761676
40426 -761676 884696 2136273 2356178 2482515 3004594 3817242 4789624 5254673 4183973
40417 4183973 1905920 383179 858200 2502063 4107044 5479374 6266268 5334694 2770238
40408 2770238 816327 1094229 2230549 2034022 845728 707849 2001647 3054735 2885962
40399 2885962 2437729 2800957 3622121 3793717 2958043 1924797 1825768 2845407 3805238
40390 3805238 3481867 2343002 2128938 3489875 5021610 5058451 3496153 1480527 312942
40381 312942 956402 3358455 5842807 6510407 5643540 5236579 5919474 6389646 6278056
40372 6278056 6837914 7761666 6543043 3036152 1370559 4182168 7777581 7132357 3593401
40363 3593401 2716049 5481449 7100629 4978406 2541198 3260743 5412306 5683741 4580885
40354 4580885 4825140 6553738 7483592 6724735 5550670 4930384 4720278 5093596 6661447
40345 6661447 8961029 10381360 9997690 8592085 7688006 8125171 9491038 10530936 10318331
40336 10318331 9200444 8145842 7247635 5913042 4624072 4922295 6909652 8375894
40328 8375894 7716739 6390379 6827539 8902288 10383345 10312941 9889324 10039180 10095973
40319 10095973 9412293 8689597 8843518 9597542 10037174 9873642 9473479 9155763 9043077
40310 9043077 9161839 9118706 8061518 5654127 2981715 1840059 2927675 5100960 6619727
40301 6619727 6867294 6598563 6714221 7194405 7247597 6194160 4203002 2487919 2614729
40292 2614729 4863439 7190625 6897345 3940950 1503720 2200741 4736783 5905404
40284 5905404 5078130 4463157 5113880 5399921 4248876 3282478 3984723 4843305 3694841
40275 3694841 1528250 1193510 2891670 3796080 2432031 796977 1104768 2586613 3117974
40266 3117974 2530953 2403000 3253461 3852582 3426947 3068155 4290983 6965942 9345139
40257 9345139 9847352 8380304 6055092 4007706 2600663 1572176 733614 371763 904007
40248 904007 2223564 3618737 4487184 4937053 5349058 5464626 4556245 2795775 1760256
40239 1760256 2762221 4994074 6309771 5846133 4831951 4552480 4678139 4342233 3893915
40230 3893915 4416423 5934088 7188852 7110552 5715834 3709168 1972575 1243173 1405292
40221 1405292 1257664 -25009 -1326138 -730970 1630531 3331818 2854479 1666402 2012017
40212 2012017 3732165 4783561 4329298 3635429 3864750 4480054 4339580 3291393 2056445
40203 2056445 1299839 1390046 2406265 3737267 4162668 2977855 769851 -1316356 -2660363
40194 -2660363 -3121905 -2534223 -957489 970158 2674307 4337305 6257777 7872902
40186 7872902 8242383 7245362 5490382 3412896 1491906 963316 2830480 6063381 8185956
40177 8185956 7991708 6465277 4845851 3340587 2193869 2238890 3433833 4442011 4762052
40168 4762052 5659419 7678599 9022018 8261208 6986757 7325314 8153929 6784730 3720371
40159 3720371 2360981 3764756 4982169 3647465 1397182 1116662 2981450 5059538
40151 5059538 6249917 6794512 6925217 6642167 6296157 6350311 7082045 8928125 11964671
40142 11964671 14570346 14306106 11188131 8481296 8883738 11404281 13531064 14882290
40134 14882290 16545176 17943723 17022416 13490667 9764204 8220343 8830356 9806369
40126 9806369 9676268 8565673 7874087 8383610 8590794 6156649 1571213 -1434241 -494137
40117 -494137 2155451 2945348 1738613 845860 872860 794165 1163250 3456623 6325689
40108 6325689 6388211 3499240 1610766 3077339 5466079 5795222 4768613 4382612 4021946
40099 4021946 1986317 -801170 -1649192 133791 2741876 4558964 5328731 5238855 4711453
40090 4711453 4591880 4929262 4283594 1886581 -434948 -478341 990088 1362486 145001
40081 145001 -663150 -65829 524875 -145632 -1304289 -1607784 -897156 145750 854487
40072 854487 775436 217274 571432 2575726 4410517 3521971 480020 -1250495 85048
40063 85048 2517135 3768486 4090348 4267580 3471421 1448997 685913 3328170 7185632
40054 7185632 8012307 5357604 3081181 3839063 5945214 6528826 5254851 3547384 2138417
40045 2138417 1089660 874120 1701612 2617226 2838951 3361492 5582287 8589410 9558337
40036 9558337 7283189 3979221 2734403 3982141 5496456 5511530 4657706 4443308 4787698
40027 4787698 4168574 2083257 192078 393794 2466818 4441784 4923506 4154306 2995237
40018 2995237 1952219 1439974 1994493 3522948 4861400 4824400 3650073 2923319 3849043
40009 3849043 5711545 6358889 4574019 1820137 879983 2566654 4821512 5706145 5943699
40000 5943699 7018464 7975385 6594544 3417343 1711726 2747812 3890479 2857180
39992 2857180 1313462 1945066 3933643 4268661 2518814 1287076 2145377 3880936 5075674
39983 5075674 5909304 6646260 6512630 5261237 4286912 4936980 6666751 7774645 7238749
39974 7238749 5279529 2920970 1465737 1605387 2644388 3266519 3121735 2797562 2455684
39965 2455684 1888020 1849455 3534921 6354147 8048718 7716416 7011025 7538490 8787004
39956 8787004 9547290 9544603 8562026 5992172 2827326 2050770 4891345 8336262 8772443
39947 8772443 6718111 5277206 5118960 4309380 2704020 2870003 5790082 8606901 8170914
39938 8170914 4898772 1736655 727799 1755777 3446372 4165980 3010000 766902
39930 766902 -646624 -203299 1370103 2829076 3549938 3385131 2680110 2707649 4676744
39921 4676744 7796282 9683828 9334544 8350809 8490893 9381319 9658388 9124654 8534237
39912 8534237 8169005 7867905 7795125 8055703 8101425 7557952 7175746 7955310 9616654 10774140
39902 10774140 10480504 9103585 7960026 8335627 10278424 12129276 12115656 10737312 10448429
39893 10448429 12415435 14863122 15496774 14269027 12589339 11051507 9484842 8285687
39885 8285687 7951075 7878360 7300635 6970999 8190996 10386989 11419698 10459473 9042376
39876 9042376 8939969 10182942 11516301 11856499 11073221 10047448 9912971 10628007 10762958
39867 10762958 9526065 8212567 8372054 9374647 9534247 8964755 9169293 10140809 10279560
39858 10279560 9255525 8518155 8696093 9071299 10063262 13188015 17460202 19102720 16921523
39849 16921523 15150045 18237587 24998036 30833168 33905354 35958228 38678650 42894705
39841 42894705 50041824 59938082 67471430 66626453 59193804 54874937 59990286 69502902
39833 69502902 73441039 68607796 60312515 54437943 52208157 52446096 54531761 57497945
39825 57497945 59247626 59101844 59654438 63794660 70240056 73946004 71619951 65890225
39817 65890225 62990439 66157119 71861282 73157050 66704817 55905133 47068753 43401369
39809 43401369 43199810 42813128 39999242 34800363 28768227 23869591 21188470 20041901
39801 20041901 18776128 16684353 14626442 13552013 13090481 12108591 10230542 8243825
39793 8243825 7172284 7398085 8646451 10408105 12152834 13298184 13376060 12557495 11850933
39784 11850933 12216567 13337589 13881303 13338083 12891130 13723753 15067371 15077931 13485736
39775 13485736 12128117 12528269 13973362 14629255 13911403 13035699 13455784 15310973 17516449
39766 17516449 19174971 20589952 22510914 24525679 25156200 24024061 22834255 23137610
39758 23137610 24104283 24115562 23763270 25006821 27518204 28497819 26867598 25226675 26239681
39749 26239681 29011141 30707982 30286047 28934520 28089822 28652629 30973800 33925626
39741 33925626 35189462 34280702 34021727 36909247 41334438 44087295 45588375 49280082
39733 49280082 55898188 61702250 63289998 61651851 60653687 63789311 72982753 87700979
39725 87700979 103628589 114343195 116298672 111631815 106103973 106031757 116425568 137627533
39717 137627533 161671409 175645605 172439815 157156298 141362516 133450693 136246348
39710 136246348 149326897 167997726 181944090 181506970 166946770 148182720 135170595
39703 135170595 131872402 138577357 153706244 170912127 179813634 174575286 160301294
39696 160301294 148400814 147243442 158440892 177997807 196950876 203951650 193570550
39689 193570550 173059641 157227494 155307041 164396899 174731615 177883718 170161466
39682 170161466 153057116 133282219 119635410 116386084 119896709 122962100 121577894
39675 121577894 116602347 110656662 105745900 103420948 105049524 110972609 119649125 127555360
39667 127555360 130226129 125196652 115432268 108749724 111398315 121501706 130052317 129163633
39659 129163633 118999355 106631202 99035213 97622678 98680971 97866167 93883736 88477768
39651 88477768 83943092 81252008 80056884 79378293 78019127 75216835 71520531 68502497
39643 68502497 67081920 66592305 65903299 64807724 63737343 62829820 62053450 61564323 60966847
39634 60966847 58867843 54458086 49222787 45721038 44650013 44317850 43097029 41152720
39626 41152720 39459352 38313331 37419234 36630106 36055578 35916046 36438687 37366704 37805663
39617 37805663 37497585 37896976 40425646 43642621 44129418 40936801 37311474 36760563 38907814
39608 38907814 40687699 40309872 38368654 36182370 35011281 36104426 39323289 42047076
39600 42047076 41575005 38592862 36239401 35705291 35065152 32959608 30937811 30793525 31606296
39591 31606296 31319561 29934015 29125138 29433034 29809397 29721672 29869207 30556840 30848279
39582 30848279 29861871 27812795 25233970 22134598 18691256 16106580 15810495 17801275
39574 17801275 20291528 21157632 19692097 17078055 15244544 15092054 15765873 15805640 14846594
39565 14846594 13696894 12811460 11622520 9904868 8908910 9983413 12440826 14133638
39557 14133638 14240823 14082187 14672939 14974518 13745299 11918156 11409078 12186413 12464083
39548 12464083 11706704 11389031 12306094 13160322 12895546 12643253 13721313 15049075 14633681
39539 14633681 12991332 12907692 15636655 19105892 20434439 18952609 16235240 14314345
39531 14314345 14476507 16775187 19838247 21737721 21772509 21031755 20792911 20980759 20816793
39522 20816793 20372303 20511189 21472428 22433351 22635096 22208319 21579173 20734076 19687978
39513 19687978 19252258 20440750 23008402 25296677 25846543 24641680 22558375 20425737
39505 20425737 19153432 19726207 21846790 23288957 22187313 19718055 18856613 20493665
39497 20493665 22551944 23099816 22266922 20548091 17594710 13971995 11919189 12512688
39489 12512688 13816033 13814025 13534175 14956931 17307474 18187741 17417858 16838860 16862814
39480 16862814 16253319 15236851 15790037 18384455 21139761 22820136 24182702 25719089
39472 25719089 26634059 27085744 29161412 34419274 42156897 50697341 58350863 62829360
39464 62829360 62795395 61308285 64582184 74722754 85592474 88519950 81413045 70721874
39456 70721874 65240511 68764582 77236303 82073510 78057632 68937898 63310268 64440167
39448 64440167 67434076 67691596 67431142 70175699 73049475 70582856 64118340 60682066
39440 60682066 62211610 62165455 54976871 43793639 35499241 31691384 28610080 24001248
39432 24001248 19832612 18219400 17931964 16360214 13394817 11670444 12938247 15357495
39424 15357495 15411873 12207412 8485341 7063209 7909583 9625104 11897059 14711005
39416 14711005 16860634 17765545 19530966 24240350 29962072 32766250 32498904 32953718
39408 32953718 35856680 38450080 38347542 37137565 36970599 36740635 34651504 32284976
39400 32284976 32709719 35755634 38401181 39385056 40413787 42536451 43952921 42454191
39392 42454191 38369837 33964381 30783998 28495020 25984160 22965047 20342621 19049682
39384 19049682 18802723 18509783 17821794 17423170 17562198 17378579 16484833 16462828 19728441
39375 19728441 26926524 35790633 42406904 43930406 41390235 40295253 46832408 61655037
39367 61655037 77658674 85270556 80564154 68392651 58313346 57555588 66185421 77156909
39359 77156909 81392763 74740917 60995738 47933445 40478296 37956212 36911307 34756232
39351 34756232 30554126 24310415 17198438 11818551 10439513 12423498 14329270 13275701
39343 13275701 9724716 6391129 5068020 5512005 6849652 8344588 8661051 6441436
39335 6441436 2689260 794674 2555737 5628217 6874934 6803349 7961175 9926632
39327 9926632 9451749 5769206 2192230 1293670 1693551 1341027 982873 1923416 2838888
39318 2838888 1912526 485536 1271770 3774459 4749000 3138148 1542467 2246580 4318335
39309 4318335 5570820 5374624 4419821 3252475 2249625 2006424 2677190 3533406 3868120
39300 3868120 3813504 3804001 3826549 3684034 3530506 3714189 4355589 5250170 5922347 5831803
39290 5831803 4931933 3898540 3328584 2946232 2228616 1506554 1521106 2011752 1832229
39281 1832229 683385 -237075 263598 1934909 3556076 4299045 4282186 4210681 4701323
39272 4701323 5573773 5738770 4291349 1774184 -203675 -657415 39216 1029850 1756601
39263 1756601 1858275 1363280 1254913 2641764 4777011 5212368 3048690 903595 1942745
39254 1942745 5506003 7643729 6113883 2921648 1223461 1536411 2325455 2849884 3502156
39245 3502156 4116785 4042471 3719746 4180898 4851186 3954910 1635428 425116 1487428
39236 1487428 2578733 1501636 -361895 -325723 1293168 1991063 1340632 1337231 2657125
39227 2657125 3658422 3496933 3267907 3271466 2090148 -344750 -1565250 -175576 1831906
39218 1831906 2348796 2398058 3719350 5189357 4562228 2349234 933692 717886 177668
39209 177668 -714574 -197664 1997261 3831726 3982272 3371367 3048755 2640471 1722232
39200 1722232 959026 979564 1481587 2101064 2866553 3302740 2545041 1035606 736989
39191 736989 2718709 5457191 6331467 4234367 377283 -2771082 -3191377 -881033 2007481
39182 2007481 3294311 3005254 2740667 3289083 4157567 5085872 6343712 7598763 8220708
39173 8220708 8703094 9893853 10796160 9434233 6300332 4402171 4970791 5678366 4521472
39164 4521472 2975843 3312702 4963718 5992426 6453413 7533661 8547184 7757639 5716619
39155 5716619 4968868 6342585 7929777 8009859 6798305 4955979 2611394 612936 677316
39146 677316 3058504 5551749 6048229 4973465 4074317 3785627 3086700 1390908 -603350
39137 -603350 -1751236 -1410086 152590 1729990 2072039 1491874 1908577 4253838 6443813
39128 6443813 5509758 1697734 -1385356 -1408573 -287383 -930792 -2446254 -1265510 3065528
39119 3065528 6206379 4586680 399068 -1366590 376446 1935849 497909 -2243837
39111 -2243837 -3107022 -1742827 -196041 445399 1030852 2487470 4531116 6201750 6717016
39102 6717016 5904692 4520231 3905209 4647233 5812645 6068980 5231918 4213709 3965695
39093 3965695 5005413 7221123 9312174 9230032 6395175 2985426 1763500 2930060
39085 2930060 4336888 4474325 3807361 3287012 3148382 3441172 4243468 4833377 4015170
39076 4015170 2004898 841870 2040896 4670626 6552169 6642941 5519955 4245624
39068 4245624 3579293 3730639 4121975 3894480 3265467 3647476 5579579 7337237 6850436
39059 6850436 4548421 2919828 3351377 4736292 5350147 4793029 3662130 2527501 1962636
39050 1962636 2627578 4406554 6064617 6577495 6318589 6177526 6068963 5328199 4231053
39041 4231053 3939147 4903422 6339943 7426317 8061935 8291758 8078310 8024938 9207778
39032 9207778 11715229 14470621 17150418 20768639 25030519 26668641 22829654 15487395
39024 15487395 9750827 7549568 5758522 1578065 -3003819 -4194370 -1745766 1397352
39016 1397352 3547473 5309912 6553725 5638064 2562555 253124 1086238 3833518
39008 3833518 5644945 5734909 5385070 5282318 4870254 4097049 3952635 4852482 5778183
38999 5778183 5660093 4841621 4560621 5346588 6389473 6449037 5227465 3730081 3080408
38990 3080408 3114402 2762359 1912805 1896133 3449060 5152429 5060232 3268447 1524107
38981 1524107 714176 359623 471437 1954971 4595619 6406884 6046685 4537486 3442517
38972 3442517 2603518 1177179 -84965 510055 2928611 5050141 5114345 3326481 1025575
38963 1025575 -493812 -255893 1906447 4648138 5967557 5303353 3960973 3123165 2466131
38954 2466131 1317607 149789 -51555 703150 1516598 1983180 2635074 3987786 5672509
38945 5672509 6645308 6110866 4365341 2825392 2903827 4577847 6260265 6329303 4716170
38936 4716170 2928906 2629444 4116563 5990107 6397956 4828929 2530226 1089669
38928 1089669 1152034 2733469 5702936 9013712 10531320 9243056 7039562 6525141 7487292
38919 7487292 7601689 6391252 5928552 7245345 8713214 8926375 8680491 8869156 8901328
38910 8901328 8687547 9627666 11756718 12516232 10709961 9214911 11131330 15724192 21016058
38901 21016058 27363513 34839145 41036744 47436714 64044081 97599180 134792151 148392213
38893 148392213 126106462 86029764 56554796 46669209 44142526 38060992 31145216
38886 31145216 29107593 29535401 27762308 26497160 31335703 40163466 46015013 50776745
38878 50776745 66914415 99837895 133746521 143540728 121510743 85886879 60310997
38871 60310997 50298245 44605542 34827019 24764459 20430201 19756017 17023966 12052348
38863 12052348 9039081 8967923 8810276 7335417 6718509 8114698 9704690 9984043 9814775
38854 9814775 10246855 10835504 11003085 11014077 10949122 10456943 9784328 9358171 8552194 6890577
38844 6890577 5968467 7513553 9931125 10049855 8290076 8269511 10644677 11628599 9282970
38835 9282970 7020252 8157713 10785274 11488410 10949869 11776549 13211882 12476482 9845919
38826 9845919 8060968 7697448 7338528 7558663 10269340 14371914 16575814 16702539 17624482
38817 17624482 19494370 19008937 15640916 13552669 15217808 17915988 19209730 21221561
38809 21221561 26124886 31804417 35972789 40674704 48853607 61109020 80348014 112911882
38801 112911882 156018245 188591291 187157349 152294287 109407414 80986905 67559830
38794 67559830 58823754 51735956 49290672 50028223 49665397 49304653 52883044 59348181
38786 59348181 66381273 79669253 107846733 146657158 176922708 182365641 165373139
38779 165373139 144175667 138620758 157049480 188962802 209212378 197672620 158875070
38772 158875070 117080542 90286184 76048314 64534421 54770200 50788070 50389504
38765 50389504 48225339 45649005 47789668 53812961 60006035 70644439 94129784 126166020
38757 126166020 147154793 142027580 116519980 88854238 70317325 59318775 50524383
38750 50524383 42668758 37151514 34008626 31842288 30171561 29874941 31116951 32199590
38742 32199590 31939564 32424095 36806161 44742848 54544544 70652765 101298555 142651586
38734 142651586 171862746 166787394 131482766 92262967 68296959 56560192 47169543
38727 47169543 40137919 39491333 41660992 40852658 39703563 43953359 51357167 57524665
38719 57524665 69391961 98394172 138092865 161917310 150507961 113427257 76922647
38712 76922647 56292400 47539672 41145479 34062852 27874149 23075420 18985726 15957509
38704 15957509 14707857 14603139 14125612 12484730 10124962 8121140 7333327 7719029 8364025
38695 8364025 8460266 8127698 8027330 8445209 9056398 9322729 8897580 7938578 7145619 7073537
38685 7073537 7282863 6671999 4864770 2840101 1975476 2761443 4486241 5842096 5905767
38676 5905767 4900457 3864426 3293672 2627473 1621319 1398836 2912193 4899121 5034062
38667 5034062 3149404 1672140 2412997 4413893 5720236 5950037 5997006 6098388 5485484
38658 5485484 3695975 1322347 -537326 -1090069 -223667 1536893 3449259 5033321
38650 5033321 6088819 6468429 6218219 5722404 5170839 4141967 2447044 1103854 1374085
38641 1374085 2787468 3298819 1812376 -419878 -1409827 -618642 963594 2147374 2364534
38632 2364534 1771905 1122904 1147316 1709526 1993644 1675754 1297428 1311028 1507688 1631744
38622 1631744 1723700 1536831 561414 -871910 -1463011 -604482 651952 1044891 769760
38613 769760 880724 1712906 2808001 3846823 4685000 4846266 3911202 2206462 418734
38604 418734 -1159839 -2412048 -3008287 -3050075 -3451381 -4590582 -5144052 -3614022 -677039
38595 -677039 1500319 2158293 2468661 3027694 2791365 1275115 -77398 -82260 211581
38586 211581 -474802 -964837 700649 3574676 4548878 3002570 1930647 3387013 5405539
38577 5405539 5315436 3885391 3491269 3725053 2231592 -528767 -982730 2274856 6027309
38568 6027309 6828588 5333424 4305664 4397074 4264659 3415885 2430237 1228889 -483537
38559 -483537 -1570444 -529149 2012060 3875825 4201470 3804706 3063715 1747757 821524
38550 821524 1820191 3987791 4523993 2537020 536884 921431 2936167 4317340 4224885
38541 4224885 3303638 2346291 2090959 3009931 4297771 4425373 3466868 3175265 3939361
38532 3939361 3855681 2157377 1227868 3199974 6590625 8685947 9492297 10580689 11463950
38523 11463950 10370645 8042960 7657798 10762607 15554346 19194952 19885883 17119806
38515 17119806 12226765 8332553 7286810 6916662 4013490 -298163 -1563741 1310184
38507 1310184 4102268 3371164 1091612 1065049 3486983 5691601 6285200 5861004 4983176
38498 4983176 3969588 3714361 4498723 4860211 3762678 2898177 4352553 6738587 6594393
38489 6594393 3585337 1247056 1733919 2693612 1125236 -1859056 -2656670 -496313 1599770
38480 1599770 1347330 285752 1092708 3460583 4645759 3602285 2397103 2938125 4145218
38471 4145218 3779476 1856487 390789 319434 685809 855484 1443573 2423466 2245215
38462 2245215 62852 -2524755 -3298369 -2049922 -202215 1313148 2456637 3009899
38454 3009899 2561798 1398924 315439 -381744 -918274 -1410252 -1896361 -2521834 -2879604
38445 -2879604 -1816991 990264 3806998 4499212 3159862 1807714 1675869 2171820 2467768
38436 2467768 2583060 2546870 1880432 552038 -602948 -1038283 -1196382 -1514881 -1656716
38427 -1656716 -1399269 -1380995 -2013815 -2329833 -1101215 1115956 2257166 1352169 -78887
38418 -78887 119261 2005366 3491145 2945669 1006440 -547182 -959384 -781793 -546547
38409 -546547 -292136 -270202 -813759 -1219320 -105872 2415930 4177964 3617514 2004556
38400 2004556 1739959 3202016 4712439 5107083 4780927 4376004 3954035 3582462 3471462
38391 3471462 3393479 3068905 3094218 4252276 5944474 6748480 6637997 7013437 8095923
38382 8095923 7989020 5264006 1156249 -1872571 -2767343 -2123792 -787892 616986 1409492
38373 1409492 1279461 809353 820808 1394843 2015194 2336497 2379896 2317700 2361540 2476000
38363 2476000 2132592 982704 -237535 -411554 300513 725425 798521 1906297 4523345
38354 4523345 7064958 8012824 7724023 7054111 5703369 3365604 1191017 465353 880824
38345 880824 1630550 3013028 5228134 6890647 6886031 6564386 7680084 9222639 9142705
38336 9142705 8349056 9582668 12788472 15669706 19122121 27250221 39861876 49298506
38328 49298506 48412727 38987830 28601307 21345173 15799515 10661155 7246989 5875604
38320 5875604 4179216 874161 -1856404 -1783489 -120543 561384 146153 349825 1393622
38311 1393622 1741167 838488 -41894 106178 889726 1955782 3909540 6808272 8952012
38302 8952012 8560294 6194423 4290056 4340381 5538968 6264149 5852382 4542773 2692487
38293 2692487 842751 -97725 344016 1515379 2449660 2979430 3297221 2976472 1604122
38284 1604122 56864 -253809 621789 1361470 1599938 2239933 3181715 2779047 584814
38275 584814 -1264304 -926016 492370 906336 375605 149689 -7039 -875983 -1195827
38266 -1195827 777146 3463724 3253962 116484 -1636778 457397 3407666 3499053 1663220
38257 1663220 1157730 2097297 1868204 -112143 -1630954 -1499075 -893994 -465810 941026
38248 941026 3623415 5510088 4823731 2615849 1237631 1467126 2376125 3032624 3088651
38239 3088651 2409688 1309582 726828 1192486 1899830 1570867 49551 -1514464 -1832308
38230 -1832308 -484478 1744261 3078547 1898683 -1538292 -4755303 -5129545 -2375161
38222 -2375161 1315771 3451114 3299765 2013069 1064494 664440 -148431 -1710573 -2560591
38213 -2560591 -953444 2558157 5180609 4905334 2575975 486459 -172345 140811 446190
38204 446190 94753 -892103 -1604464 -942334 829471 1961221 1443145 555493 1150088
38195 1150088 3065019 4508430 4563306 3954187 3535033 3409190 3620935 4404711 5409428
38186 5409428 5753226 5278981 4906344 5349662 6211990 6671785 6380133 5398934 3983681
38177 3983681 2802078 2681438 3627099 4549846 4412798 3343338 2323755 2096654 2616596
38168 2616596 3306766 3673225 3850678 4498887 5837603 6952269 6669060 5128697 3777956
38159 3777956 3545794 3669375 2801772 882630 -659526 -538162 944454 2324623 2816100
38150 2816100 3345649 5255195 8103642 9658532 8492440 5747067 3578505 2630589
38142 2630589 2137446 1911336 2678357 4409660 5778781 5843902 5292575 5369852 6191026
38133 6191026 6732957 6231727 5160189 4755390 5558389 6549609 6250256 4777224 3920485
38124 3920485 4694098 5843882 5652150 4173389 2533674 1160315 275278 970028 3578799
38115 3578799 5767359 4869194 1912275 621665 2245006 4170069 4268686 3691959 4105778
38106 4105778 4814639 4428422 3337379 2673896 2382392 1952044 1672023 1756739 1660024 1501382
38096 1501382 2475793 4462776 5115317 3081367 407834 -142639 1426760 3385866 5035047
38087 5035047 6316860 6411267 5112816 4074258 4280564 3974409 1805605 198051 2110232
38078 2110232 5816995 6829297 4291067 1508668 474999 76188 -55485 1629012
38070 1629012 4726556 5913366 3775845 1314421 1537250 3367542 4154489 3839135 4153769
38061 4153769 5371684 6175724 5789727 4601455 3468331 3348787 4495207 5423370 4311680
38052 4311680 2013591 1586165 3945817 6353268 6490893 5573383 5646949 6165348 5517519
38043 5517519 4059943 3245994 3214678 3409663 4113759 5213680 5052381 2952732 1326500
38034 1326500 2480904 4695094 4691788 3067982 3618860 7355122 10851184 11459395 11156788
38025 11156788 13672539 19751964 26592432 30583236 29676735 24408443 17653844 12585550
38017 12585550 10145793 8937963 7538769 6013290 5217677 5679452 7217678 8780543
38009 8780543 8905086 7380905 6037652 6611829 8353817 9284522 9170749 9179985 9065909
38000 9065909 7404809 4833495 4120184 5983199 7544289 6603742 5129721 6258057
37992 6258057 9465755 11257985 9896359 7178506 5709046 6222306 7648159 8362603
37984 8362603 7227865 4554571 2201565 1879330 3361272 5050024 5961722 6220372 5998213
37975 5998213 5290730 4733612 5304910 6837796 7908867 7705437 7104593 7330889 8346494
37966 8346494 9296182 9937382 10772021 12043976 13364419 14236399 14369007 13618020 12253298
37957 12253298 11169246 11052943 11300455 10646380 9145460 8550602 10071222 12635898 14349445
37948 14349445 14924774 15314327 15413536 13992904 11218436 9421924 10283058 12444791 13167613
37939 13167613 11624967 9462594 8690083 10072575 13034124 15998800 17308320 17043944
37931 17043944 17519060 20520209 24309830 25122619 21931238 18015557 16961480 18490231
37923 18490231 19519085 18501809 17185253 18058150 21256596 24641673 26470809 27200564
37915 27200564 28439846 30825680 33841384 37419324 42107501 46952878 48878108 45971094
37907 45971094 40601763 37280107 37652341 39527925 40756646 41850986 44451900 49647331
37899 49647331 58759718 73371481 93028855 115354029 140981866 176467843 228207937
37892 228207937 292346451 352443603 388192632 387007937 349927896 290108075 225977282
37885 225977282 172190152 133690380 107337763 88456479 74728707 64857558 56851855
37878 56851855 49357019 42994791 38737093 35922162 33096367 29866946 26761572 24142851
37870 24142851 22345238 21938712 22736143 23515190 23782746 24490877 25660956 25053916 21452537
37861 21452537 17713506 17412389 19286505 18698916 14663160 11376577 11620916 12658010
37853 12658010 11121993 8641771 9192633 13061309 17068587 19433185 20739975 20770393
37845 20770393 18203197 13797427 10562183 9911504 10332760 10625341 11695158 13986557
37837 13986557 15834095 16158498 16677597 19374410 23232254 25454279 24942233 22909093
37829 22909093 20902503 19738318 19635677 20003364 19718684 18705758 18345930 19282960 20144232
37820 20144232 19901059 20003863 22051607 24581537 24881268 23326268 22869394 24181355 24511082
37811 24511082 22307323 19960609 20115865 21629548 21644223 20183987 19941378 21948853 23976698
37802 23976698 23642015 21256473 18866912 17787460 17868802 18221453 17790306 15876432 12968339
37793 12968339 10699279 10251934 11082279 11883197 12432119 13524176 15232384 16456985 16561927
37784 16561927 16373002 16877407 17839632 18594410 19455108 21193028 23547142 25385570 26083514
37775 26083514 25655462 23851186 20515581 16818450 14637518 14374454 14673554 14701566 15369397
37766 15369397 17655581 20950383 23940090 26208205 28078118 29523901 29995619 28961032
37758 28961032 26341785 22921087 20205406 18893084 17608535 14558529 10468042 8134467
37750 8134467 8763596 10623554 11755936 11854910 10851840 8317287 5540704 5372987 7996168
37741 7996168 9503214 7231844 4036315 4100999 6619437 7386735 5224730 2782461 1721616
37732 1721616 1219019 1100760 2425313 4532665 5240950 4626596 5051555 6715121 6927681
37723 6927681 4926195 3552908 4404611 4999901 3094565 490661 -230755 100876 -562169
37714 -562169 -1484979 -736161 980023 1534569 1225395 2006883 3568284 3541753 1509233
37705 1509233 -280785 -499435 -277440 -561861 -440676 890545 2504739 3271430 3502055
37696 3502055 3909902 4108630 3389322 2277617 2123619 3291745 4536446 4284769 2240821
37687 2240821 -287812 -1526189 -736466 1288355 3062044 3538695 2549360 638661 -1275881
37678 -1275881 -2410963 -2590363 -2151635 -1434125 -605100 145421 615225 684534 194614
37669 194614 -733718 -916499 1195876 4894740 6573422 3826077 -604703 -1688423 1260681
37660 1260681 3905741 3309915 1557769 1490247 2291166 1958811 1362355 2397425 3906207
37651 3906207 3126699 390117 -1096652 -4515 1668609 2086855 1684816 1292490 738066
37642 738066 165552 579775 2060730 3113006 2710812 1641092 1115421 1289211 1723061
37633 1723061 2136290 2243229 1936088 1844115 2449685 2572590 422003 -3381689 -5563943
37624 -5563943 -3899630 101928 3057628 3217304 1466266 -101656 51724 1659874
37616 1659874 2748416 1936895 677725 1655492 4761069 6749632 5722515 3743271
37608 3743271 3533673 4626001 4899166 4328951 4608122 5861693 6363692 5410877 4235762
37599 4235762 3867812 3973318 4044945 3989825 3303314 1462984 -463118 -449753 1569514
37590 1569514 3154337 2597273 1066748 452855 704600 763810 763731 1502100 2637673 3227715
37580 3227715 3473666 4188570 4994681 4888142 4289468 4485401 4996360 3727954 371127
37571 371127 -2426072 -2436270 -750091 86979 -463919 -920402 -374677 546065 1035057
37562 1035057 1097526 1171811 1620207 2546819 3557244 3958392 3653392 3369468 3558434 3779587
37552 3779587 3737570 4032929 5051417 6002926 6085715 5766936 5765216 5591437 4431515 2770260
37542 2770260 1720808 1356059 1140844 1347159 2403229 3445371 3360905 2826965 3358624
37533 3358624 4670846 5116994 4555410 4396435 4683758 3742090 1402998 39828 1162515
37524 1162515 3154697 3928681 4001388 5095851 7006026 7888567 7133980 6188827 6436093
37515 6436093 7443412 7743810 6837213 5852180 5941349 6390862 5404821 3012557 1606750
37506 1606750 2525557 3823737 3272410 1882238 1816740 2258308 861448 -1409165 -932430
37497 -932430 2827451 6175865 6686253 6146698 6752566 7928819 8590182 9226517 9859963
37488 9859963 9031831 6758926 5495517 6264913 6995007 6635499 7295364 9768176 10788826
37479 10788826 8165570 5167778 5812472 8751945 10098617 9595627 9237884 8125794
37471 8125794 4189743 -252134 -296620 4258575 8352719 8735147 7195424 6252641 5932154
37462 5932154 5861398 6749314 8333220 8812669 7563969 6055158 5359061 5032751 4801524
37453 4801524 4954455 4878915 3717840 2605426 3604519 6260611 7906388 7569054 6827579
37444 6827579 6638091 6283706 5864141 6759237 8812809 9804666 8644829 6739444 5517508
37435 5517508 4914968 4829638 5695272 7072650 7943566 8734025 10650738 12811163 12742837
37426 12742837 10162042 7544387 6420720 5834574 5052239 4914304 5548816 5428026 3901775
37417 3901775 2463523 2465374 3504645 4837930 6541475 8631967 10619557 12181316 12913195
$$ [...]
##END NTUPLES=NMR SPECTRUM
##END=
