##TITLE=31Pdec_SR118_0
 D2O, 24 sc
 15.4.2022
##JCAMPDX= 6.0         $$ Bruker NMR JCAMP-DX V2.0
##DATA TYPE= NMR SPECTRUM
##DATA CLASS= NTUPLES
##ORIGIN= UXNMR, Bruker Analytische Messtechnik GmbH
##OWNER= root
$$ XWIN-NMR		Version 3.5
$$ Fri Apr 15 14:05:06 2022 Russian Standard Time (UT+4h)  she@DPX200
##.OBSERVE FREQUENCY= 81.013821
##.OBSERVE NUCLEUS= ^31P
##.ACQUISITION MODE= SIMULTANEOUS
##.ACQUISITION SCHEME= undefined
##.AVERAGES= 24
##.DIGITISER RES= 16
##SPECTROMETER/DATA SYSTEM= spect
##.PULSE SEQUENCE= zgpg30
##.SOLVENT NAME= D2O
##.SHIFT REFERENCE= (INTERNAL, D2O, 0, 248.564)
##AUDIT TRAIL= $$ (NUMBER, WHEN, WHO, WHERE, WHAT)
$$ ##TITLE= Audit trail, XWIN-NMR		Version 3.5
$$ ##JCAMPDX= 5.01
$$ ##ORIGIN= Bruker BioSpin GmbH
$$ ##OWNER= she
$$ F:/spectra/data/she/nmr/P31/1/pdata/1/auditp.txt
$$ ##AUDIT TRAIL=  $$ (NUMBER, WHEN, WHO, WHERE, WHAT)
(   1,<2022-04-15 14:04:14.04 +0400>,<she>,<DPX200>,
      <created by zg, POWCHK disabled, PULCHK disabled
       configuration hash MD5:
       00 E9 B6 7A A2 85 ED C7 34 08 36 98 17 FE 4E 26
       data hash MD5: 32K
       1F AA 43 53 33 56 08 F8 E3 38 87 F6 BC 39 DD 8F>)
(   2,<2022-04-15 14:04:18.14 +0400>,<she>,<DPX200>,
      <Start of raw data processing
       efp BC_mod = 2 LB = 1 FT_mod = 6 PKNL = 1 PHC0 = -9430.361 PHC1 = -144.9246 SI = 64K 
       data hash MD5: 64K
       29 F2 B4 F3 3F 78 97 CD F9 66 DE 85 78 A9 95 0A>)
$$ ##END=
$$ 
$$ hash MD5
$$ 6A 60 59 75 7F BF 9A 05 87 FC 2A 0A 95 C5 8B B3
##$RELAX= 
##$RELAX= 
##$RELAX= 
##$RELAX= 
##$RELAX= 
##$RELAX= 
##$RELAX= 
##$RELAX= 
$$ Bruker specific parameters
$$ --------------------------
##$DU= <F:/spectra>
##$EXPNO= 1
##$NAME= <P31>
##$PROCNO= 1
##$TYPE= <nmr>
##$USER= <she>
##$AMP= (0..31)
100 100 100 100 100 100 100 100 100 100 100 100 100 100 100 100 100 100 
100 100 100 100 100 100 100 100 100 100 100 100 100 100 
##$AQSEQ= 0
##$AQ_mod= 1
##$AUNM= <au_zg>
##$AUTOPOS= <>
##$BF1= 81.014009
##$BF2= 200.13
##$BF3= 200.13
##$BF4= 200.13
##$BF5= 200.13
##$BF6= 200.13
##$BF7= 200.13
##$BF8= 200.13
##$BYTORDA= 1
##$CFDGTYP= 0
##$CFRGTYP= 5
##$CHEMSTR= <none>
##$CNST= (0..31)
1 1 145 1 1 1 1 1 1 1 1 1 1 1 1 1 1 1 1 1 1 1 1 1 1 1 1 1 1 1 1 1 
##$CPDPRG= <waltz16>
##$CPDPRG1= <>
##$CPDPRG2= <waltz16>
##$CPDPRG3= <>
##$CPDPRG4= <mlev>
##$CPDPRG5= <mlev>
##$CPDPRG6= <mlev>
##$CPDPRG7= <mlev>
##$CPDPRG8= <mlev>
##$CPDPRGB= <>
##$CPDPRGT= <>
##$D= (0..31)
0 1 0 0 0 0 0 0 0 0 0 0.03 2e-05 3e-06 0 0 0 0 0 0 0 0 0 0 0 0 0 0 0 0 
0 0 
##$DATE= 1650017053
##$DBL= (0..7)
120 120 120 11 120 120 24 19 
##$DBP= (0..7)
150 150 150 150 150 150 150 150 
##$DBP07= 0
##$DBPNAM0= <>
##$DBPNAM1= <>
##$DBPNAM2= <>
##$DBPNAM3= <>
##$DBPNAM4= <>
##$DBPNAM5= <>
##$DBPNAM6= <>
##$DBPNAM7= <>
##$DBPOAL= (0..7)
0.5 0.5 0.5 0.5 0.5 0.5 0.5 0.5 
##$DBPOFFS= (0..7)
0 0 0 0 0 0 0 0 
##$DE= 6
##$DECBNUC= <off>
##$DECIM= 3
##$DECNUC= <off>
##$DECSTAT= 4
##$DIGMOD= 1
##$DIGTYP= 9
##$DL= (0..7)
0 0 52 120 120 21 21 25 
##$DP= (0..7)
$$ [...]
##$SUBNAM2= <"">
##$SUBNAM3= <"">
##$SUBNAM4= <"">
##$SUBNAM5= <"">
##$SUBNAM6= <"">
##$SUBNAM7= <"">
##$SUBNAM8= <"">
##$SUBNAM9= <"">
##$SW= 501.771253377433
##$SWIBOX= (0..15)
0 1 3 0 0 0 0 0 0 0 0 0 0 0 0 0 
##$SW_h= 40650.406504065
##$TD= 32768
##$TD0= 1
##$TE= 0
##$TE2= 300
##$TE3= 300
##$TEG= 300
##$TL= (0..7)
0 120 53 12 22 120 120 120 
##$TP= (0..7)
150 150 150 150 150 150 150 150 
##$TP07= 0
##$TPNAME0= <>
##$TPNAME1= <>
##$TPNAME2= <>
##$TPNAME3= <>
##$TPNAME4= <>
##$TPNAME5= <>
##$TPNAME6= <>
##$TPNAME7= <>
##$TPOAL= (0..7)
0.5 0.5 0.5 0.5 0.5 0.5 0.5 0.5 
##$TPOFFS= (0..7)
0 0 0 0 0 0 0 0 
##$TUNHIN= 0
##$TUNHOUT= 0
##$TUNXOUT= 0
##$USERA1= <user>
##$USERA2= <user>
##$USERA3= <user>
##$USERA4= <user>
##$USERA5= <user>
##$V9= 5
##$VALIST= <valist>
##$VCLIST= <CCCCCCCCCCCCCCC>
##$VD= 0
##$VDLIST= <DDDDDDDDDDDDDDD>
##$VPLIST= <PPPPPPPPPPPPPPP>
##$VTLIST= <TTTTTTTTTTTTTTT>
##$WBST= 1024
##$WBSW= 4
##$XGAIN= (0..3)
0 0 0 0 
##$XL= 0
##$YL= 0
##$YMAX_a= 1464
##$YMIN_a= -1097
##$ZGOPTNS= <>
##$ZL1= 120
##$ZL2= 120
##$ZL3= 120
##$ZL4= 120
##$ABSF1= 0
##$ABSF2= 0
##$ABSG= 0
##$ABSL= 0
##$ALPHA= 0
##$AQORDER= 0
##$ASSFAC= 0
##$ASSFACI= 0
##$ASSFACX= 0
##$ASSWID= 0
##$AUNMP= <proc_1d>
##$AZFE= 0.1
##$AZFW= 0.5
##$BCFW= 0
##$BC_mod= 2
##$BYTORDP= 0
##$COROFFS= 0
##$CY= -3
##$DATMOD= 1
##$DC= 0
##$DFILT= <>
##$DTYPP= 0
##$F1P= 0
##$F2P= 0
##$FCOR= 1
##$FTSIZE= 65536
##$FT_mod= 6
##$GAMMA= 0
##$GB= 0
##$INTBC= 1
##$INTSCL= 5.30512e-09
##$ISEN= 30
##$LB= 1
##$LEV0= 0
##$LPBIN= 0
##$MAXI= 10000
##$MC2= 0
##$MEAN= 0
##$ME_mod= 0
##$MI= 50
##$NCOEF= 0
##$NC_proc= -9
##$NLEV= 6
##$NOISF1= 182.463
##$NOISF2= 159.3651
##$NSP= 0
##$NTH_PI= 0
##$NZP= 0
##$OFFSET= 248.5645
##$PC= 4
##$PHC0= -9430.361
##$PHC1= -144.9246
##$PH_mod= 1
##$PKNL= yes
##$PPARMOD= 0
##$PSCAL= 0
##$PSIGN= 0
##$REVERSE= no
##$SF= 81.014009
##$SI= 65536
##$SIGF1= 159.3651
##$SIGF2= -187.1042
##$SINO= 113.3802
##$SIOLD= 16384
##$SREGLST= <1H.CDCl3>
##$SSB= 0
##$STSI= 65536
##$STSR= 0
##$SW_p= 40650.406504065
##$SYMM= 0
##$S_DEV= 0
##$TDeff= 32768
##$TDoff= 0
##$TI= <>
##$TILT= no
##$TM1= 0
##$TM2= 0
##$TOPLEV= 0
##$USERP1= <user>
##$USERP2= <user>
##$USERP3= <user>
##$USERP4= <user>
##$USERP5= <user>
##$WDW= 1
##$XDIM= 65536
##$YMAX_p= 213562765
##$YMIN_p= -212668531
$$ End of Bruker specific parameters
$$ ---------------------------------
##NTUPLES= NMR SPECTRUM
##VAR_NAME=  FREQUENCY,     SPECTRUM/REAL,   SPECTRUM/IMAG
##SYMBOL=    X,             R,               I
##VAR_TYPE=  INDEPENDENT,   DEPENDENT,       DEPENDENT
##VAR_FORM=  AFFN,          ASDF,            ASDF
##VAR_DIM=   65536,         65536,           65536
##UNITS=     HZ,            ARBITRARY UNITS, ARBITRARY UNITS
##FACTOR=    0.620285442955139, 1,           1
##FIRST=     20137.2065510759, 0,            0
##LAST=      -20513.1999529892, 0,           0
##MIN=       -20513.1999529892, -212668531,  0
##MAX=       20137.2065510759, 213562765,    0
$$ Real data points
##PAGE= N=1
##DATA TABLE= (X++(R..R)), XYDATA
$$ [...]
14967 -927394 2376687 6153929 10044395 16850915 21053164 14547596 3277896 3017583
14959 3017583 15400208 22317830 10946343 -7434972 -13189485 -4706509 2124397 -2802710
14951 -2802710 -11905977 -12376127 -2610700 7625861 9477545 3374713 -3778584 -6366073
14943 -6366073 -3901371 665356 3913451 3768940 1081807 -261789 2614510 7080043
14935 7080043 7814221 4709443 3435509 6238942 7511342 2444760 -4883536 -7755895
14927 -7755895 -7141298 -8617491 -11382104 -8681396 514465 8127490 7792530 2894160
14919 2894160 348835 1163079 1341955 -1042149 -4133129 -6062120 -6369255 -4062022 1794509
14910 1794509 8280643 8686600 -381967 -13125397 -19591385 -17238108 -13534542 -14874490
14902 -14874490 -17240249 -12692235 -2109007 5212468 4049975 -1187818 -4084612 -3304070
14894 -3304070 -849148 874020 -1094615 -7396897 -12287195 -9343453 -2338137 -1765532
14886 -1765532 -8260381 -9870966 -628050 9259795 9530468 5580556 7265446 10953316
14878 10953316 6367947 -4309046 -8844494 -4367923 -473324 -2474087 -4201218 55557
14870 55557 7163776 12091535 14464513 14839868 11878146 6442234 2412016 1059951 88805
14861 88805 -538406 2027852 6895407 8339943 3382062 -4419313 -9761143 -9632617 -3117015
14852 -3117015 6839953 11928075 5849726 -6151446 -11889743 -7084100 1090044 5623566
14844 5623566 7014347 7514134 6114894 2571158 79207 521920 1587899 616181 -2682690
14835 -2682690 -7552198 -11629669 -10350602 -3063529 2287394 -1210018 -6986484 -2601129
14827 -2601129 10740066 18468051 14152982 7813886 8594615 11904495 10499896 6857439
14819 6857439 5897365 4804435 -506176 -5943421 -5171878 514968 5659068 8549395
14811 8549395 9244193 5938274 -5785 -1913933 2384145 5493474 2524909 363137
14803 363137 5636349 10959859 4707551 -10740711 -22417995 -24988670 -23988871 -23203976
14795 -23203976 -20423378 -15256353 -10826616 -7484437 -3656262 -2235824 -6999415 -13451831
14787 -13451831 -13002026 -6175874 -1870900 -3209752 -4494039 -3290743 -4403780 -8828753
14779 -8828753 -9568076 -3392863 2555393 1718822 -2229226 -2647940 285007 3280195 6693146
14770 6693146 10444817 9143832 -293135 -10233249 -10362718 -2012972 3940193 2552087
14762 2552087 -379040 229575 1106112 -1884440 -5412254 -3494185 3243602 8732718
14754 8732718 9794035 7836727 3198102 -6028867 -18021094 -25676020 -24887969 -20730668
14746 -20730668 -20683948 -23934827 -22944867 -15097032 -6675612 -3475024 -2902840 741954 6908840
14737 6908840 9722075 6786938 2210804 266933 -181072 -2924591 -8165582 -11764279
14729 -11764279 -10908891 -8338866 -8744192 -11549551 -10646542 -3126606 4745873 4242525 -4246472
14720 -4246472 -10589523 -6406449 6009461 16862682 18250095 10049573 -912644 -7057572
14712 -7057572 -7090797 -6078504 -7086209 -6150763 349846 7194725 6198958 -1616599 -7749483
14703 -7749483 -8876033 -8871429 -8797151 -5449479 -977489 -2337428 -8124267 -8010033 312
14694 312 4543199 -38578 -3042677 4152213 11951403 8396729 121739 922343 7363140
14685 7363140 4358925 -8985302 -18034355 -16378988 -12494031 -10780745 -4295023 8172557
14677 8172557 14614929 8178352 -577562 192603 6126799 5854913 -1006877 -6162001
14669 -6162001 -6727238 -6088870 -4633569 24268 5455012 6254520 2991302 1371573 2220483
14660 2220483 -236945 -8423839 -16233944 -17005356 -11968113 -6791065 -2946738 2440891
14652 2440891 9124027 11773592 7623276 1454730 -1368219 -3348610 -9799414 -17199606
14644 -17199606 -15679706 -4753157 3280982 922539 -2653774 4275308 17229100 21634175
14636 21634175 13265847 1318862 -6571558 -10951715 -12870779 -11082399 -8296234 -9816340
14628 -9816340 -13661013 -11620211 -2877344 2732339 -1302744 -9344536 -12780880 -10558824
14620 -10558824 -6575823 -3355251 -2168099 -3455345 -4182518 -803707 3240930 308034
14612 308034 -9016446 -14656866 -11519374 -6595990 -6964134 -8687348 -3534621 9139051
14604 9139051 22076841 26992222 19467676 3147186 -9678552 -9596655 -3097925 -4172560
14596 -4172560 -12317751 -12719938 -1539890 5775040 -434938 -7465637 -1630311 8462046
14588 8462046 6599733 -4056882 -7122505 728032 7777190 7944711 6717764 8152431
14580 8152431 10934102 16063268 24374623 27926775 18271451 2261955 -5119833 -3134069
14572 -3134069 -4785698 -13338550 -16516072 -8330144 -518904 -4793570 -16491090 -23771863
14564 -23771863 -22859109 -17056763 -9618161 -4139385 -4146787 -6798133 -4565665 2614004 5702161
14555 5702161 1554205 -475186 6653062 15715982 16191060 9501574 4864443 5899160
14547 5899160 9389592 12547968 14148383 12470199 8570588 7766943 12177453 16007662
14539 16007662 13939550 9835829 10858359 16444733 19273519 14974073 6285108 -287876
14531 -287876 876264 9680852 17985187 17107055 9481122 5852744 8647521 8023775 -520295
14522 -520295 -6036775 1181812 13046320 16226410 13302150 16500450 25096037 25658473
14514 25658473 14710924 5366087 7411354 13685577 12386856 3253179 -5221239 -7982977
14506 -7982977 -6803426 -5893476 -8397996 -13635883 -15344132 -7185778 7557411 16799452
14498 16799452 13371059 3532037 -1571613 1184587 6469812 9486418 10342004 10394157
14490 10394157 8415378 1930609 -8574509 -18060945 -21229444 -18980494 -17905765 -21090045
14482 -21090045 -22694521 -16082617 -4559731 2254865 1431226 -1143212 -1716482 -3510377
14474 -3510377 -8044616 -9527022 -3167053 6363634 10508282 7367034 1658406 -2821756
14466 -2821756 -5444538 -5541538 -2468738 1414121 2100898 -1240113 -5449526 -7239510 -5721089
14457 -5721089 -1746205 2969028 6524600 8482567 10089055 11371214 9734982 3947889
14449 3947889 -1990637 -2288508 3737800 11159704 15688004 17437071 18161445 17921744 15984337
14440 15984337 12864468 9725225 6992135 4981517 4882962 7501384 11349690 13412203
14432 13412203 12166876 9168264 7347222 8185406 10805159 13282473 14085833 12392924
14424 12392924 8358183 4174267 3966139 10300291 19879325 24652549 19669457 9519291
14416 9519291 4358892 8548496 15577308 16462466 11326408 8857085 14410857 23140940
14408 23140940 27045107 24823163 20638402 15761221 7149330 -5694639 -17692852 -23731131
14400 -23731131 -23519752 -19413917 -13172393 -7118790 -5040598 -8570683 -14316115 -16938971
14392 -16938971 -14056391 -7416570 -1583554 -1827455 -9364373 -17435356 -17012412 -8828600
14384 -8828600 -4177091 -9756717 -17564372 -16015904 -6166032 1097517 762644 -2345684
14376 -2345684 -3959522 -5390769 -7238598 -6582000 -2951011 -72419 1097489 4685749
14368 4685749 12089287 17697657 16243843 9821557 4105150 1636500 1945619 4308736
14360 4308736 7125010 7940892 6759029 6055803 5888543 3553258 -86317 -19451 3775301
14351 3775301 3325243 -5379740 -13135100 -8158259 7176327 18484540 17354572 9512127
14343 9512127 4283642 3131972 1874337 -747272 -1433418 2205182 7992634 11565192
14335 11565192 10919535 7608335 3891575 428323 -2256936 -2113093 1812109 6279768
14327 6279768 6913821 3650603 -785434 -6737458 -16102287 -25034592 -25772927 -18179604
14319 -18179604 -11785524 -11917869 -11242847 -1834680 10608552 13617561 5760748 -1606551
14311 -1606551 43755 6943779 10386635 7276754 1016314 -3997834 -6097448 -5915957
14303 -5915957 -3555966 2603830 11870745 17016992 10116025 -5478089 -15819465 -13118498
14295 -13118498 -4921008 -1309071 -1114290 809125 714625 -7329810 -17145087 -17061248 -8795782
14286 -8795782 -5243038 -9212122 -9391271 -492113 7517275 6398699 2352161 3371479
14278 3371479 5703008 3257815 790610 5571565 12701482 11549898 3246899 -465293
14270 -465293 5223952 12800975 15217327 14095868 12732091 9557644 3110882 -2310220
14262 -2310220 -1107918 6148805 13374061 15822220 13974229 11322783 9997991 8923047
14254 8923047 6165461 2717519 2394656 6908698 12637952 14570152 12824409 12528360
14246 12528360 16398412 19788744 15806514 5087738 -2962082 -1265581 5199343 5760772
14238 5760772 -996286 -6092421 -5346558 -5772769 -10757029 -9521585 6237652 22792337
14230 22792337 18653426 -3572451 -18361467 -13450366 -5614629 -11681849 -22114080 -18645177
14222 -18645177 -4770886 283804 -8836405 -18541413 -18587511 -12740288 -6505152 732764
14214 732764 8105345 10345589 6912696 4299952 5653829 7073049 7244444 10911545
14206 10911545 18080712 19169262 7907001 -7560101 -13655346 -7412522 2230053 5960909
14198 5960909 1901105 -5616418 -10478683 -9120573 -3343782 1890436 4245769 5522495
14190 5522495 7320090 8687997 8688664 7529458 4603918 -379286 -3951757 -1776910 4014427
14181 4014427 6044491 1925514 -2530413 -2477803 -324380 -53603 -1464216 -3553742 -7465736
14172 -7465736 -12029935 -12681639 -9524224 -9784237 -16277842 -20193833 -13200573 -985003
14164 -985003 4491677 1805761 -1041564 -1236123 -2855281 -4916452 -728495 7917964
14156 7917964 8095130 -6050807 -21574413 -21798280 -7607533 4695381 3764780 -6399119
14148 -6399119 -15187199 -16916177 -12362868 -4875972 1566196 3350003 -343793 -6359889
14140 -6359889 -10184756 -9802568 -6802522 -4199639 -3440835 -3291018 -1616623 1677021 3942522
14131 3942522 2489583 -2299582 -7025059 -8220254 -4901751 1229784 7006330 9165701
14123 9165701 6164411 364516 -2125295 3423803 13796869 18655564 11202543 -2859619
14115 -2859619 -11145057 -9742155 -7471971 -12474898 -20045750 -19785564 -11377487 -4902514
14107 -4902514 -5459595 -6240269 -380503 7994385 10862310 8762004 7863261 7808171 2317389
14098 2317389 -8059564 -14145345 -12637552 -12765136 -21466198 -29883041 -25056407 -10475799
14090 -10475799 -2425832 -6320266 -9945329 -4182718 2392969 -1557975 -10643160 -10710454
14082 -10710454 -903017 5980636 3974271 1229412 4316967 7708489 4736691 -1089530
14074 -1089530 -3396922 -3685096 -6027361 -7020694 -829073 9181303 13598177 10424234
14066 10424234 6506825 6010687 6414061 6758035 10591905 17533290 19992638 13311157
14058 13311157 3372704 -915371 1674640 6076153 8869272 9726745 8209018 4716054
14050 4716054 2860568 5845239 11380295 14379176 13734575 12404713 11857041 10920698 9631705
14041 9631705 9459763 9383189 6340677 638427 -3374044 -3565182 -2814317 -3347298 -2403948
14032 -2403948 2815903 8897167 9539091 4087648 -1531538 -2640154 -900562 -409837
14024 -409837 -1714741 -1944692 655861 4598616 7150830 6762038 3476705 -1581289 -6481178
14015 -6481178 -9088672 -8292020 -4706163 -65244 3971091 6709637 8813207 11663560
14007 11663560 15303308 17037219 13821179 6761567 1060190 -354327 -886797 -4711774
13999 -4711774 -8995829 -6925382 1343283 6969811 4483608 -234080 825654 5313763
13991 5313763 4820923 -704296 -2065651 4410910 10224973 7549016 1569125 2629137
13983 2629137 10187500 13270561 6489105 -2490380 -4274775 -487985 -141911 -6152263
13975 -6152263 -11110915 -7186120 3677912 12065012 12033868 6797122 3284640 4185816
13967 4185816 7648760 12306264 17919679 21194673 16622020 4543766 -5938950 -6910785
13959 -6910785 -1824385 -87636 -2963449 -2161945 6066228 13037186 9193964 -1549255
13951 -1549255 -6702313 -2852118 -35496 -6108831 -14095980 -11417915 2036799 12938775
13943 12938775 11830067 4088710 299267 1692292 1298705 -3700524 -8392459 -9050300
13935 -9050300 -8697752 -11129269 -14612671 -15249679 -12942838 -10181877 -7651809 -4936582
13927 -4936582 -3419239 -4321231 -5115655 -1910710 4891429 10379084 10299466 4270059 -4914658
13918 -4914658 -12540491 -13961798 -8456216 -275402 6238519 10428214 11959960 8049448
13910 8049448 -754850 -6047922 -797062 8692720 9052036 -1530017 -10264725 -7801607
13902 -7801607 -115983 2415535 -340352 -1518402 696274 2101476 431107 -2655283
13894 -2655283 -5874148 -8977184 -10493839 -9748756 -9757486 -13449111 -18368126 -19832826 -18193332
13885 -18193332 -17998249 -20349429 -20768821 -15134306 -4231522 7774437 16452312 18971078
13877 18971078 15791600 10439196 5687889 1196287 -3186584 -4531736 -782593 4853919
13869 4853919 7689760 7515629 6279218 2770103 -3896578 -7687130 -1110638 12316108
13861 12316108 19854951 16423004 11186703 12487908 14225125 5494194 -11128520 -20935021
13853 -20935021 -16148780 -4757314 1894654 2809182 4040431 7274391 8457525 5657357
13845 5657357 1577057 -1961709 -5936963 -9081040 -7299302 -1593809 -325377 -7661214
13837 -7661214 -14990131 -11958042 -2342920 1260749 -2984510 -4014458 3033560 8586985
13829 8586985 5239220 494193 3606187 9425446 7052878 -2151698 -7785652 -7398717
13821 -7398717 -7449462 -9319405 -7349031 -1419605 548515 -4456130 -8887092 -5461468
13813 -5461468 3971293 12969489 17034427 13927201 4575248 -4660966 -7401926 -5933671
13805 -5933671 -7513359 -12024701 -11866875 -4506008 4446557 11323831 16597385 15899421
13797 15899421 2502066 -17039434 -24156968 -12978648 -542396 -2269775 -9643349
13790 -9643349 -5484739 8584251 15830082 9912276 949561 -1968694 -275004 2258927
13782 2258927 4850009 5131349 -399138 -8847309 -11975400 -6964309 301883 3665290
13774 3665290 2422530 -1447892 -5677703 -7475505 -6585714 -7428930 -12177607 -14177203
13766 -14177203 -6331339 6002530 10446942 5647725 3021594 8385132 12631251 5823343
13758 5823343 -7932807 -16322326 -14367407 -8475181 -7863522 -15515175 -25382586 -27045198
13750 -27045198 -16108968 -449012 7639259 5184200 -292260 -2209803 -654760 3077723
13742 3077723 9119698 14133474 11895950 2364519 -6412306 -8555630 -6294864 -3462973
13734 -3462973 -549533 1071794 -1523800 -5474144 -3093586 5159857 8575013 3337612
13726 3337612 906429 9884607 19966663 16876636 5265100 1374779 7752679 12015182
13718 12015182 9490901 9678660 17058663 21641797 15776005 7485742 7976392 15246648
13710 15246648 19372357 17085778 12066639 5971001 -1879962 -9014439 -11769811 -10744003
13702 -10744003 -8274507 -3295251 4970941 11116508 8788562 446111 -5102792 -4248175
13694 -4248175 -1213523 140011 297172 -44736 -1164183 -937556 2723286 5542644 1116489
13685 1116489 -6903323 -6238868 6200800 17141299 14389603 3522165 -1721474 615056
13677 615056 1352717 -2730840 -4600515 -134523 5273221 6182444 4506020 3857325 3813145
13668 3813145 3681261 5391732 8180247 6147026 -3769298 -15602336 -20723241 -17054767
13660 -17054767 -8510782 762166 7985315 11691774 13780784 17673497 21488580 18555758
13652 18555758 8402184 224892 -305632 -169195 -6735748 -13705408 -10730688 -1878906
13644 -1878906 -567340 -7797114 -10298794 -2539410 3709269 -2174029 -13238513 -15332250
13636 -15332250 -6122125 4276667 6621303 100194 -9270873 -12736137 -5383880 7054693
13628 7054693 12141871 4855113 -7091670 -14577138 -16728407 -15712879 -10696651 -3345998
13620 -3345998 -1001227 -6212107 -10584640 -8001755 -6085145 -13226724 -21701175 -18322094
13612 -18322094 -7067615 -4321485 -12986081 -18998300 -15570717 -12655527 -16170044 -15445516
13604 -15445516 -2240892 12322717 13762121 6422779 4433271 8056601 5662851 -4274702
13596 -4274702 -9931337 -5590347 619279 1866523 2259835 5669224 6417663 -608927
13588 -608927 -8901485 -8777213 -1965844 1195618 -3390603 -9797228 -12497209 -13014182 -14682331
13579 -14682331 -16739311 -16589043 -14251500 -11694905 -10129496 -10429526 -13948065 -19373415
13571 -19373415 -19987239 -9160060 9304283 20653409 14345427 -1665955 -8408864 692742
13563 692742 10909412 5954418 -9457838 -16149570 -7209203 3278071 945431 -10071182
13555 -10071182 -16139933 -14063710 -12018956 -14260006 -15526225 -11311542 -4879388 -971476
13547 -971476 1097113 4157843 7332595 7420544 3675194 -1743189 -6190321 -7286015 -3536130
13538 -3536130 3104172 6896818 3443338 -5181790 -12198621 -12720124 -7448311 -507734
13530 -507734 4861577 8265603 10577243 11163852 7845569 389623 -7298814 -10494454
13522 -10494454 -8574354 -4595510 -739010 3031966 6166545 6866418 4946671 2457804
13514 2457804 741300 -415146 -353204 2406393 7013478 10524174 11716747 10835397 5701151
13505 5701151 -5859726 -18285824 -20472104 -10197516 161160 -1202030 -9651556 -11096854
13497 -11096854 -1580952 8635605 9770872 3453832 -2080247 -1522231 4426966 11007425
13489 11007425 13311756 11467175 11308111 16242352 20503897 16114094 4940756 -3052444
13481 -3052444 -2880511 1537108 6085696 10206539 10994635 3804134 -7471865 -10491138
13473 -10491138 -756034 10745124 13251638 11450834 15852706 24669524 26676329 18732724
13465 18732724 9067423 3907904 1267816 -1225278 -1979067 -989576 -1186389 -1510052 3326159
13456 3326159 12479203 15795658 6151080 -10332383 -21207230 -20759401 -12490119 -3216071
13448 -3216071 1181093 -1373716 -5988102 -4561230 3194137 7582210 2867599 -2817147
13440 -2817147 518155 8160402 7180789 -2830266 -7982004 -571064 10410581 13576216
13432 13576216 9445856 4076833 -2160489 -10441328 -15055383 -9819752 376934 4424645
13424 4424645 221651 -3785398 -1975219 2111949 3764050 3524061 3643707 4840959
13416 4840959 8462746 15273355 20104930 14901867 368013 -12154677 -14494276 -11044966
13408 -11044966 -9731699 -9988309 -6270974 1107198 5875420 4262606 -2029073 -9147579
13400 -9147579 -12746321 -9306018 -838031 4820809 3534734 937563 3135206 6151604
13392 6151604 3080146 -2203917 466989 10435560 15353892 9308766 738088 -1716342
13384 -1716342 -935660 -2776470 -4709596 -1322624 4736121 5925413 797681 -5363120
13376 -5363120 -8691876 -9288001 -7550519 -4004023 -1449455 -1771107 -1896902 1616742 5603517
13367 5603517 4516722 890476 3643812 14209891 22072790 18392700 7806578 612251
13359 612251 -2143249 -7640542 -16877486 -20412743 -11667662 2243554 8523970 3834688
13351 3834688 -4232204 -8335475 -7412499 -2462232 5649895 11880284 8152804 -5664203
13343 -5664203 -17105037 -14154041 -259320 9931075 8087237 -764092 -7650960 -9352681
13335 -9352681 -8046103 -7210522 -9475502 -13984075 -14925421 -7338993 4682883 10550108
13327 10550108 5498451 -4054446 -8797613 -5706294 2079673 9266204 10550965 4200411
13319 4200411 -4046710 -5710688 -650777 1953882 -3598963 -11874260 -15300651 -14456703
13311 -14456703 -13801102 -12902991 -9339679 -6431966 -9655348 -16470433 -17436852 -8632585
13303 -8632585 2654319 6628205 1971412 -3521212 -1619680 7716075 15948591 14881524
13295 14881524 5651447 -3552727 -7995250 -9588195 -9073257 -2584686 9667086 18224608
13287 18224608 15140758 5608513 1348143 5234630 10006793 10373754 8559609 8042178
13279 8042178 8833311 9890200 10793282 10483852 8804635 8719552 12191478 15021942 11542165
13270 11542165 3690385 -677260 1769663 7078509 11224948 13510595 12948280 8473755
13262 8473755 3381533 2371911 3484249 804744 -3910093 -1921628 7227407 11515909
13254 11515909 3623168 -6811545 -6518263 2837931 9146338 8004180 5602778 5691208
13246 5691208 4834804 1818944 1804446 7158377 11646165 9042676 2469411 -494512 1156481
13237 1156481 1623225 -2079967 -6100502 -6346502 -4220470 -3155700 -3207941 -2953744 -4028854
13228 -4028854 -8381342 -11911475 -7298938 5146558 15513053 16588075 12579977 10730300
13220 10730300 9748341 3974489 -4861611 -9326110 -8389453 -8198437 -10069735 -7625554
13212 -7625554 1083100 7972364 6561174 1259057 -1098297 -1852309 -5138364 -7774808
13204 -7774808 -3589647 5363114 10587595 8694438 3649007 -1242907 -5967812 -9042687
13196 -9042687 -7970645 -4980221 -4948403 -6785629 -4618851 981844 1759475 -4657206 -8892944
13187 -8892944 -4064918 1747535 -3272900 -15479461 -18873854 -7259813 7048367 10095350
13179 10095350 3622424 -457192 2481809 5605310 2610113 -3314346 -4898295 -772218
13171 -772218 3722599 4186726 2148844 1775383 3949043 5719200 5201558 4662705 7144578
13162 7144578 11281593 12281746 8635445 4985682 5951117 9088833 7879397 1551383
13154 1551383 -2540164 1417292 9171321 11545049 6348935 322180 -1015696 -233819
13146 -233819 -1932737 -4136459 -1211813 6010684 9364996 4464944 -2749037 -4926964
13138 -4926964 -4829774 -11191857 -23997087 -31607707 -25532815 -11961413 -3538293 -3857203
13130 -3857203 -6260731 -5500297 -3462176 -3394709 -4959934 -6487601 -6919721 -4089345 3709529
13121 3709529 12618629 15057753 9224694 1669618 -2185172 -4133886 -6159466 -4278963
13113 -4278963 4047168 11873456 10424502 1613243 -5190352 -6502588 -6259321 -5816099
13105 -5816099 -2517021 1490727 -36113 -4893859 -1535131 12887164 23097271 14294879
13097 14294879 -5520971 -13407970 -629458 16851837 19824538 8848442 -384236
13090 -384236 895009 5837997 5042291 152314 -274808 5998346 12435666 13711175 11647351
13081 11647351 9610637 7152025 3870728 3134206 6509453 8850134 5591458 1470361
13073 1470361 3840759 9415767 7411037 -3645660 -12289946 -10291312 -3197030 65313
13065 65313 -268489 811584 3085115 3318839 2640268 3821197 4602830 1180156 -4528496
13056 -4528496 -8491189 -12490821 -19861357 -25466522 -20392761 -7386367 -1098693 -9096489
13048 -9096489 -21328980 -23889355 -16216898 -8147524 -5298171 -4970803 -3701490 -1607507
13040 -1607507 68432 132834 -3356476 -10203904 -15159168 -13017832 -6076882 -1001949
13032 -1001949 1170205 4946220 9798769 8516594 -165235 -6121929 -2034447 4437032
13024 4437032 2474083 -3340643 1024231 16052774 25374852 18333034 3427101 -6174989
13016 -6174989 -8983209 -9249473 -5601765 2979740 7772011 401851 -11750315 -13443431
13008 -13443431 -3060353 6582852 8349453 8259961 11215366 12937183 10773819 10100832
13000 10100832 13186913 12439239 2967984 -6983842 -7130008 349842 6226219 8002991
12992 8002991 8997566 8754294 4453857 -1076528 -2120002 776650 2302937 1187682
12984 1187682 13686 -1442585 -4612253 -6003541 -1464448 4761607 4303745 -2678896
12976 -2678896 -8322088 -10129182 -12987729 -17343951 -16505923 -8776487 -1655181 496476
12968 496476 2691159 7443806 7136533 -3062573 -13309512 -10959537 1320142 10417673
12960 10417673 11962542 12797286 15743616 14672405 7525563 3243305 9580275 21110677
12952 21110677 25828067 19427322 7454287 -3587639 -11504685 -16050031 -16473901 -12458949
12944 -12458949 -5166186 2965545 8451315 8087955 1936893 -6030344 -11948034 -15365726
12936 -15365726 -16858077 -14804288 -8214477 -1308513 -441685 -5887358 -10839138 -9892062
12928 -9892062 -4705932 449132 4546734 8014485 8792326 5070961 322377 574836
12920 574836 6426163 11678395 10808068 4873149 -803266 -2218665 956604 6287107
12912 6287107 10522727 11920698 11318254 10297437 9070171 7561367 7054265 8109296
12904 8109296 8223582 5155721 1636121 2395758 6787015 9268091 7608392 5138153
12896 5138153 3636552 259114 -5450989 -7564917 -1749163 7119969 10677731 7280911
12888 7280911 1416268 -4083954 -9181664 -11675345 -7617361 2577204 12922709 17674236
12880 17674236 15542104 8621020 476944 -5039986 -6375675 -5754701 -5980128 -7000089
12872 -7000089 -8008885 -10398343 -14658632 -16821771 -13333885 -7831542 -6967070 -10302032
12864 -10302032 -11144398 -7614724 -5268652 -6781276 -6861297 -1705142 3217720 870618
12856 870618 -6694569 -12170222 -14275349 -17676486 -22677317 -22824459 -14875096 -5062238
12848 -5062238 -1432501 -3519691 -4056703 604823 6188677 6990796 2984624 -1587235
12840 -1587235 -4307067 -6231532 -8288494 -9330058 -8501606 -6879621 -5377024 -3298932
12832 -3298932 -808192 -660790 -4688639 -9678985 -9729218 -2777888 7157390 14063593 14480704
12823 14480704 8519169 -1060155 -9893825 -13658673 -10210385 -1016290 8869168 13348721
12815 13348721 10605305 6269903 7872156 14702198 17220744 9509165 -1797053 -5858347
12807 -5858347 -1999170 233386 -5788528 -16476951 -23971074 -23999857 -17039612 -6691311
12799 -6691311 1356210 2722493 -1239559 -4777601 -4231864 -998319 1498856 845121
12791 845121 -3333045 -7666020 -5900192 3469054 11763084 8906421 -2612169 -10116216
12783 -10116216 -8060535 -4358246 -6090199 -7665011 -42621 14066757 22198705 17299002
12775 17299002 5034816 -3300426 -1541351 6623246 11388343 6952864 -1233985 -2776020
12767 -2776020 3635045 8315710 4663404 -2010335 -3694638 -379087 4134351 9727944
12759 9727944 15570082 14993908 4668436 -6075683 -6094194 712998 1248084 -5834004
12751 -5834004 -8190919 -18677 8870362 8535909 2190096 -1958625 -2484627 -1394859
12743 -1394859 2624347 9381631 12049328 5645931 -3721680 -6380951 -2418325 806902
12735 806902 1658095 5305520 12380278 16075887 12901181 8517268 8940163 11829403 11310176
12726 11310176 7450131 5774146 9304921 15585662 20720683 22336030 18903883 10700518
12718 10700518 2743039 2314857 9972555 15910356 10407281 -2732602 -8756011 328343
12710 328343 15570064 21915907 15108507 3283559 -4871529 -7509691 -6838951 -5476239
12702 -5476239 -5870466 -7951000 -7098806 158457 8669490 9815336 4879606 4845886 13878980
12693 13878980 21969688 19827378 12833297 11607474 15003741 13269880 5137131 552795
12685 552795 5859664 15563705 20752423 18159941 9199438 -2382188 -9375217 -5290238
12677 -5290238 6137680 11957022 5377769 -5102056 -7230781 -1105093 2712023 -1492886
12669 -1492886 -7973425 -8184449 -824690 7876552 10479653 3999275 -8023046 -17787618
12661 -17787618 -19127073 -12407984 -3481853 2199577 4304926 6983853 13605170 21626013
12653 21626013 23647881 15621883 3432930 -1999452 2975170 10585960 11440010 5246492
12645 5246492 -978528 -2722939 -1969496 -2163918 -3122606 -2343698 592462 2972987 2632795
12636 2632795 1556175 3890842 9818694 13894318 11779948 6356421 3466619 3447328
12628 3447328 1983807 -1559847 -3053669 -1596921 -1900691 -6256044 -10298349 -10190900
12620 -10190900 -8483858 -8925030 -10463347 -10354846 -8382570 -4465712 2095749 7173993
12612 7173993 3166748 -8408231 -14049321 -6524532 2179287 -2241964 -13431154 -13342653
12604 -13342653 -778095 6174833 -2315004 -14449345 -16595011 -11855724 -10027978 -10571878
12596 -10571878 -6596815 1539707 7310988 8666146 8892805 9551353 9631112 9505328 9869045
12587 9869045 9043067 6310318 4991775 7209640 8975711 6146322 2103212 3122171
12579 3122171 8377709 11211837 9107662 5822234 3773873 662481 -4959625 -9798125
12571 -9798125 -9903210 -5880152 -2253203 -2872363 -7359644 -11240836 -10122700 -4537206
12563 -4537206 523706 1566041 214575 153555 2951193 7814297 12474651 13427596 9141302
12554 9141302 4114937 4743173 9355476 8736447 107514 -6495655 -1933484 8181490
12546 8181490 11509678 6391070 1911176 3102120 5988986 7112743 8326818 10203536
12538 10203536 9056709 3763507 -1247892 -3316449 -5853483 -11344619 -15415935 -13039512
12530 -13039512 -6991147 -4466917 -6778269 -7557997 -1691437 7665513 12617429 9282141
12522 9282141 1462428 -3779089 -2923353 1520242 3915228 412540 -7300612 -11985228
12514 -11985228 -6981996 4918967 11233844 3124023 -12479554 -20007152 -13919375 -3011475
12506 -3011475 4265221 9125347 13503850 12294281 2757665 -6190139 -4646155 2935546
12498 2935546 3900320 -3452798 -7869799 -2461813 6309466 9663907 8111949 7641576
12490 7641576 9902757 11037613 8069355 3172597 1228610 3247412 3352262 -4120773
12482 -4120773 -14397760 -15841698 -6916652 -1279792 -8710476 -18682944 -14033545 3875200
12474 3875200 16557513 13379243 2310334 -4997040 -6316056 -3895620 2223383 10540812
12466 10540812 16054131 16780573 15864850 14157939 8050334 -2030840 -8764125 -8008083
12458 -8008083 -4944752 -5611977 -8439889 -8852126 -6806319 -5068796 -4522520 -5321648 -8707670
12449 -8707670 -14086039 -17753718 -17301157 -14297836 -11284917 -9418805 -8981354 -7850753
12441 -7850753 -825721 13093454 24190439 21364165 7760794 -2404152 -3218887 -2652814
12433 -2652814 -6968475 -11285819 -9979161 -5702478 -2647861 -257639 1478248 10652
12425 10652 -2070313 2015441 9866503 9737599 -21537 -4914451 3531338 13400211 12006031
12416 12006031 6826087 11709689 22528854 23891481 13915187 5506190 6044728 10553626
12408 10553626 13170659 12508438 7524324 -319918 -3511030 1808185 6710146 1868104
12400 1868104 -6379014 -6344891 -1700849 -4697268 -12600536 -10914366 15725 2643684
12392 2643684 -9268924 -19561595 -14872559 -3684537 -258853 -3907074 -5313931 -2284608
12384 -2284608 1452553 4336412 4831777 -662345 -9922970 -13320021 -7533762 -1770289
12376 -1770289 -2502049 -2178248 6892701 17032078 15819831 4932987 -4415805 -9215395
12368 -9215395 -14539671 -19731981 -18849591 -13735970 -13259913 -18562631 -21194003 -18028949
12360 -18028949 -16304941 -19834311 -21097954 -13521365 -3083865 222466 -3164260 -4650378
12352 -4650378 -969649 2808394 3222003 3859496 8461775 13812272 13552409 6758132 -1109847
12343 -1109847 -5158839 -5464828 -4060486 -1192623 2939969 5237863 2412114 -3620709
12335 -3620709 -6490750 -2604634 4618138 8951516 8208936 5552694 4845983 6163953
12327 6163953 6522814 4649990 3214953 4497339 5640367 2625499 -1450234 1251115
12319 1251115 10395297 14805715 8335489 589056 2591573 8402445 4101873 -8316378
12311 -8316378 -11893210 -1017301 9232151 6050345 -3194191 -5182660 -238616 4136290
12303 4136290 8939505 18187345 24426598 15995553 -3011432 -14901738 -11655247 -3114541
12295 -3114541 317440 462871 2141584 2600022 -2325276 -9446255 -13209616 -13798950 -13543596
12286 -13543596 -10379049 -2240378 5791477 6533469 1143136 -2505084 -1206299 345988
12278 345988 -1917146 -5664746 -6440346 -3032949 2970773 8834953 10403537 4751299
12270 4751299 -4232596 -6905305 1756135 15426851 23606919 23303099 19711738 17182345
12262 17182345 14497219 9141747 1939483 -3622647 -3871181 3209821 15153753 24193802
12254 24193802 23728047 16225826 9929231 7003593 1484314 -8470184 -14090078 -7959608
12246 -7959608 3667736 8827426 6176368 4213647 6538780 8145074 6285096 4344769
12238 4344769 2774883 -3145537 -12160052 -14200537 -5827159 919521 -4987677 -15537677
12230 -15537677 -14569526 -2642775 3071221 -5815747 -17474645 -18616954 -12705577 -10904391
12222 -10904391 -13660056 -12657872 -6879179 -4480911 -8017571 -8677320 59405 10890325
12214 10890325 11713658 1713158 -8933560 -13430720 -14701758 -16656917 -16756690 -11470309
12206 -11470309 -3986027 -675567 -2131460 -3178469 -1050052 1692121 2848815 3985792
12198 3985792 6012558 5766891 776605 -5107559 -5126724 1788403 9360908 11660750 9800330
12189 9800330 9280599 12254826 15016444 13617629 9764087 8707987 11726508 13824943
12181 13824943 10555556 4564373 2164597 4614449 6745710 4744138 1591892 2764376
12173 2764376 8872084 14884003 15559049 10103500 2457162 -1803675 -19906 4735312
12165 4735312 6440313 2947742 -1299179 -952225 3299854 5915626 3831727 -373909
12157 -373909 -2951539 -3582560 -3862656 -3486381 -744898 3825553 6962232 6348146 2839416
12148 2839416 -1573538 -5914856 -9085879 -8897388 -4953331 -1267580 -2593445 -7901348
12140 -7901348 -10576714 -6257255 1936925 7446353 7572278 5007430 3448388 3549084
12132 3549084 2964485 -501013 -5995408 -10599315 -13790789 -18674325 -25901662 -28747641
12124 -28747641 -19976531 -3517722 7325173 5555808 -1600133 -3656023 161254 3341306
12116 3341306 2009501 -3246223 -10985913 -18222476 -19768490 -14340775 -7904141 -5157899
12108 -5157899 -2165100 5575133 13012952 13060385 9806023 12359558 17902645 14331242
12100 14331242 142125 -12037581 -14277109 -11959956 -9413686 -1713306 11228450 16288431
12092 16288431 4869766 -11163966 -14450345 -5749372 725864 -31005 -524661 2331947
12084 2331947 2004116 -4346811 -10029295 -10085655 -8340267 -8837852 -8600483 -3995573 1977094
12075 1977094 3831843 847805 -3571112 -6274067 -5353499 -428128 5215269 5834366
12067 5834366 -716368 -10172283 -16431333 -16607905 -11154143 -2635367 4370144 5810971
12059 5810971 2574969 -156349 1010630 4821106 8580744 10381267 8046993 1095979
12051 1095979 -4928485 -1948531 9606808 18173308 13608409 -1126607 -14391729 -18410094
12043 -18410094 -13782109 -5502038 615464 450518 -4424991 -7165420 -4020121 559993
12035 559993 1402310 982638 3870864 6747533 2967314 -4749629 -6512952 -864194 2357613
12026 2357613 -2204965 -7056391 -4584480 1225567 3084564 2235547 3209630 3842729 1117581
12017 1117581 1377047 11972926 25446413 25827846 11380784 -2227775 -4426314 -2309704
12009 -2309704 -5190916 -9491364 -8576030 -7265917 -13783495 -23135041 -21970726 -8490105
12001 -8490105 4440446 7180714 4171500 4097494 7854814 10951648 11649848 11220428 9560455
11992 9560455 5563853 649613 -1664736 236322 4390650 7806064 9700488 11574667
11984 11574667 14018029 14639682 11171438 6128317 4817841 7692029 8909876 5067576
11976 5067576 901161 2024725 6042111 6881271 5103498 6460935 10973556 11456035
11968 11456035 4989720 -910583 2086446 11268367 15358040 7986254 -4552509 -10116297
11960 -10116297 -4369654 4302802 5208109 -1212931 -5130875 -2418026 -683402 -6687571
11952 -6687571 -15227340 -17513683 -14709835 -14192644 -16434418 -15763277 -12048382 -11010501
11944 -11010501 -13210037 -13079836 -9680878 -8137930 -8746565 -5204737 3407771 9342004
11936 9342004 8854528 7763304 9190296 6541519 -3626784 -11440498 -6487736 6134959
11928 6134959 13119432 11534752 9402999 10492923 9603654 3398613 -3554651 -6268574
11920 -6268574 -5999299 -5918886 -4746587 1035897 10026396 14452904 7790823 -6421484
11912 -6421484 -15951274 -12523998 -1349662 5516365 3343199 -3063200 -9308435 -15160247
11904 -15160247 -17907926 -12079462 -18015 6264937 257448 -9270034 -10869107 -6481749
11896 -6481749 -6383700 -12645697 -17091725 -14090342 -7080877 -2041913 -540539 -125994 2094301
11887 2094301 6313034 8657291 5178923 -1223176 -2353141 3879154 9115551 6162252
11879 6162252 -717534 -3146231 -954147 249590 -546629 -312036 -89186 -3651153 -8911564
11870 -8911564 -8865269 -1938191 4862305 4394759 -2960522 -10128302 -9395200 138658 8840988
11861 8840988 4912378 -9858068 -18998730 -11802220 2274043 7997728 5856812 7307610
11853 7307610 13757449 14837499 6576257 -2776688 -6778277 -8186532 -9648124 -8562470
11845 -8562470 -4768372 -2668096 -1867815 3844618 13920258 18150203 11863571 3777576
11837 3777576 2206135 3475468 1836370 920371 5043745 7478134 17907 -10845257
11829 -10845257 -10644183 1603334 10932496 6854151 -4033198 -9044087 -4984419 1483548
11821 1483548 3641351 918153 -1671958 1768620 11279952 18702588 15998031 6123899
11813 6123899 391252 3818537 9227735 8719515 4452033 2616739 2304394 -1662486
11805 -1662486 -7852674 -9398173 -5955898 -5259654 -10096917 -12327675 -5143414 5629843
11797 5629843 9495987 5787580 2493969 3472733 4737211 2502778 -2263123 -7372667
11789 -7372667 -11325723 -11629766 -6885039 -366357 3688124 5940569 8121906 6234865
11781 6234865 -3551475 -14288680 -14709468 -6163678 -836402 -1896133 334765 8548546
11773 8548546 10625249 35295 -10454499 -7307624 3377518 7244166 3579773 1467871
11765 1467871 2225569 1291529 1589203 8544191 15388509 10128217 -3819280 -9821084
11757 -9821084 -1855989 8293297 9624619 4237193 -1666091 -6428805 -8817960 -6376718
11749 -6376718 -1804938 -1440272 -4706100 -4614141 -405031 1185929 -803577 731923 6666185
11740 6666185 7992022 1790486 -2030346 2490324 5882506 -1537356 -12879072 -14687204
11732 -14687204 -6823678 -436980 -69799 630723 6064084 11336504 10017473 3314705
11724 3314705 -1354036 948295 6476816 5820934 -5133647 -18223710 -21058933 -11873122
11716 -11873122 -1102702 2311025 -124218 -2644273 -3195577 -1932164 1602316 5309793
11708 5309793 4096951 -2624022 -7747384 -5670820 -484463 285538 -3152193 -3607501
11700 -3607501 2501169 10091361 11509609 5342974 -1849255 -3060603 -116614 -2416664
11692 -2416664 -13631440 -23641268 -20039808 -5205801 6404701 7707079 6585357 11838133
11684 11838133 20229890 22411921 15749596 6092530 153397 -241119 1626126 1215958
11676 1215958 -1676228 -2267581 1537352 4067368 -70804 -6349828 -6449783 -1266867 1417892
11667 1417892 342416 1441153 5970753 8919917 9193121 10082796 9585867 2737034 -5794976
11658 -5794976 -5292367 2996635 6132470 574219 -3112862 -980713 -3047819 -12061857
11650 -12061857 -13467211 968956 15700190 12942291 -1060013 -7538401 -2966124 1344035
11642 1344035 211423 -1250404 -486616 -382570 -1462016 -1882900 -2179734 -1853012 2821565
11633 2821565 9417611 6711980 -7924508 -18385323 -10774276 4591466 8196123 721809
11625 721809 -903566 8113541 15779096 15832183 15594962 18956355 18677337 10523787 1488090
11616 1488090 -859624 3533714 12427755 23824219 31243994 27649503 16688606 9642075
11608 9642075 9168212 6910480 -614060 -5615205 -2607187 2401864 1684128 -3831129
11600 -3831129 -8780458 -10550173 -8284053 -1872681 4313183 3361333 -4924561 -12585959
11592 -12585959 -14055871 -12238798 -11691684 -11903250 -10406108 -7582243 -5565681 -5682738
11584 -5682738 -7870827 -9720283 -7517540 -2184297 -1023206 -7643753 -13900143 -9876980
11576 -9876980 1338930 8321428 8194324 8083918 10931873 11454603 6941538 1131610
11568 1131610 -4238451 -11603479 -19668460 -23067282 -21331802 -18663461 -14198987 -3383852
11560 -3383852 9842367 14224940 7316021 -924305 -3598514 -4442724 -6692614 -6627991
11552 -6627991 -2887462 -442423 -41117 4689503 13955521 17620166 11100978 3582110
11544 3582110 2510250 1722251 -5452845 -12388660 -9963974 -2338358 -75919 -4266568
11536 -4266568 -8506960 -10505578 -10794815 -5820598 5809519 14668461 10375962 -2334802
11528 -2334802 -8927533 -5136293 -573547 -2146885 -4818833 -1794421 4805653 8278643
11520 8278643 7231312 6216706 7937740 8452248 2356743 -7486208 -9751662 1108328
11512 1108328 13925041 12885085 -275706 -7342596 755412 11978027 13012287 8536232
11504 8536232 10248797 16826425 18096576 12795067 8361065 6205886 331324 -9749941
11496 -9749941 -15882293 -12282216 -1663696 9680598 16183652 14163646 6083374 1425294
11488 1425294 5594174 10975898 7852934 484873 984649 9634454 14613549 11462657
11480 11462657 8872204 12135550 14301611 9401955 2606462 -104249 -2249883 -8381053
11472 -8381053 -13711410 -11748768 -6233613 -5739015 -10125844 -11498191 -6620439 -123005
11464 -123005 3974912 6636742 9151978 9927244 7260352 1724079 -4471068 -7837526
11456 -7837526 -4883250 3085498 8103017 3697478 -5602071 -8499692 -1445142 6527457
11448 6527457 5523265 -3462604 -11658178 -13553417 -10854535 -7934491 -7841171 -12121280
11440 -12121280 -20478266 -29397021 -33204138 -27867693 -13997426 2730664 13643494 12442090
11432 12442090 1638469 -7918141 -7643803 -647273 3192317 664758 -1695655 1307102
11424 1307102 5740356 5404797 1556761 792289 6051847 14224329 20616044 21892488
11416 21892488 17032793 9787405 7824575 14290393 21997364 21475305 13396304 6985936
11408 6985936 6883874 8255777 5509718 -499808 -5509852 -6788841 -3864049 623133
11400 623133 381846 -8045749 -17588415 -16819830 -5667166 3169541 1728807 -3110940
11392 -3110940 -2457693 614137 -1437137 -6080478 -4660795 2602292 6746326 4507017
11384 4507017 2117577 3360382 3814561 677262 -462626 5311004 12673716 12675417 5349702
11375 5349702 -1318411 -3358439 -4690738 -8573870 -11826671 -10477059 -6125416 -2362641
11367 -2362641 1665278 8620357 15540792 15490729 7824518 1151751 2842624 9490172
11359 9490172 11581470 5025599 -5613907 -13347866 -14633184 -10530302 -5279159 -2632858
11351 -2632858 -1434757 2916289 10526055 14615671 10919797 4919321 3878456 5750427
11343 5750427 3493517 -2685243 -6309664 -6324453 -8288644 -13798300 -18068335 -18989953 -19114155
11334 -19114155 -17145866 -7994630 5418993 11189468 4733208 -3732424 -4742851 -3297911
11326 -3297911 -8291742 -16051293 -15290688 -4440359 5969911 6848468 -923433 -10101350
11318 -10101350 -13255222 -7311764 2652058 6575442 1271927 -4532677 -2544824 2660512
11310 2660512 1566782 -4136339 -4003688 3604447 7624688 659859 -10084347 -13246000
11302 -13246000 -7970242 -2068557 183715 1472509 3725971 3726471 -746801 -4841984 -2261690
11293 -2261690 4090427 3951845 -5235986 -12220892 -7320307 2253163 2706153 -4487464
11285 -4487464 -4733035 5316051 10977177 2744100 -8305615 -8378737 -2193681 -3082603
11277 -3082603 -10362165 -11603698 -3306376 5224971 7799521 8265673 10266078 11048903
11269 11048903 8347390 5088884 4141750 4031983 1751860 -3970319 -11679992 -15930248
11261 -15930248 -10109553 4240503 15033074 13549569 6456486 5371475 8951608 6706199
11253 6706199 -1999944 -5915985 487037 9740610 14176364 14686581 13290907 7870410
11245 7870410 -568687 -4720184 -1050142 4200477 4371566 1283492 -99654 196432
11237 196432 -512783 -2031361 -2601904 -1843687 551886 4665000 7069343 3681144 -1800386
11228 -1800386 627950 13484728 26230575 28340261 21805459 14986203 9707851 1827415
11220 1827415 -8629388 -15543835 -15009043 -10528947 -8641098 -11609211 -15550025 -15738747
11212 -15738747 -13066081 -12458445 -13615111 -8590224 5982860 19312938 18293992 6159029
11204 6159029 -1822498 -566142 -102534 -6038853 -9302897 -2276259 7110114 7220137
11196 7220137 -411996 -6293250 -7843710 -8359729 -6703039 509201 9285726 11436482
11188 11436482 6483320 1587744 132060 -1446057 -5251464 -8055453 -7447789 -5991035
11180 -5991035 -7050196 -10095835 -11627466 -8862521 -2517190 2917590 3108361 -895973
11172 -895973 -3818900 -3209835 -1506725 -439934 938777 1214646 -3069828 -9177134 -8849131
11163 -8849131 -2079804 -881203 -11919246 -24467660 -25340184 -17465823 -11748485 -7965869
11155 -7965869 1180130 11499643 9940728 -3883227 -14543242 -12462366 -5124572 -2217041
11147 -2217041 -2237921 -115507 2845131 4329247 7786022 15893499 23482726 24245318 19933446
11138 19933446 16840052 17000664 17959475 17624902 14965915 9497945 3927396 3357850 7905669
11129 7905669 10030759 3504519 -8263113 -16861181 -18805832 -16860659 -13963897 -9958088
11121 -9958088 -3585616 4501555 10401434 9145347 504715 -8772969 -12458398 -12609975
11113 -12609975 -14207885 -14857943 -9026169 -1196529 -2632292 -13029895 -18425876 -12155364
11105 -12155364 -4466039 -3824620 -2692956 6543149 14310034 8183929 -4799897 -7832658
11097 -7832658 -593970 2533915 -2363156 -4473027 311403 2685870 -1450565 -3489511
11089 -3489511 334439 473880 -8048906 -14407606 -9615576 -2144419 -3209124 -8107524
11081 -8107524 -7051521 -4919387 -12470968 -23502165 -20267339 -1840110 11158730 5170056
11073 5170056 -8023233 -9787312 -18068 6455541 2381781 -3687944 -630383 11196858
11065 11196858 20835761 18797443 7310777 -1453676 1409668 10940246 14173257 6169904
11057 6169904 -4752309 -8802190 -5860130 -1603350 2140255 7560553 14150786 17623454
11049 17623454 15399730 9435317 3479791 -110014 -1419647 -2794519 -6405561 -10333195
11041 -10333195 -9544117 -3394632 1026448 -2570241 -10455063 -13856953 -11270639 -8765104
11033 -8765104 -8627499 -6284374 -598443 1559829 -3974265 -10650186 -10369918 -4751664
11025 -4751664 -111966 3109742 7014657 7334224 -609290 -9589135 -7399904 3240774
11017 3240774 5615704 -6205796 -17267979 -13843451 -3078594 76148 -4820129 -7529924
11009 -7529924 -5784507 -5639233 -7546650 -6527046 -4030630 -5409957 -6655177 1208094
11001 1208094 13681284 14977925 2595053 -6348664 -524801 8724422 6055781 -5085895
10993 -5085895 -10810080 -8015814 -3605293 516923 7398298 13826120 12801078 6294493
10985 6294493 3954273 8709955 13252367 11358241 4451084 -3256258 -8422983 -7465472
10977 -7465472 654037 10295214 14413608 13334702 11657213 8335061 -1394270 -14727994
10969 -14727994 -21450242 -17036732 -7694955 -593761 3666228 7169428 10294913 13149882
10961 13149882 15419143 14019225 7252503 1000108 2527093 7705049 4320591 -9270021
10953 -9270021 -18985960 -13779713 -918192 4391582 -1641715 -9748726 -11453531 -7766833
10945 -7766833 -5302683 -8272154 -14363595 -17149232 -13344507 -6832487 -2974377 -1138276
10937 -1138276 2295447 5967080 5723653 3149505 3210979 3986014 -1155516 -10284248 -12972289
10928 -12972289 -6289954 749638 2910433 6607849 15196128 18490156 7665010 -8187918
10920 -8187918 -12487504 -3304244 5657534 3583240 -6801510 -15518750 -15388690 -7145925
10912 -7145925 757698 -213686 -8348903 -13761033 -13256329 -14877928 -22580661 -26446697
10904 -26446697 -17448272 -3358616 2002722 -741038 -54148 6032803 7039329 -2160564
10896 -2160564 -13092189 -16042691 -11268920 -4720978 247737 3953443 8069512 13701780
10888 13701780 18336882 16024379 5223632 -5952054 -8572492 -4839776 -4005085 -7956868
10880 -7956868 -9195388 -3330503 4472211 7421158 5133421 1615130 64322 1375273
10872 1375273 4055114 4652726 1144443 -4305494 -8454635 -11136992 -13137685 -12441382
10864 -12441382 -6972513 742124 5687435 5508293 834904 -6165990 -10661287 -7633881
10856 -7633881 365787 3786683 -561192 -3790575 511347 3947294 -4356519 -19436558
10848 -19436558 -26354670 -20099539 -7670124 6002054 20655648 30708649 26938849
10841 26938849 10628842 -4728132 -8312373 -705622 11551508 20937989 20005411 8214756
10833 8214756 -3059550 -3074709 2341095 -526390 -10836468 -14569762 -8091218 -3190444
10825 -3190444 -5786806 -7342125 -3411211 -3254293 -11777912 -17923987 -12988660 -6755187
10817 -6755187 -11325230 -19785410 -16591318 -2079203 8959448 9508842 6553180 5698016
10809 5698016 2748402 -6259599 -15973999 -17689455 -10263469 -1548717 245861 -4696002
10801 -4696002 -8914768 -8301632 -7968211 -12620204 -15122198 -4765645 13533847 20666271
10793 20666271 8059538 -10098701 -15616273 -7459479 3190010 9681091 12245326 10963749
10785 10963749 6997195 6482034 13667588 22858757 24916290 19085648 11717162 6727197
10777 6727197 4258136 5145118 8974879 10356977 4715595 -3984031 -8121427 -7293339
10769 -7293339 -7584603 -11308246 -14172642 -12426155 -7159230 -1375598 2601975 2739275
10761 2739275 -1741631 -8428703 -12945691 -12200855 -6280244 813996 2689658 -2943824
10753 -2943824 -9186139 -7093273 1374483 4868710 -1087546 -8119907 -8746186 -6187000
10745 -6187000 -4585345 150727 10490002 17158441 10793481 -1894128 -5802954 1702889
10737 1702889 8896554 7093381 -513082 -7041528 -9530503 -7799932 -3429971 -283258
10729 -283258 -51530 1231833 6003581 7820667 -191261 -12235511 -15477227 -7837055
10721 -7837055 417566 3065863 4677179 8731533 10155574 4820162 -2178367 -3618910
10713 -3618910 521234 5455392 7802934 5563527 -2273131 -11776071 -15228411 -10813463
10705 -10813463 -5970393 -6412278 -7499603 -2782172 4132136 4699380 -531728 -2540608
10697 -2540608 1537887 3897766 -783256 -6137462 -4206187 1270081 73966 -8463945
10689 -8463945 -13763653 -9445090 -2154614 -892063 -4274034 -4829427 -1563568 -381736
10681 -381736 -3315607 -4875536 -510227 6770333 10297039 6924859 -561468 -5453111
10673 -5453111 -2076329 7760320 14527206 11635232 4513289 2903721 5855834 3123412
10665 3123412 -7950498 -16833415 -14792087 -6705210 -2241480 -2400098 -1676613 1631272
10657 1631272 4610167 6120543 7326931 7241695 3183227 -4346565 -10532324 -10163959 -1923459
10648 -1923459 9714318 16969859 16194318 12511303 12934051 15833373 13675991 6150748
10640 6150748 2061006 5609316 9169183 4302291 -6818455 -15682780 -17186065 -11077430
10632 -11077430 -192862 8232547 6089244 -5531757 -15588879 -16946337 -14507023 -14965459
10624 -14965459 -16325167 -14136752 -10803629 -10792289 -12544064 -12966225 -14390649 -18939171
10616 -18939171 -21302663 -16272220 -9439942 -10805582 -19728700 -24927957 -18974180 -5941018
10608 -5941018 5148803 9102525 6933229 3249753 1170932 -921835 -4904548 -6139445
10600 -6139445 1770841 14578317 19202883 11531013 2417229 516707 -154807 -7385898
10592 -7385898 -15522716 -13858620 -3178321 6706705 10658484 10037071 5981805 -78534
10584 -78534 -3850790 -3982604 -5194262 -9015380 -9261366 -4548630 -5269803 -16946118 -26457151
10575 -26457151 -19320104 -3235828 1686488 -8352599 -18026757 -16663232 -9433636 -4699611
10567 -4699611 -3914254 -5721991 -8968392 -10203050 -7089434 -4164741 -7194705 -13669485
10559 -13669485 -17116038 -17592361 -18697226 -18102253 -11803703 -4664648 -5541608 -13885476
10551 -13885476 -21231181 -23504400 -22202776 -16924914 -7277993 1038837 2405856 123910
10543 123910 -389074 -1872093 -8108631 -13217217 -10778241 -7147232 -11327818 -17675150
10535 -17675150 -14674486 -5765815 -3897984 -8912978 -8867721 -2325699 -394463 -5541643
10527 -5541643 -6555003 1711086 9177189 6053735 -4574170 -13828246 -17577872 -17618519
10519 -17618519 -18813889 -24160936 -28302942 -22337021 -10471301 -10211267 -26723798 -41574643
10511 -41574643 -40092932 -33303668 -35371854 -37696049 -28358354 -19330967 -26396676 -38175075
10503 -38175075 -36357889 -31377014 -42727026 -58138553 -52219455 -33719146 -30811019 -40100145
10495 -40100145 -38158110 -33279172 -50250889 -72741231 -68162496 -66080977 -126376350 -212668531
10487 -212668531 -194181060 -24845440 162563210 213562765 140429256 73179603 72417993
10480 72417993 86497957 70736543 49137366 48500512 52248931 44366705 40534064 50838628
10472 50838628 56280557 43523581 26863336 19528229 15596379 12615488 20015386 33547344
10464 33547344 32900981 16685150 9595481 22569165 35073583 30307414 20120744 20063045
10456 20063045 24897202 24475223 21925776 21465571 17980121 11687655 13929716 26148011
10448 26148011 31916086 21857749 8275168 3574836 2772472 -428086 962604 11269624
10440 11269624 18149119 10066567 -5057163 -12403587 -10368073 -6402572 -3415212 -924985
10432 -924985 -73436 1018182 6981312 14257447 12747772 4071831 3344691 15562989
10424 15562989 26280722 24736255 19387518 19148863 16329828 3138304 -9841896 -9092731
10416 -9092731 -707568 309915 -5062275 -3508838 6935399 13470400 7715416 -4497350
10408 -4497350 -12547589 -11267965 -2751360 5421811 6062231 1237097 668675 7170965
10400 7170965 11260398 6284656 88227 2726366 10191191 11059856 4206581 -836132
10392 -836132 1583584 7760519 12475626 14706702 15688600 16423418 16999448 16108176 12963622
10383 12963622 9972512 9193983 6638049 -2613426 -13230291 -13163968 -759009 11750423
10375 11750423 15323561 13949805 13064422 10336100 4967479 4251565 11571219 18131026
10367 18131026 16371359 11779115 10899557 7793635 -4496501 -17389657 -16613074 -3532693
10359 -3532693 7615507 10364883 9937384 8741730 2613983 -7398926 -12501793 -8763629
10351 -8763629 -2278497 1514097 4843674 10086979 12944989 8686342 713232 -2542864
10343 -2542864 1880310 7753878 7562154 2629905 2203723 10617143 19389680 18054080
10335 18054080 9984755 7839761 13287960 13403321 1452331 -11071781 -11439003 -4226748
10327 -4226748 -2082094 -5931722 -6578609 -894297 5670187 9851332 12872659 13806507
10319 13806507 10528992 5849613 3798269 1927090 -3571766 -7807702 -2981335 7304720
10311 7304720 11118291 6024736 2630074 8264651 17386369 21468315 19561242 15371766
10303 15371766 11451556 9791545 11463164 12659491 7556190 -2221557 -7569301 -3963256
10295 -3963256 3292291 8677578 13658249 19922607 22783993 17686903 8284942 1933304
10287 1933304 679799 1771671 3451229 5043021 4629848 2134641 1932277 6773054
10279 6773054 11491923 8931073 728386 -4128173 -1198026 5026123 8919931 9611492
10271 9611492 7707809 2704803 -3142894 -4222433 486975 3684378 -156977 -4824080
10263 -4824080 -72648 12512924 20053288 15786289 7570373 5712212 9972149 14033013
10255 14033013 16357372 19270326 21634059 20386576 16776850 13455827 7731495 -3570469
10247 -3570469 -14007703 -12711115 -792698 8045592 6684035 3769504 7731818 11820264
10239 11820264 5091728 -8432130 -13591653 -5014983 6544855 9508410 4072681 -2648790
10231 -2648790 -6211243 -5728555 -1245670 4801833 7152355 3457002 -1621742 -2161531
10223 -2161531 628889 220468 -5155158 -8861992 -4404424 5554015 11968382 9889093
10215 9889093 3095904 -1306124 -19048 4730831 7656957 4294570 -4407072 -10955386
10207 -10955386 -8589253 -310643 4351770 2865659 2928648 8391453 10260823 -59529
10199 -59529 -15071354 -20046081 -14205975 -10266003 -13152552 -13114674 -4016083 4602217 1972015
10190 1972015 -6959911 -8938744 -716605 9748430 16506147 20143754 20488890 14454798
10182 14454798 3341148 -4601832 -2783762 5804980 12294586 12119785 9086929 9063366
10174 9063366 11537734 10303198 3226877 -2613299 391410 9397622 14916428 14180640
10166 14180640 13006196 13944590 11712727 3803380 -3167014 -3606006 -1952159 -4089086
10158 -4089086 -6082606 -822897 8172748 10089249 2962085 -3463783 -2469352 937013
10150 937013 -307328 -4027905 -2635756 5844087 15936621 22064030 23065780 19843157
10142 19843157 13021911 4796245 6219 1667410 5810843 4537679 -4059817 -12098469
10134 -12098469 -11133408 -2895573 3411579 3056484 -386004 -2902118 -5100582 -7129407
10126 -7129407 -4945026 3340006 11599969 12230407 6770774 4301879 9264988 15998708
10118 15998708 17144330 13545604 12269125 16249004 20030956 17450557 10642784 7493254
10110 7493254 10761054 14617795 13610401 9923346 7812432 5465236 -1258208 -9624751
10102 -9624751 -11953437 -6487110 303806 2995469 2707954 2266097 2068684 2871654 6900488
10093 6900488 13006441 15303583 10266572 2203123 -1349624 2202359 8735462 12125628
10085 12125628 9701830 4266405 703833 -137703 -2078978 -6628870 -9472862 -7542096
10077 -7542096 -4774900 -5171792 -5033460 232162 6131529 5456543 943704 524052 2745428
10068 2745428 -203024 -6073785 -3613131 8294057 16730006 13795232 6565992 3635751
10060 3635751 4249644 5538774 7936713 8396594 1467485 -7420940 -4462081 9625099
10052 9625099 15182295 2207647 -12650541 -11171532 -842661 -249620 -9315046 -13638362
10044 -13638362 -10647447 -11042556 -17249454 -19169089 -11990450 -3003522 1002791 1030194
10036 1030194 -347372 -1995382 -888524 4741897 9675216 8049904 3643809 4603881
10028 4603881 10167858 12213877 7776749 596674 -6860367 -13054272 -12773362 -4181755
10020 -4181755 2878732 -2068771 -13483259 -17186200 -12115077 -10365647 -16396688 -21617275
10012 -21617275 -21195173 -20920772 -23446348 -21926090 -13247057 -5448321 -5238702 -8104249
10004 -8104249 -7350554 -4430703 -3902750 -5086417 -4450878 -958928 4732829 11033279 13114963
9995 13114963 6367815 -5455183 -12172099 -9459813 -2547373 3764317 10475974 17097005
9987 17097005 17781059 9813647 -567893 -5831714 -5898833 -5580612 -7662694 -11533018 -14820699
9978 -14820699 -14286308 -8554788 -838442 4474983 7138194 8686722 7207251 949565
9970 949565 -5223914 -5191114 -1681426 -1935858 -4764639 -2640884 3761190 5393626 892107
9961 892107 181477 8003238 15536670 13991040 6281520 -709686 -5881971 -9613339 -8855633
9952 -8855633 -3654035 -664076 -3228671 -5379869 -2485366 29979 -3393384 -7237026
9944 -7237026 -3332929 4897044 7005698 1451026 -2799857 130435 6136897 8505081
9936 8505081 5663556 353583 -4028753 -5074487 -3209602 -2916888 -8544839 -17193970
9928 -17193970 -18891192 -7335655 10366326 18919422 11796310 -803033 -5288788 -2306016
9920 -2306016 -2906615 -8782424 -8496245 2904799 13162412 10156713 -559739 -6202929
9912 -6202929 -5531060 -4909855 -4010605 190908 2016007 -4528793 -11554476 -8453592 -2448561
9903 -2448561 -8800319 -23321384 -25903765 -12208715 -645590 -4039410 -14119492 -19334725
9895 -19334725 -19571184 -17467278 -12569216 -9446277 -14691006 -22079986 -18816605 -8591298
9887 -8591298 -7110553 -13433391 -12297724 -7406439 -18901566 -40557117 -40548351 -21909900
9879 -21909900 -35400399 -97811646 -140358603 -90547503 21240583 94717702 87051521
9872 87051521 49178676 35812477 39477872 31427924 16457197 14976818 23501539 24880644
9864 24880644 18370751 14225061 12713488 9206618 8210158 14616860 21090639 19119170
9856 19119170 13120009 10546474 7854070 -769886 -9757074 -9946174 -2724507 4490400
9848 4490400 9884972 14866415 17398460 16524198 16215958 17331963 14527874 8102783 7623813
9839 7623813 14964686 16379953 3298561 -11182457 -11212171 -3031556 -3923715 -14175693
9831 -14175693 -18533581 -11361487 -2181423 2416337 5253824 6650133 2589568 -2706566
9823 -2706566 2172297 17487260 28242510 23955371 11291962 1628934 -3081842 -5625430
9815 -5625430 -4957832 -709058 1466764 -2102198 -5053077 582503 11321357 15621008
9807 15621008 9047384 -477792 -2665537 4491724 14357753 18768456 15137916 8069666
9799 8069666 3785727 3204305 2910009 2617533 6554657 15229881 21331695 18797032 12243592
9790 12243592 11260140 16963743 20384157 14472263 2554196 -6405135 -6873533 418446
9782 418446 11048129 19789200 23022840 20805492 16413092 13230084 12381813 12810625 12380773
9773 12380773 9563872 5683390 4532954 7539865 10595576 9125160 5450907 6418203
9765 6418203 13089755 17798482 13677020 2908064 -7363615 -13562072 -16545376 -17011078
9757 -17011078 -14365842 -8999307 -2861386 994991 -1733734 -13334829 -27768739 -32439461
9749 -32439461 -21884154 -6322758 112439 -2641622 -2257322 6909798 15517313 13111162
9741 13111162 2985566 -2399013 2902118 12471236 16316612 11895456 5774475 5475770
9733 5475770 10492588 12840232 7244445 -1936526 -6604784 -4916222 -1131212 2189314
9725 2189314 6223387 11192483 15433716 18865474 21890527 21491725 14717655 5660482
9717 5660482 1757167 2838406 1736154 -3193971 -5044879 -490244 4057741 2782412
9709 2782412 -1232789 -3177452 -4176343 -5697474 -3813478 3221137 7612350 1006790
9701 1006790 -12411987 -19355193 -12242204 4557036 20509046 26367985 19669612 7965592
9693 7965592 3060526 7545636 11597247 7599059 1363363 1923587 6683395 6100286 -1344191
9684 -1344191 -8741172 -12264807 -13330960 -11646414 -6297671 -2421038 -6218304 -13233292
9676 -13233292 -11983395 -690706 9486982 10417925 6838533 6564423 9431038 11138110
9668 11138110 11277444 11618193 11072224 7971621 4417148 3559887 4310867 2836815 -1197733
9659 -1197733 -3043675 1414263 9404281 12609143 6692730 -1451028 -368757 10806347
9651 10806347 19666355 17031630 10189132 12296253 22548096 26451434 15609144 -1416731
9643 -1416731 -10100934 -5489558 5431332 11870727 7711045 -4207527 -14561170 -16620203
9635 -16620203 -12475173 -7716039 -2573699 6459486 18154269 26335589 27955506 25371854
9627 25371854 20529568 12880529 3626491 -3742838 -8179113 -11462810 -13380960 -11321376
9619 -11321376 -4988074 2914658 10268928 15268841 14095650 4909074 -6629196 -11935886
9611 -11935886 -9120214 -2631213 4610545 11830916 15550206 12858503 8339613 8745787
9603 8745787 11941811 10958012 7469605 8942066 12530504 6473898 -9373960 -19490966
9595 -19490966 -15409959 -8230685 -9648063 -13672312 -8821631 2241061 8484399 8024888
9587 8024888 6432997 3472887 -4485867 -12330361 -10470884 -510485 5894850 4407277
9579 4407277 2416455 4185574 3377506 -4521941 -11738549 -7586007 6805629 19873245
9571 19873245 23525946 20392799 17593711 17377453 15830409 9721805 2326346 514906
9563 514906 6484728 15111219 20356162 21308589 20056923 16780217 10357797 2106790 -4417243
9554 -4417243 -6711919 -4305098 2310675 11305291 18876525 21279946 17759503 11043177
9546 11043177 5563964 4576402 6826455 6542958 -10633 -8165278 -9336102 -2444896
9538 -2444896 4208426 4098527 133669 -1486407 363652 3455311 7492867 12669087
9530 12669087 16263765 15567845 12069098 8987488 7018569 5836614 6912666 11167244
9522 11167244 16484892 20783783 24246172 25210580 18511162 3368002 -10669203 -12197337
9514 -12197337 -840732 13584450 22889111 25961191 24281736 18891466 12395559 8506349
9506 8506349 8065230 8851492 9516178 10288704 10011198 6441638 182717 -4779173 -5216893
9497 -5216893 -1413687 3906954 7436248 7076536 4328239 3768379 7420853 10867715 8314570
9488 8314570 861626 -3951580 -1351290 4921251 7439137 4033012 197386 2180587
9480 2180587 8453513 10261023 2219303 -10007315 -16093182 -13285178 -7535738 -4105002
9472 -4105002 -3692313 -7214973 -15655823 -23359291 -20805941 -8271681 1804647 1133602
9464 1133602 -4375621 -6760987 -8357374 -13211224 -15575063 -9076003 -600037 -1579880
9456 -1579880 -9657611 -12651656 -8137737 -4939536 -6112803 -5293634 -1441432 -2457343
9448 -2457343 -9966426 -13929711 -8412014 -952967 751030 916284 6203998 13059183
9440 13059183 13753465 8872974 5181632 5327024 6699427 6702491 3394380 -4786425 -14597512
9431 -14597512 -18392924 -14663833 -12484476 -18586610 -25738583 -22639292 -10981599 -2848528
9423 -2848528 -3305324 -5241600 -1384673 6924656 13797629 15016167 9900024 2851173
9415 2851173 2227392 11059815 20029274 17584287 6405348 390984 4405257 7798478
9407 7798478 1899592 -6591141 -6649479 1093405 8121287 11637043 14721067 16651391 13239449
9398 13239449 6069297 2501979 5454089 10160527 12079567 11617568 10053958 7322073
9390 7322073 5344108 6985675 9577344 6282467 -2996075 -9064050 -6318757 -1423613
9382 -1423613 -2758241 -7092189 -5291090 2243441 5519490 4947 -7196878 -8380449
9374 -8380449 -5243165 -4191392 -6680980 -8438060 -5717218 813944 7098042 8835179
9366 8835179 4803642 -1909933 -6819987 -8120021 -6841466 -4141397 -553808 3155222
9358 3155222 6745245 10861539 14487768 14505353 10799793 8284556 9262162 8024660 83873
9349 83873 -7206253 -3237942 8505609 13490446 7407938 1894580 5338440 10661497
9341 10661497 9152191 4961394 5989453 9269138 6758823 -211071 -3334062 -285209
9333 -285209 4667650 9551629 14295683 14481870 5977199 -5938239 -12328699 -14207611
9325 -14207611 -19540480 -27009997 -25034314 -9916513 6181519 10893092 6673878 3944046
9317 3944046 5962134 7724312 5927189 2910499 1446109 581614 -2217889 -6768870
9309 -6768870 -9291010 -6745577 -2243634 -3451133 -13043780 -23302860 -24317226 -15879913
9301 -15879913 -6745281 -3412526 -4495734 -5217657 -2473847 3806085 9520728 7958484
9293 7958484 -2093619 -11537745 -10752648 -2536756 2403561 1456246 1946464 6748451 9120260
9284 9120260 5101487 507413 130642 -605284 -6173569 -11346609 -9785076 -6076502 -9431740
9275 -9431740 -18752212 -23443732 -18122014 -8348635 -1404559 1535652 2489558 1876094 -342213
9266 -342213 -2176021 -1257618 2184201 5611807 7002164 6471575 4986605 2317993 -2027259
9257 -2027259 -5548165 -3570726 4023646 10011759 8400826 3240959 2603708 5718960
9249 5718960 4629293 -1440011 -3693069 1327733 5190969 2193305 627443 9750175
9241 9750175 22602233 23573238 9950426 -5347240 -12106596 -13693823 -17848718 -25049289
9233 -25049289 -29492195 -26349261 -15621255 -2685554 4149553 972681 -6277929 -8046638
9225 -8046638 -2751309 3096379 5946033 8844281 12139618 9068274 -3455955 -15684411
9217 -15684411 -14867685 -2315895 6808904 1640816 -11964181 -19272376 -13103344 344829
9209 344829 9772551 9696919 3491529 -1952109 -3364116 -3280763 -5551791 -9231058 -8511367
9200 -8511367 -87697 10711107 14266697 7866809 -535267 -2004100 2556934 4994302
9192 4994302 1815104 -1558879 591479 5960325 7515830 2706899 -3620680 -4671688
9184 -4671688 1795914 11745385 18352059 17801247 12332453 6998166 3812261 847913
9176 847913 -3326595 -7294289 -9331904 -9153830 -6276366 -276604 5789100 6349886 558552
9167 558552 -5104249 -5075746 -2208287 -2518422 -5385690 -4968871 -154104 3454338 2325442
9158 2325442 -128748 276853 2608859 4558814 7707593 13892989 18772721 15286432
9150 15286432 4041433 -5347018 -5960811 -2310305 -3209264 -9078121 -12427049 -10252863
9142 -10252863 -8723560 -12667497 -16548528 -11616432 1268478 12142651 14126831 9640779
9134 9640779 4840165 3316197 6034510 12379512 19118509 21697299 18412078 11430919
9126 11430919 3815848 -1773983 -2443205 2588382 9069960 11233740 8154835 3096849
9118 3096849 -1694334 -4534491 -1484466 8159899 15503782 11227291 820185 -889870
9110 -889870 8384682 15499827 14447271 16058026 26858449 34017679 25107694 10197357
9102 10197357 7322818 14931056 17228332 11049860 7645803 10141188 9518460 4336677
9094 4336677 4732330 12229967 14025650 4660934 -3323392 320759 7474537 6710963 1415999
9085 1415999 768993 3701396 4791131 6865426 14177992 20666679 18979842 14916184
9077 14916184 18298544 24469397 20640455 7950250 891156 4861919 10218708 10573171
9069 10573171 11121438 14301134 12499136 2600703 -5345233 -3277182 1925351 558996
9061 558996 -4347858 -4560640 -1585362 -1843616 -3244275 63790 3889253 -519069 -9022253
9052 -9022253 -8066969 2938908 8195606 -507135 -10740204 -8601611 1673912 8311239
9044 8311239 11584831 18455329 24502513 18022202 963864 -10142728 -7122840 -213626
9036 -213626 -107219 -2869866 -956951 1916202 -1463710 -6617352 -3344837 6093890 8030128
9027 8030128 -2288581 -12963023 -12037214 -2745632 3528653 2957180 1194070 3209662
9019 3209662 7555736 9804453 7236049 241792 -8090015 -14133727 -17403488 -21018682
9011 -21018682 -26525951 -29808125 -25145353 -12890338 -331899 5427070 3517563 -1853686
9003 -1853686 -6329724 -8049485 -6967451 -3763884 -165783 745675 -3364788 -10476437
8995 -10476437 -14010429 -8665717 3297172 13535613 15849852 11172074 4327154 -1117606
8987 -1117606 -3453373 -1708056 2842799 6071504 5535907 4507415 7657957 13311755
8979 13311755 14616313 9363181 3884202 4341028 8096866 8356646 5133754 5646455 13106017
8970 13106017 20593744 19562607 11271057 5383970 8029622 15088482 17798394 11880495
8962 11880495 100066 -11212147 -16193528 -12603436 -4270080 501554 -3742227 -13329822
8954 -13329822 -18774885 -14921846 -5695680 1804481 4993706 5434819 3455841 -2358221
8946 -2358221 -10068621 -13219530 -7836394 1513506 6109241 2907176 -3198050 -6620935
8938 -6620935 -6442743 -3514635 2756636 10996596 15229206 11331093 4045408 1317081
8930 1317081 2712676 916718 -4872180 -6192906 465256 6034143 2657573 -2788467
8922 -2788467 712895 9649471 10818715 3059661 -168667 7367403 14190687 9473353
8914 9473353 -82480 -2106875 1840150 1468125 -3091839 -2012217 5534959 8038236
8906 8038236 261676 -7396785 -4441268 4561237 8009632 3333776 -2879838 -5549195
8898 -5549195 -4155475 583174 5318803 3141173 -7381445 -15130519 -8149802 8629114
8890 8629114 17498980 10607383 -1489811 -6057563 -2648343 3066742 9966288 18470430
8882 18470430 23889783 21044485 11824311 2436697 -2820356 -915938 9938877 23623646
8874 23623646 27245161 17527395 8504475 12171319 19150114 12997238 -2335571 -7922356
8866 -7922356 -1033254 131203 -12672694 -22495199 -13193243 5914590 14678840 8931072
8858 8931072 -973529 -8057988 -10746174 -5393132 7837993 17334374 13057867 2874298
8850 2874298 1665216 8645795 11332658 8599984 11348810 20072418 20976687 9123621
8842 9123621 -1918950 -1109388 4212769 2559527 -4279286 -8269424 -9342978 -11925497
8834 -11925497 -14972748 -15236953 -14280390 -14037020 -11861980 -7576417 -7720782 -14029878 -15921402
8825 -15921402 -5427334 7770849 9186068 1734721 423407 7905396 11230183 3717679
8817 3717679 -5133566 -5714632 -1268020 1294609 2790330 6545466 9887367 8702255
8809 8702255 5163907 4142018 5684289 6504899 5696921 4564870 4032020 5723135 11493677
8800 11493677 18285729 18681182 11584097 6931339 12723746 21624296 19234042 3866911
8792 3866911 -10943815 -13926495 -7440929 434753 6567324 11019259 11548453 6433182
8784 6433182 -686158 -4415353 -4090363 -2509324 -755062 1175144 1241831 -1580987 -3199534
8775 -3199534 213454 4125931 741649 -7642616 -9359547 -214927 9412060 9645126
8767 9645126 4891833 4637629 7594609 5803522 280170 50132 6031489 8215718 1715804
8758 1715804 -5372759 -5096252 -1114918 -434149 -1537995 1124632 6340821 8306418 6273348
8749 6273348 4209540 2998552 465646 -1875963 710886 8476276 15534907 16712981
8741 16712981 11970735 4231129 -3116381 -7058356 -7297027 -6913247 -7038344 -3321203 6721982
8732 6721982 15348813 11747709 -2466437 -13371734 -12236019 -4740851 413961 3459799
8724 3459799 8042817 11041934 6833112 -1743856 -5566491 -1846561 2907214 3269639
8716 3269639 1462774 1429243 2253283 1022819 -2183878 -6258112 -12369909 -20162484 -23209356
8707 -23209356 -15243799 -1344969 4213184 -5030284 -18196109 -19896033 -8897329 2619258
8699 2619258 6205346 5178144 4804590 3463970 -1515426 -5750459 -2595999 6768597
8691 6768597 14094161 13889274 8134036 2266794 277695 2738008 6400418 6877716 4013203
8682 4013203 2010037 1878445 -1426934 -9657623 -14552734 -8306828 3163424 7160307
8674 7160307 2520071 18853 4053324 5911724 -606445 -7904309 -6387931 453124
8666 453124 1653532 -5211278 -12248566 -13474166 -11136253 -9417388 -7575032 -1769159
8658 -1769159 8448713 17585766 19299967 14191647 9652888 9408629 7446635 -1588639
8650 -1588639 -10341240 -7693417 1936210 2176786 -9677009 -15749224 -3841207 13651922
8642 13651922 18697939 13177096 10577537 12077685 9155995 4183891 8142506 18472600
8634 18472600 18932081 5122068 -7585015 -7597720 -2265710 -1311467 -362183 7477083 15900383
8625 15900383 15015354 8584558 7937298 13485488 15241653 9582578 3803687 3817471 6842379
8616 6842379 7744997 5615123 2594592 943370 1531536 1915487 -2158108 -9617652 -12087012
8607 -12087012 -4559742 5592017 7187864 -71036 -6986889 -8472897 -7397805 -6435918
8599 -6435918 -5164126 -5001075 -7951312 -9785071 -3521044 8828904 16849427 15883670
8591 15883670 11513630 7824384 1791299 -6387853 -8439342 -929192 6126062 2552732
8583 2552732 -7070672 -11001528 -6970961 -1510594 2575093 7471602 11931393 11970477 8686658
8574 8686658 6066983 2548052 -5203386 -11282215 -5223332 10758491 21005399 16959729
8566 16959729 7871006 5432045 7674826 6030306 326680 -3107236 -3486397 -5756561
8558 -5756561 -10485983 -12161774 -7872934 -1225713 3192131 4405304 3579821 1926353
8550 1926353 425018 -1374008 -5691415 -12596976 -17092344 -14175122 -6017975 238907
8542 238907 1596693 1655910 3631553 5479346 3649301 -1644992 -6826951 -8688773 -6849172
8533 -6849172 -4243319 -5113576 -10050768 -13223021 -7931568 4347659 13896347 13369535
8525 13369535 5696088 -603782 -1533472 -235097 -782017 -2741763 -3064297 -1546475 -1824698
8516 -1824698 -5991751 -10212980 -8790589 -2424370 1530600 -1176188 -5506368 -4092349
8508 -4092349 2748911 8557657 10234952 10576234 11762284 11673513 7959885 2111416 -1716063
8499 -1716063 228742 8646586 18522891 20658329 10675939 -3964702 -10758424 -5665791
8491 -5665791 4794930 13421631 17518664 15246822 6057921 -3422281 -3446644 4801394
8483 4801394 8036425 -685036 -10890553 -9575052 478051 6919879 6781595 7945897
8475 7945897 14012035 18678761 16088829 8295611 858962 -2584703 -633051 5023900
8467 5023900 8708263 6399134 1978960 1801845 4053254 1346092 -6119508 -9246873
8459 -9246873 -4146939 1645500 1550689 335748 5680276 15589040 21695805 21195945 18081548
8450 18081548 14680532 9278684 2092030 -2689879 -2595016 -468793 -373936 -2568741 -4554540
8441 -4554540 -5450697 -6989865 -10128742 -12484497 -10716500 -5051243 532073 3076487
8433 3076487 3265917 2145476 -1656561 -8730791 -15725628 -19011578 -19041535 -17089411 -10881265
8424 -10881265 700877 11476961 14324841 12091236 13117974 16341990 11889469 -1228195
8416 -1228195 -10133232 -6823816 -698691 -3085219 -8597591 -4286172 8440396 15081878
8408 15081878 10012757 3882342 6284046 11957543 10011989 -156527 -8630771 -7469490
8400 -7469490 1560417 10794461 14807061 13902426 10745463 5863917 -901809 -5628922
8392 -5628922 -2634749 6289414 10818846 4705123 -5712925 -11019038 -11303484 -12020509
8384 -12020509 -12561310 -8749783 -3280112 -2497303 -4321107 -1287067 4447170 2363989
8376 2363989 -7654643 -11633835 -2377305 8788044 9481664 3939228 2487890 3280636
8368 3280636 -1890635 -10013667 -10007216 -1209740 5129754 3252450 -692835 -1595536 -2878126
8359 -2878126 -6868475 -8172281 -2975802 3003148 2896563 -733434 -679927 3777987 7621016
8350 7621016 9213802 11324502 13636081 11106552 1682839 -8973359 -13116721 -8840507
8342 -8840507 -454380 7094726 11871578 13906054 13178547 9925090 5927384 3772148
8334 3772148 4390298 6326259 7889623 8860444 9361024 8628745 6487661 4745171 5094874
8325 5094874 6595806 7371745 7662136 8380670 7718098 3062779 -3758942 -7367113 -5815695
8316 -5815695 -2527933 136255 4501458 11854915 17609054 17007368 12996041 13065040 18956838
8307 18956838 24065348 21371932 10648820 -2233975 -10125907 -9092090 -1771988 3333612
8299 3333612 -706523 -11609451 -20068020 -19624867 -11659152 -1364005 6729134 9070018
8291 9070018 4699347 -1179427 -556032 6808110 10845775 4069658 -6889330 -8826119
8283 -8826119 1076934 12336211 14594193 7535189 -3135291 -12807857 -18216153 -16237142
8275 -16237142 -7432269 1670059 4034450 -655370 -6305199 -6884053 -1148428 7218913
8267 7218913 12148035 9591045 1869221 -3540763 -1909045 3132217 4535577 1610801
8259 1610801 1281361 8519439 18456487 20896885 12159880 -221166 -5840440 -2691804
8251 -2691804 2359726 3626287 3147721 5500033 9962454 11950907 9931734 5992572
8243 5992572 864913 -5843922 -10641889 -8008442 1008830 8216837 8942106 7317664
8235 7317664 7714909 7527556 3541593 -737657 -864431 586048 -426937 -210477 7240760
8226 7240760 18448517 24003212 22837605 22716694 25977842 25418600 17233842 8271271
8218 8271271 5779448 7948356 9428521 8957199 6685947 1403576 -3904893 -1257883
8210 -1257883 10408076 19301172 15188197 4082198 -848240 1712566 2183717 -2961284
8202 -2961284 -7554890 -9161897 -13709925 -22999208 -28075925 -21169398 -6869849 4655457
8194 4655457 9768924 10744553 8439787 3032956 -1097451 815579 5607255 4541247
8186 4541247 -4468370 -12459428 -10413256 -1322334 2706729 -5205574 -18470893 -24394929
8178 -24394929 -17974325 -6051094 1850587 3560999 3328527 3840261 3482445 999144
8170 999144 -1670107 -2649906 -2805307 -3278138 -3234310 -2163977 -1605590 -1885012 153754
8161 153754 6348423 11922049 9703382 -245938 -9419537 -10536474 -5030274 843896
8153 843896 4105921 6119695 7531288 6227968 933398 -5808076 -9536441 -7574736
8145 -7574736 -410027 8930284 16036020 17527205 14113377 10122694 8189125 5665150
8137 5665150 -1067803 -9703895 -13436644 -10038679 -5329834 -5017562 -6596345 -3445224
8129 -3445224 5172377 13140151 16059191 15863388 15887256 15861283 14157311 11483315 9302037
8120 9302037 7044248 4052535 2379067 4068116 6711736 5566077 294460 -3728651
8112 -3728651 -1832414 4681072 10596479 11871020 7755361 465587 -5345778 -4878359
8104 -4878359 2328308 10890277 14586578 12217577 6716119 -49258 -8006195 -14650552
8096 -14650552 -14840430 -7537333 483013 1827266 -1799269 -1484508 6638547 15077709
8088 15077709 13478920 1088330 -12384237 -17564772 -14216301 -9031936 -7323935 -8631277
8080 -8631277 -9391745 -7773389 -4980457 -2485319 581900 6103655 13267958 17934962
8072 17934962 16969876 12183002 8221169 7155948 7412644 7872111 9829553 13594909 16324990
8063 16324990 15867458 14132671 13165159 10421199 3155087 -4170717 -4142297 1261009 1092228
8054 1092228 -7901393 -13669162 -5608611 8057168 10724724 1475189 -4344415 1422253
8046 1422253 9590689 10906905 9681413 11676974 10380565 -1649730 -15438896 -14882930
8038 -14882930 -886778 8655565 4506006 -2003267 2174349 12582346 15423715 7560310
8030 7560310 -1287362 -3323875 -1006771 -259985 -2057671 -3702242 -4810685 -7903623
8022 -7903623 -13372258 -17658251 -18734924 -20248555 -25184155 -27257106 -16853155 2845080
8014 2845080 15406538 12440484 5781992 9284370 17375768 15056010 2863231 -4715047
8006 -4715047 -3215323 -2406113 -5237903 -1767493 9819158 14457072 3204630 -10192868
7998 -10192868 -9001628 2079186 6533380 1068737 -3948386 -3233508 -1234430 -879152
7990 -879152 1200 2488328 6297168 12969019 20875205 21592882 10891912 -1450346
7982 -1450346 -3287732 3156392 7227903 7297799 9379581 12668123 10982054 6276719 6152968
7973 6152968 9220212 7627467 3288417 5724906 13105563 12099014 -435280 -11757536
7965 -11757536 -13549719 -12152986 -13092208 -11354738 -4764923 -2051143 -8097510 -14338092
7957 -14338092 -13615722 -11866669 -14233690 -12195987 2014804 18406243 21391597 11862404
7949 11862404 3000892 -322202 -3560205 -7462454 -5719979 2258606 8416411 7898146
7941 7898146 4917823 5059285 8534016 12176896 12924537 9328216 3834359 2075005 5643418
7932 5643418 8079461 2897159 -6990174 -12870321 -10782055 -3929989 2391156 3696432
7924 3696432 -2272061 -11884085 -16607479 -12336942 -4218623 1685702 6049257 10457377
7916 10457377 10523407 2591278 -7669826 -11760561 -9987484 -8951497 -10621904 -11296509
7908 -11296509 -8552490 -2572365 6074534 13786575 13722055 5155473 -2142646 -328117
7900 -328117 5726192 8339792 10137031 15999190 19147889 9863668 -6213971 -13961460
7892 -13961460 -10983873 -8607070 -11349733 -11488221 -5743552 -1501565 -2401257 -2330811 901321
7883 901321 -489795 -10017893 -18672787 -18200624 -12197785 -6994866 -1586809 5765294 10248137
7874 10248137 8135231 3900306 1928334 -1267231 -8391325 -12322787 -5475875 6813085
7866 6813085 11893526 6170364 -2064040 -4372582 -64241 6507077 11053435 11985972
7858 11985972 10918734 9661936 6362835 -1308209 -8627971 -6433345 5556291 15052444
7850 15052444 11976469 1164857 -5228194 -2895955 2958817 6616696 6061920 1328595
7842 1328595 -5422660 -10005773 -10500826 -9123475 -7132245 -2374163 4361330 6129737
7834 6129737 -998626 -9768610 -9535266 183504 9962897 12504482 8969868 4579483
7826 4579483 2753088 3006067 1301983 -6178175 -17053853 -23228391 -20542190 -14798490
7818 -14798490 -14149232 -18400201 -20641597 -17474534 -12561095 -10461761 -10992349 -10492516 -6893506
7809 -6893506 -2895171 -3386804 -8367023 -10459496 -3576894 7535669 12472070 9171926
7801 9171926 5176532 4535484 2718561 -2865967 -7092063 -6806824 -7386177 -13358519 -20313754
7792 -20313754 -22756115 -22562486 -22684661 -20065795 -12831166 -7193957 -8012984 -8976636 -2247565
7783 -2247565 7594671 9975797 4592072 472194 1555795 3598873 3863802 4365324 6101673
7774 6101673 7663616 8235011 5958081 -2678808 -14754931 -18084295 -6242631 8969482
7766 8969482 11571225 3186916 -2254549 -1542960 -4171972 -12298128 -15594600 -9508914
7758 -9508914 -3737695 -6409307 -11606068 -9433298 197391 9556457 12191522 6563487
7750 6563487 -2908148 -6706844 602220 11411190 13680733 8188267 6395485 10743051
7742 10743051 10348508 -349212 -12004625 -15094882 -12122506 -8551874 -3256749 4045903
7734 4045903 6581171 996893 -4776472 -3177637 1458668 1866153 365916 2473488
7726 2473488 4756430 -81429 -10268679 -16845155 -15649114 -9694513 -2754279 2487178
7718 2487178 3291884 258044 -1611425 -332057 -526006 -4771904 -8312377 -8548734 -11514339
7709 -11514339 -20317046 -25447256 -17852277 -5045436 -1499056 -7578296 -11099973 -6755026
7701 -6755026 -532019 3706655 8469605 13131564 13168358 10619555 13137280 19917561 20266540
7692 20266540 10103613 -899963 -3601810 -1215125 -1313717 -4430491 -6691301 -6974489
7684 -6974489 -5768187 -2701294 66384 -1935463 -7254260 -7160040 1788865 10199190 7776179
7675 7776179 -2481557 -9662268 -10347403 -10076341 -11603337 -10579385 -3761483 5226329
7667 5226329 10161193 7936386 -462960 -10254528 -13901078 -7068353 4988281 11637562
7659 11637562 9347029 5338038 6350735 9213429 7671383 4180347 6910900 15902317
7651 15902317 20829546 15344219 6233143 3032565 4514341 3115884 -1062316 -478812
7643 -478812 5863981 8719106 2398689 -6112153 -7646635 -3947095 -2722247 -3906993
7635 -3906993 -20498 10215502 17156975 12308607 -368262 -9544766 -10173020 -7652293
7627 -7652293 -8884466 -13526388 -16580391 -16922357 -18304273 -21437627 -20710130 -12630749 -3143006
7618 -3143006 -572027 -3999725 -5563026 -2730139 -368370 -822496 -545019 2084659 4157407
7609 4157407 5530332 9804617 15128029 13651824 4541078 -2187210 -485133 2596826
7601 2596826 -896076 -8231938 -14078041 -19827701 -25547175 -23148476 -9457404 3166948
7593 3166948 2648426 -4298037 -3570181 3967046 7277154 5654276 6743820 8880616 4393520
7584 4393520 -2267372 454346 9090197 8657856 -957581 -3890007 3424513 5884897
7576 5884897 -1920522 -4493903 6723934 16615986 12252994 5626150 12324038 23663712
7568 23663712 20677504 4651907 -6713238 -6309104 -1932780 1155259 4009220 3388845
7560 3388845 -5729740 -17600200 -19979582 -11248559 -1518687 2842140 4857678 7776291
7552 7776291 10500731 11969015 11804495 8108593 1867839 -250510 4310560 6680221
7544 6680221 -935852 -10915806 -10302401 -529344 6170257 6412310 7187037 9638829 6651875
7535 6651875 -2491989 -9162212 -9506892 -9250573 -11820039 -12808879 -8825685 -2098760 5077795
7526 5077795 11079449 10578307 362135 -11166472 -12489568 -6226258 -4200090 -6111555
7518 -6111555 -36160 14004626 19898974 10907370 1031402 1738635 4375965 -1956153
7510 -1956153 -10029283 -7230476 2454372 5366037 -44463 -3602673 -1310683 976463
7502 976463 -187284 -1633983 -1107243 61022 1124230 1826941 107422 -3893053 -4806205
7493 -4806205 338587 5267144 2639569 -4463765 -7178228 -4104792 -1697850 -3221853
7485 -3221853 -5289456 -4837293 -2712182 -210291 2767378 6243074 10267329 14839682
7477 14839682 17186338 13147483 4873818 1738611 8118688 15554095 13748356 4454094
7469 4454094 -3202715 -6566063 -9451102 -11512734 -7907396 557488 5669057 1860789
7461 1860789 -7580395 -14835380 -13971233 -4550216 6657861 9964129 3740083 -1880259
7453 -1880259 2281521 11777799 15215885 9878293 2884731 -156517 867617 5737171
7445 5737171 14159843 21728640 23472546 20618050 17084435 11930728 3406662 -2832651
7437 -2832651 -77672 6691357 5809907 -3512211 -10007131 -7482521 -1565042 2468426
7429 2468426 6589225 11089203 10213917 2295157 -5145200 -5963194 -2893858 160022 4505308
7420 4505308 9862711 10105992 2870744 -4008684 -3158134 1359241 1104404 -3946194 -7102651
7411 -7102651 -5300305 -615429 5346985 11910622 16386443 16427837 13873219 12111289 11619019
7402 11619019 11353173 11534984 11682493 9475650 5421218 5033003 12121331 22988492 31095030
7393 31095030 34193589 33198265 28026629 19342962 11151453 6625899 3661528 -1087463
7385 -1087463 -5979206 -6350837 -984091 6697615 12153772 12331854 7685068 3569091 5634541
7376 5634541 11637904 13062093 7946331 5604464 13279297 24352352 27369952 22244908
7368 22244908 18703456 20846591 22209762 16741674 7444562 1729109 2360420 4926392
7360 4926392 2668967 -5928285 -13626087 -11254952 386254 9859641 9303791 3964919
7352 3964919 2748711 5084230 4701329 2131760 4060380 11682527 18572619 20375831
7344 20375831 18841294 15614545 9889424 4128922 4659637 12789371 20648116 19956935
7336 19956935 11713057 4058267 2899085 7084323 11100527 10382133 4547751 -3477734
7328 -3477734 -10973621 -16845842 -19480705 -16246188 -7412758 1853010 6268668 5542953
7320 5542953 2743296 294374 -86110 2908330 7203340 7780750 3908669 1911452 6268717
7311 6268717 12399669 13731321 11223019 9214256 6650033 881876 -3819071 -1480417
7303 -1480417 4334606 4962918 907164 582097 5071517 6156046 1321958 -1455886 2043916
7294 2043916 4731449 893329 -3654380 -1626138 3742881 5114906 3255687 4293148
7286 4293148 8901288 12072664 11122336 7309791 1582435 -5115661 -8532004 -3901413
7278 -3901413 7319165 16886475 16787082 6267848 -6893818 -12173874 -6064673 3884576
7270 3884576 7910832 5748106 4336847 5409145 3873910 -627368 -796993 5560009
7262 5560009 9647253 5188160 -664204 1690348 9135104 11040642 5031203 -1652173
7254 -1652173 -3517252 -1200107 3076066 6701883 5637584 -481529 -4602906 -792035
7246 -792035 6492280 9388369 9123961 11761600 14579686 8940410 -3390356 -9493770
7238 -9493770 -3884249 3477127 2659870 -2490231 -2370461 4371727 11719297 15481937 15144207
7229 15144207 10826016 4273609 -258975 -767494 -109321 -359593 1117456 5694509 8368759
7220 8368759 4434298 -2470805 -5422157 -4651834 -6138299 -11165349 -14139450 -11010474
7212 -11010474 -4010586 2825743 7864372 10634717 10950838 10425388 10833212 10200957 5019735
7203 5019735 -2639973 -5578327 -1475167 2778115 609019 -5031621 -7223002 -6024822
7195 -6024822 -6888571 -9856996 -8369584 -66201 8618488 12086698 13489421 17715255
7187 17715255 21329436 16733060 4413953 -6228172 -8749108 -6210608 -4530527 -5174846
7179 -5174846 -7176256 -11113534 -16689859 -19838016 -17023936 -10676057 -6237240 -4966888
7171 -4966888 -3459193 316044 4002708 3862143 -1747806 -11290656 -19955936 -21971661
7163 -21971661 -16566338 -10674580 -11287601 -15201560 -11560688 3757968 21181802 28174472
7155 28174472 23423646 16221943 13784495 13781685 9541841 -838791 -11850038 -15512017
7147 -15512017 -8642363 3582390 11584833 10407628 4384363 1112123 1765349 733264
7139 733264 -5022690 -10836546 -11171500 -7653436 -5641638 -5272308 -2211894 2871384 2850454
7130 2850454 -4768120 -11523711 -8460320 940188 4886365 -1353555 -10824616 -15577391
7122 -15577391 -15605794 -15389650 -16565847 -16570704 -11654592 -420304 12638920 18169720 11959508
7113 11959508 3228086 5196612 16383926 20844828 10767982 -1775190 -3203770 1495266
7105 1495266 -1073800 -9577053 -10131851 426387 9076983 7217959 2824811 5549688
7097 5549688 10715299 7210613 -5402641 -16504243 -17754229 -10128916 -152930 5323207
7089 5323207 2539369 -6159385 -13684640 -15286428 -12429935 -8408557 -4427810 -2044623
7081 -2044623 -3371930 -4975324 1370570 15321697 22196738 10216802 -11012936 -20556308
7073 -20556308 -12762114 -1853704 409875 -1450683 626556 4122965 3074553 352125
7065 352125 2319636 6406926 4631807 -2680198 -6797392 -4491584 -2883850 -7733088
7057 -7733088 -14333022 -14626276 -8567317 -3306899 -3201057 -4974154 -2780906 4474850 11681508
7048 11681508 12841373 7554789 1505274 -59841 2115720 3808992 3413345 2359400
7040 2359400 843067 -2543051 -7148794 -10714411 -13597247 -17448410 -19264472 -13555916
7032 -13555916 -2824632 1786969 -4384545 -10588872 -4541938 9857951 17951337 14259122
7024 14259122 6577947 1261370 -3925217 -9921907 -10503663 -2078593 8827009 14138270
7016 14138270 13744646 10576513 3272113 -8241501 -15771131 -11740391 -2317258 -1263352
7008 -1263352 -10756737 -18166857 -14151938 -5024055 -2214647 -6062763 -6921905 489221
7000 489221 10509077 14877113 12828239 9799217 8251874 4709309 -2102591 -4912719
6992 -4912719 3518169 16641619 18235821 4147629 -8807228 -3800019 12429451 18030742
6984 18030742 5586570 -9038227 -9267557 1801915 8974169 4891489 -4508114 -9900276
6976 -9900276 -7549723 -274788 6050486 7551390 5835825 5102711 5591198 3464176 -1956070
6967 -1956070 -5556105 -3421404 1624816 4288450 3237055 834128 -181890 2404356
6959 2404356 8925855 15061342 14541660 7339945 973925 720773 3105932 2665292 224897
6950 224897 -483794 -187792 -2029317 -4839311 -4412173 -287610 3744002 5442544 6604375
6941 6604375 9899137 15393155 19456256 16710695 6015470 -5432415 -9375904 -8675550
6933 -8675550 -14196054 -26402653 -30057935 -14736576 8190293 19447823 16205365 10970985
6925 10970985 11117241 12612654 11885892 10692191 8912617 4275429 -17948 1480234
6917 1480234 5164688 2169272 -5565733 -5965631 3964804 13001011 13784707 12324746 13662079
6908 13662079 12135947 4513779 -113601 5637315 14247298 15433556 11872289 10885266
6900 10885266 9609379 2258689 -5156978 -2424946 7220317 11498743 7682739 2764313
6892 2764313 -1498504 -8217812 -12262079 -4774725 8438088 10660498 88449 -5448787
6884 -5448787 3832526 14178911 11006459 2399956 5424119 18692490 24429331 13896198
6876 13896198 -2915998 -12346409 -11151706 -4858138 -204606 -579034 -3616668 -3029196
6868 -3029196 3526688 10230837 10810057 7467191 6796690 9761142 12120293 12525377 13088132
6859 13088132 13265079 10657695 7615048 9456424 15187211 17249376 12552878 7164339
6851 7164339 7269013 11462159 15280598 17586671 18120405 14031807 4825664 -2834436 -2168433
6842 -2168433 3132686 2143882 -8523246 -19192220 -19413498 -11357891 -6092298 -8231563
6834 -8231563 -9762039 -875026 16624901 30177269 29851926 18083408 5913043 1942362
6826 1942362 5912369 11272134 12334487 9274484 6830778 8141712 10866481 11029287
6818 11029287 9525214 11029349 15831156 17358050 10985593 1864720 -673747 5053227
6810 5053227 11668068 13030864 11224937 11641014 14808006 16271832 13237013 8314843
6802 8314843 5870916 6251097 5734205 2618583 765788 4051624 8733168 6488046 -3821051
6793 -3821051 -12890728 -12843495 -7459218 -5452201 -7527392 -6985713 -1168856 5204021 8146008
6784 8146008 8917710 9260331 8399019 6695083 6641581 8029679 7331238 3951642 1567228
6775 1567228 988871 -1814639 -6956142 -6871796 2625164 13131695 13110928 3236136 -5205947
6766 -5205947 -5165480 295514 5661591 8587217 7597030 2042251 -3474285 -1448220 8379813
6757 8379813 16734465 16482727 11796466 10957521 13917248 13179893 5602215 -3035039 -6511834
6748 -6511834 -6177771 -7150532 -9502295 -8058737 -1137824 5139198 4510735 -89422 187350
6739 187350 7584732 13878495 11435092 3489400 -956377 619575 2422316 -638861
6731 -638861 -7392649 -13757666 -16827357 -15014628 -8496396 -648873 4509865 7009678
6723 7009678 9603198 11863964 10472763 6084405 4155300 6626841 8224203 4435665
6715 4435665 -1607149 -4157127 -2443287 1025641 5427706 9662756 9300175 2022118
6707 2022118 -6121548 -6411468 1625201 10699391 15784489 17286485 15334749 8821722
6699 8821722 1266867 4877 6374061 12621908 11905814 6185406 781367 -3578542
6691 -3578542 -8544209 -12169386 -10807905 -5078039 552806 3039243 2460261 73939
6683 73939 -2304146 -2623804 -1081098 -518630 -2026506 -2841084 -1465628 -1367421 -5208739
6674 -5208739 -8570830 -5261493 2828975 7333156 4522117 -867775 -3188988 -1867612
6666 -1867612 833167 2726814 1294094 -4262308 -8839130 -4839134 7210874 16095714
6658 16095714 11798122 -3133294 -17070213 -20936516 -13520799 619262 13521445 16663681
6650 16663681 7613664 -5575782 -10870189 -4704439 4431350 6007205 -703419 -6309645
6642 -6309645 -2281472 9345355 18494187 18763209 13969798 11630642 13232150 14875768
6634 14875768 14903549 14635997 12432413 4898178 -4218548 -4545903 6912869 19301415
6626 19301415 21577003 16652823 14289735 14863704 10020609 -2402556 -13968606 -16975825
6618 -16975825 -12117251 -3639326 5161318 9382110 3558022 -10067998 -20095931 -17833144
6610 -17833144 -6968973 2200404 4274146 845970 -4550344 -8560461 -8078186 -3528929
6602 -3528929 -525905 -3606292 -9442748 -10639607 -5321524 1647403 6463665 10145744
6594 10145744 13617974 14268781 10236342 4367394 373945 -2383333 -6324265 -9558867
6586 -9558867 -7262127 575583 7471603 8517536 6273267 5683262 6612036 5847025 4007467
6577 4007467 4577396 6699751 5393056 354444 -1639577 3658663 11063228 12850113
6569 12850113 8622924 3815838 1518232 452676 -1336772 -5184119 -11853752 -18563025
6561 -18563025 -18656556 -9421794 2001256 6158859 3175631 1526088 6269517 14278421
6553 14278421 20123317 20775716 15300125 6014380 -584785 -175064 2729487 700137
6545 700137 -5228444 -7500987 -4323003 -1204911 -301691 1891126 4760908 2077590 -6187308
6536 -6187308 -10471743 -4941337 4560996 10649162 13372105 13668241 7874151 -3391789
6528 -3391789 -9824591 -4425083 5069434 7136683 2322536 -1878513 -5536500 -13295814
6520 -13295814 -20821704 -17704768 -3812623 8740882 11424855 7572100 3306229 -641040
6512 -641040 -5014793 -7492407 -6305877 -4078816 -5090978 -10876705 -18776763 -22691197
6504 -22691197 -17275844 -5038784 3429037 1192468 -5714812 -6279388 977185 7959597
6496 7959597 8965210 5381947 213139 -4487790 -5750554 -2488746 831257 85802
6488 85802 -1072006 2550516 6861311 3905977 -3669017 -5170253 991010 4804995 1257526
6479 1257526 -2702242 -1510764 217516 -2598684 -7453574 -11581606 -17252110 -23283348
6471 -23283348 -21252727 -8378348 4338576 5825137 -195727 -2984172 -1043889 -794881
6463 -794881 -3843973 -5829748 -5437836 -5590009 -7125450 -8728129 -11336330 -15612846 -17144687
6454 -17144687 -11570219 -2954878 271702 -3187997 -6908184 -6743093 -4495642 -2143989
6446 -2143989 482769 2074987 855491 61614 5566601 16269763 23299484 21552802
6438 21552802 16369660 15107322 16834326 15193944 8678493 2783918 2096757 4339302
6430 4339302 4085077 268452 -2832474 -2258625 -1032636 -3489393 -7735195 -7278148 -615985
6421 -615985 5575364 5128863 246403 -2460170 -401280 4059841 8002406 9167833 5576268
6412 5576268 -1189773 -4376435 730375 8894164 9983073 2346929 -4353451 -1444851
6404 -1444851 8310126 15410667 15271853 11398326 8543156 6830216 3795205 -223943
6396 -223943 -1528470 1816765 6610398 8434588 7963144 10395147 18092638 26445401 28470377
6387 28470377 21853766 10574889 1467312 -58268 6537597 15845044 20498909 17957063
6379 17957063 12355077 8878729 7825305 5242659 -1669001 -10566070 -15252795 -12141212
6371 -12141212 -6011096 -6003153 -13316090 -17697862 -11873113 -4329402 -7821856 -18163760
6363 -18163760 -18126289 -4179095 5364532 -4083610 -22252674 -28774937 -19655377 -7383632
6355 -7383632 -1544083 -1748802 -5582030 -11060593 -12657893 -5783113 4852980 9961773
6347 9961773 7810589 3736026 -23706 -4745145 -7915188 -6299340 -4912286 -11173071
6339 -11173071 -20377041 -19951541 -9867174 -4918878 -12010744 -18791714 -12900976 -640104
6331 -640104 4365831 2089908 2785082 7845691 7719656 -1074480 -8637557 -5381812 4731301
6322 4731301 9958657 5657401 -1808027 -4703131 -2617571 99245 2125450 5998029
6314 5998029 11602588 14112143 11028850 6838080 6487403 8105960 7574394 6628954 9195424
6305 9195424 12392553 10118477 4545450 3960820 8281174 7795419 30991 -3228736 6992268
6296 6992268 21576043 24395527 13238489 544663 -3476905 50409 4746141 6333669
6288 6333669 3988226 398818 758564 7205232 14796161 16982185 13523426 8514851
6280 8514851 3040286 -3691226 -7436364 -1821004 9855546 13800324 2135216 -14890428
6272 -14890428 -19712722 -8625390 4216546 4645441 -5390178 -12972964 -11478802 -6606258
6264 -6606258 -5528153 -6789186 -4883396 -137705 2400112 2225637 4513439 10947739
6256 10947739 15650368 13225658 6317425 1845916 3150298 8646818 14532234 15592264
6248 15592264 7547795 -6512454 -15276737 -10814958 483925 4739124 -1918046 -9222019
6240 -9222019 -7880253 -2343981 -3614475 -13176116 -20753083 -18153063 -9499641 -4638283
6232 -4638283 -6330113 -9044786 -8849287 -8027795 -8279816 -5772387 2081370 9549973 9392404
6223 9392404 4633275 5523973 14226232 20412025 15121119 2454015 -6815283 -8039907
6215 -8039907 -4251153 558570 3576682 1368055 -7248555 -16591579 -17964427 -9731380
6207 -9731380 -59011 2128502 -3231636 -8386653 -7263528 -2042260 505697 -1728813
6199 -1728813 -3222300 1367936 9122089 12445351 9269097 4559694 1723098 -1627813
6191 -1627813 -7659525 -13632988 -16019360 -14577714 -9739882 -1255000 7260081 8476255
6183 8476255 1236061 -5034203 -2071449 5592712 7826045 3665606 299743 -104952
6175 -104952 -2585657 -8266308 -10838068 -6939623 -1971050 -1501046 -3355356 -2883756 -795092
6166 -795092 -403243 -809034 1514148 6173960 8920878 7809943 5385101 4488153 4852039
6157 4852039 4474019 2366637 -629388 -2514492 -1581179 1433880 2755372 -857142 -7123027
6148 -7123027 -8960941 -2582865 6209019 7413046 -688583 -8384145 -6697271 1028566
6140 1028566 4821405 2638606 1551033 4458903 4968709 -523418 -4443688 548766
6132 548766 8113228 6251960 -4357956 -11000773 -7814274 -2968667 -3869024 -5636578
6124 -5636578 -1090752 5729634 5437991 -1301768 -4254190 697972 5583144 3221104
6116 3221104 -1426309 1021122 9562469 13545276 7851417 -173704 -1980520 276559
6108 276559 -949572 -5284710 -4528255 4223347 13499736 15852486 12380947 7251482 689420
6099 689420 -6596433 -8091194 739002 12498274 14995647 7628662 1615516 3032228
6091 3032228 5124200 1112191 -4168558 -2222962 5314498 8877338 4690397 -742132
6083 -742132 228491 8113643 17651784 23058756 21063611 12743157 4072920 1541438 5086497
6074 5086497 7727960 4418850 -1071909 -1410493 3779185 7493490 6024835 4539098
6066 4539098 8301390 12859594 9772144 756178 -1818930 9032176 24874392 32085269
6058 32085269 27100667 16369268 5581671 -3902347 -9922032 -8728581 -867190 7371289
6050 7371289 10279264 7374656 1493409 -3861265 -4855995 572366 9182880 13955559
6042 13955559 10616509 959120 -9932444 -17174941 -17889287 -13323374 -8514111 -6016117
6034 -6016117 -1566321 8668792 18416153 16950493 4762677 -5474531 -6206075 -4075732
6026 -4075732 -7132112 -12320399 -13232031 -12181568 -14318954 -15266524 -6625412 8235192
6018 8235192 15931058 11720821 5506167 5883791 8187001 4435462 -2697386 -4294903
6010 -4294903 488415 3168083 -1430414 -8459862 -11054456 -9839174 -10572408 -14915277
6002 -14915277 -18269010 -17173031 -14641113 -15147628 -16958724 -14354869 -7279015 -3298846
5994 -3298846 -7703770 -16278018 -21278835 -20349569 -15328494 -6994409 2466293 5765299
5986 5765299 -1538435 -10733148 -7796141 7051989 17869507 14749701 6692925 6061630
5978 6061630 9856941 7042460 -1965143 -6038707 -1667298 1937830 -2193225 -9266873
5970 -9266873 -11816944 -9561614 -5487252 435130 7764401 11567481 8284904 1812757
5962 1812757 -1988402 -3620330 -7156074 -12079346 -14266383 -13421713 -13125104 -13904949 -12252121
5953 -12252121 -7046204 -1592155 1954395 5583249 11226511 17180749 20179091 18319790
$$ [...]
##END NTUPLES=NMR SPECTRUM
##END=
