##TITLE=31Pdec_SR117_k
 DMSO-d6, 124 sc
 25.8.2022
##JCAMPDX= 6.0         $$ Bruker NMR JCAMP-DX V2.0
##DATA TYPE= NMR SPECTRUM
##DATA CLASS= NTUPLES
##ORIGIN= UXNMR, Bruker Analytische Messtechnik GmbH
##OWNER= root
$$ XWIN-NMR		Version 3.5
$$ Thu Aug 25 15:25:34 2022 Russian Standard Time (UT+4h)  she@DPX200
##.OBSERVE FREQUENCY= 81.013821
##.OBSERVE NUCLEUS= ^31P
##.ACQUISITION MODE= SIMULTANEOUS
##.ACQUISITION SCHEME= undefined
##.AVERAGES= 124
##.DIGITISER RES= 16
##SPECTROMETER/DATA SYSTEM= spect
##.PULSE SEQUENCE= zgpg30
##.SOLVENT NAME= CDCl3
##.SHIFT REFERENCE= (INTERNAL, CDCl3, 0, 248.564)
##AUDIT TRAIL= $$ (NUMBER, WHEN, WHO, WHERE, WHAT)
$$ ##TITLE= Audit trail, XWIN-NMR		Version 3.5
$$ ##JCAMPDX= 5.01
$$ ##ORIGIN= Bruker BioSpin GmbH
$$ ##OWNER= she
$$ F:/spectra/data/she/nmr/P31/1/pdata/1/auditp.txt
$$ ##AUDIT TRAIL=  $$ (NUMBER, WHEN, WHO, WHERE, WHAT)
(   1,<2022-08-25 15:24:52.12 +0400>,<she>,<DPX200>,
      <continue with go, POWCHK disabled, PULCHK disabled
       configuration hash MD5:
       00 E9 B6 7A A2 85 ED C7 34 08 36 98 17 FE 4E 26
       data hash MD5: 32K
       63 95 86 FA 6B 7F D8 D0 2F 95 64 28 5E 85 78 44>)
(   2,<2022-08-25 15:24:59.93 +0400>,<she>,<DPX200>,
      <Start of raw data processing
       efp BC_mod = 2 LB = 1 FT_mod = 6 PKNL = 1 PHC0 = -10247.29 PHC1 = 35.25665 SI = 64K 
       data hash MD5: 64K
       65 45 87 EC 40 D2 4E 50 AF CB 39 37 13 21 BE D3>)
$$ ##END=
$$ 
$$ hash MD5
$$ 28 D7 17 83 FD 3E 9D 32 AD 3C D0 98 59 A6 28 C8
##$RELAX= 
##$RELAX= 
##$RELAX= 
##$RELAX= 
##$RELAX= 
##$RELAX= 
##$RELAX= 
##$RELAX= 
$$ Bruker specific parameters
$$ --------------------------
##$DU= <F:/spectra>
##$EXPNO= 1
##$NAME= <P31>
##$PROCNO= 1
##$TYPE= <nmr>
##$USER= <she>
##$AMP= (0..31)
100 100 100 100 100 100 100 100 100 100 100 100 100 100 100 100 100 100 
100 100 100 100 100 100 100 100 100 100 100 100 100 100 
##$AQSEQ= 0
##$AQ_mod= 1
##$AUNM= <au_zg>
##$AUTOPOS= <>
##$BF1= 81.014009
##$BF2= 200.13
##$BF3= 200.13
##$BF4= 200.13
##$BF5= 200.13
##$BF6= 200.13
##$BF7= 200.13
##$BF8= 200.13
##$BYTORDA= 1
##$CFDGTYP= 0
##$CFRGTYP= 5
##$CHEMSTR= <none>
##$CNST= (0..31)
1 1 145 1 1 1 1 1 1 1 1 1 1 1 1 1 1 1 1 1 1 1 1 1 1 1 1 1 1 1 1 1 
##$CPDPRG= <waltz16>
##$CPDPRG1= <>
##$CPDPRG2= <waltz16>
##$CPDPRG3= <>
##$CPDPRG4= <mlev>
##$CPDPRG5= <mlev>
##$CPDPRG6= <mlev>
##$CPDPRG7= <mlev>
##$CPDPRG8= <mlev>
##$CPDPRGB= <>
##$CPDPRGT= <>
##$D= (0..31)
0 1 0 0 0 0 0 0 0 0 0 0.03 2e-05 3e-06 0 0 0 0 0 0 0 0 0 0 0 0 0 0 0 0 
0 0 
##$DATE= 1661426505
##$DBL= (0..7)
120 120 120 11 120 120 24 19 
##$DBP= (0..7)
150 150 150 150 150 150 150 150 
##$DBP07= 0
##$DBPNAM0= <>
##$DBPNAM1= <>
##$DBPNAM2= <>
##$DBPNAM3= <>
##$DBPNAM4= <>
##$DBPNAM5= <>
##$DBPNAM6= <>
##$DBPNAM7= <>
##$DBPOAL= (0..7)
0.5 0.5 0.5 0.5 0.5 0.5 0.5 0.5 
##$DBPOFFS= (0..7)
0 0 0 0 0 0 0 0 
##$DE= 6
##$DECBNUC= <off>
##$DECIM= 3
##$DECNUC= <off>
##$DECSTAT= 4
##$DIGMOD= 1
##$DIGTYP= 9
##$DL= (0..7)
0 0 52 120 120 21 21 25 
##$DP= (0..7)
$$ [...]
##$SUBNAM2= <"">
##$SUBNAM3= <"">
##$SUBNAM4= <"">
##$SUBNAM5= <"">
##$SUBNAM6= <"">
##$SUBNAM7= <"">
##$SUBNAM8= <"">
##$SUBNAM9= <"">
##$SW= 501.771253377433
##$SWIBOX= (0..15)
0 1 3 0 0 0 0 0 0 0 0 0 0 0 0 0 
##$SW_h= 40650.406504065
##$TD= 32768
##$TD0= 1
##$TE= 0
##$TE2= 300
##$TE3= 300
##$TEG= 300
##$TL= (0..7)
0 120 53 12 22 120 120 120 
##$TP= (0..7)
150 150 150 150 150 150 150 150 
##$TP07= 0
##$TPNAME0= <>
##$TPNAME1= <>
##$TPNAME2= <>
##$TPNAME3= <>
##$TPNAME4= <>
##$TPNAME5= <>
##$TPNAME6= <>
##$TPNAME7= <>
##$TPOAL= (0..7)
0.5 0.5 0.5 0.5 0.5 0.5 0.5 0.5 
##$TPOFFS= (0..7)
0 0 0 0 0 0 0 0 
##$TUNHIN= 0
##$TUNHOUT= 0
##$TUNXOUT= 0
##$USERA1= <user>
##$USERA2= <user>
##$USERA3= <user>
##$USERA4= <user>
##$USERA5= <user>
##$V9= 5
##$VALIST= <valist>
##$VCLIST= <CCCCCCCCCCCCCCC>
##$VD= 0
##$VDLIST= <DDDDDDDDDDDDDDD>
##$VPLIST= <PPPPPPPPPPPPPPP>
##$VTLIST= <TTTTTTTTTTTTTTT>
##$WBST= 1024
##$WBSW= 4
##$XGAIN= (0..3)
0 0 0 0 
##$XL= 0
##$YL= 0
##$YMAX_a= 10543
##$YMIN_a= -17504
##$ZGOPTNS= <>
##$ZL1= 120
##$ZL2= 120
##$ZL3= 120
##$ZL4= 120
##$ABSF1= 0
##$ABSF2= 0
##$ABSG= 0
##$ABSL= 0
##$ALPHA= 0
##$AQORDER= 0
##$ASSFAC= 0
##$ASSFACI= 0
##$ASSFACX= 0
##$ASSWID= 0
##$AUNMP= <proc_1d>
##$AZFE= 0.1
##$AZFW= 0.5
##$BCFW= 0
##$BC_mod= 2
##$BYTORDP= 0
##$COROFFS= 0
##$CY= -3
##$DATMOD= 1
##$DC= 0
##$DFILT= <>
##$DTYPP= 0
##$F1P= 0
##$F2P= 0
##$FCOR= 1
##$FTSIZE= 65536
##$FT_mod= 6
##$GAMMA= 0
##$GB= 0
##$INTBC= 1
##$INTSCL= 5.30512e-09
##$ISEN= 30
##$LB= 1
##$LEV0= 0
##$LPBIN= 0
##$MAXI= 10000
##$MC2= 0
##$MEAN= 0
##$ME_mod= 0
##$MI= 50
##$NCOEF= 0
##$NC_proc= -6
##$NLEV= 6
##$NOISF1= 182.463
##$NOISF2= 159.3651
##$NSP= 0
##$NTH_PI= 0
##$NZP= 0
##$OFFSET= 248.5645
##$PC= 4
##$PHC0= -10247.29
##$PHC1= 35.25665
##$PH_mod= 1
##$PKNL= yes
##$PPARMOD= 0
##$PSCAL= 0
##$PSIGN= 0
##$REVERSE= no
##$SF= 81.0140089999908
##$SI= 65536
##$SIGF1= 159.3651
##$SIGF2= -187.1042
##$SINO= 113.3802
##$SIOLD= 16384
##$SREGLST= <1H.CDCl3>
##$SSB= 0
##$STSI= 65536
##$STSR= 0
##$SW_p= 40650.406504065
##$SYMM= 0
##$S_DEV= 0
##$TDeff= 32768
##$TDoff= 0
##$TI= <>
##$TILT= no
##$TM1= 0
##$TM2= 0
##$TOPLEV= 0
##$USERP1= <user>
##$USERP2= <user>
##$USERP3= <user>
##$USERP4= <user>
##$USERP5= <user>
##$WDW= 1
##$XDIM= 65536
##$YMAX_p= 345258627
##$YMIN_p= -86561513
$$ End of Bruker specific parameters
$$ ---------------------------------
##NTUPLES= NMR SPECTRUM
##VAR_NAME=  FREQUENCY,     SPECTRUM/REAL,   SPECTRUM/IMAG
##SYMBOL=    X,             R,               I
##VAR_TYPE=  INDEPENDENT,   DEPENDENT,       DEPENDENT
##VAR_FORM=  AFFN,          ASDF,            ASDF
##VAR_DIM=   65536,         65536,           65536
##UNITS=     HZ,            ARBITRARY UNITS, ARBITRARY UNITS
##FACTOR=    0.620285442955139, 1,           1
##FIRST=     20137.2065510736, 0,            0
##LAST=      -20513.1999529914, 0,           0
##MIN=       -20513.1999529914, -86561513,   0
##MAX=       20137.2065510736, 345258627,    0
$$ Real data points
##PAGE= N=1
##DATA TABLE= (X++(R..R)), XYDATA
$$ [...]
39632G863328j193873k634553j257256j56747j117116k034199o34282J583188
39624D18490J547693n74008j679033m96025Q86815O96197j16097k14285j33726
39615C36021o39519r43231l99534j96551j279323k073086o28457J983743K880553
39606i59384J451177j29984l36103L6602p4861l00922M8565O49375Q04335M76659
39596A665459j9952o95245j594292k161982j479538O37463K881839L326354J594411
39587D154517l24358m48383M50768J02771j458405j681678L26722J985167J041935
39578D149056j087510j727554p40076K64924P92812J153977Q10832m42437j040065
39569B133959j1628O73210q84308k637852j405019J520353J873157p15766j971601
$$ y = [7863328, 6669455, 4034902, 2777646, 2620899, 1503783, -530416, -1164698, 418490, 1966183, 1392175, -286858, -782883, 103932, 800129, 684032, 469747, 336021, -303498, -1246729, -1646263, -1842814, -3122137, -5195223, -5823680, -3839937, -959384, 491793, 361809, 25706, 62308, -12553, -313475, -264910, 384465, 1188800, 1665459, 1645507, 950262, -644030, -2806012, -4285550, -3648087, -766248, 2560106, 4154517, 3830159, 3381776, 3832544, 3935315, 2476910, 795232, 1121954, 3107121, 4149056, 3061546, 1333992, 593916, 858840, 1651652, 2805629, 3616461, 3174024, 2133959, 2122331, 2795541, 1911233, -726619, -2131638, -611285, 1261872, 546106, -1425495]
39560a425495J36845K267775J281022r58338r45761J205970K690558K223601P31301
39551G207478q77907k351060l217438k978488j787364r0323J674264K575598J682599
39542A837359k98476j243165k31361J244074J277925l61668k391838l038132j148866
39533d354148K018875K786782n63763m026378k201792L587724O175631K720331
39525F143262j236574o45351J363827n83177m602379m338355O55485L917343J708387
39516B382468k069130k244144P56961K806239J830542p72127k689226k668053
39508b666470r06872J160423J957734J233525p236r17608j290569r75570j00922
39499b513565L29058n17726j714241j448419M72398K308696K632475J652687K93271
$$ y = [-1425495, -1288650, 979125, 2260147, 1301809, 356048, 1562018, 4252576, 6476177, 7207478, 6329571, 3978511, 761073, -2217415, -4004779, -4095102, -2420838, 154760, 1837359, 1538883, 295718, 64357, 1308431, 2586356, 2224688, -167150, -3205282, -4354148, -2335273, 451509, -112254, -4138632, -6340424, -2752700, 3422931, 6143262, 4906688, 4261337, 5625164, 5041987, 439608, -3898747, -3243262, 674081, 2382468, 313338, -1930806, -1173845, 1632394, 3462936, 2690809, 1583, -2666470, -3573342, -2412919, -455185, 778340, 771104, -146504, -1437073, -2412643, -2513565, -2184507, -2702233, -4416474, -5864893, -5392495, -3083799, -451324, 1201363, 1494634]
39490A494634q26391j386072j333029r10206j64998J028590J925885J188784p03155
39481C14042j033365J296229L266242J766091j422445k102991j03582Q30572o59455
39472B151338j795075q92773J42966P6912O74199K406415K082278j807438n017749
39463a978927l143351J378073K682657K20664j138315P43102K360557Q33210j629855
39454C27815j710501J29299J330501J224494P09109j40743j485793k072049p63290
39445b451158J078365J179058j49336n02217P24508J380313J8235j871204k127235
39436b720671p51898P49781J548479J624690P43169j050291k375362j636853O84289
39427c184667K217391J567598q9878q02922k84172K25553q8052p22873p41643
$$ y = [1494634, 668243, -717829, -2050858, -2961064, -3126062, -2097472, -171587, 1017197, 314042, -719323, 576906, 3843148, 5609239, 4186794, 2083803, 1980221, 2810793, 2151338, 356263, -536510, -393544, -316632, 357567, 2763982, 4846260, 3038822, -1978927, -5122278, -3744205, -1061548, -840884, -1979199, -1236097, 1124460, 1957670, 327815, -1382686, -1253387, 77114, 1301608, 2010717, 1869974, 384181, -1687868, -2451158, -1372793, -193735, -343071, -845288, -120780, 1259533, 1277768, -593436, -2720671, -3472569, -2722788, -1174309, 450381, 1193550, 143259, -2232103, -3868956, -3184667, -967276, 600322, 510444, -292478, -576650, -351097, -439149, -1162022, -1903665]
39418a903665K19623J817870L201006L236614J310309j596237l184099k033794
39410A067627N98782K023603J242120j25804l75915N7735q8279n24922o4574R51953
39400D762326R78980j4062l77981K40947J58746j157533j656308p8201J575241
39391D432155J106848m62252j098187j295803k219866k237390N49324L567484
39383B342313K510666j401692k284552J313566L749873J129458k512824j822554
39375C024254J442258J768879j131183k419158j53408K207059J721189j72605
39367F287285r64911o57827l87654j50969L32302L46440o35758j704379j636898
39358H27631l84480J337886K995525L975965L242349L42375l334130n083404l280666
$$ y = [-1903665, -1684042, 133828, 3334834, 6571448, 7881757, 6285520, 3101421, 1067627, 1666409, 3690012, 4932132, 4806328, 4430413, 4488148, 4399869, 3874947, 3810373, 4762326, 5741306, 5727244, 5349263, 5590210, 5748956, 4591423, 2935115, 2856914, 4432155, 5539003, 5076751, 3978564, 2682761, 462895, -1774495, -1225171, 2342313, 4852979, 3451287, 1166735, 2480301, 6230174, 7359632, 4846808, 3024254, 4466512, 6235391, 5104208, 2685050, 2531642, 4738701, 6459890, 6287285, 5322374, 4664547, 4276893, 4125924, 4458226, 4804666, 4168908, 2464529, 827631, 443151, 1781037, 4776562, 8752527, 11994876, 12337251, 9003121, 3919717, 639051]
39349F39051N95704K906152J643404j058499j455566J014967L339682L405856
39341A1030751K329405J474170R2221k153966l053007j004015J790976K354898
39333A2861433J417394J585465K631918K470698J759046L170181O255161P422343
39325C9573639N730855M643320O643589R586942J0113141P862705M636589J788253
39317I0579033K101m49463n34791j579176k692718j492110J677214L155028J201111
39308H9866229j036405p274L251543N274840N367119N543898O258686N217598
39300A19736234O57797o126365j1885500j4038534j2366331r008006o640817o164335
39292E4164143o486478o535774o323533n740506l927185r24980J228041M82053
$$ y = [639051, 1234755, 4140907, 5784311, 4725812, 3270246, 4285213, 7624895, 11030751, 13360156, 14834326, 14926547, 12772581, 9719574, 8715559, 10506535, 12861433, 14278827, 15864292, 18496210, 20966908, 22725954, 25896135, 32151296, 39573639, 45304494, 49947814, 56591403, 66178345, 76291486, 84154191, 88790780, 90579033, 90581134, 90131671, 89596880, 88017704, 85324986, 83832876, 85510090, 88665118, 89866229, 88829824, 88822550, 92074093, 97348933, 102716052, 108259950, 114518636, 119736234, 120394031, 114267666, 102382166, 88343632, 75977301, 66969295, 60328478, 54164143, 47677665, 41141891, 34818358, 29077852, 25150667, 24225687, 25453728, 25935781]
39284B5935781k465283m369719k645416J653331M224243J798064l564841o012333
39276A4553827k947643J448815J993205m05523j143521K34335k22163l318041
39268A0193291m526984j129499L283724M078065J482044j419777l071454l078286
39260E811124q40590K411655L250353P53066j332612j20516J891731J269455o37217
39251A2456449n90575P53436O77387j92236O79128K404816J856153o46056j684260
39242A5714242m59060M46546J5495R9248J361679J950466R59461j49690j79455
39233A9758932N76245J766666K921316K606124P98202R45815N539569J0654001
39225D5566870J0067072M665250K053248N825426J0881874J1387805Q058223M669431
$$ y = [25935781, 23470498, 19100779, 16455363, 18108694, 22332937, 24131001, 20566160, 14553827, 11606184, 13054999, 15048204, 14642681, 13499160, 13733495, 13511332, 10193291, 5666307, 4536808, 7820532, 11898597, 13380641, 11960864, 8889410, 5811124, 4970534, 7382189, 10632542, 11385608, 10052996, 9932480, 11824211, 13093666, 12456449, 11865874, 12619310, 13296697, 13104461, 13783589, 16188405, 18044558, 17398502, 15714242, 15255182, 15701728, 15717223, 15816471, 17178150, 19128616, 20088077, 19938387, 19758932, 20335177, 22101843, 25023159, 27629283, 28427485, 29373300, 34912869, 45566870, 55633942, 60299192, 62352440, 68177866, 79059740, 90447545, 98505768, 103175199]
39217A03175199K099959m43006j947190j329250j82634l60949p70789M54661K388121
39208A03084122K771210J628942R16420J699920L656142O091904P722732O799674
39200A34371066K997701k141150p512059j3055544j7218442j7026997j2655240
39193F7759335q732563q367354q760204n998995j509055L06973j106219k460511
39185C1131407k417618k833332m255599m446010k335654n1252L15146o15614j274527
39176A3216947j438376j526201j321851o28482K0292K84976O62191J341448J265983
39167A1876927o11453l345011m188275j462104K799835M156865Q40600l313601
39159F753783l112245J098768L731703J822376r72289l76460J988821J814806
$$ y = [103175199, 105275158, 104832152, 102884962, 101555712, 101373078, 101012129, 100241340, 100696001, 103084122, 105855332, 107484274, 108400694, 110100614, 113756756, 119848660, 127571392, 134371066, 137368767, 135227617, 127715558, 114660014, 97441572, 80414575, 67759335, 59026772, 50659418, 41899214, 35900219, 34391164, 34698137, 33591918, 31131407, 28713789, 25880457, 21624858, 17178848, 14843194, 14791942, 15107088, 14491474, 13216947, 11778571, 10252370, 8930519, 8302037, 8322329, 8607305, 9269496, 10610944, 11876927, 11265474, 7920463, 3732188, 2270084, 5069919, 9226784, 10067384, 6753783, 3641538, 4740306, 8472009, 10294385, 9322096, 8945636, 10934457, 12749263]
39151A2749263o49441j331561O26210J528257o38960l090472k909152j135896
39143E148248r4852L58543J384228K194085J315282n14329j267361p05082l05911
39134G512851n82608o13038j44709q2018m78344O9711K064206L578589K501870
39125A3826510m11944k224117j431108M40940J150338M06419m60122m48491M46934
39116A1295359J669730K099934M92440k614366m209882j995515K131403L997410
39108A2866513K496111N37472L80636Q81034L78387n60228r51964j354873k009115
39099A2663973j477866N18467J323392p61682l037397k235728J48502L23411j452008
39090F013064j579886M03250J022457r23475k163215n51090J404451R16694p49753
$$ y = [12749263, 12099822, 10768261, 11394471, 12922728, 12283768, 9193296, 6284144, 5148248, 5053396, 5411939, 6796167, 8990252, 10305534, 9791205, 8523844, 7818762, 7512851, 6930243, 6317205, 6172496, 6090478, 5612134, 5681845, 7746051, 11324640, 13826510, 13414566, 11190449, 9759341, 10200281, 11350619, 11757038, 11296916, 10848425, 11295359, 12965089, 15065023, 15557463, 12943097, 8733215, 6737700, 8869103, 12866513, 15362624, 15900096, 16280732, 17161766, 17540153, 16979925, 16027961, 14673088, 12663973, 11186107, 11704574, 13027966, 12266284, 9228887, 6993159, 7141661, 7465072, 6013064, 4433178, 4836428, 5858885, 4935410, 2772195, 2221105, 3625556, 4542250, 3792497]
39081C792497j056894m00219n35065j007691k88942R92306R34863l72403j123953
39072I34499q15958n92543q22875n69689L76417Q36611J05831q93898q98178J10101
39062b229682J071976J191459P97402Q49464J527594J694647M59748j099780j105245
39053C157583K63025P99536l76937j435919q17835K95440R0532q94311r27178
39044A53936j21859r0210j066848j480624l61391J499283K807017K812759J308120
39035E460183r62594k107797r43829R84608R19498j403117l246843k493146j48474
39026c941511J453846J516321Q87927L90260Q0111l80016j277577k316236k337919
39017e924794n11717J913547K385902L87104j350569l24953K093146K366021k88632
$$ y = [3792497, 2735603, 2335384, 1800319, 792628, 503686, 1495992, 2430855, 2058452, 934499, 118541, -474002, -1296877, -1866566, -1490149, -653538, -547707, -1441605, -2339783, -2229682, -1157706, 33753, 831155, 1680619, 3208213, 4902860, 5362608, 4262828, 3157583, 3420608, 4220144, 3843207, 2407288, 1589453, 1884893, 1975425, 1081114, 153936, 32077, -58133, -1124981, -2605605, -2966996, -1467713, 1339304, 4152063, 5460183, 4497589, 2389792, 1445963, 2430571, 3350069, 1946952, -1299891, -3793037, -3941511, -2487665, -971344, -83417, 306843, 386954, 6938, -1270639, -3586875, -5924794, -6436511, -4522964, -2137062, -1749958, -3100527, -3425480, -1332334, 1033687, 745055]
39008G45055k778097k320977J51606J849128J886763J534771J487511R06875n73066
38999B889569j653931j211922j97869l15926j308303j117835J004283K954227
38991A042293K307702l55039j927689o12985J838626K396245N61194j250102j161058
38982B839187l13116q73863k492392k557643p3650K613540K894691J138193n59749
38973B615198j519180k373259k714283j382582R27214J878289R20178J78202R35628
38964e34595J555137M80609q49272l70002R39610N58366j228756j515047N75651
38955c88299K261294J102155j601549k852004j847062k33090N94032P83541Q43975
38946a337007N63708l74298j306427q44103J422752L724588L532902O84750j900913
$$ y = [745055, -2033042, -4354019, -4202413, -2353285, -466522, 1068249, 2555760, 3462635, 2889569, 1235638, 23716, -174153, -490079, -1798382, -2916217, -1911934, 1042293, 3349995, 2994956, 1067267, 454282, 2292908, 4689153, 5250347, 4000245, 2839187, 2526071, 1652208, -840184, -3397827, -3471477, -857937, 2036754, 3174947, 2615198, 1096018, -1277241, -3991524, -5374106, -4446892, -2568603, -1648425, -1470223, -534595, 1020542, 1501151, 651879, 281877, 1221487, 1779853, 551097, -963950, -388299, 1872995, 2975150, 1373601, -1478403, -3325465, -3558555, -2964523, -2180982, -1337007, -773299, -1147597, -2454024, -3298127, -1875375, 1849213, 5382115, 6066865, 4165952]
38937D165952j752224j57590j40665j776969k165076k73562J252344M46247p98450
38928a199993k38839O55019n15057k177713r42596K173241K480755q63725k944191
38919c573099o20333K535132K041484n43418q00862J114916J305758q80196j927690
38910a348308k86227J431307J311158Q03566J068481P59220o04218r02875N70565
38901B802669J066897q12355j929653J50133K185269J70843l492322l281815N61551
38892b578783K467462N98216o96161J318386L295030J722558j467375k564548
38884B094785j718927j317336j430562n72874P59952P88166k61979m66740O99884
38875a425631J819475J659801K25273j642192k459987j045086J520801K397395
$$ y = [4165952, 2413728, 2256138, 2115473, 338504, -1826572, -2100134, -847790, -401543, -1199993, -1438832, -783813, -1298870, -3476583, -4419179, -2245938, 234817, -628908, -3573099, -4193432, -1658300, 383184, -160234, -961096, 153820, 1459578, 579382, -1348308, -1634535, -203228, 1107930, 1911496, 2979977, 3739197, 3134979, 2232104, 2802669, 3869566, 3057211, 1127558, 1277691, 3462960, 3633803, 141481, -3140334, -2578783, -111321, 486895, -209266, 1109120, 4404150, 6126708, 4659333, 2094785, 375858, -941478, -2372040, -2944914, -2184962, -1396796, -1658775, -2125515, -1425631, 393844, 2053645, 2278918, 636726, -1823261, -2868347, -1347546, 1049849]
38867A049849P70086q15812m45160L35160j22852k33423J503421K510795r7428
38858D454636l617125k859115J578532L727963J351942j072860j40101J258172
38850D682044l36922k633234j422345K277560L646621J221923j617572j941712
38842C876363m68712P59119R90890M29852n49903j151166o33898M80157Q10315
38833D543017j10978j417312k102714j688007j64568J539998J648327l78563k358645
38824d89445j812075M97159J572312O27908m6878P83340J109765p82344k932675
38815a472933k310658N62642K237892J112766q48378j305633l15935O92653R93179
38806f54405P06592Q1745n14498p16131q10612j399724k043977j436708M90498
$$ y = [1049849, 1819935, 1004123, 558963, 894123, 771271, 537848, 2041269, 4552064, 4454636, 837511, -2021604, -443072, 3284891, 4636833, 3563973, 3423872, 4682044, 4345122, 1711888, 289543, 2567103, 6213724, 7435647, 5818075, 3876363, 3407651, 4166770, 5157660, 5587512, 5037609, 3886443, 3252545, 3732702, 4543017, 4432039, 3014727, 912013, -775994, -940562, 599436, 2247763, 1869200, -489445, -2301520, -1804361, -232049, 395859, 348981, 1132321, 2242086, 1459742, -1472933, -3783591, -3220949, -983057, 129709, -718669, -2024302, -2340237, -1647584, -654405, 52187, 133932, -380566, -1096697, -1907309, -3307033, -5351010, -6787718, -6297220]
38797f297220J978906J844602J108814J059259J102655K00431q19558n50435K37660
38788a34886l67529j929494j882891M06103K350022J814402r2386j069273o51948
38779a557880O0742K29964l29992j314489j603860j47461K117994K880093J657903
38770A993014L72016l9139q96073k356425j941359J077049K946807O52485k660929
38761h52554j888470K040439L369245K62884k792798k131528L29132J281725Q92823
38752E10898Q85551R16517j18988j198306m90933J495316K441151J386944l30987
38743E497163j039251m86883J56377m73241k345773l658925k808835m92036J306527
38734d344877J961644K193676J952797O52070o81486k54809J204443R34639j409198
$$ y = [-6297220, -4318314, -2473712, -1364898, -305639, 797016, 997447, 177889, -372546, -134886, -502415, -2431909, -4314800, -3908697, -1558675, 255727, 163341, -905932, -1557880, -1497138, -1267174, -1597166, -2911655, -4515515, -4662976, -2544982, 335111, 1993014, 2365030, 2325891, 1429818, -926607, -2867966, -1790917, 1155890, 1808375, -852554, -2741024, -700585, 2668660, 2931544, 138746, -1992782, -1663650, -381925, 510898, 1396449, 2312966, 2193978, 995672, 504739, 2000055, 4441206, 5828150, 5497163, 4457912, 3971029, 4127406, 3654165, 1308392, -2350533, -5159368, -5651404, -4344877, -2383233, -189557, 1763240, 2415310, 1733824, 1479015, 2683458, 3618097, 2208899]
38725B208899k825179j547300N16165J331806J569091K012290J319195j100178
38717C484789k739332j477044Q14289J125091j44446n51441J56438M25960K78858
38708A373162J030870K312559K297712N55898j622029l137488l360209j676104
38700b225629J042826K007843J20930j634557m09536J717329R66810j651038j768669
38691a833691J023037K399936M21798j499807l90595J779248J715831l39056j820709
38682A455992j534231q9972J381061J412482q35512l495162l226489L5681K177786
38673b718364O11924j779863r63850K216428L486101J306630j580705k356275
38665a777974j110698M90021J276271Q60921m19368j256339l33765J819081K844780
$$ y = [2208899, -616280, -2163580, -1647415, -315609, 1253482, 3265772, 4584967, 3484789, 745457, -731587, 82702, 1207793, 1063347, 511906, 668344, 1094304, 1373162, 2404032, 4716591, 7014303, 7570201, 5948172, 2810684, -549525, -2225629, -1182803, 825040, 945970, -688587, -1098123, 619206, 1586016, -65022, -1833691, -810654, 1589282, 2011080, 511273, 120678, 1899926, 3615757, 3276701, 1455992, -78239, -168211, 1212850, 2625332, 1789820, -1705342, -4931831, -4896150, -2718364, -2106440, -3886303, -4850153, -2633725, 852376, 2159006, 578301, -1777974, -2888672, -2398651, -1122380, -261459, -680827, -1937166, -2270931, -451850, 2392930]
38656B392930J192105j692478k647161n27439J992499J376833k056625m001349
38648c970685j708787K078454K852075O74133l54576J373561K723666J191001
38640D858842j015439o42231J460876J902475k4632j787221j755742j045524r54868
38631I96536r53450j28601R92642J214860M32121l57912m66243k15736k47699
38622A266518o11208p44896j46113J132254K436838K725848J275646j166288k447288
38613C721311j458516j23782j022889l093254k517930J223816L611202J651783
38605A991741j182654k74465K668950K393631j296016l384893j829159p6865m76222
38596a465952q29530M36698R00944j063560k596924r86890J644541J963586O71997
$$ y = [2392930, 3585035, 1892557, -754604, -1282043, 710456, 2087289, 30664, -3970685, -5679472, -3601018, -748943, -74810, -429386, 944175, 3667841, 4858842, 3843403, 3201172, 4662048, 6564523, 6539891, 4752670, 2996928, 1951404, 996536, 43086, -85515, 907127, 2121987, 2554108, 2196196, 1729953, 1514217, 1266518, 655310, -89586, -235699, 896555, 3333393, 6059241, 7334887, 6168599, 3721311, 2262795, 2139013, 1116124, -1977130, -4495060, -3271244, 339958, 1991741, 809087, 534622, 3203572, 5597203, 4301187, 916294, -912865, -989730, -1465952, -2295482, -1858784, -957840, -2021400, -4618324, -5605214, -3960673, -1997087, -1325090]
38587a325090L88319R10822M87231k69308L57161J499207R54975r08598j756133
38578C38586r67926O7721M72884K73759n82579j383825l85657K289107L418376
38569C540446J011236k229894k784720j393885p63740n40490J108035K780210
38561G27198J637258j133149j597888N95892J912876Q35019n55275j017880j570089
38552a66038k058950q78663J193932J294900n54460j099006O25722J840625J159380
38543A357442O07673J149319Q74305o23056q07590P43707O98233j988799l289784
38534a278550p30193J917560P22276j877353j491906Q58817J255040K6744N34185
38525f3380K445250K157555n95003k131675j097444k13543q92619r39394P54323
$$ y = [-1325090, -936771, -25949, 461282, 191974, 549135, 2048342, 3003317, 2094719, 338586, -629340, -561619, -88735, 185024, -397555, -1781380, -2167037, 122070, 3540446, 4551682, 2321788, -462932, -1856817, -2620557, -3161047, -2053012, 727198, 2364456, 1231307, -366581, 229311, 2142187, 2977206, 2421931, 1404051, -166038, -2224988, -3103651, -1909719, -614819, -1169279, -2268285, -1642563, 198062, 1357442, 1965115, 3114434, 3988739, 3365683, 2558093, 3301800, 4000033, 2011234, -1278550, -2008743, -91183, 631093, -1246260, -2738166, -1879349, -624309, -597565, -63380, 2381870, 4539425, 3944422, 1812747, 715303, 501760, -390859, -1330253, -575930]
38516e75930J557583m46994k793149k262963K40190J401036N48544M6523J120785
38507a164375J938513M89863k244465l172831q00036K748559L851548J428974
38499C075750j764999k330769j78546J635219R36726q86759r66039J046901K420764
38490B988248J073223j429572j903356L6642J514095O53849q38057o45599N53021
38481B002494N93160m61759p58683o1192O4250p82055j392185j431089j610910
38472c837969j392023M08124K438156J700264j524307l146209j080535J757369
38464d677130K048461M74851n43137m92765J36734J528189K882911J947656j196487
38455B109283k765572n84157K171183J814328k42958o01531K15574m31930j809469
$$ y = [-575930, 981653, 534659, -2258490, -4521453, -4281263, -2880227, -2331683, -2285160, -1164375, 774138, 1264001, -980464, -4153295, -4953331, -2204772, 1646776, 3075750, 1310751, -1020018, -1198564, 436655, 1373381, 486622, -479417, 567484, 2988248, 4061471, 2631899, 728543, 765185, 2279280, 2933129, 2095072, 1449473, 2002494, 2595654, 2133895, 1375212, 1314020, 1378270, 596215, -795970, -2227059, -3837969, -5229992, -4821868, -2383712, -683448, -2207755, -5353964, -6434499, -4677130, -2628669, -2153818, -2696955, -3189720, -3052986, -1524797, 1358114, 3305770, 2109283, -656289, -1240446, 930737, 2745065, 2502107, 1900576, 2116150, 1684220, -125249]
38446a25249j206758O04901N02868j175088j101694R72137J677990j02520j616556
38437a569969j201072l94032k04566M26852J417500J014578l41764J52237K563045
38428A862809L216186N95976j936629j556366j29476l38057j329727j215479o47403
38419a478166p27879k44975J673660K714331P31212k134402k288417l9354J394867
38410c99123R89130N01914P18298M98433n41830j236647r14321q9359Q40206J777514
38400B144215K094437J292904J03986n28491q70330j402320j475649o14823M4173
38391G88102m89926j124498n70750K21700n5835k14195J403813L218773K287185
38382E464369o91088k000401n98947O06511j97595j179514o67750j1407o54003
$$ y = [-125249, -1332007, -727106, -224238, -1399326, -2501020, -1528883, 149107, 46587, -1569969, -2771041, -3165073, -3369639, -2942787, -1525287, -510709, -852473, -700236, 1862809, 5078995, 5674971, 3738342, 2181976, 2052500, 1714443, 384716, -830763, -1478166, -2206045, -2451020, -777360, 1936971, 2668183, 533781, -1754636, -1793990, -399123, 590007, 1091921, 1810219, 2308652, 1766822, 530175, -384146, -473505, 366701, 2144215, 4238652, 5531556, 5635542, 5107051, 4236721, 2834401, 1358752, 743929, 788102, 298176, -826322, -1397072, -1175372, -1231207, -1445402, -41589, 3177184, 5464369, 4773281, 2772880, 2173933, 2780444, 2582849, 1403335, 735585, 724178, 70175]
38373G0175j289373l58491Q79584L83563j138380j315774J82108J357296Q96521
38364c32771m17311j174323p76378N15211J872041K313933J568137L00604q68396
38355C000747j886359k455549j898501n86526j24695r41597j124899O70102K489503
38346b857774J594374j092005j846879M75590K738356K104317j40365r44559J80078
38337B11133J187580P34615o30989j962676k708570k200657j41513K223969K989119
38328b97989J955369O80177j07412j310492k923319k794859K16392L364341K870439
38319A652647q21155l275067j889059R81912J750161K62112r62420n93266M71952
38310b422183J105914J008722J45342j075892j268598M89848K697045K776167
$$ y = [70175, -1219198, -1577689, -698105, -314542, -1452922, -2768696, -2586588, -1229292, -332771, -750082, -1924405, -2700783, -2185572, -313531, 2000402, 3568539, 3869143, 3000747, 1114388, -1341161, -3239662, -3826188, -3950883, -4892480, -6017379, -5347277, -2857774, -1263400, -2355405, -4202284, -3726694, -988338, 1115979, 975614, 31055, 211133, 1398713, 2133328, 1502339, -460337, -3168907, -5369564, -5511077, -3287108, -297989, 1657380, 2337557, 2230145, 919653, -2003666, -4798525, -4582133, -1217792, 1652647, 831492, -2443575, -4332634, -3350722, -1600561, -1338449, -2300869, -2894135, -2422183, -1316269, -307547, -162205, -1238097, -2506695, -2016847, 680198, 3456365]
38302C456365O52856r21509k06805J263081J213940l48199j939818k811417k769368
38293b410874j246353J459642L108071J916513o26870j610954q32396n13008j136712
38284a892941o68084J457569K714684J403429m96779m61983P83237R80706K0022
38275C839860p58279j448361k732029l165331p25320L165964M548494K289738
38267E014736n35999j330926r57585r24986p05843K99135Q23561N8371l09843
38258A430621J077252K273835Q01343j951461k350957k1989J477873j76725k974458
38249d14666l552664j283261J693566L147880K495659P24315o48120q96238n65711
38240G00760l97580k46240K69126O89627L68604k91719m00359O3283N53249J011681
$$ y = [3456365, 4109221, 3187712, 2980907, 4243988, 5457928, 5109729, 3169911, 358494, -2410874, -3657227, -2197585, 910486, 2826999, 2200129, 589175, -243221, -756229, -1892941, -2561025, -1103456, 1611228, 3014657, 2517878, 2055895, 2839132, 3819838, 3839860, 3081581, 1633220, -1098809, -4264140, -4989460, -1823496, 2724998, 5014736, 4478737, 3147811, 2190226, 1265240, 559397, 858532, 1682093, 1740464, 1430621, 2507873, 4781708, 5583051, 3631590, 1280633, 1258644, 2736517, 2559792, -414666, -3967330, -5250591, -3557025, -409145, 2086514, 2810829, 2162709, 1266471, 700760, 303180, 56940, 326066, 1015693, 1384297, 1092578, 692219, 755502, 1308751, 2320432]
38230B320432J384507Q80777p23596j869767j200967L0336j77603j023480q2057
38221d61418K230185K724983N15717j380418p86323M97077J66716r16568r98896
38212A591055q23520j717048k229630k18154K760983K863960k37527k442743j031941
38203a484565J574638J595075p46316k007197p23526P05831k16970k329121k323739
38194e955890O49454L667038L749696J415962o21405j177580j254085j518913
38186a045723j259287j37676Q87571J088820R02904O88877P4167p26421n52957
38177g9725P50443J582501R67815K01327O78670J435272N96904j627266l145603
38168A360338k698371r71278O10687J076352L37206o55000o94325J21933M98875
$$ y = [2320432, 3704939, 4585716, 3862120, 1992353, 791386, 821722, 644119, -379361, -461418, 1768767, 4493750, 5009467, 3629049, 2842726, 3339803, 3506519, 2589951, 1591055, 767535, -949513, -3179143, -3397297, -636314, 2227646, 1990119, -452624, -1484565, 90073, 1685148, 938832, -1068365, -1791891, -1086060, -1303030, -3632151, -5955890, -5306436, -1639398, 2110298, 3526260, 2904855, 1727275, 473190, -1045723, -2305010, -2442686, -1555115, -466295, 436609, 1125486, 1199653, 473232, -79725, 670718, 2253219, 3221034, 3422361, 4101031, 5536303, 6133207, 4505941, 1360338, -1338033, -2309311, -1698624, -622272, -285066, -940066, -1634391, -1512458, -1013583]
38159a013583P4764l6123M29696L1424j511902j827028N24216K936417K133960
38150A741841q00778k060559q48475J42637k79620k10572J247153J920056K68068
38141A119751j686569j263669R08592J882674K90304k326044l467790k004944
38133f547695Q90275K681757K055097N51630M66635J422303J004749j134326k386932
38124i96507j243134L88992M81661P9431R54125K058062J200054q77678j208992
38115H36014P99584K375945J563084q6451k18430P78648O63032j146486k715958
38106B848982k294443n67842M25667q952n24122J93317J484619J628722L49086
38097C535034o81017j54076J019174R86723m89079j799325j707814p49801p6965
$$ y = [-1013583, -938819, -974942, -545246, -513822, -2025724, -3852752, -3328536, -392119, 1741841, 941063, -1119496, -1967971, -1825334, -2104954, -2315526, -1068373, 851683, 1119751, -566818, -1830487, -921895, 960779, 1251083, -1074961, -4542751, -6547695, -5657420, -2975663, -920566, -368936, 97699, 1520002, 2524751, 1390425, -996507, -2239641, -1850649, -1368988, -1289557, -335432, 1722630, 2922684, 2045006, 836014, 1635598, 4011543, 5574627, 5488176, 5269746, 6048394, 6711426, 5564940, 2848982, 554539, -13303, 412364, 403412, -120710, 72607, 1557226, 3185948, 3535034, 2854017, 2699941, 3719115, 4705838, 4216759, 2417434, 709620, -40181, -117146]
38088a17146J56247M35881N33409k24545j324269j159450N02088J512349K52375
38079E66939j544763j056038J118256J607958k16325q22988J659827L573356R86080
38070E872302l585116m111680J92167L722683K616952l80199r36485P14914J383562
38061E489100R3943j432540k052495k157028j979057j221077j77438M34946O03840
38052b397806P83930R27228P99280P04780Q86284Q41711J83026o03686j123731
38043A001016j725115k226222j463465M93362J346843j78458j671346l04807K451080
38034b277112K696809J28324j532470m49249Q49452J98596o79953K96650J577007
38025H08054O11205j591744j914429Q052J609718J507402P19029j9940j075916
$$ y = [-117146, 39101, 474982, 1008391, 783846, -540423, -1699873, -1197785, 314564, 566939, -977824, -2033862, -915606, 692352, 476027, -346961, 1312866, 4886222, 5872302, 2287186, -1824494, -1632327, 2090356, 4707308, 4327109, 3390624, 4105538, 5489100, 5583043, 4150503, 2098008, -59020, -2038077, -3259154, -3436592, -3001646, -2397806, -1613876, -686648, 112632, 817412, 1703696, 2545407, 2728433, 2124747, 1001016, -724099, -2950321, -4413786, -3920424, -2573581, -2752039, -4423385, -4728192, -2277112, 419697, 548021, -984449, -1433698, -584246, -385650, -1065603, -768953, 808054, 1419259, -172485, -2086914, -2078862, -469144, 1038258, 1757287, 1737347, 661431]
38016F61431j858568j052510M63658R2426j984561k126564J033964L509603J625532
38007C64411k027503k301739P36937K439065J163921N5725P20837M80644k022113
37998c89815l401469j087459J758665J169785r69072k43823K490986K422103q90193
37989H59708k516816k19773K206835J579323R1328M82460J034916o38392k435027
37980D44562j079049J822528J955699p93768k456298j512354n06541p63459k18559
37971c107239K019159L143366J091133j717381j859595J90690J446265R95107
37963B201505L69715L62455J81839n71612j282795j542155j315022k75737J411691
37954d60116K251104J203724k94914k25816P15238L07231j107703r88882O64664
$$ y = [661431, -1197137, -2249647, -1785989, -1693563, -3678124, -5804688, -4770724, -1261121, 364411, -1663092, -3964831, -3227894, -788829, 375092, 430817, 1151654, 1632298, -389815, -3791284, -4878743, -3120078, -1950293, -2919365, -3163188, -672202, 1749901, 859708, -1657108, -1876881, 329954, 1909277, 2000605, 2483065, 3517981, 2879589, 444562, -634487, 1188041, 3143740, 2349972, -106326, -1618680, -2125221, -2888680, -3107239, -1088080, 2055286, 3146419, 1429038, -430557, -239867, 1206398, 2201505, 2571220, 2933675, 3115514, 2543902, 1261107, -281048, -1596070, -1871807, -460116, 1790988, 2994712, 2699798, 2473982, 3189220, 3496451, 2388748, 1399866, 2064530]
37945B064530O86653j818745l236002j093977J568201J028589q96083o8500K565361
37936H00027K360900q36630j941520Q41316K653431j11332l761940l275773j81391
37927c452912O02746j013235r53059J430663K284675J30803j498047N0630K324716
37918i3020J855212o58194j904728p24321J054844J438587K67246q97334j49304
37909A88988K456751L865192J212432l660067n558617k758778N47889M35667j234919
37900d505462m52226K311298L116224J033099o30573K31302J619389J122232m74609
37891C370674j008482k91940K30913p8693o40537r78400j100682r41388m49606
37882a888141J0153Q7795k4147j11598n37952j518126k143218j142047J343611
$$ y = [2064530, 2751183, 932438, -2303564, -3397541, -1829340, -800751, -1696834, -1765334, 800027, 3160927, 2324297, 382777, 1224093, 3877524, 3766192, 4252, -3271521, -3452912, -2850166, -3863401, -4816460, -3385797, -1101122, -970319, -2468366, -2417736, -93020, 1762192, 1103998, -800730, -1525051, -470207, 968380, 1235626, 338292, 188988, 2645739, 6510931, 7723363, 4063296, -1495321, -4254099, -3706210, -3270543, -4505462, -4957688, -2646390, 469834, 1502933, 872360, 1103662, 2723051, 3845283, 3370674, 2362192, 2070252, 2301165, 2222472, 1581935, 603535, -497147, -1438535, -1888141, -1877988, -1790193, -1814340, -1925938, -2463890, -3982016, -6125234, -7267281, -5923670]
37873e923670L594604M102151K828023O48800j422914k145729n50135K378115
37865C509245L631492J442143k041495l209921j684602k49032k47462j25876O88077
37856A712569M2798k629602l623339j07113M490758M589765N50863k064433q70019
37847B092247P35797l960j182702n43049N53890J95092m97975K17439J451428
37838C018207J640306J299309J127398r3257k709425l833464j327292J980788
37830A102570K023794k57988p93398O29247K26770k866614m556832k125518J563225
37821e054744K484500R51751N6016P65258J372616P90955q5509k38227j4657l19863
37811G08096j195002j733741j226197O021J143183J889596K303420J929254L90395
$$ y = [-5923670, -2329066, 1773085, 4601108, 5249908, 3826994, 1681265, 1131130, 3509245, 7140737, 8582880, 6541385, 3331464, 1646862, 1397830, 1150368, 1024492, 1712569, 1755367, -874235, -4497574, -4604687, -113929, 4475836, 5026699, 2962266, 2092247, 2828044, 2824084, 1641382, 1098333, 1652223, 1847315, 1349340, 1566779, 3018207, 4658513, 5957822, 7085220, 6991963, 4282538, 449074, -878218, 1102570, 3126364, 2868376, 2074978, 2704225, 2930995, 64381, -4492451, -6617969, -5054744, -2570244, -1618493, -1562477, -797219, 575397, 1366352, 1280843, 1042616, 1027959, 708096, -486906, -2220647, -3446844, -3440823, -2297640, -408044, 1895376, 3824630, 4215025]
37802D215025j149569r30520M91461M58800j567545k513130l73535K103456J344150
37793B078593j435280k161250k11321J190891M67274m71027k50620j08925r07612
37784a809277j355572n65933L38353M77650O35621J217090J137787K3386o70743
37775e71638k2234Q73948R55052P85350J016006J163917R02810O39027O6476j558752
37765D249962k985372j683712J757934L049519m4668m212990n161905l011474
37757h042706n34663J349654L066968L541226J644339p72739r32537N41917P46526
37748F07985o81475j397252p25311m60558r56950k05779K020783K625235j66601
37739F60077l353015k937495N82570L154707K669612R20009J70599J98809l44737
$$ y = [4215025, 3065456, 2134936, 2626397, 3085197, 1517652, -995478, -1369013, 734443, 2078593, 643313, -1517937, -1729258, -538367, -71093, -542120, -792740, -901665, -1809277, -3164849, -3730782, -3392429, -2914779, -2279158, -1062068, 75719, 99105, -571638, -593872, 280076, 1235128, 2020478, 3036484, 4200401, 5103211, 5742238, 5808714, 4249962, 1264590, -419122, 1338812, 4388331, 4343663, 130673, -5031232, -8042706, -8577369, -7227715, -4160747, -619521, 1024818, 252079, -680458, -138541, 607985, -73490, -1470742, -2196053, -2656611, -3613561, -3819340, -1798557, 826678, 660077, -2692938, -5630433, -5047863, -1893156, 776456, 1696465, 1867064, 2065873, 1721136]
37730A721136j333310j489229o37611J633r5754J01512J179291J795647O52996
37721A896311j059464j199795j13038q5174j335442j427495M65802J720988M76392
37712f60915j074657j95846J857710K025556N04638n1743N40539r5795k079826
37703G69661k449040j65440J740574Q08736j144097j207919J82559N85632l90454
37694a269788j020275m53769N52862J230693J143134k91475k560306l166768m79309
37685f315001L032965L308418M80644j089905N78025J985933j32116l137364k202017
37676c490418K079042M193192J739576j322094q20642J836064K457990R2271k665995
37667D098986l806906l396918j794723P05600K612485K249885L57089m72607O68557
$$ y = [1721136, 387826, -1101403, -1739014, -1737381, -1833135, -1731623, -552332, 1243315, 1896311, 836847, -362948, -475986, -561160, -1896602, -3324097, -2858295, -1137307, -660915, -1735572, -1931418, -73708, 1951848, 2456486, 2404743, 2945282, 2849487, 769661, -1679379, -1844819, -104245, 704491, -439606, -1647525, -1464966, -879334, -1269788, -2290063, -2743832, -2190970, -960277, 182857, -108618, -2668924, -5835692, -6315001, -3282036, 26382, 507026, -582879, -4854, 1981079, 1848963, -1288401, -3490418, -1411376, 2781816, 4521392, 3199298, 2378656, 4214720, 6672710, 6764981, 4098986, 292080, -3104838, -4899561, -4193961, -1581476, 668409, 1025498, 552891, 1221448]
37658A221448J934917J557955p6451j548820j882634o87755J321727J884735m59728
37649C265394l370676k815746J111235L582036J694534j397623j351015J128024
37641A846163K051370K77095j585749j550518l99761L67539K30466p17709j882776
37632a363880k076720r08083K46138J65175k67497K19843Q89550N12099o5022
37623b648397M40976Q37464n34082j937531l61234K898032L201150l12037k982374
37614a398033j488924J593595K246505N38769q62856r12811k87119N12533Q37392
37605G79051k38324j732710r12452K198515L388582K46117l369159k662629Q10435
37596a492574J856448r4604p80903J346474K869244J511544n13124r84868j100741
$$ y = [1221448, 3156365, 4714320, 4637869, 3089049, 1206415, 518660, 1840387, 3725122, 3265394, -105282, -2921028, -1809793, 1772243, 3466777, 2069154, 718139, 1846163, 3897533, 4174628, 2588879, 1038361, 638600, 1006139, 1236605, 518896, -1363880, -3440600, -4348683, -4102545, -3937370, -4204867, -3985024, -3095474, -2583375, -2648397, -2207421, -1369957, -1904039, -3841570, -4202804, -1304772, 1896378, 1584341, -1398033, -2886957, -1293362, 953143, 1491912, 629056, -283755, -570874, -58341, 779051, 540727, -1191983, -2104435, 94080, 3482662, 3728779, 359620, -2303009, -1492574, 363874, 269270, -511633, 834841, 3704085, 5215629, 4702505, 3717637, 2616896]
37587B616896k071674k129950R7694K231307J433699j042599j823789m82873M68169
37578g03120j71200r25865l64837J053581J935061J284619q00637k621010j918380
37569c231788J216550L608200K779637J62803j376814j595759j813819j432721
37561a683711P86541K856185J369575k594414l887649q15906K171216J394035
37553d04128p30655m08987J274510J010152o27688n60224R29981P44183j148502
37544G8642j325125J099245K673541J101322j476839k405821k108119j704548
37536d067702m59682J761374K474656K10683k160621j239021J487044J814515
37528a78754o04834j916694k32786J800946J548827P1055m13722o0016k83728
$$ y = [2616896, 545222, -1584728, -1487034, 744273, 2177972, 1135373, -688416, -1171289, -703120, -874320, -1800185, -2165022, -1111441, 823620, 2108239, 1307602, -1313408, -3231788, -2015238, 1592962, 4372599, 4535402, 3158588, 1562829, -250990, -1683711, -897170, 1959015, 3328590, 734176, -3153473, -3969379, -1798163, -404128, -1134783, -1543770, -269260, 740892, 113204, -447020, 482961, 1227144, 78642, -1246483, -147238, 2526303, 3627625, 2150786, -255035, -2363154, -4067702, -4527384, -2766010, -291354, -80671, -2241292, -3480313, -1993269, -178754, -783588, -2700282, -2933068, -1132122, 416705, 487760, 74038, 14022, -269706]
37519b69706r72753r64696k03832M08007N33850K91069m96236j401203p71953
37510c847453J975522M196814K720098j315986l121754o33526K452301J842199
37502D268215j381110k667029n93848J660463J357209l91958j166560o13155K22636
37493F94863R37745J356035O10809j380209k638802j402998J043049J887344O78213
37484A786049m46145k54765J18144m02587j046847p50588P3235L93229J67648
37475c62627J29245N45518Q79984M80444n35054r72286K67830K207704K122795
37466D763553q40954l558727k539179J127429L015383J304717j327094j991775
37458d6647q95749L35055Q70202K52402j580173k807188j047383K607040L886429
$$ y = [-269706, -1242459, -2207155, -2410987, -2002980, -1469130, -1178061, -1674297, -3075500, -3847453, -1871931, 2324883, 5044981, 3728995, 607241, -26285, 2426016, 4268215, 2887105, 220076, -373772, 1286691, 2643900, 2251942, 1085382, 472227, 694863, 1632608, 2988643, 3599452, 2219243, -419559, -1822557, -779508, 1107836, 1786049, 1339904, 1085139, 1203283, 800696, -246151, -996739, -923504, -530275, -362627, -233382, 312136, 1192120, 1672564, 1137510, 165224, 433054, 2640758, 4763553, 3922599, 363872, -2175307, -1047878, 1967505, 3272222, 1945128, -46647, -942396, -607341, 262861, 515263, -1064910, -3872098, -4919481, -2312441, 1573988]
37449A573988J267015j582208j334668L59464N35819q5814O06348J618131Q55199
37440C813274n26462k34428M80924q77791k516834p13472K882878K575571j998617
37431B885043m256515p55207L180782J805541k199738k482433R50893K558266
37423A686632M82988j229760M6336J502799J56465k142107j960100K08877J067473
37414a80397k05675j135069k68977O89912j3961j342593j357138l07723K06198
37405c915423J63525Q92092K251537K476391J139888l6285k4254J47863r2575
37396C002759N71119K553047L386127R54172k853952m269163k415427L45643J882381
37387C156706J773541K57865j770474k418069r14694O41548J56933q71674K54204
$$ y = [1573988, 2841003, 1258795, -75873, 283591, 819410, 733596, 1339944, 2958075, 3813274, 3286812, 3052384, 3533308, 2655517, 138683, -574789, 2308089, 4883660, 2885043, -1371472, -2126679, 1054103, 2859644, 659906, -1822527, -871634, 1686632, 2169620, 939860, 986196, 2488995, 2645460, 503353, -1456747, -1247870, -180397, -386072, -1521141, -1790118, -1100206, -1114167, -2456760, -3813898, -4121621, -3915423, -3751898, -2859806, -608269, 1868122, 3008010, 2971725, 2947471, 3095334, 3002759, 3573878, 6126925, 9513052, 10467224, 7613272, 3344109, 928682, 1274325, 3156706, 4930247, 5188112, 3417638, 999569, 84875, 726423, 883356, 11682, 265886]
37378B65886K394063J839794j510504l478275j880742N87352J201942J084970
37370E04486K032406K794369J379464j233753k507546j976907j103038o40899
37362g51418j91843M68767J220309J989929K206109R12607j535042l054615k179562
37353i14759J68451J930450J827987k07387k872131l568860q25059K960978L696276
37344B195946J078780j009583m18705M75851m94586j505349l69185J269351O95529
37335A918049j323990k075933j121025N5011Q44753J129371K9534k021989k117775
37326d683994R32415L491700J958578j417169j942358J65560Q35225o87795j190787
37317b538625L05843J151048L26919m4161O53476L41843j073709p79721J535971
$$ y = [265886, 2659949, 4499743, 2989239, -489036, -2369778, -1782426, -580484, 504486, 2536892, 5331261, 6710725, 5476972, 2969426, 992519, -110519, -751418, -943261, -474494, 745815, 2735744, 4941853, 5854460, 4319418, 1264803, -914759, -746308, 1184142, 3012129, 2804742, -67389, -3636249, -4461308, -1500330, 2195946, 3274726, 2265143, 1846438, 2322289, 1827703, 322354, -46831, 1222520, 1918049, 594059, -1481874, -2602899, -2547888, -1703135, -573764, -544230, -2566219, -4683994, -3751579, -259879, 1698699, 281530, -1660828, -1495268, -660043, -1347838, -2538625, -2232782, -1081734, -754815, -798976, -145500, 196343, -877366, -1657087, -121116]
37308a21116K253564p639j602133o8408J518119M5769j963060p11613K084400
37299A427883J895998j101692k413797m46996J465251P08467r62963p23726J216822
37290A065247K396707J416283p33342j977545j299983J96367O50885m6624k51095
37281A416900N34945O13476q69523j890129n81981J441899J401143k67122p47789
37272A051819O12012J608836R18931l21563r67172j278958j345497n10398Q55477
37263F23487J206593L33954l2040Q52057J224905l93545k608263l023940j543527
37254c360319j03834J85600M6441L88428R81261J026560L34445m42461o09890
37245a553769k28727J93539P28327J876085L003649K271667o32163l012440k447425
$$ y = [-121116, 2132448, 2124809, 522676, 454268, 1972387, 2018156, 55096, -656517, 1427883, 3323881, 2222189, -191608, -638604, 826647, 1535114, 572151, -151575, 1065247, 3461954, 4878237, 4144895, 2167350, 867367, 1063734, 1714619, 1667995, 1416900, 1951845, 2565321, 1695798, -194331, -776312, 665587, 2066730, 1799608, 1051819, 1663831, 3272667, 4191598, 3870035, 2902863, 1623905, 278408, -231990, 623487, 1830080, 2164034, 2131994, 2984051, 4208956, 3815411, 1207148, -1816792, -3360319, -3464153, -3278553, -3232112, -2843684, -1862423, -835863, -501418, -943879, -1553769, -1782496, -1588957, -860630, 1015455, 4019104, 6290771, 5658608, 2646168, 198743]
37236A98743n02015m50407j953293j540182J370840K993804J179089j089053p64435
37227e56909L55604n68163j784570J17817L517133L410851n59283l063746j065426
37218a96692K004049K082242K93059m3320R57218O66616j281302k507948j544283
37209D29639N56047J977017J734235m5458j961488k071211j50157J517170R20359
37200B906153j021166k013126j543639p51386p2840R67197K148599K633989K337672
37191E591453J662219M62913j111344j639410l30681R77133J96401j371397p75901
37182C661386J522109J854422q53005l093287k072449K49806O17118o48474r12337
37173C25289M40678J687754J705524P97427o28663j976219j742983P73634L388751
$$ y = [198743, -303272, -753679, -2706972, -4247154, -2876314, 117490, 1296579, 207526, -556909, -201305, -769468, -2554038, -2436221, 1080912, 4491763, 3932480, 868734, -196692, 1807357, 3889599, 4182658, 4139338, 5096556, 5763172, 4481870, 1973922, 429639, 985686, 2962703, 4696938, 4651480, 2689992, 618781, 468624, 1985794, 2906153, 1884987, -128139, -1671778, -2423164, -2496004, -1528807, 619792, 3253781, 5591453, 7253672, 7716585, 6605241, 4965831, 4635150, 5612283, 5808684, 4437287, 3661386, 5183495, 7037917, 6184912, 3091625, 1019176, 1268982, 1886100, 1237626, 325289, 765967, 2453721, 4159245, 4956672, 4328009, 2351790, 608807, 1382441, 4771192]
37164D771192K977264l57042l098613k674503k06914J588713J592725N56758m87289
37155D662291j048571j116015j058852j202571j186093l29319J110785J854269
37147A685924J249762K69332J82692Q21228R86661K49722n77328p66516o17155
37138C484322p27875r42394n96070M38414J505212J957871J756417J177781L41504
37129H395182o98891j626119j967170j550994o82983J92799Q84734J339855J191566
37120E477979o8102j974739k689230r54810J594318J860391l41914j524517K90622
37111A669998K097802N63259k044902j093732K380448K632699j251780l154965
37103A798827K44742L720202J949295j847295j667200J351246J918656L14738
$$ y = [4771192, 7748456, 7391414, 4292801, 1618298, 1411384, 3000097, 4592822, 5149580, 4662291, 3613720, 2497705, 1438853, 236282, -949811, -1279130, -168345, 1685924, 2935686, 3205018, 3387710, 4208938, 5195599, 5445321, 4867993, 4101477, 3484322, 2756447, 1814053, 1217983, 1656397, 3161609, 5119480, 6875897, 8053678, 8395182, 7696291, 6070172, 4103002, 2552008, 1869025, 2061824, 2946558, 4286413, 5477979, 5409877, 3435138, 745908, -208902, 1385416, 3245807, 2903893, 1379376, 1669998, 3767800, 4331059, 2286157, 1192425, 3572873, 6205572, 4953792, 1798827, 2043569, 5763771, 7713066, 5865771, 4198571, 5549817, 7468473, 7783211]
37095G783211J027516L368445K176613k065623k703570J752860M358169J113919
37087A6811540k418764p24090K563665J418286k312718k565761P12990K243169
37079A5728317L72183j300482o43682L91375J35875m11185k12686J77991J14159
37070A4351865l71375j166745j751516j272645m46384j379914l666149l527633
37062G69504M38922L852668K537999j098671k058345l90037K02889q05379q71610
37053B577940J49633L15392M39397K858598N737940M460000q99677m930157m505798
37044F203268k072107m96671M83271J520962J829099J373596J183328Q58781o08235
37035A0275292j736911n15449J156861Q3598j846329p1209M053681M302844O2146
$$ y = [7783211, 8810727, 12179172, 14355785, 12290162, 9586592, 11339452, 15697621, 16811540, 14392776, 13668686, 16232351, 17650637, 15337919, 12772158, 13485148, 15728317, 16100500, 14800018, 14156336, 14547711, 14683586, 14272401, 14059715, 14237706, 14351865, 13980490, 12813745, 11062229, 9789584, 9343200, 7963286, 4297137, 769504, 1208426, 5061094, 7599093, 6500422, 4442077, 4052040, 4254929, 3449550, 2577940, 2727573, 3042965, 3482362, 6340960, 12078900, 16538900, 15639223, 10709066, 6203268, 4131161, 3634490, 4117761, 5638723, 7467822, 8841418, 10024746, 10883527, 10275292, 8538381, 8022932, 9179793, 9263391, 7417062, 7345853, 11399534, 15702378, 15764524]
37026A5764524k050338Q63898L423970J769072M4023K262647M857583L353883
37018C0289262M94623J133550L793023L955753J974946J246610J563819M29487
37010D4881073j533654k103108j963983k532724k036327J036520L676964L130790
37002D2555551K601552N987541J0369918J0912218J0016280J3213984J8522789
36995A14179833J9852676K0123933K9537318M7856509N8327322M5003496J0377540
36988C45258627k8166457n4109629o0859517n1628899l6161746k4417688j8977188
36981G0937503j5070897r306609m394288l379071m260862l890866l025360l553831
36973B4055719m203353l060309j459249j412719j691999l03074J386582Q11705
$$ y = [15764524, 13714186, 14578084, 18002054, 19771126, 19815149, 22077796, 26935379, 30289262, 30783885, 31917435, 35710458, 39666211, 41641157, 42887767, 44451586, 44881073, 43347419, 41244311, 39280328, 36747604, 34711277, 35747797, 39424761, 42555551, 45157103, 51144644, 61514562, 72426780, 82443060, 95657044, 114179833, 134032509, 154156442, 183693760, 231550269, 289877591, 334881087, 345258627, 317092170, 262982541, 202123024, 150494125, 114332379, 89914691, 70937503, 55866606, 46559997, 42165709, 38786638, 34525776, 30634910, 27609550, 24055719, 19852366, 16792057, 15332808, 13920089, 12228090, 11925016, 13311598, 14123303]
36965A4123303j349663k442965j910757r34823J87104J225911O52689j612658
36957G938141k311187N71515L547471K260359j554542k663886n26261N90690p58886
36948G093414j248651O94785J891722m1631k682898k905973j372744k47434N66490
36939A747080K048505L207941K441210K76780j473332k043064j476417L42689
36931E071392K585058L064374J046336r79198n19862J309832J789148Q81133O83794
36922A4932007J526211J845122J673298K825190N084023N531543L024367M62651
36914C6904412O77298K383064K525893Q68203l77953l24735o8777j26973Q5371
36905D2545803K81500n20467j478296k87512L024316N398008N503871O591783
$$ y = [14123303, 12773640, 10330675, 8419918, 7485095, 7672199, 8898110, 9550799, 7938141, 5626954, 6198469, 9745940, 12006299, 10451757, 7787871, 7261610, 7852300, 7093414, 5844763, 6539548, 8431270, 8389639, 5706741, 2800768, 1428024, 1180590, 1747080, 3795585, 7003526, 9444736, 9721516, 8248184, 6205120, 4728703, 5071392, 7656450, 10720824, 11767160, 10787962, 10268100, 11577932, 13367080, 14248213, 14932007, 16458218, 18303340, 19976638, 22801828, 27885851, 33417394, 36441761, 36904412, 37581710, 39964774, 42490667, 43358870, 42980917, 42656182, 42587405, 42460432, 42545803, 42827303, 42306836, 40828540, 40541028, 43565344, 48963352, 54467223, 61059006]
36897F1059006J1844659J8811652K2326902K2634389K6330226L7141739M8356683
36890B48505256M7411391K7840576m455383l5830803n4285191n5706046m4359179
36883A29120621k9002947j7219171j1450651r515268q430188p198496o262961
36876D0040939n753282n217325m389771l282606j854428l79724J98898p65119
36868A8597582k422713l126201k348217j013257P1667R45988J398753N75009j375548
36859A1303063k382962o40692K707369M424369K846785k19663j486405M63261
36851A7015125L852201N400281L498850p8268k072263j459849k46083j08087R4329
36842B5896236K036921M733722N951186N835263O281114P030568N645810J865598
$$ y = [61059006, 72903665, 91715317, 114042219, 136676608, 163006834, 200148573, 248505256, 295916647, 323757223, 319301840, 283471037, 229185846, 173479800, 129120621, 100117674, 82898503, 71447852, 61932584, 53502396, 46303900, 40040939, 34287657, 29070332, 24680561, 21397955, 19543527, 19163803, 19362701, 18597582, 16174869, 13048668, 10700451, 9687194, 9758861, 10704849, 12103602, 12678611, 11303063, 8920101, 8279409, 10986778, 15411147, 18257932, 18038269, 16551864, 17015125, 20867326, 26267607, 29766457, 29688189, 27615926, 26156077, 25909994, 25801907, 25896236, 27933157, 32666879, 38618065, 44453328, 50734442, 57765010, 63410820, 65276418]
36834F5276418j352573k455003l712017o859357r298189p845069m199185k874131
36826B6680894m611058n694247l857173j181371j79515k98902p4352o8944j244521
36817I470811k224119j000071J391904J667905j054806l764866l546107j167241
36809b26590O01459P69445M29832J76753n63260j600652j535928m1015J137720
36800h52236O16887n51162n56983N74136J495865J604276J077790p8293j338452
36791A991828j186758O09002J508846m00924k702157j710020J494970K210218
36783A815005n56087k348448j00198L519050M607374L105890R75080j207076l074809
36774F735781l081400j215267j92272j092212j027719J665278L621864J999186
$$ y = [65276418, 63923845, 61468842, 57756825, 50897468, 41599279, 33754210, 29555025, 26680894, 22069836, 16375589, 12518416, 11337045, 11157530, 10858628, 10784276, 10715332, 9470811, 7246692, 6246621, 7638525, 9306430, 8251624, 4486758, 940651, -226590, 374869, 1144314, 1574146, 1750899, 1187639, -413013, -1948941, -1989956, -852236, -235349, -786511, -1343494, -769358, 726507, 2330783, 3408573, 3330280, 1991828, 805070, 1414072, 2922918, 2521994, -180163, -1890183, -395213, 1815005, 1258918, -1089530, -1189728, 2329322, 6936696, 10042586, 11017666, 9810590, 6735781, 3654381, 2439114, 2246842, 1154630, 126911, 1792189, 5414053, 7413239]
36766G413239J11934K073915M892957K549044l812665o955904m476967j484610
36758C10943j501689j718861M75291K623489K174355J084004J726770K482519
36750G656821J220424l40841M22197K544648L475218L177243K997931K786137
36742B3939778K372716L591020P176670R493179O267442j303532p581756r131031
36734C4824486p468772n647376m842015m386281l171932q95932J054499P40183
36726A0206860j403550k394636q13413R38641M00839j123494j120370k48564q99024
36717C543289k714866l039258j237316O10178J070854O40013k6007n27877J59909
36708a521081K284024L585218J923603r11498j318304N68668J224332k94414r78723
$$ y = [7413239, 7525173, 9599088, 14492045, 17041089, 13228424, 6272520, 1795553, 310943, -1190746, -2909607, -2434316, 189173, 2363528, 3447532, 5174302, 7656821, 8877245, 8536404, 8958601, 11503249, 14978467, 18155710, 21153641, 23939778, 26312494, 29903514, 37080184, 46573363, 52840805, 51537273, 43955517, 34824486, 27355714, 21708338, 16866323, 12480042, 9308110, 8412178, 9466677, 10206860, 8803310, 6408674, 5595261, 6533902, 6934741, 5811247, 4690877, 4442313, 3543289, 828423, -2210835, -3448151, -2837973, -1767119, -1127106, -1153113, -1680990, -1521081, 762943, 4348161, 6271764, 5360266, 4041962, 4610630, 5834962, 5540548, 4561825]
36699D561825N52528J464004k18817j878621p27033J143823l8047l324866l932431
36690b397635j40662M201414M696953J379016k268340l417988j950281L45345
36682D47822J474677P41267o40785p73788O11392J608720N65198j513981k140807
36673C79715p52929O11199N70810N39051K015010L272198J513815k163220l336531
36664B649118n96606K040214J021810j449055j090695J699100K682495M39821
36656G396202j889074j776855n11514j28973l11184m9296R3816n66731r05430
36647A350961L52761K127540K145411J01204k006993k513026j651516m39776P36755
36638B03321J852619K326023J342175p73112k246610j697378j1183O62475j82991
$$ y = [4561825, 5114353, 6578357, 6359540, 4480919, 3753886, 4897709, 4859662, 1534796, -2397635, -2538297, 1663117, 6360070, 7739086, 5470746, 2052758, 102477, 447822, 1922499, 2663766, 2022981, 1249193, 1860585, 3469305, 4034503, 2520522, 379715, -373214, 237985, 808795, 1347846, 3362856, 6635054, 8148869, 5985649, 2649118, 2052512, 4092726, 5114536, 3665481, 2574786, 4273886, 6956381, 7396202, 5507128, 3730273, 3218759, 3089786, 2778602, 2729306, 2823122, 2256391, 1350961, 1703722, 3831262, 5976673, 6077877, 4070884, 1557858, -93658, -533434, 203321, 2055940, 4381963, 5724138, 4951026, 2704416, 1007038, 995855, 1658330, 1475339]
36629A475339q62924k86936L69538j38733q75416l28155J021221J631985J351150
36620C357069R28124J42012j307008k028095p05995J138451J058503k62967j33244
36611B186850J342226J319569o93221j789952o39460L94787l89755j220734l19952
36602A90358J102996J376467Q62280M3233j651600l189066j819278J974320L491956
36593B381666Q75731j252434P03409K813939L38809l197051j172506M405464N012526
36584A0909553q91404n273287l132090O71537O77359o85460Q16986K778233N52956
36575F424383l783970m009791M01074L566755K231230k19663R1334K030257K215553
36566H947162J53446j721715j525604K79773J813458J591951j22908j579653j597512
$$ y = [1475339, 612415, 325479, 695017, 556284, -319132, -647287, 373934, 2005919, 3357069, 4285193, 4427205, 3120197, 1092102, 386107, 1524558, 2583061, 2320094, 2186850, 3529076, 4848645, 4155424, 2365472, 1726012, 2120799, 1731044, 510310, 190358, 1293354, 2669821, 3532101, 3575334, 1923734, -1265332, -3084610, -1110290, 2381666, 3257397, 2004963, 2708372, 5522311, 5861120, 2664069, 1491563, 5897027, 10909553, 10018149, 4744862, 1612772, 2284309, 2961668, 2276208, 3093194, 5871427, 6424383, 2640413, -1369378, -968304, 2598451, 4829681, 4610018, 4701352, 6731609, 8947162, 9100608, 7378893, 5853289, 6133062, 7946520, 9538471, 9415563, 7835910, 6238398]
36557F238398r47031q46124q89570m749J142189P60320j044826j985084q91282
36548A532241O19526P61810J87152N11283J427577J155790n70776j770094r45088
36539B909421P49166J041145m36237j816929j579627k74695P35613J182445J590483
36530D100785J791402J027280n95479j890197j970512j043079J37339P99503L86608
36521B743650p30887j123910j84214L31002j486043m154612l972800k51969L216456
36512e613327L168094R49956j41588N31861J263045J299436J272722J215123N13325
36503D458647n21648q95491m42452K79915R62308J166622Q6354j799643k189935
36494A104677j4175K339209K148555L80512j55709N07560j4647j901118k677311
$$ y = [6238398, 5291367, 4445243, 3555673, 3550924, 4693113, 5453433, 4408607, 2423523, 1532241, 2151767, 2913577, 3100729, 3612012, 5039589, 6195379, 5624603, 3854509, 2909421, 3658587, 4699732, 4263495, 2446566, 866939, 592244, 1327857, 2510302, 4100785, 5892187, 6919467, 6323988, 4433791, 2463279, 1420200, 1557539, 2357042, 2743650, 2012763, 888853, 704639, 1035641, -450402, -4605014, -8577814, -8829783, -5613327, -2445233, -1495277, -1636865, -1105004, 158041, 1457477, 2730199, 3945322, 4458647, 3936999, 3041508, 2599056, 2878971, 3841279, 5007901, 5094255, 3294612, 1104677, 1090502, 3429711, 5578266, 5958778, 5803069, 6310629, 6295982, 4394864, 1717553]
36485A717553j451452j26037J99108O99851J728111J449230q76433k947921k581699
36476b189689p52296K22997j42847o86725n61781L08669J627342K597471K406758
36467B829899J376785N27904p0216r58117j434458k56523J613581J489799j129282
36458C989372l510272l364057j348728P91482K198527K281096O77411j232834
36450D81997j219622N68847J695641J198000L85459l53192j874178k952820j075932
36441c145800K386418K772433l91533j933238M73510K316252L45177j607601l2359
36432A183259J112100k517729o523953l917942L098364O170193L500196P92616
36424B897104O23535j22505k047652j443726J758808K512120n63120k525985q81346
$$ y = [1717553, 266101, 140064, 339172, 1039023, 2767134, 4216364, 3339931, 392010, -2189689, -2941985, -2718988, -2861835, -3548560, -4110341, -3801672, -2174330, 423141, 2829899, 4206684, 4734588, 4664372, 3706255, 2271797, 2015274, 3628855, 5118654, 3989372, 479100, -2884957, -4233685, -3442203, -1243676, 1037420, 1714831, 481997, -737625, -168778, 1526863, 2724863, 3110322, 2757130, 882952, -2069868, -3145800, -759382, 2013051, 1621518, -311720, 161790, 2478042, 2823219, 1215618, 1183259, 2295359, -222370, -6746323, -10664265, -7565901, -1395708, 2104488, 2897104, 3520639, 3398134, 1350482, -93244, 1665564, 4177684, 3614564, 1088579, 207233]
36415B07233M90349o29351l84742L180047M848942N67758m873875m810002p35719
36406b139360J108289l59953j190044o5235O23157K63681Q17225K347171K564197
36397C969128R63418n16193j025135j553325k136674j460153N48023K264286K569493
36388C622868J540927n32293k840165l561614j821960O16103J573483J326259
36380g6392J235998R01755p30959k513731k217383j514J795592K015407J567640
36371A976413J278049R58692M42793j84023j080926k011001j919421m91006Q86471
36362a43959J074918P71458O96233k2954j711274k281055n5750L009891L604411
36353D941919J451484r99534k097496j821982m45989J067912P09632j828619l453254
$$ y = [207233, 697582, 68231, -316511, 2863536, 7712478, 8280236, 3406361, -1403641, -2139360, -1031071, -1391024, -2581068, -2646303, -2023146, -1759465, -942240, 1404931, 3969128, 4932546, 4416353, 3391218, 1837893, -298781, -1758934, -1210911, 1053375, 3622868, 5163795, 4631502, 1791337, -1770277, -3592237, -2976134, -1402651, -76392, 1159606, 2061361, 1330402, -1183329, -3400712, -3402226, -1606634, 408773, 1976413, 3254462, 4213154, 4655947, 4471924, 3390998, 1379997, -539424, -1030430, -143959, 930959, 1702417, 2398650, 2375696, 664422, -1616633, -1672383, 1337508, 4941919, 6393403, 5393869, 3296373, 1474391, 1028402, 2096314, 2805946, 977327, -2475927]
36344b475927j598301J640825K493588J115220N08898J119948P29528q57606j370762
36335A305411m08178j24443j082931j224933K14266J237436N52010n44482p50283
36326h26127n15846l35764K17358J000624J104652O00070L10014j40038j518465
36317a03522k432114o44992K883931M468740K718221J00620j045072j093428j099430
36308C752954j047268q65272p32665q3039J306902J663961l61062k428699j515173
36299c09361O55450O1624k192259r64712L711385N286013R42577l397194k175624
36290A617899J527521J764310j029753k222226r38566N454r9920L76625J140753
36281B142097L69353j338103j589931k42381P82639J027020J470565J733095O16919
$$ y = [-2475927, -4074228, -2433403, 60185, 1175405, 1684303, 2804251, 3533779, 2676173, 1305411, 897233, 772790, -310141, -1535074, -1320808, -83372, 468638, -75844, -826127, -1341973, -1677737, -1460379, -459755, 644897, 1244967, 1554981, 1414943, -103522, -2535636, -3180628, -296697, 4172043, 6890264, 6990884, 5945812, 4852384, 3752954, 2705686, 1840414, 1107749, 1024710, 2331612, 3995573, 3634511, 1205812, -309361, 346089, 407713, -1784546, -2749258, 962127, 6248140, 7190717, 3793523, 1617899, 3145420, 4909730, 3879977, 1657751, 719185, 724639, 624719, 1001344, 2142097, 2511450, 1173347, -416584, -658965, 123674, 1150694, 2621259, 4354354, 4971273]
36272D971273j135037j631255q17965q3779K19329M24756N1239q36805n43238
36263F18518J198156J355266j712804m213862k095242J977837K348702m81266
36255a004695r10338J928135K561140j155653l784193j043823L117323K841435
36247B549331o20223j580697R91722K535440L36059k807662l087176n24650J990845
36238b17011K470070J277536j82604j066840j421137j491387j219902n93839K3691
36229b421423M33920R49999J516627J225093k18090j342350p23147P46306J161332
36220A328267N70543N17929J040655O05923r30607j874244j612665j479213k001429
36211c834841j734634J16470K058152K431702J380859j70580j641044k156149
$$ y = [4971273, 3836236, 2204981, 1387016, 1303237, 1522566, 1947322, 1998561, 1161756, 618518, 1816674, 3171940, 1459136, -2754726, -4849968, -2872131, -523429, -1004695, -1915033, 13102, 2574242, 1418589, -2365604, -3409427, -292104, 2549331, 1929108, 348411, 1340133, 3875573, 4211632, 1403970, -1683206, -2207856, -217011, 2253059, 3530595, 3347991, 2281151, 860014, -631373, -1851275, -2445114, -2421423, -1987503, -1037504, 479123, 1704216, 1486126, 143776, -579371, 166935, 1328267, 1898810, 2416739, 3457394, 4063317, 3132710, 1258466, -354199, -1833412, -3834841, -5569475, -5453005, -3394853, -963151, 417708, 247128, -1393916, -3550065]
36203c550065q96329J072546J517511M42695K81143J653811J870610o39195l323553
36194a570826l239377j169423N83046J954380L536459L571252M64714l137439
36186I92786k957825P14817L283906K291881k3175r90618q09146o48440n35209
36177A318977m22079q68004j447909p28209J068459J641327J22590j207871l16778
36168h39497J413431J294290q12621k623745k484687p03827J437827K639639K123774
36159A444584L85047j005322j066325l04255M49325J059613J433807J108380K00113
36150C704967m79629q56803j601084k131007p77621J953332K826793N24985j644176
36141A519757m10840K294729K336045j40869j393398m38951r0746j358727j524784
$$ y = [-3550065, -4446394, -3373848, -1856337, -1413642, -1132499, 521312, 2391922, 1752727, -1570826, -4810203, -5979626, -5396580, -3442200, 94259, 3665511, 4130225, 992786, -1965039, -1250222, 2033684, 4325565, 4302390, 3311772, 2502626, 1854186, 1318977, 896898, 28894, -1419015, -2147224, -1078765, 562562, 685152, -522719, -839497, 573934, 1868224, 1055603, -1568142, -4052829, -4756656, -3318829, -679190, 1444584, 1829631, 824309, -242016, -546271, -96946, 962667, 2396474, 3504854, 3704967, 3225338, 2368535, 767451, -1363556, -2141177, -187845, 2638948, 3163933, 1519757, 1108917, 3403646, 5739691, 5598822, 4205424, 3766473, 3675727, 2317000, 792216]
36132G92216O92039K296491Q16133j470729j110867J230651K210166Q02074j214624
36123E043550k581113l381507l203128j335095J244839K470744J995596J463930
36115A717816J752445J727239K70106j827514k713717j597415L41836J053624
36107G24420j11993j306491l28858K098340K933890J231508l96645r7914J29626
36098D875883j789734l615458j954024J691119K514745k18277j988513p6383K545681
36089A985039K286491J73768o81104l1041J69300m93706q48659p51755j010886
36080G97447j306793o11027O49016J041148N91268O54264J215315N44790j701113
36071A874315l014862j192407K223797L538240J702118l66058P4435J819578J787107
$$ y = [792216, 1484255, 3780746, 4596879, 3126150, 2015283, 3245934, 5456100, 6258174, 5043550, 2462437, -919070, -4122198, -5457293, -4212454, -1741710, 253886, 1717816, 3470261, 5197500, 5467606, 3640092, 926375, -671040, -329204, 724420, 612427, -694064, -1022922, 1075418, 4009308, 5240816, 4844171, 4746257, 4875883, 3086149, -529309, -2483333, -792214, 1722531, 1504254, -484259, -560642, 1985039, 4271530, 4445298, 3764194, 3733153, 3902453, 3408747, 2560088, 1808333, 797447, -509346, -1120373, -471357, 569791, 1161059, 1815323, 3030638, 3575428, 1874315, -1140547, -2332954, -109157, 3429083, 5131201, 4765143, 4839578, 6659156, 8446263]
36062H446263k05633j293942k62648N41332o68847j833868l48652K463332L342589
36053A0179926K155911J408683J541105O97921r68994j121685m0870j064526m543992
36044H243479n848374k235838K217595K320266o81342j651574L89276J595951
36036D349439m3038k032810j923539o77367j48854p9051O99144J864292J995434
36027D003650N51561j402505k077792n69604J825825K400329J84593k293490j884866
36018G37701R80654K806269J726828l02182o40357N24393J149112P01294O98654
36009H382366J841909K371709O26019j719263j257271K031732M075324K795224
36001A9147749J826414M681517Q073973O963002M862994J0694794K3035989K6352488
$$ y = [8446263, 8240630, 6946688, 6684040, 7225372, 6556525, 4722657, 4374005, 6837337, 10179926, 12335837, 13744520, 15285625, 15983546, 15014552, 13892867, 13851997, 12787471, 8243479, 2395105, 159267, 2376862, 4697128, 4015786, 2364212, 2753488, 4349439, 4306401, 2273591, 350052, -327315, -476169, -555220, 143924, 2008216, 4003650, 4555211, 3152706, 1074914, 505310, 2331135, 4731464, 4916057, 2622567, 737701, 1718355, 4524624, 6251452, 5949270, 5308913, 5833306, 6982418, 7683712, 8382366, 10224275, 12595984, 13222003, 11502740, 10245469, 12277201, 16352525, 19147749, 20974163, 25655680, 33729653, 40692655, 45555649, 56250443, 79286432, 105638920]
35993A05638920R789270j6148757l0330375k5578075j3810926p711760o912050
35986A4936247m788885m15482J959135O00290k090318l594296l135208j019818
35978B451665J135250J059278j050566j836221O02096L361118K613800q18115
35970G518305k694822j183039J386337K232602J115067n16491j417448j199258
35962E241253l35659K02060m900k89039J01815J002642J820871K233333J876531
35953A1848907M30547j290880j644919n32815l8439j375778k691559j750178M66131
35944C421017J159877p2085j019556o29314k90322r01072j235415l44879O00027
35935F88278M00604l7435M92439J050420K07439q43639L69404L253309M084874
$$ y = [105638920, 115428190, 99279433, 68949058, 43370983, 29560057, 21848297, 14936247, 10147362, 9731880, 11691015, 12291305, 10200987, 6606691, 3471483, 2451665, 3586915, 4646193, 3595627, 1759406, 2361502, 5722620, 8336420, 7518305, 4823483, 3640444, 5026781, 7259383, 8374450, 7857959, 6440511, 5241253, 4905594, 5107654, 5102754, 4813715, 4915530, 5918172, 7739043, 9972376, 11848907, 12279454, 10988574, 9343655, 8810840, 8772401, 7396623, 4705064, 2954886, 3421017, 4580894, 4508809, 3489253, 2859939, 2569617, 1668545, 433130, 88251, 688278, 1088882, 1051447, 1543886, 2594306, 2801745, 1958106, 2327510, 5580819, 9665693]
35926I665693J203463k305264k746503n75095J055023Q81610J80686j34012l34678
35917F890923k32894O25568J187174p2324k179140k383907k29393J793427K146585
35908G546019J918440J938233J440506O72284J388826L252603L377959J413438
35900B2948308J134995M278887O797659M777364K81419k799430m886384p679551
35892B4853267q649318m886579J48220O72113k215228k555958K08093Q21973j840122
35883F556461k712702m067J428740r00814k398433J93396K646680O68127k499389
35874B977999j769866J269665J719254l76831j269605l75802n6701l68673N39246
35865B288686K029711J832336L20020l49807k80587r62956j594366m27740J312749
$$ y = [9665693, 10869156, 8563892, 5817389, 5242294, 6297317, 7178927, 7359613, 7225601, 6890923, 6658029, 7283597, 8470771, 8398447, 6219307, 3835400, 3606007, 5399434, 7546019, 9464459, 11402692, 12843198, 13515482, 14904308, 18156911, 21534870, 22948308, 24083303, 28362190, 35159849, 39937213, 40218632, 37419202, 32532818, 24853267, 16203949, 11317370, 11465590, 12137703, 9922475, 7366517, 7574610, 8396583, 6556461, 3843759, 3839692, 5268432, 4367618, 1969185, 2162581, 4809261, 5477388, 2977999, 1208133, 2477798, 4197052, 3820221, 2550616, 2174814, 2118113, 1749440, 2288686, 4318397, 6150733, 6470753, 6120946, 5840359, 4877403, 3283037, 2855297, 4168046]
35856D168046J027477o83575j076467N2532P55218R23957J610864J461523j319647
35847F919928m138774k505310K535935M940154K539312p9697O17939J801842p3249
35838A2558080k847893k308749O00699J102579j828667l748179j413781K423057
35830D537146L124129Q50128j16164J732094K735458K24376k572720j512567J287655
35821A0289535P18494k248582j636676K987673M899497J615063m08977K914013
35813A9130040N716973K855664R5519M218546J0304666J1157673J3297804K7001955
35805I3778840M2097551L3192387m787254m2790440n0271177l0052991q914127
35798C2252789k750765n237850n900687l875707k400757j497175m56651n54452
$$ y = [4168046, 5195523, 4511948, 3435481, 3488013, 4243231, 5167188, 6778052, 8239575, 6919928, 2781154, 275844, 2811779, 7751933, 10291245, 10211548, 10829487, 12631329, 12558080, 9710187, 7401438, 8002137, 9104716, 7276049, 3527870, 2114089, 4537146, 7661275, 8511403, 8395239, 10127333, 12862791, 13087167, 10514447, 9001880, 10289535, 11008029, 8759447, 7122771, 10110444, 15009941, 16625004, 16216027, 19130040, 24847013, 27702677, 27798196, 32016742, 42321408, 53479081, 66776885, 93778840, 135876391, 169068778, 164281524, 121491084, 71219907, 41166916, 32252789, 29502024, 24264174, 18363487, 14487780, 12087023, 10589848, 10133197, 9578745]
35790I578745j798438j710557L99109J856369R24970p34694j151154n84139j5578
35781F764633K99033J41093n32417o19653P45591K237290K296562K303976M484944
35772A8121052P057225N519608m09845m943540l271328K167512M707872J330069
35764C0278625m433433o989774m731495j206103n20884k432643l313177j668408
35756D982708r3031p09511j633469m05235J585079J405250n13750j451689j099612
35747B066740j300151j947661j287913M8227l74895k018902j582859J283111K910486
35738b203817J585852K27440J115642K138104J021570m32839K48964J594191P70319
35729F065426j420546k067632j136517r12564j360276k32762K157519K403074
$$ y = [9578745, 7780307, 6069750, 6468859, 8325228, 9250198, 8515504, 7364350, 6780211, 6764633, 7063666, 7204759, 6672342, 6052689, 6798280, 9035570, 11332132, 13636108, 18121052, 25178277, 30697885, 30288040, 25344500, 22073172, 24240684, 28948556, 30278625, 25845192, 18855418, 14123923, 12917820, 12396936, 9964293, 6651116, 4982708, 4889677, 4180166, 2546697, 2141462, 3726541, 5131791, 4618041, 3166352, 2066740, 766589, -1181072, -2468985, -2420758, -2795653, -4814555, -6397414, -5114303, -2203817, -617965, -390525, 725117, 2863221, 3884791, 3451952, 3700916, 5295107, 6065426, 4644880, 2577248, 1440731, 528167, -832109, -1064871, 1092648, 3495722]
35721C495722o14734l311652k367338N20693J366435l23499j377002K0807K012291
35712e78277K334085J430133Q03634J10272j778220l691494k926503N91803L476589
35703b27978L264913J384173K66136k15556j165954j534474K89951K873601L167973
35694H102785J189469j67863p4465p89602k912178l507713r64399J680934J131435
35685C688403j041814j067928Q90765J086546j674478l827729k006781K277409
35677a675607M545178K765549o03798j803645j8814K102912J974315J81508p53418
35668F714180J4684J056987J734159L532539O968387R008042O018698j042903
35660C4004773o471962n581252K08526M627433K856336l490772p984527o404498
$$ y = [3495722, 2880988, -430664, -2798002, -2277309, -910874, -1234373, -2611375, -2590568, -578277, 1755808, 3185941, 3989575, 4099847, 2321627, -1369867, -4296370, -3704567, -227978, 3036935, 4421108, 4687244, 4471688, 3305734, 1771260, 2061211, 4934812, 8102785, 9292254, 9124391, 9049926, 8260324, 5348146, 1840433, 876034, 2556968, 3688403, 2646589, 1578661, 2469426, 3555972, 1881494, -1946235, -3953016, -1675607, 2869571, 5635120, 5031322, 3227677, 3208863, 5311775, 7286090, 7467598, 6714180, 6728864, 7785851, 9520010, 13052549, 20020936, 29028978, 35047676, 34004773, 27532811, 21951559, 22160085, 26787518, 29643854, 26153082, 18168555, 11764057]
35652A1764057j491142O32670j773767m338288l115834O6939Q69901j173602k589121
35643a148187j399857M78852O12952o51664j303539n56581N42445P80360K14513
35634b430706j11211L13063O37371k0849p71631L9525J827216J863733n29165
35625H17346k142638l42763K564419K465046k33010j127115J263633K983731O28606
35616F877255l252633l509470L86769L464271J731306k732816m507379j697305
35608c240002J797112J527631j545908k509625M33662L294128K042542j607643
35600A91897k815594l55629K450693K890920J707739N90910k14345q97106r60896
35591B588589k23373N36468N80250k37385j776329l065815k180765J147393L604011
$$ y = [11764057, 10272915, 10905585, 9131818, 4793530, 1677696, 1744635, 2614536, 1440934, -1148187, -2548044, -2069192, -1456240, -2107904, -3411443, -3968024, -3425579, -2645219, -2430706, -2541917, -2228854, -1591483, -1612332, -2383963, -2344438, -517222, 1346511, 817346, -1325292, -1668055, 896364, 3361410, 3128400, 2001285, 3264918, 6248649, 6877255, 3624622, 115152, 501921, 3966192, 5697498, 2964682, -1542697, -3240002, -1442890, 84741, -1461167, -3970792, -3537130, -243002, 1799540, 191897, -2623697, -2979326, -528633, 2362287, 4070026, 4660936, 4446591, 3549485, 2588589, 2365216, 2901684, 3481934, 3244549, 1468220, -1597595, -3778360, -2630967, 973044]
35582I73044K002569j577142k128192P71410K299848K39192j553903N0669K074175
35573C151670P13413k054804k009921J32481M63614j060445r69118J023002J309946
35564F99838j132067k732172j182069J101479J253493L9254l99234J49887Q91364
35555a310227J652575J880372N77176j217780p91509J599292J772502k055259
35547B107142n305899l160925J972706L724144R46500j428506m27829J291575
35539b81092R81001K19359J209120K331159Q68808k026627k663893k11808K303108
35530B729135K274435L16641j430889j761690p26009Q41136J551006N01792j412961
35521B882596k265260j433585j04151P02052J210719J622724J311807J18693q85362
$$ y = [973044, 2975613, 1398471, -729721, 41689, 2341537, 2580729, 1026826, 1077495, 3151670, 3865083, 1810279, -199642, -67161, 396453, -663992, -1633110, -610108, 699838, -432229, -3164401, -4346470, -3244991, -1991498, -1952244, -2351478, -2201591, -1310227, 342348, 2222720, 2799896, 1582116, 790607, 2389899, 4162401, 2107142, -3198757, -6359682, -4386976, -662832, 283668, -1144838, -1572667, -281092, 699909, 919268, 2128388, 4459547, 5328355, 3301728, 637835, 426027, 2729135, 5003570, 5320211, 3889322, 2127632, 1401623, 2242759, 3793765, 4295557, 2882596, 617336, -816249, -920400, -218348, 992371, 2615095, 3926902, 4045595, 3160233]
35512C160233r12187n55838l88668K14483J517351K013503M36609j758460k082113
35503A644913p10825k11613j524190k499584j113289J712603L442653K808651
35495C549319O22070j263113j347365J55763J200226K72301j355528j401056k22327
35486B10290j26677r68427J08748L297640M245393L04134m431524m203894K25773
35477a338544K795357P55494k335161k573025n68920J008622J350425R82886j16346
35468c9212j650536k027237m27107J353914J157622k94581m50871J179971K257630
35459A059593J062558j012625j456090j17645P40497j81393j246903k70328K041531
35450F19195K776239R24302j167127j259735k49091k02198r94050j033582k29151
$$ y = [3160233, 2248046, 1692208, 1303540, 1518023, 3035374, 5048877, 5485486, 3727026, 1644913, 934088, 722475, -801715, -3301299, -4414588, -2701985, 740668, 3549319, 4171389, 2908276, 1560911, 1716674, 2916900, 3189201, 1833673, 432617, 210290, 83613, -884814, -776066, 2521574, 6766967, 7071101, 2639577, -1564317, -1338544, 1456813, 2212307, -122854, -2695879, -3264799, -2256177, -905752, 77134, -39212, -1689748, -3716985, -4144092, -2790178, -1632556, -1927137, -2378008, -1198037, 1059593, 2122151, 1109526, -346564, -464209, 276288, 94895, -1152008, -1422336, 619195, 3395434, 4319736, 3152609, 1892874, 1643783, 1441585, 447535, -586047, -815198]
35441h15198K05365K50001Q16564J331907L68404j254853r90401J220251K272515
35432C404555N96582j390375j190286J84292P15684R26025K042320K615185M60783
35423H364765k987812l766979q01369K703845L572201J774341j038140l371406
35415D449446l602928p45819L089786L592575l55187m269187l512858M72245K361493
35406A479566M15971j753206j084322Q39335J125128Q7756o2573Q05299R16336
35397B769290j03046p74860m52443q8170j92913j72589O9404k9823l681J182275
35387B203444K570722J790465r35602k277211p63666P75176p8453j247833L0066
35378B067108J986320J097001j630147j898144Q80750K632102J205033o19356
$$ y = [-815198, -609833, -359832, 456732, 1788639, 2157043, 902190, -88211, 1132040, 3404555, 4001137, 2610762, 1420476, 1604768, 2320452, 3246477, 5288797, 7903982, 8364765, 5376953, 1609974, 808605, 3512450, 7084651, 8858992, 7820852, 4449446, 846518, 100699, 3190485, 6783060, 6427873, 2158686, -1354172, -881927, 1479566, 1895537, 142331, -941991, -102656, 1022472, 1110228, 1047655, 1852954, 2769290, 2666244, 1891384, 1438941, 1350771, 1157858, 985269, 1054673, 1024850, 1021169, 2203444, 4774166, 6564631, 5629029, 3351818, 2588152, 3363328, 3284875, 2037042, 2067108, 4053428, 5150429, 3520282, 1622138, 2502888, 5134990, 6340023, 5720667]
35370E720667j65685J090113P09392o75774j075171n47977l91942o05728m13846
35361C644049p3858k30208n08287m01997n60969j643217k756598k480183p87028
35352e798296J140762K321875K379120J414143K49787j05850J63464j44758j301865
35343C18382k155062j938475j075330J00305J590253K458754J622564L14956R16407
35334B152754K567590J448154k919742n439126k394329K670218L788512P67995
35326B642026j676365j235259O7478M33002L39910M4763j003259j882534q95999
35317c166237J024115J074355p62484j465261j84502K61001j318434j717003J362777
35308d891673M598035L409154j026078l191976r13790K233629K508863N91591
$$ y = [5720667, 5554982, 6645095, 7354487, 6678713, 5603542, 5055565, 4663623, 4057895, 3644049, 3570191, 3339983, 2831696, 2429699, 1868730, 225513, -2531085, -5011268, -5798296, -4657534, -2335659, 43461, 1457604, 1707391, 1601541, 1765005, 1620247, 318382, -1836680, -3775155, -4850485, -4750180, -3159927, -701173, 921391, 1236347, 2152754, 4720344, 6168498, 3248756, -2190370, -4584699, -1914481, 1874031, 2642026, 965661, -269598, -202120, 230882, 570792, 615555, -387704, -2270238, -3166237, -2142122, -1067767, -1830251, -3295512, -3480014, -3219013, -4537447, -6254450, -4891673, -293638, 3115516, 2089438, -1102538, -2016328, 217301, 2726164, 3317755]
35300C317755o62300l75731L67516R46832J402938J103940n43088k212320j665254
35291A680288Q53293K191906L67584k557973l210992j267310P69918J275344Q41666
35282I43724L00306l43196q14309m05404O51227J259495J159197R86143O64897
35273D402080l77170j438850j197307j97046k26354j081227q03733N44929O84482
35264C09804o11725q00771O14930O68204j656745k870502p76433J341219J87853
35255c594166j678456k39343K799355K735113k32369j631073k82676N27469n57005
35246b153151r35104O30861J615689L63211r52342p7029J721161J878787J80088
35237B272171j505704j624360m0998K057819K929836J963985M00691n60078j278239
$$ y = [3317755, 2655455, 2279724, 2647240, 3594072, 4997010, 6100950, 5557862, 3345542, 1680288, 2533581, 4725487, 5093071, 2535098, -675894, -1943204, -1173286, 102058, 943724, 1244030, 900834, 86525, -318879, 332348, 1591843, 2751040, 3737183, 4402080, 4024910, 2586060, 1388753, 1191707, 965353, -115874, -919607, -374678, 309804, -301921, -1102692, -487762, 180442, -1476303, -4346805, -5123238, -3782019, -3594166, -5272622, -5511965, -2712610, 22503, -209866, -1840939, -2123615, -1596146, -2153151, -3088255, -2457394, -841705, -478494, -1430836, -1507865, 213296, 2092083, 2272171, 766467, -857893, -898891, 1158928, 4088764, 6052749, 6453440, 5893362, 4615123]
35228D615123j994074j502630L68628J163417l74117j209926J389391M400237
35220F856049L045428j346554l049374p56948J140025J09325j550560j903676
35212B543715j788570j102622J509503M037923K274979k692701m520507j438090
35204a176370O74248j728627l819401j097066K486928J423240j726327r75330
35196e938705K589019K804011j040702l251073r53171K355561L089091J876239
35188A530270N74779m23729q13175j02537M37378j017373l147463k526369R50511
35179d537708L255861K035178j11047J22786K004100K474859P22228j287288j976726
35170B702243j823336j787384j506541L7989K363352L145921R69603k229684l070815
$$ y = [4615123, 2621049, 1118419, 1487047, 2650464, 2276347, 1066421, 2455812, 6856049, 9901477, 8554923, 5505549, 4748601, 5888626, 5997951, 4447391, 2543715, 755145, -347477, 1162026, 5199949, 7474928, 4782227, 261720, -1176370, -502122, -2230749, -6050150, -7147216, -4660288, -3237048, -4963375, -5938705, -3349686, -545675, -1586377, -4837450, -5790621, -3435060, -345969, 1530270, 2105049, 1681320, 868145, 765608, 1202986, 185613, -2961850, -5488219, -4537708, -1281847, 753331, 642284, 765070, 2769170, 5244029, 5966257, 4678969, 2702243, 878907, -908477, -2415018, -2377029, -13677, 3132244, 4101847, 1872163, -1198652]
35161a198652j045426R59795Q79876L2675L63680J244410Q52394o83938j472812
35152f7998n25909J141979J673091M6698k630643l490504j043960K181363K422506
35143b93377R5945p01964J333341K598517N62973k099245k059423n05519l61157
35134a429909j193910o86845Q96769J465831Q50435M47554L70186o5527l00203
35125C54381K67268M84968n41179j361682o90126J03122k47156j90441J374498
35116d46347K023082k3098j606381N74623L522674K136286k031865k760069Q37597
35107B226502L048214P74878k414488k857133j577631n20201P39025K094360J359943
35098B873469j662313l438718j690285J163582J931498R56704J93322j73078q04152
$$ y = [-1198652, -2244078, -1284283, -404407, -371732, -8052, 1236358, 2088752, 1404814, -67998, -593907, 548072, 2221163, 2267861, -362782, -3853286, -4897246, -2715883, -293377, -197432, -899396, 433945, 3032462, 3595435, 1496190, -563233, -1068752, -1429909, -2623819, -3310664, -2413895, -948064, -97629, 349925, 720111, 654584, 354381, 621649, 1106617, 565438, -796244, -1486370, -1383248, -1630404, -1820845, -446347, 1576735, 1553637, -52744, 521879, 4044553, 6180839, 4148974, 1388905, 2226502, 5274716, 6049594, 3635106, 777973, -799658, -1319859, -580834, 1513526, 2873469, 1211156, -2227562, -3917847, -2754265, -822767, 133937, 327259, 154181, -649971]
35089f49971j249457j004407n86677r1688J203915K650013K129528n66763k787202
35080i52709k715469j496506n30624N27757J703916J589155L0161p82336K79326
35071b347329J341965P67564k56403k41509M5573l75679m92458O51179J784083
35062H76986J438341L01533l76286q63233j620062j809527r37204j05327L7481
35053c057298N54682J769009J866860n7210j825501j269751N60857J486234J417671
35044A445553J211897M45018j115183j814616o17408N28020l65136j794880j225223
35035c301958N80770J040600K62310M71044J712641J804774M11674l04462N35541
35026C212934J167782L26231q34661q92329k48926j62140j047403k289895k763559
$$ y = [-649971, -1899428, -2903835, -3490512, -3582200, -2378285, 271728, 2401256, 1834493, -952709, -3668178, -5164684, -5695308, -5167551, -3463635, -1874480, -1844319, -2626655, -2347329, -1005364, -237800, -494203, -735712, -690139, -1065818, -1558276, -907097, 876986, 2315327, 2616860, 2240574, 1377341, -242721, -2052248, -2989452, -3094779, -3057298, -2502616, -733607, 1133253, 1076043, -749458, -2019209, -1458352, 27882, 1445553, 2657450, 3102468, 1987285, 172669, -444739, 83281, -281855, -2076735, -3301958, -2721188, -1680588, -1418278, -947234, 765407, 2570181, 2981855, 2677393, 3212934, 4380716, 4706947, 3872286, 2979957, 2731031, 2568891, 1521488, -768407, -3531966]
35017c531966j558457P78432K130276J166661p62859j441596o66517L18635J226051
35008b341340K327423K496514M26331k411416k895012p03361J051751L61409j066563
34999b754264q48010P29036J918968K221547K099580J324071n05524k422848k725658
34990i63102j112853Q16866J287998J32783j061724n65500J332600K096266o2026
34981A901308l201869l473118k87129K537792K031377J46626K43905J485172L93876
34972A777940k719664l320272K78178L585469K336241j137896j729304N61056
34964c68252J285696p51382j649896P71090L070816J600523j759994k538893j14852
34955d55144K030622J364865j112491k821106k217456O5550J559493M41153j658067
$$ y = [-3531966, -5090423, -4311991, -2181715, -1015054, -1777913, -3219509, -3886026, -3567391, -2341340, -13917, 2482597, 2908928, 497512, -2397500, -3100861, -2049110, -1687701, -2754264, -3602274, -2873238, -954270, 1267277, 3366857, 4690928, 4185404, 1762556, -963102, -2075955, -1259089, 28909, 161692, -900032, -1465532, -132932, 1963334, 1901308, -1300561, -4773679, -5060808, -2523016, -491639, -345013, -101108, 1384064, 1777940, -941724, -4261996, -3983818, -398349, 1937892, 799996, -929308, -368252, 917444, 166062, -1483834, -712744, 2358072, 3958595, 2198601, -340292, -455144, 1575478, 2940343, 1827852, -993254, -3210710, -3145160, -1585667, -1144514, -2802581]
34946b802581j303076J451857K469967l0652k149784n02783J970795R04296j894215
34937a886176j457903J656201K108298j280215l670021k016098J041696K447357
34929c056861K616835K365985Q41012j499812k216663j042047n06832r31370M92961
34920b936792L864048M970484J967894j464166k451007l071828m740859m085170
34912g947396P75253M855124L036667j666581k659629L58665K267661J183943
34904B03707J5410L90531P54912K61535k34147q06137j925499j973553N65278
34895b747963L288755K621152l69082j388667L83090J611104O00173q05632j292680
34886A900250j699118k093933j170061Q76098K212570K253030J594824k05270
$$ y = [-2802581, -4105657, -2653800, -183833, -214485, -2364269, -2867052, -896257, 8039, -1886176, -3344079, -1687878, 420420, -859795, -4529816, -6545914, -5504218, -3056861, -440026, 1925959, 2766971, 1267159, -949504, -1991551, -2498383, -3429753, -2936792, 927256, 5897740, 7865634, 6401468, 3950461, 878633, -3862226, -7947396, -7172143, -2317019, 719648, -946933, -3606562, -3247897, -980236, 203707, 219117, 609648, 1364560, 1626095, 1391948, 585811, -1339688, -3313241, -2747963, 540792, 3161944, 2792862, 1404195, 1787285, 3398389, 3998562, 3192930, 1900250, 201132, -1892801, -3062862, -2186764, 25806, 2278836, 3873660, 3668390]
34878C668390l132485m110307n56993M170020M153296l90200l373091k146656
34870a718026m97326j114984j356322R53664L183243K702279J267293J123811
34862D543632R66280o22629j600454j75246J337776L23368j477284j133429L36051
34853B498065J66313j080575r41274K58951M66147K09442J372060K600216O97285
34844F246630l414794m785099j542424K102031J827912r67077j811262L54520
34836a989563K178871J000077j416256j338208J676533L699446J402008l099566
34828B113342m381488o25284L942172M468346J188282j941989k554536j580367
34820F28478p40405p12215j424457k131988j367225J297384L551386K469673j332017
$$ y = [3668390, 535905, -3574402, -4131395, 38625, 4191921, 3801721, 428630, -1718026, -2215352, -3330336, -4686658, -3732994, -549751, 2152528, 3419821, 4543632, 5509912, 4887283, 3286829, 3111583, 4449359, 4772727, 3295443, 2162014, 2498065, 2664378, 1583803, 642529, 901480, 1367627, 1577069, 2949129, 5549345, 6246630, 2831836, -1953263, -3495687, -1393656, 434256, -532821, -2344083, -1989563, 189308, 1189385, -226871, -1565079, 111454, 3810900, 5212908, 2113342, -2268146, -2893430, 1048742, 5517088, 6705370, 4763381, 2208845, 628478, -111927, -824142, -2248599, -4380587, -5747812, -4450428, -899042, 1570631, 238614]
34811B38614l676565j875960J821090L169784J213636j058176r94810N70354J112181
34802E20148K0967j011237p82294j30581k58860q77591r93107n73685k35660O0162
34792d261738P02848J256590R19112n9778o33404m50451M3461O82176J468441
34783c32743J701098P03197p04537r59324J8578P73543M51082m28137j222606
34774A51j698390j441546l36452N33455J50672n40461O3278J336099J192157l18522
34764a059559q55588L75162J358004O78976l71396k75293M15036N79793L87469
34755A232604L65042K52770j54396m56139n56554o40009j97324R37587R64668
34746A748249j526729l872887k028193K624785L960366J45595l169788j515615
$$ y = [238614, -3437951, -5313911, -3492821, -323037, 890599, -167577, -1162387, -592033, 520148, 541115, -470122, -1252416, -1382997, -1641857, -2519448, -3512555, -4086240, -4321900, -4261738, -3558890, -2302300, -1383188, -1442966, -2076370, -2526821, -2483360, -1801184, -332743, 1368355, 2071552, 1367015, 407691, 426269, 1199812, 1650894, 1222757, 151, -1698239, -3139785, -3476237, -2942782, -2792110, -3332571, -3269293, -1933194, -741037, -1059559, -1915147, -1539985, -181981, 496995, 125599, -149694, 265342, 845135, 1232604, 1597646, 1850416, 1696020, 1239881, 683327, 43318, -154006, 783581, 1748249, 221520, -3651367, -5679560, -3054775, 905591, 1051186, -2118602, -3634217]
34738c634217J666749J190754j455348j357717J330365K238445M23069p49164
34730c47064K50885J437277J668145J758940J198022j333076l815173k379482
34722a561526K029862L546989k03034m274946l582373K07839K181311J226760
34714d29118j34957o42207j117050j529906p62994Q31474J363062K54277p48423
34705b915842L9433J980916K754490R08092k294488l757598j874030J344221K645308
34696a169498J759289J304292K322345K552609M20602j852803j500856L11813
34688D147793K70104j781435k576853n59584J835727K048071R09632N76570R31040
34679E801065L38437j125725j722904j093868q40851j579468j619020K33495K335310
$$ y = [-3634217, -1967468, -776714, -2232062, -3589779, -2259414, -20969, 402100, -347064, -96179, 1341098, 3009243, 4768183, 5966205, 4633129, 817956, -1561526, 468336, 4015325, 3812291, -462655, -4045028, -3837189, -1655878, -429118, -564075, -1206282, -2323332, -3853238, -4616232, -3784758, -2421696, -2167419, -2915842, -2876409, -895493, 1858997, 2767089, 472601, -3284997, -5159027, -3814806, -1169498, 589791, 1894083, 4216428, 6769037, 7189639, 5336836, 3835980, 4147793, 4417897, 2636462, 59609, -499975, 1335752, 3383823, 4293455, 4870025, 5801065, 6139502, 5013777, 3290873, 2197005, 1356154, -223314, -1842334, -1608839, 726471]
34670G26471K343821M76046j150056j506999j073079p3844J374421J858775J04677
34661C080233k199266j938431O48768J925375M86264p75584N5967N13947j403012
34652C94261k710880j62838L329627K443358j862523l347982j55683K545235J013655
34643A486230j617753j221036P13969L15623k068047k824675q81791J348745K050874
34634b697861J768646J343377P53787J30261j2038L22855O99695R03260N90596
34625C802578p37827k339989k230180r6538J400612L08531j274725k79938K229459
34616G81983K475760m5986j789280q30420L75310o14609k228483j548772J165556
34607b258941L098040K795528J250301k48518j296823j539816m22800J679279
$$ y = [726471, 3070292, 3546338, 2396282, 889283, -183796, -257640, 1116781, 2975556, 3080233, 880967, -1057464, -408696, 1516679, 2002943, 1227359, 1283326, 1797273, 394261, -2316619, -2479457, 850170, 3293528, 1431005, -1916977, -2072660, 472575, 1486230, -131523, -1352559, -638590, -322967, -2391014, -5215689, -6097480, -4748735, -2697861, -929215, 414162, 1167949, 1298210, 1286172, 1609027, 2308722, 3211982, 3802578, 3064751, 724762, -1505418, -1601956, -201344, 107187, -1167538, -1447476, 781983, 3257743, 3211757, 1422477, 592057, 967367, 352758, -1875725, -3424497, -2258941, 839099, 3634627, 4884928, 4636410, 3339587, 1799771, 1376971, 3056250]
34599C056250L058259K149401o40256k946182k756516p85654K78253o03554j262748
34590d52747K17563J958005Q65109k050769k546689L35490K584998J507466l36662
34581B081764q5036M06221j561300l779814k374445J093726J486009j477731k570875
34572f781481L05508K652929Q51222k007148j280873K077481L586269J913200
34564A317107l89824j256312q25969J63060R32833N40625o36734o13459J053792
34555B85119J802144J02051j460191k71792J579875O72124j723285j711928N20069
34546b05814J284018p85k92817Q85219M79743j886612k429165K08643K232356
34537B74786J063134n71339J11066J329975Q39995J96810R71063Q69344j823232
$$ y = [3056250, 6114509, 8263910, 7623654, 4677472, 1920956, 1135302, 1413555, 810001, -452747, -235184, 1722821, 2587930, 537161, -2009528, -1674038, 910960, 2418426, 2081764, 1996728, 2402949, 841649, -2938165, -5312610, -4218884, -2732875, -4210606, -6781481, -6475973, -3823044, -2971822, -4978970, -6259843, -4182362, -596093, 1317107, 927283, -329029, -1154998, -991938, -59105, 481520, -155214, -768673, 285119, 2087263, 2189314, 729123, 457331, 2037206, 2709330, 986045, -725883, -205814, 1078204, 1077419, 784602, 1669821, 2149564, 262952, -2166213, -1957570, 274786, 1337920, 766581, 877647, 2207622, 3047617, 3244427, 4215490, 5084834, 3261602]
34528C261602l709194j371484K160279J745749j455552k012261Q24456K496716
34520A940311J022232o46194o18277o78485j701340j652460J27722J204920M68057
34511e33514J21428J345010J910411K68858j644601j955975j735233j979469j200245
34502e403330J183103K326925J89794k426036j690068J441168K903238J578427
34494A03221M1116M0704N92718M00748n14925j579938k015688q02888J846939
34485a887993L658628K842635O48281n93730q74581j605246k454591j981498o89641
34476b937736l41428n84121N03269K513528K747637O08678j363052j632229j503493
34467a988947j715708p61788J585864K559060P81060p63016O11804K369865N44626
$$ y = [3261602, -447592, -1819076, 341203, 2086952, 631400, -1380861, -556405, 1940311, 2962543, 2316349, 1698072, 1019587, -681753, -2334213, -2206491, -1001571, -533514, -412086, 932924, 2843335, 3112193, 1467592, -488383, -2223616, -4203085, -5403330, -4220227, -1893302, -1703508, -4129544, -5819612, -4378444, -1475206, 103221, 144337, 185041, 777759, 1178507, 663582, -916356, -2932044, -3734932, -1887993, 1770635, 4613270, 5261551, 4667821, 3793240, 2187994, -266597, -2248095, -2937736, -3279164, -3863285, -3360016, -846488, 1901149, 2509827, 1146775, -485454, -1988947, -3704655, -4466443, -2880579, -321519, 459541, -303475, 308329, 2678194, 3222820]
34458C222820l437664m399411j208143J806883J647074K91762J67569K45421q73543
34449b537232j523968J10252K210203K009062M59693M14508J307217o5245l503010
34440a118520m557363j080758L119265L474298O97520j110948m22418P12651O08308
34431C22035j00010l80217k63695o523M08222N89423O5952n08978k3004J005200
34421A108405P21968j127951k313761j199980P75769J164557J7177m33889P27105
34412e60600J702546N97609j809547k906355j385249J382501L101625K850438
34404B972968J290865n83280j986400k104415o94456Q90734O64878j309102k441041
34395c299249q82645J797981K622448J081991o74592j091292p59321o39883n38722
$$ y = [3222820, -214844, -4614255, -5822398, -4015515, -2368441, -2076679, -1909110, -1663689, -2537232, -4061200, -3950948, -1740745, 268317, 728010, 1142518, 2449735, 2384490, -1118520, -5675883, -6756641, -3637376, -163078, 534442, -576506, -998924, -286273, 322035, 222025, -158192, -421887, -428410, -20188, 569235, 635187, 126209, 103205, 1108405, 1830373, 702422, -1611339, -2811319, -2035550, -870993, -853816, -1287705, -560600, 1141946, 1739555, -69992, -2976347, -4361596, -2979095, 122530, 2972968, 4263833, 3680553, 1694153, -410262, -1104718, -213984, 450894, -858208, -3299249, -4181894, -2383913, 238535, 1320526, 645934, -445358, -1204679, -1844562, -2383284]
34386b383284K7812P40178R31671L42113q45013j925703j747050r497J652903
34377c215870J397071p1665l41667Q97639J214852n20357j903016n57585K071694
34368a028904K828159J385608R6516J8921j68732j190729j635744k95670J722082
$$ y = [-2383284, -2355472, -1615294, -683623, -341510, -1186523, -3112226, -4859276, -4868773, -3215870, -1818799, -1890464, -2232131, -1334492, -119640, -639997, -2543013, -3100598, -1028904, 1799255, 3184863, 3281379, 3300300, 3131568, 1940839, 305095, 9425, 1731507]
$$ [...]
##END NTUPLES=NMR SPECTRUM
##END=
