##TITLE=31Pdec_SR117_Z5
 , 24 sc
 5.4.2022
##JCAMPDX= 6.0         $$ Bruker NMR JCAMP-DX V2.0
##DATA TYPE= NMR SPECTRUM
##DATA CLASS= NTUPLES
##ORIGIN= UXNMR, Bruker Analytische Messtechnik GmbH
##OWNER= root
$$ XWIN-NMR		Version 3.5
$$ Tue Apr  5 11:14:18 2022 Russian Standard Time (UT+4h)  she@DPX200
##.OBSERVE FREQUENCY= 81.013821
##.OBSERVE NUCLEUS= ^31P
##.ACQUISITION MODE= SIMULTANEOUS
##.ACQUISITION SCHEME= undefined
##.AVERAGES= 24
##.DIGITISER RES= 16
##SPECTROMETER/DATA SYSTEM= spect
##.PULSE SEQUENCE= zgpg30
##.SOLVENT NAME= CDCl3
##.SHIFT REFERENCE= (INTERNAL, CDCl3, 0, 248.564)
##AUDIT TRAIL= $$ (NUMBER, WHEN, WHO, WHERE, WHAT)
$$ ##TITLE= Audit trail, XWIN-NMR		Version 3.5
$$ ##JCAMPDX= 5.01
$$ ##ORIGIN= Bruker BioSpin GmbH
$$ ##OWNER= she
$$ F:/spectra/data/she/nmr/P31/1/pdata/1/auditp.txt
$$ ##AUDIT TRAIL=  $$ (NUMBER, WHEN, WHO, WHERE, WHAT)
(   1,<2022-04-05 11:13:13.84 +0400>,<she>,<DPX200>,
      <created by zg, POWCHK disabled, PULCHK disabled
       configuration hash MD5:
       00 E9 B6 7A A2 85 ED C7 34 08 36 98 17 FE 4E 26
       data hash MD5: 32K
       69 09 77 37 D4 85 7A E5 98 C9 0C B5 16 A8 87 C8>)
(   2,<2022-04-05 11:13:15.98 +0400>,<she>,<DPX200>,
      <Start of raw data processing
       efp BC_mod = 2 LB = 1 FT_mod = 6 PKNL = 1 PHC0 = -9632.614 PHC1 = 304.4756 SI = 64K 
       data hash MD5: 64K
       F8 BA A2 E5 14 2A FD EE 59 85 F7 76 26 BE 2D 60>)
(   3,<2022-04-05 11:13:41.56 +0400>,<she>,<DPX200>,
      <pk PHC0 = 32.90169 PHC1 = -86.20002 
       data hash MD5: 64K
       E9 F4 B6 3A 95 C0 3D A5 C3 2C 7B A4 9B 32 BD FA>)
$$ ##END=
$$ 
$$ hash MD5
$$ 13 6F BF 0C 77 70 5D D0 D7 35 45 57 B4 9E 74 AB
##$RELAX= 
##$RELAX= 
##$RELAX= 
##$RELAX= 
##$RELAX= 
##$RELAX= 
##$RELAX= 
##$RELAX= 
$$ Bruker specific parameters
$$ --------------------------
##$DU= <F:/spectra>
##$EXPNO= 1
##$NAME= <P31>
##$PROCNO= 1
##$TYPE= <nmr>
##$USER= <she>
##$AMP= (0..31)
100 100 100 100 100 100 100 100 100 100 100 100 100 100 100 100 100 100 
100 100 100 100 100 100 100 100 100 100 100 100 100 100 
##$AQSEQ= 0
##$AQ_mod= 1
##$AUNM= <au_zg>
##$AUTOPOS= <>
##$BF1= 81.014009
##$BF2= 200.13
##$BF3= 200.13
##$BF4= 200.13
##$BF5= 200.13
##$BF6= 200.13
##$BF7= 200.13
##$BF8= 200.13
##$BYTORDA= 1
##$CFDGTYP= 0
##$CFRGTYP= 5
##$CHEMSTR= <none>
##$CNST= (0..31)
1 1 145 1 1 1 1 1 1 1 1 1 1 1 1 1 1 1 1 1 1 1 1 1 1 1 1 1 1 1 1 1 
##$CPDPRG= <waltz16>
##$CPDPRG1= <>
##$CPDPRG2= <waltz16>
##$CPDPRG3= <>
##$CPDPRG4= <mlev>
##$CPDPRG5= <mlev>
##$CPDPRG6= <mlev>
##$CPDPRG7= <mlev>
##$CPDPRG8= <mlev>
##$CPDPRGB= <>
##$CPDPRGT= <>
##$D= (0..31)
0 1 0 0 0 0 0 0 0 0 0 0.03 2e-05 3e-06 0 0 0 0 0 0 0 0 0 0 0 0 0 0 0 0 
0 0 
##$DATE= 1649142793
##$DBL= (0..7)
120 120 120 11 120 120 24 19 
##$DBP= (0..7)
150 150 150 150 150 150 150 150 
##$DBP07= 0
##$DBPNAM0= <>
##$DBPNAM1= <>
##$DBPNAM2= <>
##$DBPNAM3= <>
##$DBPNAM4= <>
##$DBPNAM5= <>
##$DBPNAM6= <>
##$DBPNAM7= <>
##$DBPOAL= (0..7)
0.5 0.5 0.5 0.5 0.5 0.5 0.5 0.5 
##$DBPOFFS= (0..7)
0 0 0 0 0 0 0 0 
$$ [...]
##$SUBNAM2= <"">
##$SUBNAM3= <"">
##$SUBNAM4= <"">
##$SUBNAM5= <"">
##$SUBNAM6= <"">
##$SUBNAM7= <"">
##$SUBNAM8= <"">
##$SUBNAM9= <"">
##$SW= 501.771253377433
##$SWIBOX= (0..15)
0 1 3 0 0 0 0 0 0 0 0 0 0 0 0 0 
##$SW_h= 40650.406504065
##$TD= 32768
##$TD0= 1
##$TE= 0
##$TE2= 300
##$TE3= 300
##$TEG= 300
##$TL= (0..7)
0 120 53 12 22 120 120 120 
##$TP= (0..7)
150 150 150 150 150 150 150 150 
##$TP07= 0
##$TPNAME0= <>
##$TPNAME1= <>
##$TPNAME2= <>
##$TPNAME3= <>
##$TPNAME4= <>
##$TPNAME5= <>
##$TPNAME6= <>
##$TPNAME7= <>
##$TPOAL= (0..7)
0.5 0.5 0.5 0.5 0.5 0.5 0.5 0.5 
##$TPOFFS= (0..7)
0 0 0 0 0 0 0 0 
##$TUNHIN= 0
##$TUNHOUT= 0
##$TUNXOUT= 0
##$USERA1= <user>
##$USERA2= <user>
##$USERA3= <user>
##$USERA4= <user>
##$USERA5= <user>
##$V9= 5
##$VALIST= <valist>
##$VCLIST= <CCCCCCCCCCCCCCC>
##$VD= 0
##$VDLIST= <DDDDDDDDDDDDDDD>
##$VPLIST= <PPPPPPPPPPPPPPP>
##$VTLIST= <TTTTTTTTTTTTTTT>
##$WBST= 1024
##$WBSW= 4
##$XGAIN= (0..3)
0 0 0 0 
##$XL= 0
##$YL= 0
##$YMAX_a= 20441
##$YMIN_a= -42633
##$ZGOPTNS= <>
##$ZL1= 120
##$ZL2= 120
##$ZL3= 120
##$ZL4= 120
##$ABSF1= 0
##$ABSF2= 0
##$ABSG= 0
##$ABSL= 0
##$ALPHA= 0
##$AQORDER= 0
##$ASSFAC= 0
##$ASSFACI= 0
##$ASSFACX= 0
##$ASSWID= 0
##$AUNMP= <proc_1d>
##$AZFE= 0.1
##$AZFW= 0.5
##$BCFW= 0
##$BC_mod= 2
##$BYTORDP= 0
##$COROFFS= 0
##$CY= -3
##$DATMOD= 1
##$DC= 0
##$DFILT= <>
##$DTYPP= 0
##$F1P= 0
##$F2P= 0
##$FCOR= 1
##$FTSIZE= 65536
##$FT_mod= 6
##$GAMMA= 0
##$GB= 0
##$INTBC= 1
##$INTSCL= 5.30512e-09
##$ISEN= 30
##$LB= 1
##$LEV0= 0
##$LPBIN= 0
##$MAXI= 10000
##$MC2= 0
##$MEAN= 0
##$ME_mod= 0
##$MI= 50
##$NCOEF= 0
##$NC_proc= -6
##$NLEV= 6
##$NOISF1= 182.463
##$NOISF2= 159.3651
##$NSP= 0
##$NTH_PI= 0
##$NZP= 0
##$OFFSET= 248.5645
##$PC= 4
##$PHC0= -9599.713
##$PHC1= 218.2756
##$PH_mod= 1
##$PKNL= yes
##$PPARMOD= 0
##$PSCAL= 0
##$PSIGN= 0
##$REVERSE= no
##$SF= 81.014009
##$SI= 65536
##$SIGF1= 159.3651
##$SIGF2= -187.1042
##$SINO= 113.3802
##$SIOLD= 16384
##$SREGLST= <1H.CDCl3>
##$SSB= 0
##$STSI= 65536
##$STSR= 0
##$SW_p= 40650.406504065
##$SYMM= 0
##$S_DEV= 0
##$TDeff= 32768
##$TDoff= 0
##$TI= <>
##$TILT= no
##$TM1= 0
##$TM2= 0
##$TOPLEV= 0
##$USERP1= <user>
##$USERP2= <user>
##$USERP3= <user>
##$USERP4= <user>
##$USERP5= <user>
##$WDW= 1
##$XDIM= 65536
##$YMAX_p= 464659249
##$YMIN_p= -17557528
$$ End of Bruker specific parameters
$$ ---------------------------------
##NTUPLES= NMR SPECTRUM
##VAR_NAME=  FREQUENCY,     SPECTRUM/REAL,   SPECTRUM/IMAG
##SYMBOL=    X,             R,               I
##VAR_TYPE=  INDEPENDENT,   DEPENDENT,       DEPENDENT
##VAR_FORM=  AFFN,          ASDF,            ASDF
##VAR_DIM=   65536,         65536,           65536
##UNITS=     HZ,            ARBITRARY UNITS, ARBITRARY UNITS
##FACTOR=    0.620285442955139, 1,           1
##FIRST=     20137.2065510759, 0,            0
##LAST=      -20513.1999529892, 0,           0
##MIN=       -20513.1999529892, -17557528,   0
##MAX=       20137.2065510759, 464659249,    0
$$ Real data points
##PAGE= N=1
##DATA TABLE= (X++(R..R)), XYDATA
$$ [...]
39468A0822242j009601n75366k97518k8623M358j09275k3707q0427p25608j200296
39458F776179n76115L57193L20599K5753R42901K287566K179814J214214J527904
39449A5056008K761597K711920J756924K422474M557673N738724O774048J0913075
39441E2692443J5955224J3692724J152959j2918980j7840000j3437683p713096
39434C1583591n403396m708057l425345k169138j461878n23686L50054j58968
39426A4083177j517059j646560l84258K61978m51444j046768n98750O7705L27995
39417I096016O54539J199904J432290J401487J636457J799658J106976j28188
39409A8199139j000779j597461k359324k571989j480386j67748j24944o82056
$$ y = [10822242, 9812641, 9237275, 8939757, 8911134, 8915492, 8806217, 8782510, 8702083, 7976475, 6776179, 6200064, 6557257, 6877856, 6903609, 7846510, 10134076, 12313890, 13528104, 15056008, 17817605, 20529525, 22286449, 24708923, 29266596, 35005320, 41779368, 52692443, 68647667, 82340391, 83493350, 70574370, 52734370, 39296687, 31583591, 26180195, 21472138, 18046793, 15877655, 14415777, 13892091, 14242145, 14083177, 12566118, 10919558, 10535300, 10797278, 10345834, 9299066, 8700316, 8768021, 9096016, 9750555, 10950459, 12382749, 13784236, 15420693, 17220351, 18327327, 18199139, 17198360, 15600899, 13241575, 10669586, 9189200, 9021452, 8896508, 8214452]
39401H214452k33939P69370P43699J53833P38079K078680K324683K083388L732937
39392B0605182O435057N940864Q24434m706767o251845m475506k752997k243866
39384A3374556j909767j418431j253413j065770k43848N87014M35323l64317q08339
39375G333008q12528p96348n15280L27908J078762J069285Q56203J260982J900636
39366A1702628K020700K154119L432487N462678O214621M170835j44766m669650
39358C0343652p253974o953522m616633k112252o24254L9984L95519L72767o3683
39349I527604k34227M83753J641690K161998J528709J22994j272565j989050j911051
39340A0059855j638406j756114j903537j292211j87120J76982n13767r62126j03591
$$ y = [8214452, 7980513, 8749883, 9493582, 9647415, 10385494, 12464174, 14788857, 16872245, 20605182, 27040239, 32981103, 33805537, 29098770, 22846925, 18371419, 15618422, 13374556, 11464789, 10046358, 8792945, 7727175, 7483327, 8070341, 8505664, 8141347, 7333008, 6520480, 5724132, 5208852, 5536760, 6615522, 7684807, 8541010, 9801992, 11702628, 13723328, 15877447, 19309934, 24772612, 30987233, 35158068, 35013302, 30343652, 23089678, 16136156, 11519523, 9407271, 8783017, 8823001, 9218520, 9591287, 9527604, 9293377, 9777130, 11418820, 13580818, 15109527, 15232521, 13959956, 11970906, 10059855, 8421449, 6665335, 4761798, 3469587, 3282467, 3459449, 2945682, 1983556, 1879965]
39331A879965J308719J760317R03710l46330j094300j127398p05453k73217j05914
39322B200099M5125N46215J032320O86243m25235j143266p16666L00765J049452
39313C575052J405558J529346J231901M72707j36087M4123R45635K000457K563860
39304A3632552K004821J80946j904662k771320k146544j193815p87231n12156
39296F502591K10319R90734J088440M54308l47430p29191m07526K37474K08627
39287H208346q45770j680447r85637M32011O48628l58501p44336O508K98248n34523
39277D444527r20066M9473Q22463R8999q42287m38210M61059L25059k63207J58356
39267C896166J202365J440105R19734O90296P13832L75478K32245J144691K432535
$$ y = [1879965, 3188684, 4949001, 5852711, 5506381, 4412081, 3284683, 2579230, 2306013, 2200099, 2245224, 2791439, 3823759, 4510002, 4084767, 2941501, 2224835, 2525600, 3575052, 4980610, 6509956, 7741857, 8214564, 8078477, 8122600, 9068235, 11068692, 13632552, 15637373, 15818319, 13913657, 11142337, 8995793, 7801978, 7014747, 6502591, 6712910, 7703644, 8792084, 9246392, 8898962, 8169771, 7762245, 7999719, 8208346, 7362576, 5682129, 4696492, 5128503, 5777131, 5418630, 4674294, 4680802, 4979050, 4444527, 3524461, 3573934, 4396397, 4495396, 3653109, 3214899, 3675958, 4001017, 3737810, 3896166, 5098531, 6538636, 7458370, 8148666, 8862498, 9237976, 9470221, 10614912, 13047447]
39258A3047447K911599K930815L417946M048155M610143O711183J0982709J3675066
39250F2335063R980315Q55338p138135r523313q160504o957197o805630o525182
39242B8060755n870101n186945l985114k037728n71279n55494r99090n82991J50953
39233H422966q3059r69272j097147k14830O09262P56370O35893O38442O23231
39224I321856M49021K24361N5081R6315P11675K056844L531973L965010K457803
39215B2869939p19783l846306m850919l402048j479804r80637j309630o69668
39207E611144Q11747J204900p857j055544p74224k24564m29473n33618L79095
39198D981606J397890J382589J009169J460432K286094K395874K148361K577975
$$ y = [13047447, 15959046, 18889861, 22307807, 26355962, 30966105, 37677288, 48659997, 62335063, 72315378, 73170716, 66032581, 56509268, 48348764, 41391567, 34585937, 28060755, 22190654, 17003709, 13018595, 10980867, 10409588, 9854094, 8855004, 8272013, 8422966, 8339907, 7370635, 6273488, 6058658, 6667920, 7424290, 8060183, 8698625, 9321856, 9770877, 9995238, 10050319, 10146634, 10858309, 12915153, 16447126, 20412136, 22869939, 22150156, 18303850, 13452931, 10050883, 8571079, 7590442, 6280812, 5611144, 6422891, 7627791, 7619934, 6564390, 5790166, 5565602, 5136129, 4602511, 4981606, 6379496, 7762085, 8771254, 10231686, 12517780, 14913654, 17062015, 19639990]
39190A9639990L532407M625422O961411J1092225J3669530R584155j336024j2302766
39182E5466350j6124927j2407916o684171l668071l377396l348495k344248j032446
39174F478680l29702l31722o38422r19967j017953q84118n81038j81374L33207
39165A927591Q63248R70503L03803o82399r92331l70433K38693j6783p06745q95613
39155F39534n66854l45393k09376L53392J047952Q98904j68626j045822j027734
39146d24023n94037k87679M5557M60297N11098K35244M29802J254796J622390
39137C253445P87125m30976q81868o43572m49259m24276l50848l92343n83749
39128a16321l71753L69741O90194j4830p80382m70437M11340O47449K97510K63758
$$ y = [19639990, 23172397, 27797819, 34759230, 45851455, 59520985, 69105140, 67769116, 55466350, 39341423, 26933507, 20249336, 16581265, 13203869, 9855374, 7511126, 6478680, 6148978, 5817256, 5178834, 4258867, 3240914, 2356796, 1775758, 1594384, 1927591, 2790839, 3761342, 4065145, 3382746, 2390415, 2019982, 2258675, 2241892, 1535147, 639534, 72680, -272713, -482089, -128697, 919255, 1818159, 1649533, 603711, -424023, -1018060, -1305739, -1260182, -799885, -288787, -53543, 376259, 1631055, 3253445, 4040570, 3609594, 2727726, 2084154, 1634895, 1210619, 859771, 467428, -116321, -488074, -118333, 571861, 557031, -223351, -693788, -282448, 365001, 662511, 926269]
39118I26269M76380J53348n20551o46411l30458m92965j038184q82762J05749
39109b249585Q27380Q07269P37439Q61511M44825o20346j195085n73254M87361
39100d72485J023068R39083L35672q27034j753908j066104J003353K158803J034622
39091B375070p21382q56596K20859M66564l72027n83252M26415J093939K94249
39082B343839q29011o39734O03135J291486P20760k89988p57895n85715k09604
39073A647273Q4102K03372L9082l93826p32787n49586O8214N06575L84742N9047
39063A316208L9096J50501j55847p29665o94573K47709J169848J083394K36357
39054B663028l72567l84350k40885j81608N8402M84606N97754K27050o2148J49115
$$ y = [926269, 1402649, 1555997, 1035446, 389035, 58577, -434388, -1472572, -2355334, -2249585, -1422205, -614936, 122503, 984014, 1428839, 808493, -386592, -959846, -472485, 550583, 1489666, 1825338, 998304, -755604, -1821708, -818355, 1340448, 2375070, 1653688, 797092, 1017951, 1484515, 1112488, 529236, 955651, 2049590, 2343839, 1514828, 875094, 1478229, 2769715, 3490475, 3200487, 2442592, 1856877, 1647273, 1731375, 1934747, 1973829, 1580003, 847216, 297630, 365844, 872419, 1257161, 1316208, 1355304, 1505805, 1349958, 620293, -74280, 173429, 1343277, 2426671, 2663028, 2290461, 1906111, 1665226, 1483618, 1542020, 2026626, 2624380, 2851430, 2789282, 2938397]
39044B938397L94068P1985m66745l78844K72742M82139j33322o17540r8000Q03761
39034C268641Q71097J38137k79966m9875r230m41121l61335O86682J381094M31768
39024E635892j247489j710593q15944k08912o13993r44547m19292J94452J82974
39015E2548J54055O51969Q49414o4214j227325j280350m29533J42786L12943Q21326
39005a6381J415405R98805l11811j039178o44742l27015q55353j177745k60188
38996b218203R65604Q84026l63495j134553o04963M49623J066729J135212R19032
38987A099012N11005K8148l19312n42664p41968o65219l5627O89877O68055p1336
38977F19971n02619n0893N76494M60677k49969o83829m10992K69099Q47295R37262
$$ y = [2938397, 3332465, 3404450, 2937705, 2558861, 2831603, 3313742, 3180420, 2562880, 2464880, 3268641, 4139738, 4277875, 3997909, 3948034, 3938804, 3497683, 3136348, 3823030, 5204124, 5635892, 4388403, 2677810, 1861866, 1652954, 1038961, 94414, -324878, -130426, 52548, 206603, 858572, 1707986, 1643772, 416447, -863903, -1293436, -1150650, -837707, -16381, 1399024, 2397829, 2086018, 1046840, 402098, 75083, -780270, -1958015, -2218203, -1252599, -368573, -732068, -1866621, -2471584, -2021961, -955232, 179980, 1099012, 1610017, 1638165, 1318853, 776189, 34221, -630998, -666625, 23252, 691307, 619971, 117352, 66459, 642953, 1103630, 853661, 169832, -241160, 27939, 875234, 1812496]
38967A812496M29238k38492l07349L69613J013126R60556M97599J12925l75145
38958D274567j073482j094827K91780J961082J963425L25933p99112k24847O56368
38949F280887K14833r53349j215459m34211K28383L19305L13168K21269m16634
38940D558192j233574j233711m35213M2169k32788m38557o6889K65163Q7974j01115
38930A211651K5209j32217q62563j264272o40176K00797K22493j07059K65396
38921a080741R95562Q64542n2575m14912J64363N65415J62937j89866J70535N00937
38911A686197P0258m10429j7459O17580K15177r67203j373690m98298M56523N38127
38901C16783L00036M70706N61519j55982j090366j036724j23399K72600l29393
$$ y = [1812496, 2241734, 2003242, 1695893, 2065506, 3078632, 4039188, 4536787, 4649712, 4274567, 3201085, 2106258, 2398038, 4359120, 6322545, 6648478, 5849366, 5624519, 6280887, 6495720, 5542371, 4326912, 3892701, 4121084, 4440389, 4753557, 4974826, 4558192, 3324618, 2090907, 1655694, 1697863, 1465075, 1026518, 959629, 1224792, 1312766, 1211651, 1236860, 1104643, 242080, -1022192, -1662368, -1461571, -1239078, -1346137, -1080741, -85179, 779363, 726788, 311876, 476239, 1041654, 1204591, 1014725, 1185260, 1686197, 1756455, 1346026, 1328567, 1946147, 2161324, 1194121, -179569, -677867, -221344, 316783, 616819, 1087525, 1649044, 1493062, 402696, -634028, -757427, -484827, -814220]
38892h14220p36903k4922Q54384M58030q16915j134861J10165J355456J084447
38883C34661r4907m77541L11599J035771P90000R6797j99205j91277m46233q57839
38873C01826p42480N7948Q15377P90593P7579n94819o65804k01712K83101L30414
38863D52023m3091l55715j88571K59728L35584k16348p74202n32942L87658R47981
38853B72105M71787m46505o92248o0523N82501N43858J11541j26798k07778m82826
38843c4886p27213l18819O56535J199499O54735l35416o44436j22543L55772K07803
38833H91031j60261j65488M4615j3577k33995p0342M39991N19338j94455r31296
38823A25561p84165m6757J73784m15856q63753l94765M82927Q11663N52709L83012
$$ y = [-814220, -1551123, -1576045, -721661, -263631, -1080546, -2215407, -2105242, -749786, 334661, 239754, -237787, 73812, 1109583, 1899583, 1996380, 1797175, 1605898, 1159665, 301826, -440654, -382706, 432671, 1223264, 1300843, 706024, 40220, -161492, 121609, 452023, 408932, 53217, -135354, 124374, 459958, 243610, -530592, -1063534, -675876, 272105, 743892, 297387, -394861, -455384, 127117, 670975, 782516, 655718, 447940, -34886, -762099, -1080918, -424383, 775116, 1429851, 1094435, 449999, 327456, 683228, 891031, 730770, 565282, 609897, 596320, 362325, 291983, 731974, 1251312, 1056857, 125561, -658604, -705361, -531577, -947433, -1811186, -2205951, -1723024, -911361, -358652, 24360]
38813B4360M48187K12043m15187o74358q5594O60260N50025l30882q57933l09718
38803g78797P66290J260646P09202m04141j284331j472013r60488k1559R10980
38794a274211J355963J072469L19589l15288m50651j97101J18766L36027M59775
38785A425338N01967N30817O69668P70661L40524p47304j637200j241654L08668
38776I21485J605405J600423O96612j54397p65205j433044j845752j271065J47316
38767d98222J169108R06478o5335m99352n4347M19144J24855n93897p06086J05860
38757C08206R28904P67233j27285o52410m58712l14891o52403p33771K9244Q07581
38747i8304N13405l65852m48476L06414N71308p7841m97271n0733K84211k23803
$$ y = [24360, 472547, 684590, 269403, -404955, -490549, 169711, 719736, 388854, -469079, -778797, -12507, 1248139, 1957341, 1553200, 268869, -1203144, -2163632, -2185191, -1274211, 81752, 1154221, 1473810, 1158522, 707871, 510770, 629536, 965563, 1425338, 1927305, 2458122, 3127790, 3898451, 4238975, 3491671, 1854471, 612817, 921485, 2526890, 4127313, 4823925, 4669528, 3904323, 2471279, 625527, -645538, -498222, 670886, 1577364, 1512029, 1012677, 958330, 1377474, 1502329, 908432, 202346, 308206, 1237110, 2004343, 1877058, 1224648, 765936, 451045, -201358, -935129, -905885, -98304, 415101, 49249, -399227, -92813, 478495, 400654, -96617, -147350, 136861, -86942]
38737h6942o08478P5986Q48996L01271q60897o99596Q69442J830476J049576k88677
38727B431157p06548l08802Q6646L11326M22298N7953p46849j004371j06370R94474
38717A430914R97150N9027o69765p78624o97130m89370J39733Q03071P14686O4349
38707A574041j35772K74027L56116k01515m71896L7337M35474L6913l44006J48361
38697A709080P30416K33684p48484o96752K66649N34986k51005n92647K58207
38688A444134R84377M63527l54910j98632L27882J1004n92022q8356J042892R22809
38678C962705n87645j454723o49914L51187J66888l39313R7916P75280L22086
38669B644467p28356p11455L52928P66199m1479o49393p5375O16903Q8399j088550
$$ y = [-86942, -695420, -619434, 229562, 530833, -330064, -1029660, -160218, 1670258, 2719834, 2431157, 1724609, 1415807, 1502453, 1813779, 2236077, 2294030, 1547181, 542810, 436440, 1430914, 2428064, 2487091, 1817326, 1038702, 341572, -147798, -8065, 795006, 1509692, 1574041, 1438269, 1712296, 2068412, 1866897, 1395001, 1432338, 1867812, 1904725, 1560719, 1709080, 2439496, 2673180, 1924696, 1227944, 1494593, 2029579, 1778574, 1185927, 1444134, 2428511, 2892038, 2537128, 2338496, 2666378, 2677382, 2085360, 1997004, 3039896, 3962705, 3375060, 1920337, 1270423, 1621610, 1788498, 1449185, 1547101, 2322381, 2644467, 1916111, 1204656, 1557584, 2323783, 2282304, 1632911, 1557536, 2174439, 2262838, 1174288]
38659A174288j221767O1262J271214R80930m18479j219388m49844R53919J314085
38650B446220L56097n05432k18333M83847M19065j46262j31478L86725L23070
38641C413519m50557q39780m10812k9178j92197j98663L42764N74789j10631q60381
38631A238873p38862k62147l27248n07029J76741J380934J800991J120325K60656
38622D143234k01742n90959j021634r37054j38816N96959M27738m81145j106751
38613F89830o12840P66291J775129J345464p9076r32774n13813J57393l7778p36761
38603A821065r83385q12200p81073o44885J09340Q99897P34226k2076r9002N85544
38593H07451Q71756M01915N4364J33488j57513r75833j236447m45964L77282M30087
$$ y = [1174288, -47479, 13783, 1284997, 2265927, 1847448, 628060, 178216, 1132135, 2446220, 2802317, 2296885, 2078552, 2562399, 2981464, 2835202, 2703724, 3090449, 3413519, 2962962, 2123182, 1712370, 1683192, 1490995, 1292332, 1635096, 2209885, 2099254, 1238873, 500011, 237864, -89384, -596413, -419672, 961262, 2762253, 3882578, 4143234, 3941492, 3350533, 2328899, 1391845, 1253029, 1849988, 2277726, 1796581, 689830, 76990, 843281, 2618410, 3963874, 3884798, 2952024, 2438211, 2595604, 2557826, 1821065, 837680, 25480, -755593, -1400478, -1291138, -391241, 342985, 320909, 221907, 807451, 1679207, 2081122, 2135486, 2268974, 2111461, 1135628, -100819, -546783, -169501, 260586]
38583B60586L50425P84250J062429M17818n83362r41843o30305j20596N13772
38574A113174J037482O71402n79421j260303m19863P59804P04753j38959k77394
38565A610675K77522L15915k48490l62082R7377K13014m1164K37970Q38782M47397
38555C386916q39543j158576R8196R71629l1226j422385j023177O16351J179134
38546A777319J83842n48401R2113J002370Q15419j78690p68782m43439M05379
38537B337130J161368J282080N30060n36429q29203n0924P30625M71093l33137
38528D762663l84181L92460O60341k63266j237989r15786K81059Q48116M22143
38519D565560O6611L72757O14322K15676j87566M2808L36957O922k87710M81270
$$ y = [260586, 611011, 1395261, 2457690, 2875508, 2292146, 1350303, 719998, 599402, 1113174, 2150656, 2822058, 2242637, 982334, 562471, 1322275, 2027028, 1888069, 1610675, 1888197, 2204112, 1955622, 1593540, 1690917, 1903931, 1862767, 2100737, 2939519, 3386916, 2547373, 1388797, 1486993, 2458622, 2427396, 1005011, -18166, 598185, 1777319, 1961161, 1412760, 1504873, 2507243, 3322662, 3143972, 2375190, 1931751, 2337130, 3498498, 4780578, 5310638, 4774209, 3945006, 3894082, 4624707, 5095800, 4762663, 4378482, 4770942, 5431283, 5168017, 3930028, 3014242, 3295301, 4143417, 4565560, 4632171, 5004928, 5619250, 5834926, 5647360, 5690168, 6027125, 6034047, 5746337, 6227607]
38509F227607J787117K121533J327724Q02729J217407J610256J284184J133647
38501A7512204K136457L609026M039874K980427J211056l82751j281157j242652
38493B8582484n56345P3365M83241J211416K145863K149851J082187R00149K948340
38484C9020551N042637L604842j414008o076467p332134o121173m803158l746841
38476A8174249k054765K3509J377032J810613J853706J528605Q67957Q79138K189944
38467B6649988L307672K245672l47619j791858j191302m44611r55435j619635
38459B5852872j191019n85243j158776k241394k301489j524586j264467j593375
38451A3992523j386581n29607q4650k69299j67833L02483L8911j049143j327363
$$ y = [6227607, 8014724, 10136257, 11463981, 12266710, 13484117, 15094373, 16378557, 17512204, 19648661, 23257687, 27297561, 30277988, 31489044, 31106293, 29825136, 28582484, 28026139, 28099504, 28582745, 29794161, 31940024, 34089875, 35172062, 36072211, 39020551, 44063188, 47668030, 46254022, 40177555, 32845421, 26724248, 21921090, 18174249, 16119484, 16142993, 17520025, 19330638, 21184344, 22712949, 23580906, 24460044, 26649988, 29957660, 32203332, 31855713, 30063855, 28872553, 28427942, 27472507, 25852872, 24661853, 24076610, 22917834, 20676440, 18374951, 16850365, 15585898, 13992523, 12605942, 12076335, 11991685, 11722386, 11554553, 11857036, 11895947, 10846804, 9519441]
38442I519441N2014J478120J079639n53930j381097r02233n17755j126324j885485
38433E762390j654712n87721K21651J17572m76008n89636J86529J075280R08130
38424D963475k70787j013180l82669O53303O41165j62152k86113N42580R97585
38415E683207L68353k98564O5842Q94465R96058L37094k23693l69974m35927m61464
38405F555397j97410J03332j01688o23118o48026p134N43914N79130O46911J127329
38395G978637J248751J57902j441590j822795n39882P73363M77446q83029j343505
38386D605298j85628J217715J411270O58696O7009k10001p59600j365380j077166
38377D362213Q1442Q04413L60874m16711o39739o68930r68685q27413L60090J414199
$$ y = [9519441, 9571455, 11049575, 12129214, 11575284, 10194187, 9291954, 8774199, 7647875, 5762390, 4107678, 3519957, 3741608, 3859180, 3383172, 2793536, 2980065, 4055345, 4963475, 4692688, 3679508, 3296839, 3950142, 4591307, 4429155, 4143042, 4685622, 5683207, 6051560, 5752996, 5818838, 6713303, 7709361, 8046455, 7822762, 7452788, 7016861, 6555397, 6357987, 6461319, 6359631, 5736513, 5088487, 5081353, 5625267, 6204397, 6851308, 7978637, 9227388, 9385290, 7943700, 6120905, 5581023, 6354386, 6831832, 5948803, 4605298, 4419670, 5637385, 7048655, 7707351, 7774360, 7564359, 6804759, 5439379, 4362213, 4443655, 5248068, 5608942, 5192231, 4552492, 3883562, 2914877, 2087464, 2447554, 3861753]
38367C861753P65083r04461j379756k82332L84711m30820j123360k47016R04464
38358A548266L91541j079452j212704K15585J099343L64646o46183o46515k43918
38349b09391l54090m74273J26744P45705L11164o57677p16862K43028Q87032N39620
38339D41000Q358M9977K70724J18119o2623K13359M64296j10933j166163j381551
38329a155437k39651J161498J472731P18597j3458j70222k44292o53870r35023
38320e9127n42195J32397K86897l2324m3533M34918O54232J92656k82062k7378
38310G14481O07584O71660p9298r33369j091057l79511O85523J237501P52212
38301B185726l08252r10514p41429n07302o20098m34008M97222J248856P28874
$$ y = [3861753, 4626836, 3722375, 2342619, 2060287, 2444998, 2014178, 890818, 643802, 1548266, 1939807, 860355, -352349, -136764, 962579, 1327225, 681042, 34527, -209391, -563481, -1037754, -911010, -165305, 145859, -511818, -1228680, -985652, -98620, 441000, 449358, 499335, 770059, 888178, 825555, 1038914, 1503210, 1392277, 226114, -1155437, -1395088, -233590, 1239141, 1957738, 1944280, 1774058, 1529766, 875896, -59127, -601322, -468925, -182028, -214352, -257885, 177033, 831265, 1023921, 741859, 714481, 1322065, 1993725, 1914427, 981058, -109999, -489510, 196013, 1433514, 2185726, 1877474, 966960, 225531, -281771, -901869, -1335877, -838655, 410201, 1139075]
38292A139075n10106r41893k57388M23781M13439J70913R1013n2640k01860J08546
38282C82880O02811L60498m46846l84186R17135J751605P96243p66791j033503
38273B179846j79264K43871J8457K91808J181217J363597L28182o98947o55795
38264D072972m0331K70403L30400M40202K68468l47576o08930J17526J005432
38255E508566Q00130k11030n03840M30032J325611R64533k37434j037898j032122
38246F006548p68921o35332m51827j11263R9123J2743p3315J47655N05781N96964
38236E328156L14537j00541m11211n85100p14876q54724q79072n35636J56691
38227A718224O39569L61046l77004o61694k24286J94018M6188k15133r6824j4643
$$ y = [1139075, 628969, -312924, -570312, -146531, 266908, 437821, 528834, 476194, 274334, 382880, 985691, 1346189, 899343, 515157, 1432292, 3183897, 3980140, 3213349, 2179846, 2000582, 2244453, 2262910, 2554718, 3735935, 5099532, 5427714, 4728767, 4072972, 4032641, 4303044, 4633444, 5073646, 5342114, 4994538, 4385608, 4503134, 5508566, 6308696, 6097666, 5593826, 6023858, 7349469, 8314002, 8076568, 7038670, 6006548, 5237627, 4602295, 4150468, 4039205, 4138328, 4151071, 4077756, 4225411, 4731192, 5328156, 5642693, 5542152, 5130941, 4545841, 3830965, 2976241, 2097169, 1561533, 1718224, 2357793, 2718839, 2341835, 1680141, 1455855, 1649873, 1696061, 1480928, 1384104, 1369461]
38217A369461l99639n80362K50810J450586J679916R92323O85029J115763J300646
38208G864533R42020J133550K357292L329222K811141J300438q9601j234405k353089
38199A6061101k875474k298429j356788j043521j136975r08109n68924p00416
38191E172465r05198m66171J84467J32957l23087j90384L63907L13442k76789
38182D005609l32928K08201K50769l77075n08962K00482M76299m05434j245719
38173B271242q07350K48957N65905J99338J49465M63243K45995o53714j250226
38164A432855q68512l9135L77422K94517J94864K32039Q5454l48984o59765n62693
38154A38062l90264m47502l13745L72504P85907r9959j419631j079164R28870
$$ y = [1369461, 969822, 389460, 640270, 2090856, 3770772, 4763095, 5448124, 6563887, 7864533, 8806553, 9940103, 12297395, 15626617, 18437758, 19738196, 19648595, 18414190, 16061101, 13185627, 10887198, 9530410, 8486889, 7349914, 6441805, 5872881, 5172465, 4267267, 3801096, 3985563, 4118520, 3795433, 3605049, 3968956, 4282398, 4005609, 3672681, 3880882, 4131651, 3754576, 3245614, 3446096, 3922395, 3516961, 2271242, 1463892, 1712849, 2278754, 2478092, 2627557, 3090800, 3336795, 2683081, 1432855, 564343, 525208, 902630, 1197147, 1392011, 1624050, 1709504, 1360520, 700755, 138062, -252202, -699704, -1013449, -640945, 144962, 45003, -1374628, -2453792, -1524922]
38145a524922J894075L50409j359117n41912J565279J765828r829q78144J38367
38136A400034R20925K90718k15993L31359L91117r47723j852124q04521O42828
38127A56620M76062m73356l16207N25916M15696l62480l16074L56583L33331m8974
38117G47117N95969J680465J164785q00014j655667m56253O28881j12498j322792
38108D69993j039942K49493Q45299O20599N91904O79314m5492j253631j442381
38099c24844l03555O09558J38113q27758p76588K45983R19424O25143L1693k10744
38089A26425k70638l59855j59191L99560O16024Q1445m26990o6313O21812N10881
38079A073160k73619o06028k24185N5652m4887R5722N70711O24979J08735j51128
$$ y = [-1524922, 369153, 719562, -639555, -1181467, 383812, 2149640, 2139811, 1261667, 1400034, 2320959, 2611677, 2395684, 2727043, 3118160, 2170437, 318313, -486208, 156620, 632682, 159326, -156881, 369035, 784731, 422251, 106177, 462760, 796091, 747117, 1343086, 3023551, 4188336, 3388322, 1732655, 1276402, 1905283, 1792785, 469993, -569949, -320456, 524843, 1145442, 1737346, 2416660, 2371168, 1117537, -324844, -628399, -18841, 119272, -708486, -1485074, -1239091, -319667, 305476, 337169, 126425, -144213, -504068, -663259, -263699, 352325, 433770, 6780, -59533, 562279, 1073160, 799541, 193513, -30672, 24980, -19907, 75815, 646526, 1271505, 1380240, 1229112]
38069A229112J70315M27640L76450N10018O56024k1736j092633r08637N87803
38060A934356J222187n2780j313560p74248L54004J27195q76765r25408k29898
38051e34917j37986m08660J11887R74233Q49203Q8035O2258N38148K28025n48611
38041A221615l57807N59986O34357j36441l01953J75147n2634q34991n81609N82242
38031I07912P18282l89277o52401N90904J323218M43841l56005K18168P93460
38022C598102L1116r11248o20406N1886j88793o33462j16074O04827K12382p14029
38012A314301p36309j9885K28004o2893m7679L33776N40478O83861J107146J349318
38002D690118R14798M19779O42218J098765Q83877K96714L39019J123691J970209
$$ y = [1229112, 1399427, 1827067, 2203517, 2713535, 3369559, 3347823, 2255190, 1346553, 1934356, 3156543, 3103763, 1790203, 1015955, 1369959, 1497154, 620389, -305019, -534917, -672903, -1081563, -969676, 4557, 853760, 941795, 1004053, 1542201, 1770226, 1221615, 863808, 1423794, 2058151, 1921710, 1619757, 1794904, 1742270, 907279, 325670, 907912, 1626194, 1236917, 584516, 1175420, 2498638, 2942479, 2586474, 2804642, 3598102, 3629218, 2717970, 2097564, 2149450, 1960657, 1327195, 1211121, 1815948, 2028330, 1314301, 577992, 558107, 786111, 723218, 675539, 1009315, 1549793, 2233654, 3340800, 4690118, 5604916, 6024695, 6666913, 7765678, 8649555, 8946269, 9285288, 10408979, 12379188]
37993A2379188K639642L468231M634288N896491O471924M967881P40879m209499
37985C6989025o417598m949185k532446j686842j713266r13330M46933J454151
37977B0677442K754388M818207N640881L148717j157854l888952m303381m245597
37969B3443851m254420l046874p86334M62549Q8178j69755O37539J429194J888186
37960A9692114L591909O762674Q349265N537584k77479m962201o162689m804074
37952B7727103k923935j663852j096503o44483M89644K504090M417069M690720
37944C3499853K583963j076004m335720n531982m678271l327585k737741k558202
37936A1838311j848521p89554l80465p72338j062304p26325k11487J7797J11081
$$ y = [12379188, 15018830, 18487061, 23121349, 29017840, 35489764, 40457645, 41198524, 36989025, 30571427, 25622242, 23089796, 21402954, 19689688, 18776358, 19223291, 20677442, 23431830, 28250037, 33890918, 37039635, 35881781, 31992829, 27689448, 23443851, 19189431, 16142557, 15356223, 15818772, 15906950, 15737195, 16374734, 17803928, 19692114, 23284023, 30046697, 38395962, 43933546, 43656067, 38693866, 32531177, 27727103, 24803168, 23139316, 22042813, 21398330, 21887974, 24392064, 28809133, 33499853, 36083816, 35007812, 30672092, 25140110, 20461839, 17134254, 14396513, 11838311, 9989790, 9200236, 8819771, 8047433, 6985129, 6258804, 6047317, 6065114, 6176195]
37927F176195L06752M95411N16738M38465N04603J048382K151749L174685L274158
37918A8087138K711947K719646L687497M876929O526236J0063329J4528944J5049378
37910G8251044Q023946l129020j0643363j0752132o609855k932053q17636J304281
37902E2695212M242184O920931P155005L046187m668900j1562730j3122741r855054
37894C4850094o438442n426801m747289k379826r5160l18249j993566k420353
37886A1030408j438247r48425j385473j408790o13279j13660m31287p33974l98119
37877C559154J26089K66250R5741o2619j17019j82562l90922n95734k69929P69613
37867C198062J642116J339561L27575k6371L69354L04100m02651m53015N12439
$$ y = [6176195, 6482947, 6978358, 7495096, 7933561, 8438164, 9486546, 11638295, 14812980, 18087138, 20799085, 23518731, 27206228, 32083157, 38609393, 48672722, 63201666, 78251044, 86274990, 83145970, 72502607, 61750475, 55140620, 52208567, 51390931, 52695212, 56937396, 63858327, 71013332, 74059519, 69390619, 57827889, 44705148, 34850094, 28411652, 22984851, 18237562, 15857736, 15762576, 15444327, 13450761, 11030408, 9592161, 8643736, 7258263, 5849473, 5236194, 5122534, 4691247, 3957273, 3559154, 3685243, 3951493, 4047234, 3984615, 3867596, 3685034, 3294112, 2698378, 2428449, 3198062, 4840178, 6179739, 6507314, 6480943, 6850297, 7154397, 6751746, 6298731, 6811170]
37858F811170J108455P01792O32078J755652K828350K785753K655135L591177
37850B2869562N013747O458879Q984227J2291340J2631435O931875k127963q391285
37842F4661817r034256o313352l178823l25103K391301M556894N759054N410597
37834F3928129K114880m338323j0505619j1852699q350463m714742m261854n315935
37826A6703374m886104l052192j714889j208764n55531K38639L55507j03978l87579
37817E388483n79287j224250j835090j300489K53863J287464P52788o83019j563957
37808D96506j219011k05562M63195L40767j12052j47675M02118J014115J101950
37799B134351N36417l03772p62107m47199J79808J85225n02710p95254j13402
$$ y = [6811170, 7919625, 8621417, 9253495, 11009147, 13837497, 16623250, 19278385, 22869562, 27883309, 34342188, 43326415, 55617755, 68249190, 75181065, 73053102, 64661817, 55627561, 49314209, 46135386, 45810283, 48201584, 52758478, 58517532, 63928129, 66043009, 61704686, 51199067, 39346368, 30995905, 26281163, 22019309, 16703374, 11817270, 8765078, 7050189, 5841425, 5285894, 5524533, 5880040, 5776062, 5388483, 4809196, 3584946, 1749856, 449367, 703230, 1990694, 2743482, 2060463, 496506, -722505, -928067, -464872, -124105, -236157, -383832, 18286, 1032401, 2134351, 2670768, 2366996, 1604889, 1157690, 1337498, 1522723, 1020013, 224759, 111357]
37790A11357M66870j69004j152669p88065O52944J141740K1387r86985n44237
37781a246662L23002J39664n60479k56647R32738J344499L03969r28426j035654
37772i83996l04530K02127K94819N56821R58694O76737m52603j265270p73150
37763a090351L55936P76878L93788R3658l6899o19201j204056n44082R64653J227269
37753C17593k82220j344940m19527R08269P21999m7903L69765J183807N24272
37744A931115r62590j133712j41305J0306p79266p09842L07439M63336l09222
37735a323741j3395J464033J617921l44671j828619j024931M01429N78950L58681
37726a14343Q71622J008508j63348r57894J99064J672942J112915o76887j258100
$$ y = [111357, 578227, 409223, -743446, -1531511, -878567, 263173, 284560, -702425, -1246662, -923660, -783996, -1344475, -1601122, -668384, 676115, 980084, 51658, -983996, -1288526, -1086399, -791580, -234759, 723935, 1400672, 948069, -317201, -1090351, -734415, 42463, 436251, 529909, 493010, -126191, -1330247, -1874329, -909676, 317593, 35373, -1309567, -1729094, -820825, -98826, -146729, 223036, 1406843, 1931115, 968525, -165187, -306492, -296186, -1075452, -1785294, -1477855, -1014519, -1323741, -1337136, 126897, 1744818, 1400147, -428472, -1453403, -1051974, -473024, -114343, 757279, 1765787, 1602439, 644545, 843609, 2516551, 3629466, 2952579, 1694479]
37717A694479n22216j76587l92879Q750P60875M88143n29495o88117K3036N6800
37707G22789p55410q66291J42660P92684K87942k86580J542N74660P16654O46757
37697A977407N14220j76989j352034j858335j021252K57443O93803J87765l73213
37688a151185k96192L55178R55254Q56555O0431o89080p94695m91383k44832N200
37678a434749M05821O22636M71941M54488P94301P20214k33373j041631o25424
37669A34224K91304K86822m52843o48488k40429k88652q18812p45731L3571M06160
37659b042874J12849J68228Q31146R89880J66735n51087l22297J97254J90115
37650b60051p6477j25472j70671l59855k31912L09682N20303M9614l38317k8969
$$ y = [1694479, 1172263, 995676, 602797, 611547, 1372422, 1860565, 1331070, 642953, 665989, 722789, -32621, -898912, -756252, 36432, 324374, 37794, 39336, 613996, 1330650, 1977407, 2491627, 2314638, 962604, -895731, -1916983, -1659540, -965737, -777972, -1151185, -1447377, -1092199, -136945, 719610, 780041, 90961, -703734, -1195117, -1439949, -1434749, -1028928, -406292, 65649, 520137, 1314438, 2034652, 1801279, 759648, 134224, 425528, 712350, 259507, -388981, -629410, -918062, -1736874, -2482605, -2449034, -2042874, -1930025, -1761797, -930651, 59229, 225964, -325123, -647420, -450166, -260051, -336528, -462000, -632671, -992526, -1224438, -914756, -394453, -344839, -683156, -712125]
37640g12125L90449J28628n61142q85903o07294q558O04599Q61014M48790k46192
37630e87734l15213M05765R50374N70785k32714n47593k80807j335k2749j35349
37620a96570M958M58503P99825M62067l98633p89733k12092M64260L17730j10172
37610H00143J59788O82823L74447l53230j67965P48216R90763N85029R35225J924356
37600F679595J793047N81451P22833K825270L773760J200780k581611l761439
37592A1233686k298028j132039j415475j623170r00570l35265o58190j049336
37584A821613p60314j51220L39428Q06485J112622P63764j60366r68730j345799
37575A457483j451296j177335l66159L89521L01395l44587n49215j08102L06389
$$ y = [-712125, -321676, -193048, -754190, -1640093, -2247387, -2255945, -1651346, -790332, -341542, -587734, -902947, -497182, 453192, 1023977, 791263, 243670, -37137, -38472, -61221, -196570, -191612, 266891, 1066716, 1528783, 1130150, 340417, 128325, 592585, 910315, 800143, 959931, 1642754, 2017201, 1663971, 1496006, 2244222, 3234985, 3820014, 4755239, 6679595, 8472642, 9054093, 9776926, 12602196, 16375956, 17576736, 14995125, 11233686, 8935658, 7803619, 6388144, 4764974, 3864404, 3529139, 2870949, 1821613, 1061299, 910079, 1249507, 2055992, 3168614, 3932378, 3772012, 2803282, 1457483, 6187, -1171148, -1537307, -1147786, -846391, -1190978, -1740193, -1848295, -1541906]
37566a541906L86096L86183K88724l6542m8813P68760J591571J094414l94388
37557B494099j127521n20872Q3706l24692r64708q05167k00892J2326J2056M61639
37547h80026J150357J222426M62845m58347q80593p05985j65346M93750J048923
37538A288004J258290Q65086j95784j405702j754783p66309O37245R05511l46649
37529D84909j781787j775201j12213J844955K452324J256025o04826j530481j117429
37520h83724l97767k86485m16948l0992O30614P20757J88072j96736p8861J34128
37510f17942J45719J47004K62350L51292M06028M92330L49285k44650p90516n59480
37500e8580K33170N65568L0676o26266n66794J47386P63467O02134l51567j248307
$$ y = [-1541906, -1155810, -769627, -480903, -517445, -566258, 202502, 1794073, 2888487, 2494099, 1366578, 845706, 929412, 604720, -359988, -1165155, -1366047, -1353721, -1341665, -880026, 270331, 1492757, 1955602, 1497255, 616662, -89323, -254669, 239081, 1288004, 2546294, 3411380, 3215596, 1809894, 55111, -711198, -73953, 831558, 484909, -1296878, -3072079, -3184292, -1339337, 1112987, 2369012, 1764186, 233705, -883724, -1281491, -1567976, -1984924, -2015916, -1385302, -664545, -476473, -673209, -752070, -617942, -472223, -325219, -62869, 288423, 694451, 1186781, 1536066, 1291416, 500900, -58580, 174590, 740158, 770834, 144568, -422226, -274840, 488627, 1090761, 739194, -509113]
37490e09113j057033R4997Q02977K78729l81791J11723J064492Q53811l56112
37481I02680q49300j93862K07556k76085m24206N08364J269460O04640p27066
37472A022181j238515q25600l08283J05024N67955O71973J16425l80636j32401
37463d01877J86166l87514j240388r22610M91239J338792P90337q3876q5104M71713
37453A56878N70361R4294k25526n5646J39117n6220l28164j03587N37684Q38260
37443A567451L63643l37352m32354O9013L88389P9583n02305q45404q24057n10065
37433i83458m168L98907L83072O8599j56749k36621l22745k11113L00807O41243
37423a22226J14285o89259m33673P81168J258224K82356o84507l30826M76579
$$ y = [-509113, -1566146, -1471149, -668172, -389443, -771234, -659511, 404981, 1258792, 902680, 53380, -140482, 67074, -209011, -633217, -124853, 1144607, 1749247, 1022181, -216334, -1041934, -1350217, -1245193, -677238, -5265, 111160, -269476, -401877, -215711, -603225, -1843613, -2766223, -2274984, -936192, -145855, -229731, -314835, 156878, 727239, 821533, 596007, 540361, 679478, 623258, 295094, 191507, 729191, 1567451, 1931094, 1593742, 1161388, 1230401, 1618790, 1698373, 1196068, 350664, -473393, -983458, -987626, -588719, -205647, -137048, -293797, -530418, -853163, -1064276, -763469, -122226, -7941, -697200, -1130873, -349705, 908519, 1190875, 506368, 175542, 652121]
37414F52121L52963j99020J89895J172113J110621j69070r66008k99002O89046
37405B533659N12663o56820j495705j274377m30590K10365L03368J74072K90856
37396A67491N48944L44730m39536r93881o10546K67048O57942L58923m7479j86766
37386F6870j24468J41897N92520P59019K43206m44731m43288J20996K87354k01742
37376I97633n19257j46200L33800K87197K8925J32869L85330J88554l48541n05973
37366H34337q6925K37139n1405m68855k10053N45330P10323j15576q55913m39064
37356I9338M78171L64248p93962j321930l96301O65545M76352l14120k28472O36070
37346c35061R22863K62309l38393k71126o3858j38168j01303K75382M21237n4435
$$ y = [652121, 1005084, 806064, 995959, 2168072, 3278693, 3109623, 2143615, 1844613, 2533659, 3046322, 2389502, 893797, -380580, -811170, -600805, -297437, -123365, 167491, 716435, 1061165, 621629, -372252, -982798, -715750, -57808, 301115, 253636, 66870, -57598, 84299, 676819, 1435838, 1679044, 1234313, 791025, 912021, 1199375, 997633, 478376, 332176, 665976, 953173, 982098, 1114967, 1500297, 1688851, 1340310, 834337, 747412, 984551, 933146, 464291, 254238, 799568, 1509891, 1394315, 538402, 99338, 577509, 941757, 147795, -1174135, -1570436, -904891, -428539, -742659, -971131, -335061, 587802, 850111, 511718, 240592, 176734, 38566, -62737, 212645, 633882, 579447]
37336E79447m91130j3860J122240J676660R06422n10650j261389r61200n11566
37327E34974o83090r15366k97115O98100P51760o8578k35379O57055J035982K2246
37317A500589q82160k91061N76875n1508j333753j152077K82209Q57707J75851
37308c17328m8531P45427J045272J26467p01734n13660j50149k78312k20832K79448
37298c3932K26516n73918p04427L29990Q44604j80450j031652k433J564195J284051
37288A722544n11060j457378p94776N5125J59805J04378L41722M19160J20980
37279A60500q5700j2829l1684k67420m42725m88423m99715l06862J28018K86733
37269a560107r8827l50693J24537P47295P38265M36082M32884K20863p82256j598449
$$ y = [579447, 88317, 74457, 1196697, 2873357, 3779779, 3269129, 2007740, 1046540, 534974, -148116, -1063482, -1360597, -662497, 89263, 20685, -214694, 442361, 1478343, 1500589, 618429, 327368, 904243, 852735, -481018, -1633095, -1350886, -493179, -317328, -365859, 379568, 1424840, 1551307, 849573, 335913, 185764, -92548, -313380, -33932, 192584, -381334, -1085761, -755771, 88833, -91617, -1123269, -1125702, 438493, 1722544, 1211484, -245894, -1040670, -985545, -825740, -721362, -379640, 39520, 160500, 74800, 61971, 30287, -237133, -679858, -1168281, -1667996, -1974858, -1846840, -1560107, -1658934, -2009627, -1885090, -1137795, -399530, 36552, 469436, 690299, -91957, -1690406]
37259a690406q98329O27428J055689J82896l16282K76824P83064L89141j00552
37250C09473M6780K54929p9998m97641m85063l41965k95396O1352P26981Q67069
37240E66521J90606l81015k07176L4195l31818p16005l37290L95540O46512M97681
37230C57751M63926L69266j85453p96015p96530m12037l40299n27074l71820R3144
37220b145141K42918M28O811N44226J009978O83651l80091j335868j279035j54529
37210b806652R71062R51579J8944m22652K70386J083263R18571J64876j82379
37201I66998j49346l58807n80995j21088O05910L86063p88221j435337p27617
37192b202440L30663N07548M4576j03433J22745J05115j12976J47983Q89833J159599
$$ y = [-1690406, -2588735, -1961307, -905618, -722722, -1039004, -762180, 20884, 410025, 309473, 356253, 611182, 531184, 33543, -451520, -793485, -1088881, -1027529, -300548, 566521, 757127, 376112, 168936, 203131, -128687, -844692, -1181982, -786442, -139930, 357751, 821677, 1190943, 1005490, 209475, -587055, -999092, -1339391, -1866465, -2238285, -2145141, -1902223, -1901795, -1894984, -1350758, -340780, 342871, -37220, -1373088, -2652123, -2806652, -1835590, -884011, -865067, -1287719, -1017333, 65930, 984501, 1149377, 966998, 817652, 458845, -122150, -243238, 362672, 748735, -39486, -1474823, -2202440, -1871777, -1364229, -1319653, -1423086, -1300341, -1195226, -1308202, -1160219, -270386, 889213]
37182H89213M07631n82344o36053K91339J062152P47860l67556j275968j368398
37173h32124q10869p5780M68558N79190K38150j51270r3157K92033L21688k22104
37163b85685o14281j98437N63054P16248K20668o6728K42224N68102M37219K46580
37153A828964M83691Q17423O38706J41339J19557P55540J271550R44700k5362
37144F976108q97331j245682j125695o94875j26210K14250J1898m60756n11207
37135B140500j1813K04922n40245j535891j342261J98699J440333R50902n63212
37126I41934j175896k76985P94519P36226q6745n03136k55642l5649j85862k85658
37116c32894m0337K14102J60996N2413K24984N11600N78226N14482N76467N60277
$$ y = [889213, 1296844, 714500, 78447, 369786, 1431938, 2179798, 1812242, 536274, -832124, -1642993, -1718773, -1250215, -671025, -432875, -584145, -677302, -385269, -63581, -285685, -899966, -1098403, -535349, 180899, 401567, 334839, 577063, 1145165, 1582384, 1828964, 2312655, 3130078, 3768784, 3910123, 4029680, 4785220, 6056770, 7001470, 6976108, 6078777, 4833095, 3707400, 3012525, 2886315, 3100565, 3112463, 2651707, 2140500, 2128687, 2333609, 1793364, 257473, -1084788, -886089, 554244, 1505146, 941934, -233962, -510947, 283572, 1019798, 933053, 429917, 174275, 138626, -47236, -332894, -373231, -159129, 1867, 54280, 279264, 790864, 1369090, 1883572, 2460039, 3020316]
37106C020316M6395p41322r59637k84196M82391L82881m15623q52746m12937K35490
37096E01012K44465k48242m45411j60203p8965n66235q63807j16063J162034J538903
37086I67488O49585k16516L9487P55991O01383m06119j057649q15399l15369m2539
37076A60343K33720M53610j996r86726j214941j18544R58486N66951o69656j030681
37066a649434k74000L04477J55546J61244P99806J190312O41398j08319j14452
37057A106578K48833M1038n90340o46887O5330N93943K81027l27136m01530n0839
37047C20017k8356m78800o59607q5927O04879M72080l12319o08355N6116P85564
37037F5292O39903p8569m96228m80303m20684k15648M37622J019553O78560k58962
$$ y = [3020316, 3066711, 2325389, 1365752, 1081556, 1563947, 1946828, 1531205, 678459, 265522, 501012, 745477, 497235, 51824, -108379, -187344, -753579, -1617386, -1733449, -571415, 967488, 1617073, 1400557, 1440044, 2196035, 2797418, 2391299, 1333650, 518251, 202882, 160343, 394063, 847673, 845677, -141049, -1355990, -1474534, -516048, 50903, -618753, -1649434, -1923434, -1618957, -1463411, -1302167, -502361, 687951, 1329349, 1221030, 1106578, 1355411, 1396449, 806109, 159222, 224552, 818495, 1099522, 772386, 370856, 320017, 291661, -187139, -846746, -932673, -327794, 144286, -168033, -776388, -720272, 65292, 705195, 626626, 130398, -349905, -770589, -986237, -548615, 470938, 1149498, 890536]
37027H90536n19989J44714M99517j53117p42161j24743R88648J019202j25038
37018A877569r67091o44575q712k07112j023229j261122m05790P63777J257304
37009f18981J022346O46488K99772l06530r49361q21118J46622P80567K63210
37000D63015n40596l95290L23554K94844n16347q39656k24576L96406M32954L73658
36990b32034M75422K65180j82786l2252O41392N45580o71093j518905q92824K94443
36980a307877P74647P38364P93924O07734k6046j90131N39401Q54467k30328j432845
36970A121310j164493j15474J82867P6868O81532J225814K85089j164054r50046
36961A79413M74241N97448q17056j275726J28231J243360O49104k08056r416K09512
$$ y = [890536, 370547, 515261, 1014778, 861661, 119500, -5243, 983405, 2002607, 1877569, 910478, 265903, 257191, 50079, -973150, -2234272, -2640062, -1876285, -618981, 403365, 1049853, 1349625, 1043095, 93734, -727384, -580762, 199805, 463015, -77581, -472871, -149317, 145527, -370820, -1210476, -1435052, -1038646, -605692, -232034, 243388, 508568, 325782, 293530, 934922, 1480502, 809409, -709496, -1602320, -1307877, -533230, 205134, 999058, 1606792, 1580746, 1390615, 1930016, 2784483, 2554155, 1121310, -43183, -158657, 24210, 101078, 782610, 2008424, 2293513, 1129459, 179413, 653654, 1251102, 434046, -841680, -713449, 529911, 1179015, 970959, 961543, 1171055]
36951A171055m80304q39849J50171J100809N49252m55582k96954L91497J51863
36942A441958n18769k33150N78923M62533l73971n02542J70474N09057L51062
36933A885575M39540M98844m01644j666641j547240J10981J473768J410662P76017
36924B979862N76059N60905K49096j06278k46407m26585o62919n09065l387J95871
36914B607152k1514K4677N11448O50136k6499q79608j121088p19586l5433N90592
36904A580277O74700l527o37695j62382R64709J054248k86396j324876o72156
36895A186902P54741J275968P87764K99031O1870l82930q44112o12195K17930
36886B744969P65035O71000L97228K65406J49733R9969L26038N10016O6846p60558
$$ y = [1171055, 690751, -149098, 1073, 1101882, 1651134, 1195552, 898598, 1290095, 1441958, 923189, 690039, 1268962, 1731495, 1357524, 854982, 1025456, 1534513, 1885575, 2325115, 2823959, 2422315, 755674, -791566, -680585, 793183, 2203845, 2979862, 3555921, 4116826, 4365922, 4259644, 4013237, 3586652, 2923733, 2414668, 2411281, 2607152, 2585638, 2610315, 3121763, 3771899, 3745400, 2865792, 1744704, 1025118, 989685, 1580277, 2254977, 2251450, 1613755, 1451373, 2416082, 3470330, 3183934, 1859058, 1186902, 1941643, 3217611, 4005375, 4304406, 4366276, 3983346, 3139234, 2527039, 2744969, 3510004, 4181004, 4578232, 4843638, 4993371, 5093340, 5419378, 5929394, 5996240, 5235682]
36876E235682r78952k84473M30437L83038q0650k54534j33830r6565j33771j00688
36866C985694k35807o42509o73200K28253J331874J362672M08557j12775L63609
36857F016368P09364Q4214n47133k3877R28615P71431l10064p00030k1134L27615
36847G235369l88975j019541m75094O06412J107124J057441R28066M55707n30305
36838H976204j063344k77590R87806J298028Q12900P96303J273552R48146m21677
36829A3330328j287206n92212N39499L33259j212589k363965j823586j77835Q92073
36820G637766N26311m42541o57175Q540M78473K05144j24601K4458Q4642l96237
36810G344780o78562q4404O22948M25036k02827j63988L82289N68537N07135O88693
$$ y = [5235682, 4256730, 3972257, 4402694, 4785732, 4705082, 4450548, 4316718, 4220153, 4086382, 3985694, 3749887, 3107378, 2434178, 2662431, 3994305, 5356977, 5765534, 5652759, 6016368, 6725732, 6809946, 6262813, 6238936, 7167551, 7938982, 7628918, 6928888, 6907754, 7235369, 6846394, 5826853, 5351759, 5958171, 7065295, 8122736, 9050802, 9506509, 8976204, 7912860, 7635270, 8623076, 9921104, 10734004, 11530307, 12803859, 13752005, 13330328, 12043122, 11450910, 11990409, 12323668, 11111079, 8747114, 6923528, 6745693, 7637766, 8164077, 7721536, 7064361, 7072901, 7551374, 7756518, 7631917, 7656375, 7741017, 7344780, 6666218, 6581814, 7204762, 7629798, 7426971, 7262983, 7645272, 8213809, 8720944, 9409637]
36800I409637M42596r16284k014646r65076J284853J875080M43494l02195R37710
36791A0195169K018443J096030l86450l45995O18243P54068K20378K97515Q05236
36782A5272637N75266l10710p75445o82898p70545j094794j097421q50284q59291
36773I406515r47250n18367L49847J015235J121658O92423l1528l59986L28717
36764A1057264J383386J408683M58918J01955O95889O69840m51129o69362J187203
36755A5842647L094307K906728J744849J881993L093161L726598L779243M225419
36747D0294945M820730N245451O807973J0309733J4111018J7049746K0469256
36740A19108852K3605807K0510286P615722p900854j4506631j0393057l986249
$$ y = [9409637, 9852233, 8935949, 6921303, 5956227, 7241080, 9116160, 9559654, 9257459, 10195169, 12213612, 13309642, 12923192, 12577197, 13195440, 13949508, 14169886, 14467401, 15272637, 15847903, 15537193, 14761748, 14078850, 13308305, 12213511, 11116090, 10265806, 9406515, 8459265, 7940898, 8290745, 9305980, 10427638, 11120061, 11088533, 10728547, 11057264, 12440650, 13849333, 14308251, 14410206, 15106095, 15775935, 15324806, 14655444, 15842647, 18936954, 21843682, 23588531, 25470524, 28563685, 32290283, 36069526, 40294945, 45115675, 50361126, 57169099, 67478832, 81589850, 98639596, 119108852, 142714659, 163224945, 170840667, 162939813, 148433182, 138040125, 134053876]
36733A34053876o10752L029242R733172J6248890K0450308K5566057L2178133
36726B40648926L4331928L0593196L0844733M1667967N0335724L6236775j875702
36719D62783547m0937085n8025484n1128265l3526344j7260851p755691p099995
36712B47049832j3812967k1281438k2706126j7789309j1515688p602899o285499
36705A46055906p107917r985355j3478799j5088300j3973216j1571840r263142
36698F5587337p020459m644941k834734k325648k735133k877183k091061j019589
36690D0038589q48346j633819j918092p06209P76039O40149o87651r07193N36568
36681C5290035J406833J70060j474261j158032N80271J288404L37767l87714N88034
$$ y = [134053876, 133443124, 136472366, 146205538, 162454428, 182904736, 208470793, 240648926, 274980854, 305574050, 336418783, 378086750, 428422474, 464659249, 462783547, 421846462, 363820978, 312692713, 279166369, 261905518, 254149827, 247049832, 233236865, 211955427, 189249301, 171459992, 159944304, 152341405, 146055906, 138947989, 128962634, 115483835, 100395535, 86422319, 74850479, 65587337, 58566878, 53921937, 51087203, 48761555, 46026422, 43149239, 41058178, 40038589, 39190243, 37556424, 35638332, 34932123, 35708162, 36348311, 35660660, 34753467, 35290035, 36696868, 36866928, 35392667, 34234635, 34814906, 36103310, 36441077, 36053363, 36641397]
36672C6641397K467845L608190L600633L365639L829567N006892O209883O960593
36664G1690639P639484R095166J1646689J4697549J7134076J7625661J4871354
36657A64400618Q599102N17859o599088j1091482j3096228j3268749j2015016
36650A17447016j0071713q409475p058163n262270l205501k112109k085355j584910
36642G7657520K0570J239472J156996J458136L808244O914538Q768557J0498695
36634A11522728J4574322J9293241J8675398R428697m214161j4380403j7005887
36627A37893935j4063278r659888n925456k639478Q32219M388485P724782J0970960
36619A29522281J3846054J4361476R898871O62186q956046j4029829j3707844
$$ y = [36641397, 39109242, 42717432, 46318065, 49683704, 53513271, 58520163, 64730046, 71690639, 79330123, 88425289, 100071978, 114769527, 131903603, 149529264, 164400618, 172999720, 173517579, 166918491, 155827009, 142730781, 129462032, 117447016, 107375303, 98965828, 91907665, 86645395, 83439894, 81327785, 79242430, 77657520, 77678090, 78917562, 80074558, 81532694, 85340938, 92255476, 101024033, 111522728, 126097050, 145390291, 164065689, 173494386, 169280225, 154899822, 137893935, 123830657, 114170769, 108245313, 105605835, 106438054, 110826539, 118551321, 129522281, 143368335, 157729811, 167628682, 168290868, 159334822, 145304993, 131597149]
36612A31597149j0774024p322707l102653J969688O486015R773274J2875084J5482718
36604A56984544J4165358O593369l531468q990882o854640j396108J326442m92882
36596A57803733m772365r516372j4046290j7311675j7648684j4838251j0933080
36589F8737016q242980p213171o738363n833755m381138k752293j446593r56210
36581C1172513j390016k156428k372478j692943o08148L5073k56993j175101j727689
36572A9827790j133285J56261P20629j19585j267427j159977J98194J327730J254550
36563A9804880M57815k19954n86660o81514l06496M11872P13091J07134r38049
36554A8762119j717610k087088k031829j235549J27501Q98524K74293q59396j040190
$$ y = [131597149, 120823125, 113500418, 110397765, 112367453, 118853468, 128626742, 141501826, 156984544, 171149902, 177743271, 174211803, 165220921, 158366281, 156970173, 158296615, 157803733, 153031368, 143514996, 129468706, 112157031, 94508347, 79670096, 68737016, 60494036, 53280865, 46542502, 40708747, 36327609, 33575316, 32128723, 31172513, 29782497, 27626069, 25253591, 23560648, 22952500, 22987573, 22730580, 21555479, 19827790, 18694505, 18850766, 19571395, 19451810, 18184383, 17024406, 17222600, 18550330, 19804880, 20262695, 20042741, 19456081, 18774567, 18468071, 18879943, 19593034, 19700168, 18762119, 17044509, 14957421, 12925592, 11690043, 11817544, 12716068, 12990361, 12130965, 11090775]
36545A1090775l19986n2038p57373j458844j254667m24597K89506N32210K14506
36536G859492n07412q65930p5203J346940J826211P59519o62142j182437j008095
36527G490943q98440p74731k67886J97108R8154K558P35449J753528J783712R44589
36517A1064984O86714J419395J795614J012371L30529J149057K698473L168695
36509B3325832K491021K265601K965924K971374J036703j655715k986314k555033
36501B7859393j655691j162274q00419l60369j84742j23011O79918K270792L330838
36492B9854435L126689K973951M273718N746212M562802L62675l777255n173494
36484D1949733m656302m554158n008606m347491k464144j406808k200429l171733
$$ y = [11090775, 10770789, 10718751, 9961378, 8502534, 7247867, 6823270, 7112776, 7644986, 7859492, 7352080, 6486150, 6410947, 7757887, 9584098, 10343617, 9681475, 8499038, 7490943, 6592503, 5817772, 5549886, 5746994, 5845148, 5847706, 6583155, 8336683, 10120395, 11064984, 11751698, 13171093, 14966707, 15979078, 16309607, 17458664, 20157137, 23325832, 25816853, 28082454, 31048378, 34019752, 35056455, 33400740, 30414426, 27859393, 26203702, 25041428, 24241009, 23880640, 23695898, 23572887, 24252805, 26523597, 29854435, 32981124, 35955075, 40228793, 45975005, 50537807, 50900482, 47123227, 41949733, 37293431, 32739273, 27730667, 23383176, 20919032, 19512224, 17311795, 14140062]
36476A4140062k519296r58642l55304q56326j101037o60875m33880p22844o99725
36467E832133r5937J91882k21455m15913J07394L05091o23822j529141r05736
36458B644496O16933J076615P8267q07156n18330K32894M63403K54973O9354r9755
36448D011694k82510j62693K89171N58784L71363J2173l81225r78782j478190
36439A959785j203169l26695J26649n4967J50280J127664J690251R66122n8677
36430D377243j23439K74134j20560j117082j445256q01887k8114M26696P84858
36421B226593Q96205L30303n02967o09833Q7786N79302K13615n69880r99350p11014
36411I40760J50699R00253P24139j75346m83409K93038P27024l43458j541520
$$ y = [14140062, 11620766, 10662124, 10306820, 9450494, 8349457, 7688582, 7254702, 6531858, 5832133, 5736196, 5928078, 5706623, 5290710, 5398104, 5703195, 5079373, 3550232, 2644496, 3261429, 4338044, 4416311, 3609155, 3090825, 3323719, 3787122, 4042095, 4111449, 4011694, 3729184, 3566491, 3855662, 4414446, 4785809, 4797982, 4416757, 3437975, 1959785, 756616, 429921, 556570, 501603, 651883, 1779547, 3469798, 4435920, 4377243, 4253804, 4527938, 4407378, 3290296, 1845040, 1043153, 1015039, 1441735, 2226593, 3122798, 3453101, 2950134, 2340301, 2428087, 3007389, 3221004, 2651124, 1651774, 940760, 1091459, 1991712, 2715851, 2540505, 2057096, 2350134, 3077158, 2733700, 1192180]
36402A192180q28088J048952J409018k18381j419733p67732K56787J74539j30823
36393G16719N11370J186657N32208p25715q92640k0030M21250J9625k21013J87486
36383A715917N09815J74130l11318j68487O07575J270316J109655K37221l62656
36374D782168Q7622J027163J143656J66687p69943p50409r4486N30587R28270
36365G051315R08430K08758n62572j53422J477538K805509K971018K897089L204615
36356B0808278K672416L05648k455049l445821k735940k053202k043427j976572
36348I076331j612543j459342j449749j055444n08174l95846l75402J88477P43475
36339C151783L80167l05972l9548Q07989P46723j87906n05940K8784P1475o77615
$$ y = [1192180, 364092, 1413044, 2822062, 2603681, 1183948, 416216, 673003, 847542, 716719, 1228089, 2414746, 2946954, 2221239, 1328599, 1308569, 1729819, 1749444, 1528431, 1715917, 2225732, 2399862, 2088544, 1920057, 2527632, 3797948, 4907603, 5144824, 4782168, 4869790, 5896953, 7040609, 7207296, 6437353, 5686944, 5592458, 6123045, 7051315, 7959745, 8168503, 7605931, 7452509, 8930047, 11735556, 14706574, 17603663, 20808278, 23480694, 23786342, 21331293, 17885472, 15149532, 13096330, 11052903, 9076331, 7463788, 6004446, 4554697, 3499253, 2991079, 2595233, 2219831, 2408308, 3151783, 3531950, 3225978, 3186430, 3994419, 4741142, 4553236, 4047296, 4076080, 4147555, 3469940]
36329C469940r08767k78485j01176o50163k97255J374210K077953L18129j743705
36320C260681j271027R18979J608003p3497j730845j398874J14751R55866N51393
36311B935430l78451r27744o07255L28013Q69175K76604q08937j044413j96783
36302D45639N94498M75828j30440m76249n16947m82879k05246L92066O52494o1805
36292F86959j141307j176311J40121J364155J125389j5797m25901K17527O04866
36283A379701r65o00923k37888L13709p9636p79714l19995R83282J299696K30474
36273B187741m99132J27430P95009J63917q33873n58248O27419R88040J66382
36264C164685m65367j02445M38495K77435j95286j56679L04060L73524k99509
$$ y = [3469940, 2561173, 2282688, 2181512, 1531349, 1234094, 2608304, 4686257, 5004386, 3260681, 1989654, 2908633, 4516636, 4443139, 2712294, 1313420, 1428171, 2384037, 2935430, 2556979, 1629235, 1021980, 1349993, 2219168, 2495772, 1686835, 642422, 445639, 1040137, 1515965, 1385525, 909276, 392329, -90550, -295796, 96270, 748764, 686959, -454348, -1630659, -1490538, -126383, 999006, 983209, 557308, 774835, 1379701, 1378736, 777813, 539925, 853634, 773998, -5716, -325711, 657571, 1957267, 2187741, 1688609, 1816039, 2611048, 2774965, 1941092, 1382844, 2010263, 2998303, 3164685, 2699318, 2596873, 3035368, 3312803, 3117517, 2960838, 3264898, 3638422, 3338913]
36255C338913j120109j223576m30053N45705Q70730M83917k1023k83665m39744
36246A721095m78182o8532O52392Q55979J44193o98142p16626o0393M20638L89212
36236B161634J09486k57810o48117p02670k04806L31718K98683k4789M8190M01498
36226A513017L32668j76237m38826k90864k56972l92906j16235N00990M49769
36217A124404o10495j499237j071417J82809R63268R18420O39298M42331K21006
36208A310387J69630N33046P69537J00186j059043j364794m74898M57519O26587
36199A068157O55321J111119J232894L44309n44321j51020Q07177O48956l65567
36190D807025l61040Q32509J124387k99970j317994k40572J291971Q72203q52019
$$ y = [3338913, 2218804, 995228, 565175, 1110880, 1981610, 2465527, 2444504, 2160839, 1721095, 1242913, 1174381, 1826773, 2682752, 2826945, 2128803, 1412177, 1351784, 1772422, 2161634, 2271120, 2013310, 1365193, 662523, 457717, 789435, 1088118, 1063329, 1111519, 1513017, 1845685, 1669448, 1230622, 939758, 682786, 289880, 173645, 674635, 1124404, 513909, -985328, -2056745, -1873936, -910668, 7752, 647050, 1089381, 1310387, 1480017, 2013063, 2782600, 2882786, 1823743, 458949, -15949, 441570, 1068157, 1723478, 2834597, 4067491, 4411800, 3867479, 3716459, 4523636, 5172592, 4807025, 4445985, 5278494, 6402881, 6102911, 4784917, 4544345, 5836316, 6708519, 5856500]
36181E856500j360394j80377R35249J116309J097804J134439P26463L83527J191047
36172A0900567K565581K964776K857084M048364N743610M719082N21280k912977
36164C1407367k568628j45592J493395K516698M201441N818701O551060P924224
36156E7198666J1119828J4581327J7774050K3696422L2144045L3628081J8218692
36149B08361111r337093l1172118l5461719k7706224k0107771j6540238j3263376
36142E4772572q959582o437313o273637n560936l254179j714197k164463k683792
36134A7724473j767149n65774l87250o22743l39571J76976M71791P56704R70757
36125A6418214O42265K33667R36541K562154L310953K282704O37628l75854r70023
$$ y = [5856500, 4496106, 4315729, 5250978, 6367287, 7465091, 8599530, 9325993, 9709520, 10900567, 13466148, 16430924, 19288008, 23336372, 29079982, 33799064, 34320344, 31407367, 28838739, 28693147, 30186542, 32703240, 36904681, 42723382, 49274442, 57198666, 68318494, 82899821, 100673871, 124370293, 156514338, 190142419, 208361111, 199024018, 167851900, 132390181, 104683957, 84576186, 68035948, 54772572, 45812990, 39375677, 33102040, 27541104, 24286925, 22572728, 20408265, 17724473, 15957324, 15391550, 15004300, 14381557, 14041986, 14218962, 14690753, 15447457, 16418214, 17060479, 17294146, 18230687, 20792841, 24103794, 26386498, 27024126, 26648272, 25678249]
36116B5678249j668732k138020k051916j841712j755965j328255m90195n2629
36108A4350825m00172q47384q84969q51577q48602m10396J56214k40180j345912
36099H677847j271195N00679J735000P18915q84354n58424J183783J912547J197748
36090A3212546O85774Q54685N68413j59663J88624J705252K407027J452636O20994
36081B1536288J311580K248505J861011J133734J986014M016371N120071M809355
36073D4022929M732812N807599O777260O295327M975631M243266L921427K301423
36065H3077674j266526m912230o215120n223889m363351n133229o218833n784991
36057D3959505m376272l846014m213327l825855k497911j978631k734569k795327
$$ y = [25678249, 24009517, 21871497, 19819581, 17977869, 16221904, 14893649, 14403454, 14350825, 13950653, 13103269, 12218300, 11366723, 10518121, 10107725, 10263939, 10023759, 8677847, 7406652, 7907331, 9642331, 10361246, 9476892, 8918468, 10102251, 12014798, 13212546, 13898320, 14753005, 15321418, 15161755, 15350379, 17055631, 19462658, 20915294, 21536288, 22847868, 25096373, 26957384, 28091118, 30077132, 34093503, 39213574, 44022929, 48755741, 54563340, 61340600, 67635927, 72611558, 76854824, 80776251, 83077674, 81811148, 76898918, 70683798, 65459909, 61096558, 55963329, 49744496, 43959505, 39583233, 35737219, 31523892, 27698037, 25200126, 23221495, 20486926, 17691599]
36049A7691599j067145N03297r5286j698482j891901p09271j0581k47921l84855
36040A2089454l26243q18672j315321o00325N45311L1908j928785k660196j113647
36031C903484N77549O40113J07781K94639L40980p48830j727632j099450Q6422
36022B375056r1050j067546o75032J189421K260124J245879o39662j719944j646569
36013A230677q37486K85123J032145P19326l02473q54773m56139K38690O16578
36004A671668P29579O32341J53438m43095n37616j42128P4143q8529j26032J38663
35994B062432K86655K37304L78616N37646J6787r63523j159934k73590L03848
35985A426241l45813j026698l04302R85858Q60190o42948j326277o9176J540792
$$ y = [17691599, 16624454, 17127751, 17032465, 15333983, 13442082, 12732811, 12722230, 12474309, 12089454, 11763211, 10944539, 9629218, 9028893, 9574204, 9606112, 7677327, 5017131, 3903484, 4481033, 5121146, 5228927, 5523566, 5864546, 5115716, 3388084, 2288634, 2375056, 2284006, 1216460, 541428, 1730849, 3990973, 5236852, 4597190, 2877246, 1230677, 393191, 678314, 1710459, 2429785, 2127312, 1272539, 816400, 1055090, 1671668, 2401247, 3033588, 3187026, 2743931, 2206315, 2064187, 2138330, 2049801, 1923769, 2062432, 2349087, 2586391, 2965007, 3502653, 3519440, 2555917, 1395983, 1122393, 1426241, 1080428, 53730, -250572, 735286, 1595476, 952528, -373749, -442925, 1097867]
35976A097867J565570L28497m73172l36861k10300n29770n11752K74493Q72243
35967B076815K92826q53427j071216j2577J139650J280769N34774l19480p73330
35958B294804o58758j4624O89620P63278J67339l17308k12675q5093o10864j392396
35948F23323j415313m34115P26177J131543N65160m08428q43639j99177R04137
35939F49668J154841K22157o34841k71362O87637Q43216J30819k95815l3676R4041
35929B546685l39342n95151j13375M75732L92592o0471j20057J33684l8170p51485
35919A530642j192757p32930J78899N75611K22657j10442K27927P65157N40759
35910B005523m09659r89436o44164j53115k79957m80081J32173J141044J312794
$$ y = [1097867, 2663437, 2991934, 2518762, 2181901, 1971601, 1441831, 930079, 1204572, 2076815, 2369641, 1516214, 444998, 432421, 1572071, 2852840, 3387614, 3068134, 2294804, 1636046, 1621422, 2311042, 3074320, 3241659, 2924351, 2711676, 2626583, 2015719, 623323, -791990, -1226105, -499928, 631615, 1196775, 788347, -55292, -254469, 649668, 1804509, 2026666, 1391825, 1120463, 1808100, 2651316, 2782135, 2486320, 2452644, 2546685, 2207343, 1612192, 1498817, 1974549, 2367141, 2306670, 2186613, 2320297, 2282127, 1530642, 337885, -395045, -216146, 359465, 582122, 471680, 699607, 1464764, 2005523, 1595864, 606428, -37736, -190851, -470808, -950889, -818716, 322328, 1635122]
35901A635122M73697k58296j71890J53705o2739o76372r86626o86161q3273L14894
35891c47939K67627M3440J58360O84258J041704P32345n1458q02101j185426q84823
35881c44013K50886J405274J142950n71782j719323p79921R92749J321593J13287
35872A811700q13012n75115J29894Q22452J572764J689027L05769j552597j718752
35863A672130q6548J113445P39978J19011K35687L6212j164572j894520r05136
35854a34313N45096O93330k296r0627K78034O8799l88621j8809Q31303Q94322
35844B676218K13105l3405L42344L78079j76105m85952j64589K54010M33155N57161
35834C994021N23366K6298n21298l22488M58554P62824J88980m64572l64420M22606
$$ y = [1635122, 2108819, 1850523, 1678633, 1832338, 1769599, 1093227, 106601, -579560, -662833, -347939, -80312, -36872, 121488, 805746, 1847450, 2579795, 2528337, 1726236, 540810, -344013, -93127, 1312147, 2455097, 1883315, 163992, -615929, 376820, 1698413, 1811700, 998688, 423573, 553467, 1375919, 2948683, 4637710, 4943479, 3390882, 1672130, 1585582, 2699027, 3439005, 3558016, 3793703, 3829915, 2665343, 770823, -134313, 410783, 1104113, 1101817, 1011190, 1289224, 1358023, 969402, 950593, 1781896, 2676218, 2889323, 2855918, 3198262, 3576341, 3400236, 2914284, 2749695, 3003705, 3436860, 3994021, 4517387, 4543685, 4022387, 3699899, 4158453, 4921277, 5110257, 4645685, 4281265, 4703871]
35824D703871J229258J384770O13458n27362q42518J61917J428748J615239Q79468
35815A0646849N19902J121030K039511K583552K727076K679403K662337L196808
35807B8176468M773709O967080Q400462P864941N338109J967951q57970k648914
35799E9981836m013399n398905n997366m827568k602300j062471m58449N21317
35791C6142695K094572K911948K936688M198704P315844R981324J0913043J2537792
35783H9032610J7106556K3046400K8663119L6091826M5707376M8607572L2886889
35776C21142348k63626l3068114m7962158m4075194l3536013k5640328k0226515
35769A16370400j4415541q852212n292673k448203K181757P537704Q861145L224936
$$ y = [4703871, 5933129, 7317899, 7931357, 7403995, 6561477, 6723394, 8152142, 9767381, 10646849, 11166751, 12287781, 14327292, 16910844, 19637920, 22317323, 24979660, 28176468, 32950177, 39917257, 48317719, 56182660, 61520769, 63488720, 62630750, 59981836, 55968437, 50569532, 44572166, 39744598, 37142298, 36079827, 35621378, 36142695, 38237267, 41149215, 44085903, 48284607, 55600451, 65581775, 76494818, 89032610, 106139166, 129185566, 157848685, 193940511, 239647887, 288255459, 321142348, 320878722, 287810608, 239848450, 195773256, 162237243, 136596915, 116370400, 101954859, 93102647, 87809974, 85361771, 87543528, 95081232, 103942377, 107167313]
35761A07167313n730469j0084860n669856K751410N971946K47669q994180j3945842
35753G1713131j2751934r441650p551256o773891n503121l772855k657950k441671
35745B0818803k530197k403483j926354j223672o71945n77343o44526k91704L17809
35736A0867388K24930r20032j981302j574714M2801J104422N35498o62473p89583
35727F846935K49465R35233M09809l13828J9367R51188R90042j58757j122805
35718H806649o82789P56374J788679J649512R83207J043421K141467L191961L388500
35709B3066981L922885O493452R823120R766214M384091k675114n816357l430952
35701D5534320J606206N876189P272641M339836k432150q715894r544248n320342
$$ y = [107167313, 101436844, 91351984, 85682128, 88433538, 94405484, 94653153, 85658973, 71713131, 58961197, 49519547, 41968291, 35194400, 29691279, 25918424, 23260474, 20818803, 18288606, 15885123, 13958769, 12735097, 12063152, 11485809, 10841283, 10549579, 10867388, 11092318, 10172286, 8190984, 6616270, 6659071, 7763493, 8298991, 7636518, 6846935, 7096400, 8031633, 8441442, 8127614, 8146981, 9098169, 10088211, 9929454, 8806649, 8123860, 8880234, 10668913, 12318425, 13301632, 14345053, 16486520, 19678481, 23066981, 26989866, 33483318, 43306438, 53072652, 57456743, 54781629, 48965272, 45534320, 47140526, 53016715, 60289356, 64629192, 62197042, 53481148, 43936900, 38616558]
35693C8616558j444537j018391j401804M60163L063626L497146K544340L071575
35685D7388676N193846O638427O880048P494807Q800571R268207Q352250P167876
35677A07184708O007558L631130l41213m339787o847137p900665q100278p643422
35669H1650894o866577o346218n924627m866380l387915k728431l214955l570389
35661D4745402k806132j614945j105148j195682j163199r40231r04771r79588
35653C4035706q82759q67551j312968j834789j705500j088442r45395j538537
35645B3859765j906124j330296n73625p87635j645258j721326p09481M6477l22209
35636A4910288q74350n64686o7310n02312j282990j003074O5141L17069m82832
$$ y = [38616558, 37172021, 36153630, 34751826, 35211989, 38275615, 41772761, 44317101, 47388676, 52582522, 59220949, 66100997, 73595804, 82396375, 91664582, 100016832, 107184708, 113192266, 116823396, 116482183, 112142396, 105295259, 97394594, 89294316, 81650894, 74784317, 68438099, 62513472, 57647092, 54259177, 51530746, 48315791, 44745402, 41939270, 40324325, 39219177, 38023495, 36860296, 35920065, 35015294, 34035706, 33152947, 32285396, 30972428, 29137639, 27432139, 26343697, 25398302, 23859765, 21953641, 20623345, 20049720, 19262085, 17616827, 15895501, 15186020, 15232497, 14910288, 14035938, 13471252, 13403942, 12901630, 11618640, 10615566, 10680707, 10997776, 10514944]
35627A0514944q60507k03401L12802j02239n87138k57573N18925J179852J766903
35618A2282568K075707J623581R81237J332294K286002K394701K396976M930480
35610C0303546R559033J1240998O351966k031949p499604p105615k523395L156137
35602D1451117O647991M786309k223882q935631r937223o383734l695942l697758
35594A8011247l439737j520101m65191j637773k434392q09060J114456O14289
35586I433738j283487j790926o22633L49316K57149k69196p65500j163786j109682
35577C034993n25356j17981k27554j24939N43215P78593j55112j256665j139765
35568H09429O5382J220392J678297J354349L05000q33347r83468q6919N70719
$$ y = [10514944, 9654437, 9451036, 9763838, 9661599, 9074461, 8816888, 9335813, 10515665, 12282568, 14358275, 15981856, 16963093, 18295387, 20581389, 22976090, 25373066, 30303546, 39862579, 51103577, 57455543, 55423594, 47923990, 40818375, 38294980, 41451117, 48099108, 52885417, 50661535, 41725904, 31788681, 25404947, 21709005, 18011247, 14571510, 13051409, 12586218, 10948445, 8514053, 7704993, 8819449, 9433738, 8150251, 6359325, 5736692, 6086008, 6343157, 6073961, 5308461, 4144675, 3034993, 2509637, 2391656, 2164102, 2039163, 2582378, 3360971, 3205859, 1949194, 809429, 874811, 2095203, 3773500, 5127849, 5432849, 4599502, 3616034, 3529115, 4099834]
35559D099834K33871k98763k61666j37929l68176l32620K36036K93286p21490
35550B742383j501290p70531O54874J234278R79828P81859N69937j17290o80055
35541C893993l73898J21641j63423n53968J57730J309297J182995j04193o72612
35532D797562J13267P44530P4844j039147j277490o84583j99935k53400m53317
35523A822331j99443O37169J344532R18463n49087j556365j015602K34389P40547
35514B376934N77652Q08415J312827Q63982o54418j758426j448989m36673J62274
35505A803578K01398R1072k397j6796K05868N62447O91303N23842L00747O8738
35495D429800j95024j33137M77881R65743N47672k66830k64761N05038P22367
$$ y = [4099834, 4333705, 4034942, 3773276, 3635347, 3267171, 2934551, 3170587, 3463873, 2742383, 1241093, 470562, 1125436, 2359714, 3339542, 4121401, 4691338, 4574048, 3893993, 3520095, 3641736, 3478313, 2924345, 3082075, 4391372, 5574367, 5470174, 4797562, 4910829, 5655359, 5730203, 4691056, 3413566, 2728983, 2529048, 2275648, 1822331, 1622888, 2260057, 3604589, 4523052, 3973965, 2417600, 1401998, 1636387, 2376934, 2954586, 3763001, 5075828, 5939810, 5285392, 3526966, 2077977, 1641304, 1803578, 2004976, 2096048, 2093651, 2076855, 2282723, 2845170, 3536473, 4060315, 4361062, 4429800, 4234776, 4101639, 4579520, 5545263, 6092935, 5826105, 5561344, 6066382, 6788749]
35486F788749o6370p53387n48188j06685j07541r1430L50719M98731k12178q68948
35476D883472l75601P19524J099536P98852R56280J810049K506305K803383L394502
35467A8596302M514053N985566Q774671J3911930J8578236J6213796M184517r679421
35459H1079650j2827286k129518J0876589J1888159o26440j4854182j9583969
35452E3823003j4879471q392062n259146m635753l941004k644187j604408j223676
35444A1243296j285497j449907j316534p27822j80787k18130m70885j92369L51602
35435E752967J41243q37974j289467m73803O72387Q84467J83646n09125o62889
35426C861452l56164K02073O59218M93200l01140q79719n70996J44891L90203
$$ y = [6788749, 6722379, 5968992, 5420804, 5314119, 5206578, 5115148, 5465867, 5964598, 5752420, 4883472, 4507871, 5227395, 6326931, 7125783, 8082063, 9892112, 12398417, 15201800, 18596302, 23110355, 29095921, 37870592, 51782522, 70360758, 86574554, 90759071, 81079650, 68252364, 66122846, 76999435, 88887594, 88261154, 73406972, 53823003, 38943532, 30551470, 25292324, 20656571, 16715567, 14071380, 12466972, 11243296, 9957799, 8507892, 7191358, 6463536, 6282749, 6064619, 5593734, 5401365, 5752967, 5894210, 5056236, 3766769, 3292966, 3965353, 4849820, 5033466, 4524341, 3861452, 3505288, 3707361, 4366579, 4859779, 4558639, 3678920, 3107924, 3252815, 3643018]
35417C643018K22114L05242N45940K06194n99363p89691j09528K14523n76887
35408C061562j302619n74641Q35085J015624p3230n37156K99685P13467n26053
35399B911724j911856j413066L89857J273746O70469k2493o2329j94133p31541
35390I10378p90273j4278N93158L07477k31944l08942k10699k46900N0182Q39187
35380H97346J225712N94286l03089n45967l77797l73752k61820L15503P45545
35371A915967L52194l56782m95734j88297m2261N9628M70716P66285M59876R1018
35361C032610L13318N49514l9599q76301q39339k88589m45310j086249q20523
35352e00468L27974O62191m02477j185703k52445J442445K013695J162747J05399
$$ y = [3643018, 3865132, 4170374, 4716314, 4922508, 4323145, 3533454, 3423926, 3638449, 3061562, 1758943, 1184302, 2019387, 3035011, 2961781, 2424625, 2724310, 3437777, 2911724, 999868, -413198, -23341, 1250405, 1920874, 1898381, 1836052, 1641919, 910378, 120105, 105827, 698985, 1006462, 774518, 465576, 254877, 7977, 58159, 897346, 2123058, 2717344, 2414255, 1868288, 1490491, 1116739, 854919, 1170422, 1915967, 2268161, 1911379, 1415645, 1227348, 1185087, 1244715, 1715431, 2481716, 2941592, 3032610, 3345928, 3895442, 3855843, 2979542, 2140203, 1851614, 1406304, 320055, -500468, -172494, 489697, 87220, -1098483, -1350928, 91517, 2105212, 3267959, 3373358]
35343C373358l23621m03089o07064q04619n48420J49175N78739J11407p97269
35334G28597r49234m9860P29973M47938j95183r6915M21938L69390j0572K59796
35324A655868Q55537M71877q13852j393082o87105l7606l84848p43095L4250J340153
35314B98097J792277J152082K43033l14950m26960j89225O5114p2549m00962k49193
35304A896764L16796L22102n34133j080126k64394J219187J812196J089464K5103
35295D802959m23687k51715l9860j88477n59089p14014n20295l28687l24907j51420
35285A300808K75684J91850p93933j518298p39874O36199O39664n87415q67790
35276a463105M31559J303086N09838l34302L05664J062103P748j816075j859383
$$ y = [3373358, 3049737, 2646648, 2039584, 1234965, 686545, 835720, 1414459, 1525866, 728597, -220637, -270497, 459476, 907414, 712231, 615316, 1037254, 1406644, 1396072, 1655868, 2511405, 2983282, 2169430, 776348, 89243, 51637, -333211, -1076306, -1042056, 298097, 2090374, 3242456, 3485489, 3170539, 2743579, 2554354, 2619468, 2546919, 2145957, 1896764, 2213560, 2535662, 2001529, 921403, 657009, 1876196, 3688392, 4777856, 4802959, 4379272, 4127557, 4087697, 3899220, 3340131, 2626117, 2105822, 1777135, 1452228, 1300808, 1576492, 1768342, 974409, -543889, -1283763, -647564, -7900, -595315, -1463105, -1031546, 271540, 781378, 447076, 752740, 1814843, 1822591, 6516, -1852867]
35267a852867j37844Q72940J80672m73114L08562J493268J505476N21939k21451
35258B197581l14803k88539m66027o10388m76969j25564K39651M25352L03319
35249H83613j06525n81580p55736l66884L39958O05186J8418o99097m92809M07475
35239g47981O54438j21851n71214K69682J275738Q54136n67514j155347l67969
35230d77882M70442K89600m04999o34947k83659J21112J94468j22893o07702p33746
35220b190206j16813Q58596J356519J137539P45976N43869K13354m61859r14174
35211A172801m84299M50883O89906k79879j434132j361352j15832P69715L66239
35202b25950l57842o9947P99068P33939l52765q69831n6205Q55989O96740J29757
$$ y = [-1852867, -1990711, -1117771, -937099, -1410213, -1101651, 391617, 1897093, 2419032, 2197581, 1882778, 1594239, 1128212, 517824, 40855, -84709, 154942, 580294, 883613, 777088, 195508, -560228, -927112, -587154, 18032, 36450, -662647, -1155456, -747981, -93543, -215394, -786608, -516926, 758812, 1612948, 1045434, -109913, -477882, -7440, 282160, -122839, -757786, -1041445, -920333, -725865, -848758, -1456460, -2190206, -2307019, -1448423, -91904, 1045635, 1791611, 2335480, 2548834, 2086975, 1172801, 688502, 1139385, 1829291, 1549412, 115280, -1246072, -1361904, -592189, -225950, -583792, -653739, 145329, 879268, 526503, -343328, -399533, 456456, 1153196, 1282953]
35192A282953K99430Q84940Q04759M7306n00219n10479l60516k72605l03567o73888
35182F98114j165113q55367M76330J423910P22599p24350j054024j42847N12294
35173a08454K53717j13443n3224L4663j8457J23064K60151j43078o01368p4869
35163d41298R88727Q68282o69660j631106o63778R71191J383145O01146j00738
35154A305911k75956l60388m62642l47281r6311J54022N58008Q95258M14296p74227
35144A010690j173402J8787J294588Q67720m88081n75773O63475R91688m61233
35135B148459j661935q37579P43744P97636m79008r35452P6149Q51569J44818
35126H48401j000093j036036j72034L02272R2937J2964L88028N94992K36964k35222
$$ y = [1282953, 1582383, 2467323, 3272082, 3319388, 2819169, 2308690, 1948174, 1675569, 1372002, 698114, -466999, -1322366, -846036, 577874, 1300473, 576123, -477901, -620748, -108454, 145263, 31820, -21404, 13259, -5198, 117866, 378017, 234939, -366429, -441298, 547429, 1415711, 746051, -885055, -1548833, -577642, 805503, 1406649, 1305911, 1029955, 669567, 206925, -140356, -236667, -82645, 475363, 1370621, 1784917, 1010690, -162712, -143925, 1150663, 2018383, 1530302, 954529, 1618004, 2609692, 2148459, 486524, -351055, 392689, 1190325, 711317, -224135, -147986, 703583, 848401, -151692, -1187728, -1359762, -1057490, -964553, -951589, -563561, 31431, 268395, 33173]
35116C3173l14590o9925K63051O35770Q77214O82646J92732m0070O1030q2368
35106B238663o55716r53461m38337L42736N08762K0712m63618n02892j47870L05429
35096B54408M36971Q965n46133m96776R4817M10939K50327L14423P09029M72839
35086A909809o26136j219063m10209N96017L77402m13164l38863L17363L12430
35077E05586j49794N7018O44985L89828m08872l16249N26925N35000l94868o23983
35067G65576K07775M89604l89781r56783m60951k23386r59102j219602m6639J104550
35057a688739Q54689K03702M15499O03167l68194j354035p71581M78901N08565
35048a118026l02281j95992P02355P69776j8592j39637N46006O08322j35666k43604
$$ y = [33173, -281417, -351342, -88291, 547479, 1424693, 2107339, 2300071, 2260001, 2321031, 2238663, 1582947, 629486, 191149, 533885, 1042647, 1063359, 599741, 96849, -51021, 254408, 691379, 700344, 154211, -342565, -247748, 163191, 413518, 727941, 1436970, 1909809, 1283673, 64610, -345599, 250418, 627820, 214656, -124207, 193156, 505586, 355792, 412810, 1057795, 1447623, 1038751, 722502, 1249427, 1784427, 1389559, 765576, 973351, 1462955, 1073174, 116391, -344560, -567946, -1527048, -2746650, -2793289, -1688739, -834050, -630348, -214849, 388318, 20124, -1333911, -2105492, -1626591, -1118026, -1420307, -1616299, -913944, -144168, -162760, -302397, 243609, 851931, 716265, 472661]
35038D72661N49468O61586n18424j424720q53271K67112O67629N75929O61724
35029A059694O34228O4747n27500m57722J11951O54623Q97757N00559p71601k062077
35019A04659j887146k24528J136281J023559L23347K03539L58553Q9354k52823
35010H74795j74951j60618n55220n62677J92723M19479p26465j565259k48861
35001b507054J777236J497645q31110j707411K39727K036828R67388j331100j601091
34992a458942J60870J243464N73004k37822P599M69345K43399j14315N7496K07330
34982A151428l06300q89834o39436J54339M85491J26977l09349m59857m51233
34973a137774k81680J57681N30828L63718o6369N2274P94146J177162M39081r27442
$$ y = [472661, 1022129, 1683715, 1165291, -259429, -1112700, -845588, -177959, 397970, 1059694, 1693922, 1758669, 1231169, 773447, 885398, 1540021, 2437778, 2938337, 2166736, 104659, -1782487, -2007015, -870734, 152825, 476172, 679711, 1038264, 1127618, 874795, 699844, 539226, -15994, -578671, -385948, 33531, -692934, -2258193, -2507054, -729818, 767827, -63283, -1770694, -1530967, 505861, 1473249, 142149, -1458942, -1298072, -54608, 518396, 280574, 288173, 757518, 1000917, 886602, 944098, 1151428, 845128, -44706, -684142, -529803, -44312, 82665, -226684, -686541, -1137774, -1419454, -1261773, -730945, -367227, -433596, -381322, 412824, 1589986, 2029067, 1101625]
34963A101625j768342j471940k92234J074294J850674J521927L38658p07231q66428
34954G81003m77039l89595o58601m32448O52563J583283J101169n10955j552430
34945I6950j006335K08075O20473K20893J44000O62405P68280k3018p44311n49723
34935C97689r4101l01634o78084k07186O81239O15288m57516j108378o35606J03783
34925a684506L92967O42651J083483R66988q85p05902k27243O42804O76394J20526
34915A907277K0373L48081K49033k94644n16189l71636n54520r98823p70730K91597
34905f90181J094403Q69511J55244k85570n16310p89228p83145k75035J40235
34896a080076r4531m17118Q9224J082240J185773K87j084818o83024O36695J066388
$$ y = [1101625, -666717, -2138657, -2430891, -1356597, 494077, 2016004, 2354662, 1647431, 781003, 303964, -85631, -744232, -1176680, -524117, 1059166, 2160335, 1649380, 96950, -909385, -701310, -80837, 140056, 284056, 946461, 1714741, 1691723, 947412, 397689, 303588, 1954, -676130, -883316, -202077, 413211, -44305, -1152683, -1788289, -1684506, -1291539, -648888, 434595, 1401583, 1400698, 694796, 467553, 1110357, 1786751, 1907277, 1927650, 2275731, 2524764, 2230120, 1713931, 1342295, 787775, -211048, -981778, -690181, 404222, 1273733, 1428977, 1143407, 627097, -162131, -945276, -1220311, -1080076, -1174607, -1591725, -1502501, -420261, 765512, 765799, -319019, -1002043, -365348, 701040]
34886G01040J8020j121207r69439K4060M77002J51671J9115M53219O40686R7242
34876D91409l97136m9451O83977R12746O37405L33124j19938r54466j444523o65192
34866e72045P84011J176266L4228j104467q14165L58368R11307M97842O7786K40511
34856A579642M89668J02289o94585j010169n04283J30194J03849l55873l30634
34847d89902L91481R20479N58027j87227m52383l09143l91009o38521m04963L15098
34837f88063P53908N49393J53279j06985m75306r61507r41522p5835R99076J411095
34827F17533J027590K99880l86139p91564p06687k09590K69757M68632N30506
34818A119918N02240J24047n28011p95610l82386J005l60620r81518q29930P0042
$$ y = [701040, 719060, -402147, -1371586, -1347526, -870524, -718853, -699738, -246519, 394167, 491409, 94273, 44822, 728799, 1641545, 2278950, 2612074, 2492136, 1537670, 93147, -572045, 211966, 1388232, 1422460, 317993, -496172, -137804, 773503, 1271345, 1339131, 1579642, 2069310, 2171599, 1477014, 466845, -37438, 92756, 196605, -159268, -489902, -98421, 822058, 1380085, 1192858, 740475, 431332, 40323, -598198, -1003161, -688063, 65845, 615238, 768517, 661532, 186226, -775281, -1716803, -1792638, -793562, 617533, 1645123, 1945003, 1558864, 767300, 60613, -148977, 120780, 589412, 1119918, 1622158, 1746205, 1218194, 422584, 40198, 41203, -319417, -1300935, -2130865, -2060823]
34808b060823O61000M73806K23605M79551O72232R9052p20474o01568N75391J536302
34798A338074J188158q9664j036207r53622j91155M90098N76727r953q91636j365267
34788i44447r64234k5740N80471M15747o5661j37040L31198P83290O43495o6937
34778E50142p79818j016505q55845n67535L8313J248609K336824J834778l56600
34769B432363k086631j440231N83250J463764P57162K69691P03065N96471o73313
34760B605591j364755l47673O24498k87504j744580j303709N25311J133138L6741
34751a22942o82904o4769M89211Q8044j97950L71779P86945K53227m09205m80758
34741C0678o22528j205378j122207K45999J415418Q46294n79151q71098J31345
$$ y = [-2060823, -1399823, -926017, -702412, -222861, 449371, 548423, -172051, -773619, -198228, 1338074, 2526232, 2436568, 1400361, 446739, 255584, 745682, 1322409, 1312456, 420820, -944447, -1908681, -1934421, -1353950, -938203, -1003864, -1140904, -809706, -26416, 617079, 550142, -229676, -1246181, -2102026, -2669561, -2631248, -1382639, 954185, 2788963, 2432363, 345732, -1094499, -511249, 952515, 1709677, 1979368, 2682433, 3278904, 2605591, 1240836, 893163, 1517661, 1230157, -514423, -1818132, -1292821, -159683, -122942, -805846, -870615, -381404, -293360, -491310, -119531, 667414, 920641, 511436, 30678, -591850, -1797228, -2919435, -2673436, -1258018, -411724, -990875, -1861973, -1730628]
34732a730628Q53430M73120k81602n76019l71357K0757K74743R5662l00398j20474
34722a662766Q43206J544651J065349O0833k17326K04967L12924j48801m87947
34713A515090m17159l51221l83012j11438M08768N60706J78261j93011j97731
34704A009253p2135l7132j8875q4026m63508j000900j163818p16419Q0006Q75481
34694a592073J341754J086070J48636n78263k56373O18117P38862j17257p08090
34685F81383k00071N22295J61826r82294j278417O201J562559J566331n4421j508336
34675D77056j324933j651R30841Q88848M79996J57853k20164m82640n7105Q13146
34665A661247R67740Q6170n91193j37366N68531L11905m86924o22771j66789j55239
$$ y = [-1730628, -877198, -404078, -685680, -1261699, -1633056, -1612299, -1337556, -1241894, -1542292, -1662766, -819560, 725091, 1790440, 1851273, 1633947, 1838914, 2151838, 2003037, 1515090, 1097931, 746710, 363698, 252260, 661028, 1221734, 1399995, 1206984, 1009253, 937118, 899986, 881111, 797085, 333577, -667323, -1831141, -2547560, -2467554, -1592073, -250319, 835751, 984387, 406124, 149751, 767868, 1506730, 1389473, 681383, 481312, 1003607, 1165433, 183139, -1095278, -1089077, 473482, 2039813, 1985392, 477056, -847877, -849528, 81313, 970161, 1450157, 1608010, 1387846, 905206, 848101, 1661247, 2628987, 2715157, 2123964, 1986598, 2555129, 2867034, 2380110, 1757339, 1590550, 1435311]
34655A435311o63974p46707j66510K34638j9411m13990l81432J07752Q66215J484185
34645A736077J208302j27088j309603j085950l0565K76775l03292m72096J05771
34636a669K64077m47098q54335j94683O06975O27034M16433O81089Q10213K6574
34626A934610j002648j061589k24855M00550K77940k36641p12168q59880l91903
34617a876584M77859Q75598M36132M9715N05230J021220L59681j004303j269886
34608d25338P6074J372578R96609n25174j334284o22123N76132Q86081K47870
34599A248425k99762j78795P9093n0889j03282M67574R80214L54077r60170j338724
34589A97761m61193J47888l65383p66110R9852J217859J032096L0943j28725N95446
$$ y = [1435311, 771337, 24630, -141880, 92758, 73347, -340643, -722075, -614323, 251892, 1736077, 2944379, 2817291, 1507688, 421738, 391173, 667948, 364656, -107440, -1669, 262408, -184690, -1039025, -1233708, -626733, 301, 416734, 1097823, 1908036, 1934610, 931962, -129627, -354482, 46068, 324008, 87367, -624801, -1484681, -1876584, -1398725, -523127, -86995, -37280, 467950, 1489170, 1848851, 844548, -425338, -349264, 1023314, 2019923, 1494749, 160465, -461658, 114474, 1000555, 1248425, 948663, 769868, 848961, 798072, 694790, 1162364, 2142578, 2496655, 1536485, 197761, -263432, -115544, -480927, -1247037, -1147185, 70674, 1102770, 1133713, 1004988, 1600434]
34579A600434O70695l79714j237274r07382p827M99357N75899N72667M41531K8484
34569A856870n38606j067620j329023q83441L16024J240243P63665o13494j181029
34560a436411l56265O12999O29583J44712j7523m904k62717n11245l04956J59379
34550a347348N69086J041986J422759R69364l65383j296603r23337j50753j63452
34541b43681m50589N9284P47664K19450r77529q51417P01311J416547J91041j132543
34531c20462o97761N75113P16806k83329r83658q86740m93725J76650J208274
34522i88832J561080K72849j428658j307095O02320J958127J541651N73838J45819
34513B931099l77078j400733j714039n40690P69164P45996L3744q1059L5634m97268
$$ y = [1600434, 2271129, 1891415, 654141, -253241, -261068, 238289, 814188, 1386855, 1828386, 1856870, 1318264, 250644, -1078379, -1961820, -1645796, -405553, 358112, -255382, -1436411, -1792676, -1179677, -550094, -405382, -422905, -427809, -690526, -1201771, -1506727, -1347348, -778262, 263724, 1686483, 2655847, 2290464, 993861, 70524, -80229, -243681, -694270, -634986, 112678, 332128, -645401, -1496818, -795507, 621040, 812081, -320462, -1018223, -443110, 273696, -9633, -993291, -1880031, -2373756, -2197106, -988832, 572248, 845097, -583561, -1890656, -1288336, 669791, 2211442, 2785280, 2931099, 2554021, 1153288, -560751, -1101441, -332277, 413719, 447463, 366404, 402038, -95230]
34503i5230q86664P5184J399171J024368q27258j846287j101730M4470N69081
34494a644895Q99298J045535J38392j412279j694977k84987P94113L17301k07298
34485b049797N87601J372364N37393p53148m40192Q99668J089755K4n76833j97006
34475D69829j60570o92483m26745Q64243J488039N86672m47145l21457K10592
34466A570975o1268p79762q86597l95439m3395K8818J41007K23413O7128l2784
34456a67904L03615Q17405R19315M32406l42743r19972q03180K6554O60418J34488
34446A060402j031090j210401J0072J087124P75840j13442k31966J97375J72769
34437G16683r2597L37496J113486Q95294l36139r92967l31374L54334k15888j307181
$$ y = [-95230, -981894, -906710, 492461, 1516829, 689571, -1156716, -2258446, -2213976, -1644895, -745597, 299938, 438330, -973949, -2668926, -2953913, -2159800, -1842499, -2049797, -1462196, -89832, 447561, -305587, -745779, 153889, 1243644, 1243668, 666835, 469829, 309259, -383224, -809969, 54274, 1542313, 2128985, 1681840, 1360383, 1570975, 1509707, 729945, -156652, -552091, -595486, -566668, -425661, -202248, -135120, -167904, 135711, 953116, 1872431, 2304837, 1962094, 1042122, 238942, 265496, 925914, 1060402, 29312, -1181089, -1171017, -83893, 691947, 578505, 346539, 543914, 716683, 624086, 961582, 2075068, 2970362, 2634223, 1641256, 1309882, 1664216, 1448328, 141147]
34427A41147j322156j44624Q87118R78126O52289N17394L62816r5143m22613j24998
34417A429356L98998L29462l76775j006289j180771j091839o75265L66247J431888
34408c74988J175946m23813j343328j20380J753730J693051l00583j713723j157247
34399h11335Q5024M83278K52506J29753m1439l88517k05611O46923Q78823k80980
34389G48425j468557j096743J53084N21115L0802J65679J116397J426755M51484
34380B048441o87197r45658o01568k39370J16653L91989K33119j33177M1000O53891
34370H78123O09003m11723j189601p28123K40770M18709j41531k74311N11866
34361h6818J344913J085626l23374j667778j608251j48702J259039J406752O99956
$$ y = [141147, -1181009, -1325633, -438515, 539611, 1191900, 1709294, 2072110, 1976967, 1554354, 1429356, 1828354, 2157816, 1781041, 774752, -406019, -1497858, -2173123, -1806876, -374988, 800958, 377145, -966183, -1086563, 667167, 2360218, 2059635, 345912, -811335, -726311, -243033, 9473, 139226, 97787, -290730, -496341, 150582, 1029405, 748425, -720132, -1816875, -1663791, -1142676, -1111874, -946195, 170202, 1596957, 2048441, 1361244, 415586, -185982, -425352, -308699, 83290, 316409, 183232, 224232, 878123, 1487126, 1075403, -114198, -842321, -601551, -182842, -324373, -598684, -86818, 1258095, 2343721, 2020347, 352569, -1255682, -1404384, -145345, 1261407, 1961363]
34352A961363K24480N4515l82241p37802j52749Q38273O43354p54769j379042
34343C15382k85894Q22481K97275p83246m07718J064504J449226Q6918j317097
34334A241831j254852j94118N77537O45299M31579K37751q1846o89421j256738
34325c42978j038740K16077J504220J457134J67128q00206n61785M1443J17915
34316G60208Q7629M19905M14929l83393q45173j5312R20926M04944p40663o14990
34306D09010M35847M17815p16848r28150K69881R21744P6800o74122k25640J30680
34296A17017o49514j228815l07104Q84059O43170l35517l87422K53673L43507
34287f66946J96864Q73891J646826Q82560r61828j746683r53788j86522k46404
$$ y = [1961363, 2185843, 2240358, 1858117, 1120315, 967566, 1805839, 2449193, 1694424, 315382, 29488, 851969, 1149244, 365998, -41720, 1022784, 2472010, 2558928, 1241831, -13021, -207139, 370398, 1015697, 1447276, 1685027, 1603181, 913760, -342978, -1381718, -1165641, 338579, 1795713, 1962841, 1162635, 600850, 642293, 760208, 847837, 1267742, 1682671, 1299278, 454105, 438793, 1359719, 1764663, 1024000, 409010, 844857, 1262672, 545824, -382326, -112445, 809299, 886099, 211977, -13663, 117017, -532497, -1761312, -2068416, -1184357, -541187, -876704, -1264126, -1010453, -666946, -470082, 403809, 2050635, 2933195, 1971367, 224684, -729104, -915626, -1162030]
34278a162030q1273Q63227J420577O59681o55353j352662j181202l09862J006292
34269g92605J752165P94372j118239j669666j60973J299412Q83308l63950m94775
34260A29049K71211L45221l64903m64822M20582J040731N20887n02673j012584
34251C82699p81327j89216K81142K50209j80482l25997J59418N47045M6665p98334
34241f08178q01743J3106M99864K87533K08906N85550N27818l98414j087830m93057
34231a266445O16687O88346l28665r35765k39911Q94085J123606L42449l61816
34222E32571j69000N18806O94127P2486n91594o30764m00733n54157p92719k90512
34212a611489P19545R56949L2420q15533o21087j62393m39257p41826J56111J537794
$$ y = [-1162030, -1243303, -380076, 1040501, 1700182, 1044829, -307833, -1489035, -1798897, -792605, 959560, 1753932, 635693, -1033973, -1194946, 104466, 987774, 623824, 129049, 400260, 745481, 380578, -84244, 336338, 1377069, 1897956, 1395283, 382699, -398628, -587844, -306702, -56493, -236975, -562972, -403554, 143491, 190156, -608178, -1409921, -1396815, -896951, -609418, -400512, 185038, 712856, 314442, -773388, -1266445, -649758, 38588, -290077, -1225842, -1465753, -571668, 551938, 894387, 532571, 363571, 882377, 1576504, 1648990, 1057396, 426632, 25899, -528258, -1320977, -1611489, -891944, 65005, 97425, -718108, -1339195, -1501588, -1940845, -2682671, -2526560, -988766]
34202i88766J457327j36601j057046k12090O98290k7849j306866r94090P31663
34193a836028J718108J094026J63481j1278k0181n27684q93610l47108N76201
34184h4073Q24587L39846j59283l55903m17767l29790n628K24816L2115k36389
34174a67469n1145L33659K06564m12874p24086l21905L18527O53688O93641O20680
34164A149280L82598o1883n14920p64033p31334l72390J97966N35115L17550p4000
34154F3949j1550L81651L98450m2661k05973K01289M59194q860p03580q88932
34144c57023o82309n74786m21884K19748J063141J263239N69281l49479p42391
34135a2463m76377M4015K73389j8192l63392L0212J133691J762300J004602m13446
$$ y = [-988766, 468561, 331960, -725086, -937176, -238886, -266735, -1573601, -2567691, -1836028, -117920, 976106, 1139587, 1128309, 1108128, 580444, -313166, -660274, -84073, 740514, 1080360, 921077, 565174, 147407, -182383, -188011, 36805, 68920, -167469, -218614, 115045, 321609, -91265, -815351, -1137256, -818729, -165041, 528600, 1149280, 1531878, 1469995, 955075, 191042, -540292, -912682, -714716, -179601, 137949, 63949, 52399, 434050, 832500, 789839, 583866, 785155, 1244349, 1235489, 531909, -357023, -1039332, -1614118, -2036002, -1816254, -753113, 510126, 1079407, 729928, -12463, -488840, -444825, -171436, -189628, -553020, -522808, 610883, 2373183, 3377785, 2964339]
34125B964339r96712m48299J51476L6646l80527m96464m11304m29736m13854j43131
34115e67566J88216K95271K73094L80763O03179O57176K53000o43386j511815
34106g2068j446105k22595R80500Q14436l18381o83003K47866R98716M37129m69729
34096B66766l34855M12540M61123q8131j21424K98111Q0378o52295n31109N01329
34086B92433O99256n34138j223922J33352J794643J155024j141782j957906l02019
34077a085059J295170O63143r65555j146908J55823R74221N18620o939K75630
34068F78146N78745O4415n57076j43572R20986J154257J86420o72033l79531L65607
34058B196364L20103m05578o89613k73440p0834n09084p72002k18902M66545L46219
$$ y = [2964339, 1967627, 1519328, 1670804, 1707450, 1326923, 830459, 419155, -10581, -424435, -567566, -379350, -84079, 189015, 569778, 1172957, 1830133, 2083133, 1439747, -72068, -1518173, -1740768, -760268, 54168, -264213, -947216, -699350, 299366, 736495, 266766, -68089, 344451, 805574, 717443, 596019, 894130, 974508, 322213, -208896, 292433, 991689, 457551, -766371, -633019, 1161624, 2316648, 1174866, -783040, -1085059, 210111, 873254, -92301, -1239209, -1083386, -109165, 409455, 402516, 678146, 1256891, 1321306, 764230, 620658, 1541644, 2695901, 2882321, 2210288, 1830757, 2196364, 2516467, 2110889, 1421276, 1147836, 1077002, 567918, -204084, -422986, 43559, 389778]
34048C89778l34858p03702o43654o10813n45407q0698M93026O40001O95399J289029
34038E88101J838949J125190n73936j531531j056425k73384K2930M38230J139079
34029A717203R71017l09783r05249J72679R80560l60198k178939j630319N76005
34020i67024J165858l83227j127577K77577J390260K50036j343858r51060O02471
34011a086544R61865J24615q9565O02334P13757k71717j153284j025098l00786
$$ y = [389778, 54920, -648782, -1292436, -1903249, -2448656, -2529354, -2036328, -1396327, -700928, 588101, 2427050, 3552240, 2978304, 1446773, 390348, 116964, 139894, 578124, 1717203, 2688220, 2378437, 1473188, 1645867, 2626427, 2266229, 87290, -1543029, -967024, 198834, -184393, -1311970, -1034393, 355867, 605903, -737955, -1689015, -1086544, -124679, -64, -89629, 512705, 1226462, 954745, -198539, -1223637, -1524423]
$$ [...]
##END NTUPLES=NMR SPECTRUM
##END=
