##TITLE=31Pdec_SR117_1
 , 74 sc
 31.3.2022
##JCAMPDX= 6.0         $$ Bruker NMR JCAMP-DX V2.0
##DATA TYPE= NMR SPECTRUM
##DATA CLASS= NTUPLES
##ORIGIN= UXNMR, Bruker Analytische Messtechnik GmbH
##OWNER= root
$$ XWIN-NMR		Version 3.5
$$ Thu Mar 31 11:48:46 2022 Russian Standard Time (UT+4h)  she@DPX200
##.OBSERVE FREQUENCY= 81.013821
##.OBSERVE NUCLEUS= ^31P
##.ACQUISITION MODE= SIMULTANEOUS
##.ACQUISITION SCHEME= undefined
##.AVERAGES= 74
##.DIGITISER RES= 16
##SPECTROMETER/DATA SYSTEM= spect
##.PULSE SEQUENCE= zgpg30
##.SOLVENT NAME= D2O
##.SHIFT REFERENCE= (INTERNAL, D2O, 0, 248.564)
##AUDIT TRAIL= $$ (NUMBER, WHEN, WHO, WHERE, WHAT)
$$ ##TITLE= Audit trail, XWIN-NMR		Version 3.5
$$ ##JCAMPDX= 5.01
$$ ##ORIGIN= Bruker BioSpin GmbH
$$ ##OWNER= she
$$ F:/spectra/data/she/nmr/P31/1/pdata/1/auditp.txt
$$ ##AUDIT TRAIL=  $$ (NUMBER, WHEN, WHO, WHERE, WHAT)
(   1,<2022-03-31 11:47:30.03 +0400>,<she>,<DPX200>,
      <continue with go, POWCHK disabled, PULCHK disabled
       configuration hash MD5:
       00 E9 B6 7A A2 85 ED C7 34 08 36 98 17 FE 4E 26
       data hash MD5: 32K
       1A EF 43 7B 27 25 39 C6 91 51 FB 5C 04 41 B3 A6>)
(   2,<2022-03-31 11:47:33.06 +0400>,<she>,<DPX200>,
      <Start of raw data processing
       efp BC_mod = 2 LB = 1 FT_mod = 6 PKNL = 1 PHC0 = -9206.82 PHC1 = 136.8756 SI = 64K 
       data hash MD5: 64K
       6A E9 CF 65 95 54 E4 B1 64 6D DB 73 78 CC D2 0B>)
(   3,<2022-03-31 11:47:54.68 +0400>,<she>,<DPX200>,
      <pk PHC0 = 1.187231 PHC1 = 0 
       data hash MD5: 64K
       8A 47 EA 68 9B 32 A8 CA AF A3 D7 19 2B 2D 50 92>)
$$ ##END=
$$ 
$$ hash MD5
$$ D6 DC DD 8E 7C 5C 42 0D 6B 82 39 D2 DC 1A 3C E5
##$RELAX= 
##$RELAX= 
##$RELAX= 
##$RELAX= 
##$RELAX= 
##$RELAX= 
##$RELAX= 
##$RELAX= 
$$ Bruker specific parameters
$$ --------------------------
##$DU= <F:/spectra>
##$EXPNO= 1
##$NAME= <P31>
##$PROCNO= 1
##$TYPE= <nmr>
##$USER= <she>
##$AMP= (0..31)
100 100 100 100 100 100 100 100 100 100 100 100 100 100 100 100 100 100 
100 100 100 100 100 100 100 100 100 100 100 100 100 100 
##$AQSEQ= 0
##$AQ_mod= 1
##$AUNM= <au_zg>
##$AUTOPOS= <>
##$BF1= 81.014009
##$BF2= 200.13
##$BF3= 200.13
##$BF4= 200.13
##$BF5= 200.13
##$BF6= 200.13
##$BF7= 200.13
##$BF8= 200.13
##$BYTORDA= 1
##$CFDGTYP= 0
##$CFRGTYP= 5
##$CHEMSTR= <none>
##$CNST= (0..31)
1 1 145 1 1 1 1 1 1 1 1 1 1 1 1 1 1 1 1 1 1 1 1 1 1 1 1 1 1 1 1 1 
##$CPDPRG= <waltz16>
##$CPDPRG1= <>
##$CPDPRG2= <waltz16>
##$CPDPRG3= <>
##$CPDPRG4= <mlev>
##$CPDPRG5= <mlev>
##$CPDPRG6= <mlev>
##$CPDPRG7= <mlev>
##$CPDPRG8= <mlev>
##$CPDPRGB= <>
##$CPDPRGT= <>
##$D= (0..31)
0 1 0 0 0 0 0 0 0 0 0 0.03 2e-05 3e-06 0 0 0 0 0 0 0 0 0 0 0 0 0 0 0 0 
0 0 
##$DATE= 1648712721
##$DBL= (0..7)
120 120 120 11 120 120 24 19 
##$DBP= (0..7)
150 150 150 150 150 150 150 150 
##$DBP07= 0
##$DBPNAM0= <>
##$DBPNAM1= <>
##$DBPNAM2= <>
##$DBPNAM3= <>
##$DBPNAM4= <>
##$DBPNAM5= <>
##$DBPNAM6= <>
##$DBPNAM7= <>
##$DBPOAL= (0..7)
0.5 0.5 0.5 0.5 0.5 0.5 0.5 0.5 
##$DBPOFFS= (0..7)
0 0 0 0 0 0 0 0 
##$DE= 6
$$ [...]
##$SUBNAM2= <"">
##$SUBNAM3= <"">
##$SUBNAM4= <"">
##$SUBNAM5= <"">
##$SUBNAM6= <"">
##$SUBNAM7= <"">
##$SUBNAM8= <"">
##$SUBNAM9= <"">
##$SW= 501.771253377433
##$SWIBOX= (0..15)
0 1 3 0 0 0 0 0 0 0 0 0 0 0 0 0 
##$SW_h= 40650.406504065
##$TD= 32768
##$TD0= 1
##$TE= 0
##$TE2= 300
##$TE3= 300
##$TEG= 300
##$TL= (0..7)
0 120 53 12 22 120 120 120 
##$TP= (0..7)
150 150 150 150 150 150 150 150 
##$TP07= 0
##$TPNAME0= <>
##$TPNAME1= <>
##$TPNAME2= <>
##$TPNAME3= <>
##$TPNAME4= <>
##$TPNAME5= <>
##$TPNAME6= <>
##$TPNAME7= <>
##$TPOAL= (0..7)
0.5 0.5 0.5 0.5 0.5 0.5 0.5 0.5 
##$TPOFFS= (0..7)
0 0 0 0 0 0 0 0 
##$TUNHIN= 0
##$TUNHOUT= 0
##$TUNXOUT= 0
##$USERA1= <user>
##$USERA2= <user>
##$USERA3= <user>
##$USERA4= <user>
##$USERA5= <user>
##$V9= 5
##$VALIST= <valist>
##$VCLIST= <CCCCCCCCCCCCCCC>
##$VD= 0
##$VDLIST= <DDDDDDDDDDDDDDD>
##$VPLIST= <PPPPPPPPPPPPPPP>
##$VTLIST= <TTTTTTTTTTTTTTT>
##$WBST= 1024
##$WBSW= 4
##$XGAIN= (0..3)
0 0 0 0 
##$XL= 0
##$YL= 0
##$YMAX_a= 42213
##$YMIN_a= -79684
##$ZGOPTNS= <>
##$ZL1= 120
##$ZL2= 120
##$ZL3= 120
##$ZL4= 120
##$ABSF1= 0
##$ABSF2= 0
##$ABSG= 0
##$ABSL= 0
##$ALPHA= 0
##$AQORDER= 0
##$ASSFAC= 0
##$ASSFACI= 0
##$ASSFACX= 0
##$ASSWID= 0
##$AUNMP= <proc_1d>
##$AZFE= 0.1
##$AZFW= 0.5
##$BCFW= 0
##$BC_mod= 2
##$BYTORDP= 0
##$COROFFS= 0
##$CY= -3
##$DATMOD= 1
##$DC= 0
##$DFILT= <>
##$DTYPP= 0
##$F1P= 0
##$F2P= 0
##$FCOR= 1
##$FTSIZE= 65536
##$FT_mod= 6
##$GAMMA= 0
##$GB= 0
##$INTBC= 1
##$INTSCL= 5.30512e-09
##$ISEN= 30
##$LB= 1
##$LEV0= 0
##$LPBIN= 0
##$MAXI= 10000
##$MC2= 0
##$MEAN= 0
##$ME_mod= 0
##$MI= 50
##$NCOEF= 0
##$NC_proc= -2
##$NLEV= 6
##$NOISF1= 182.463
##$NOISF2= 159.3651
##$NSP= 0
##$NTH_PI= 0
##$NZP= 0
##$OFFSET= 248.5645
##$PC= 4
##$PHC0= -9205.633
##$PHC1= 136.8756
##$PH_mod= 1
##$PKNL= yes
##$PPARMOD= 0
##$PSCAL= 0
##$PSIGN= 0
##$REVERSE= no
##$SF= 81.014009
##$SI= 65536
##$SIGF1= 159.3651
##$SIGF2= -187.1042
##$SINO= 113.3802
##$SIOLD= 16384
##$SREGLST= <1H.CDCl3>
##$SSB= 0
##$STSI= 65536
##$STSR= 0
##$SW_p= 40650.406504065
##$SYMM= 0
##$S_DEV= 0
##$TDeff= 32768
##$TDoff= 0
##$TI= <>
##$TILT= no
##$TM1= 0
##$TM2= 0
##$TOPLEV= 0
##$USERP1= <user>
##$USERP2= <user>
##$USERP3= <user>
##$USERP4= <user>
##$USERP5= <user>
##$WDW= 1
##$XDIM= 65536
##$YMAX_p= 295139274
##$YMIN_p= -3314910
$$ End of Bruker specific parameters
$$ ---------------------------------
##NTUPLES= NMR SPECTRUM
##VAR_NAME=  FREQUENCY,     SPECTRUM/REAL,   SPECTRUM/IMAG
##SYMBOL=    X,             R,               I
##VAR_TYPE=  INDEPENDENT,   DEPENDENT,       DEPENDENT
##VAR_FORM=  AFFN,          ASDF,            ASDF
##VAR_DIM=   65536,         65536,           65536
##UNITS=     HZ,            ARBITRARY UNITS, ARBITRARY UNITS
##FACTOR=    0.620285442955139, 1,           1
##FIRST=     20137.2065510759, 0,            0
##LAST=      -20513.1999529892, 0,           0
##MIN=       -20513.1999529892, -3314910,    0
##MAX=       20137.2065510759, 295139274,    0
$$ Real data points
##PAGE= N=1
##DATA TABLE= (X++(R..R)), XYDATA
$$ [...]
$$ plain form
39507 -96935 -222820 -148971 -23435 -51688 -157610 -140600 -38359 -43882 -138900 -118128 30662
39496 30662 68486 -117042 -330297 -356812 -227908 -94670 -14446 22607 -196 -70581 -106500
39485 -106500 -78674 -77773 -158194 -214086 -133633 5645 42639 -12731 7483 154646 257056
39474 257056 157332 -52220 -134146 1561 205900 284358 199100 56470 -41444 -84111 -119395
39463 -119395 -175497 -213710 -149545 54443 304017 424106 334225 145753 43476 93633
39453 93633 207623 261912 199159 41427 -125964 -198367 -149991 -80920 -99489 -170689 -162022
39442 -162022 -35457 99522 141059 112361 86814 71005 16008 -94431 -205280 -225800 -107509
39431 -107509 85811 212878 209051 169317 209313 290952 286106 173509 47256 -45940 -137551
$$ packed form
39507i6935j25885P3849J25536k8253j05922J7010J02241n523r5018K0772J48790
39496C0662L7824j85528k13255k6515J28904J33238Q0224L7053k2803p0385l5919
39485a06500K7826R01q0421n5892Q0453J39278L6994n5370K0214J47163J02410
39474B57056r9724k09552q1926J35707K04339P8458q5258j42630r7914m2667l5284
39463a19395n6102l8213O4165K03988K49574J20089q9881j88472j02277N0157
39453I3633J13990N4289o2753j57732j67391p2403M8376O9071j8569p1200Q667
39442a62022J26565J34979M1537k8698k5547j5809n4997j10439j10849k0520J18291
39431a07509J93320J27067l827l9734L9996Q1639m846j12597j26253r3196r1611
$$ plain form
39420 -137551 -216621 -232057 -219400 -262467 -314631 -238903 -59679 21809 -74711 -195173 -217865
39409 -217865 -222099 -274235 -261560 -104492 55070 65400 -1433 -23547 -71455 -248245 -433485
39398 -433485 -443358 -332130 -267325 -208525 -13409 208769 195110 -23308 -121742 10313 101985
39387 101985 -36312 -202950 -150223 25185 76998 2165 -18441 51257 88472 66298 84356
39376 84356 146769 116282 -60036 -233486 -241489 -120505 -49565 -119366 -228237 -221673 -95197
39365 -95197 -2749 -50920 -156064 -176985 -130548 -150562 -250524 -283528 -178395 -64813 -77545
39354 -77545 -162649 -190130 -155742 -137308 -126361 -55376 42815 55371 -26036 -76242 -25054 39402
39342 39402 11432 -76133 -109534 -54165 20629 57251 74881 98357 78356 -55054 -261640
$$ packed form
39420a37551p9070j5436J2657m3067n2164P5728J79224Q1488r6520j20462k2692
39409b17865m234n2136J2675J57068J59562J0330o6833k2114m7908j76790j85240
39398d33485r873J11228O4805N8800J95116K22178j3659k18418r8434J32055R1672
39387A01985j38297j66638N2727J75408N1813p4833k0606O9698L7215k2174J8058
39376H4356O2413l0487j76318j73450q003J20984P0940o9801j08871O564J26476
39365i5197R2448m8171j05144k0921M6437k0014r9962l3004J05133J13582j2732
39354g7545q5104k7481L4388J8434J0947P0985R8191J2556q1407n0206N1188O4456
39342C9402k7970q7565l3401N5369P4794L6622J7630K3476k0001j33410k06586
$$ plain form
39331 -261640 -380494 -302702 -122228 -43245 -139185 -279094 -310896 -233109 -134383 -43777 63849
39320 63849 152410 124938 -40747 -228747 -293986 -204998 -65368 -17190 -120576 -294817 -379066
39309 -379066 -286493 -99061 23833 21374 -34123 -71740 -110738 -180124 -225124 -171791 -50867
39298 -50867 24819 2446 -64055 -116873 -167453 -234959 -280740 -260965 -200089 -152080 -119966 -75658
39286 -75658 -35585 -47929 -114754 -191638 -256893 -313890 -334897 -286577 -213447 -199994 -230640 -192275
39274 -192275 -57601 43916 9796 -80283 -90037 -26800 152 -31836 -37651 26587 104785
39263 104785 133028 103266 35182 -40358 -75652 -52611 -21999 -34538 -64179 -69066 -77653 -119505
39251 -119505 -127942 -39112 57789 23136 -105170 -156341 -93676 -49262 -73016 -54540 44875
$$ packed form
39331b61640j18854P7792J80474P8983r5940j39909l1802P7787R8726R0606J07626
39320F3849Q8561k7472j65685j88000o5239Q8988J39630M8178j03386j74241q4249
39309c79066R2573J87432J22894k459n5497l7617l8998o9386m5000N3333J20924
39298e0867P5686k2373o6501n2818n0580o7506m5781J9775O0876M8009L2114M4308
39286g5658M0073j2344o6825p6884o5255n6997k1007M8320P3130J3453l0646L8365
39274a92275J34674J01517l4120r0079r754O3237K6952l1988n815O4238P8198
39263A04785K8243k9762o8084p5540l5294K3041L0612j2539k9641m887q587m1852
39251a19505q437Q8830R6901l4653j28306n1171O2665M4414k3754J8476R9415
$$ plain form
39240 44875 93381 23712 -31657 25335 75548 528 -86506 -28783 96872 120148 83717
39229 83717 152398 283367 265448 80066 -49552 -12312 41576 -13951 -81176 -45325 20832
39218 20832 8527 -33105 -16678 -1168 -83511 -195967 -186544 -53528 56580 62748 24738
39207 24738 10917 9357 -14606 -54498 -69084 -11068 123538 237190 190521 -10781 -168772
39196 -168772 -132010 -1924 26645 -46201 -66954 -10666 -14112 -114864 -163063 -60617 86452
39185 86452 146362 143504 156886 165955 118924 53528 26246 -268 -82864 -179413 -215190 -201672
39173 -201672 -179384 -114886 16899 112727 53212 -103549 -189031 -156373 -91320 -17483 121626
39162 121626 273199 272337 101715 -28366 26823 126064 59734 -131744 -232675 -176868 -108273
$$ packed form
39240D4875M8506o9669n5369N6992N0213p5020q7034N7723J25655K3276l6431
39229H3717O8681J30969j7919j85382j29618L7240N3888n5527o7225L5851O6157
39218B0832j2305m1632J6427J5510q2343j12456R423J33016J10108O168l8010
39207B4738j3821j560k3963l9892j4586N8016J34606J13652m6669k01302j57991
39196a68772L6762J30086K8569p2846k0753N6288l446j00752m8199J02446J47069
39185H6452N9910k858J3382R069m7031o5396k7282k6514q2596r6549l5777J3518
39173b01672K2288O4498J31785R5828n9515j56761q5482L2658O5053P3837J39109
39162A21626J51573q62j70622j30081N5189R9241o6330j91478j00931N5807O8595
$$ plain form
39151 -108273 -125886 -150728 -100260 -45603 -91439 -192118 -211546 -130202 -67003 -79862 -62868
39140 -62868 84118 267249 299866 167917 61903 110698 207193 182941 59835 4955 85695
39129 85695 204343 267076 286591 288580 232284 88255 -77529 -161396 -126746 -14132 115221
39118 115221 212105 246111 212740 129234 26298 -45219 -33955 43473 90106 44587 -29485
39107 -29485 -45725 -37543 -87867 -155651 -122840 -13813 -1394 -147231 -289588 -267847 -129076
39096 -129076 -21058 6311 -6998 -38831 -76074 -74570 -29550 -21758 -103023 -203838 -245493
39085 -245493 -269095 -345813 -426123 -404431 -295078 -221543 -244259 -303183 -327668 -315620 -300144
39074 -300144 -302794 -319004 -308027 -221814 -84205 407 -34242 -135260 -216251 -267224 -324172
$$ packed form
39151a08273j7613k4842N0468N4657m5836j00679j9428Q1344O3199j2859J6994
39140f2868J46986J83131L2617j31949j06014M8795R6495k4252j23106n4880Q0740
39129H5695J18648O2733J9515J989n6296j44029j65784q3867L4650J12614J29353
39118A15221R6884L4006l3371q3506j02936p1517J1264P7428M6633m5519p4072
39107b9485j6240Q182n0324o7784L2811J09027J2419j45837j42357K1741J38771
39096a29076J08018K7369j3309l1833l7243J504M5020P792q1265j00815m1655
39085b45493k3602p6718q0310K1692J09353P3535k2716n8924k4485J2048J5476
39074c00144k650j6210J0977Q6213J37609Q4612l4649j01018q0991n0973n6948
$$ plain form
39063 -324172 -390661 -449913 -492592 -478985 -355913 -174632 -89240 -148379 -197822 -107965 10944
39052 10944 -25779 -186481 -280674 -253587 -227983 -265001 -275438 -199677 -111446 -86729 -95992 -85905
39040 -85905 -73118 -104083 -187484 -298451 -398821 -442530 -406445 -313191 -195487 -76552 -14026
39029 -14026 -78829 -228465 -304297 -246216 -193920 -254372 -304568 -200791 -54715 -67123 -177280
39018 -177280 -149633 30123 132906 69220 7574 56658 105671 74451 64308 133291 154207
39007 154207 47912 -44437 12395 121827 126978 62710 61673 123307 143736 90336 4425
38996 4425 -90274 -159251 -127571 -2571 65865 -20988 -140709 -109443 59072 190080 188967
38985 188967 117521 67396 69682 105464 124156 83307 22523 33657 110087 124530 23761
$$ packed form
39063c24172o6489n9252m2679J3607J23072J81281Q5392n9139m9443Q9857J18909
39052A0944l6723j60702r4193K7087K5604l7018j0437P5761Q8231K4717r263J0087
39040h5905J2787l0965q3401j10967j00370m3709L6085R3254J17704J18935O2526
39029a4026o4803j49636p5832N8081N2296o0452n0196J03777J46076j2408j10157
39018a77280K7647J79756J02783o3686o1646M9084M9013l1220j0143O8983K0916
39007A54207j06295r2349N6832J09432N151o4268j037O1634K0429n3400q5911
38996D425r4699o8977L1680J25000O8436q6853j19721L1266J68515J31008j113
38985A88967p1446n0125K286L5782J8692m0849o0784J1134P6430J4443j00769
$$ plain form
38974 23761 -71477 -53704 5215 -6181 -46366 -9641 83632 132170 115607 71042 -19519 -171042
38962 -171042 -288150 -267536 -159010 -83602 -46052 22598 92726 77569 14238 30250 136837
38951 136837 212779 193375 129206 60272 -19982 -74409 -48870 -1502 -54066 -190386 -251557
38940 -251557 -169404 -63500 -54923 -111639 -138926 -111199 -51153 25683 86550 86648 49099 56684
38928 56684 117565 128055 27843 -88753 -89681 20810 110867 72038 -82734 -245820 -312515
38917 -312515 -276099 -231311 -250462 -272971 -183758 7366 153939 158399 81803 31097 15861
38906 15861 -27414 -123241 -224688 -263452 -201482 -65603 49881 58794 -14592 -50661 24741
38895 24741 155948 235192 218898 138855 43861 -27175 -41905 10723 100999 169485 161441 64789
$$ packed form
38974B3761r5238J7773N8919j1396m0185L6725R3273M8538j6563m4565r0561j51523
38962a71042j17108K0614J08526P5408L7550O8650P0128j5157o3331J6012J06587
38951A36837P5942j9404o4169o8934q0254n4427K5539M7368n2564j36320o1171
38940b51557Q2153J05904Q577n6716k7287K7727O0046P6836O0867R8l7549P585
38928E6684O0881J0490j00212j16596r28J10491R0057l8829j54772j63086o6695
38917c12515L6416M4788j9151k2509Q9213J91124J46573M460p6596n0706j5236
38906A5861m3275r5827j01447l8764O1970J35879J15484Q913p3386l6069P5402
38895B4741J31207P9244j6294q0043r4994p1036j4730N2628R0276O8486q044r6652
$$ plain form
38883 64789 -65359 -136741 -112368 -64218 -90169 -179358 -211247 -102748 85040 207764 179991
38872 179991 43308 -87616 -135576 -123159 -121710 -144751 -130423 -43875 56741 96295 72476
38861 72476 14866 -89171 -244194 -363499 -343084 -214499 -127607 -166915 -263810 -304280 -249017
38850 -249017 -132947 -21194 13969 -56664 -166129 -208380 -166304 -120733 -118714 -107693 -28622
38839 -28622 97169 212284 292679 332669 315986 245781 160850 85878 4996 -86906 -152616
38828 -152616 -165715 -152876 -148745 -146303 -123611 -83406 -35683 23268 83417 105240 63065 -17911
38816 -17911 -86136 -102786 -56368 19500 43585 -35622 -147041 -151580 -16186 138530 198468
38805 198468 180781 145765 79127 -39292 -119733 -49322 120801 202598 111954 -19153 -19642
$$ packed form
38883F4789j30148p1382K4373M8150k5951q9189l1889J08499J87788J22724k7773
38872A79991j36683j30924m7960J2417J449k3041J4328Q6548J00616L9554k3819
38861G2476n7610j04037j55023j19305K0415J28585Q6892l9308r6895m0470N5263
38850b49017J16070J11753L5163p0633j09465m2251M2076M5571K019J1021P9071
38839b8622J25791J15115Q0395L9990j6683p0205q4931p4972q0882r1902o5710
38828a52616j3099J2839M131K442K2692M0205M7723N8951O0149K1823m2175q0976
38816a7911o8225j6650M6418P5868K4085p9207j11419m539J35394J54716N9938
38805A98468j7687l5016o6638j18419q0441P0411J70123Q1797r0644j31107m89
$$ plain form
38794 -19642 106528 203495 155451 -2717 -144558 -172418 -83577 47359 141516 179017 188355
38783 188355 181722 134012 40561 -40565 -44215 16365 58763 28144 -45150 -88171 -55896 46685
38771 46685 176527 264577 247057 125302 -11006 -53935 19281 127802 175650 145503 100649
38760 100649 106080 159929 207386 216066 215839 246892 291525 301247 284416 306819 387703 455536
38748 455536 441529 361482 263995 160562 65047 34595 85562 124849 69553 -8031 22969
38737 22969 136967 174466 82474 -14877 -19800 8568 -7628 -20554 60863 231659 411742
38726 411742 533947 553381 455348 321507 304703 466958 719915 982469 1287336 1641678
38716 1641678 1896325 1890894 1663559 1390415 1167522 974143 804908 702883 673954 680253
$$ packed form
38794a9642J26170R6967m8044j58168j41841k7860Q8841J30936R4157L7501R338
38783A88355o633m7710r3451q1126l650O0580M2398l0619p3294m3021L2275J02581
38771D6685J29842Q8050j7520j21755j36308m2929P3216J08521M7848l0147m4854
38760A00649N431N3849M7457Q680k27L1053M4633R722j6831K2403Q0884O7833
38748D55536j4007q0047r7487j03433r5515l0452N0967L9287n5296p7584L1000
38737B2969J13998L7499r1992r7351m923K8368j6196j2926Q1417J70796J80083
38726D11742J22205J9434r8033j33841j6804J62255K52957K62554L04867L54342
38716A641678K54647n431k27335k73144k22893j93379j69235j02025k8929O299
$$ plain form
38706 680253 714315 791962 888821 967799 1044583 1142532 1217483 1222264 1213910 1293989 1465149 1648561
38694 1648561 1823622 2045148 2335126 2665563 3049740 3552740 4208014 5016581 6036934
38685 6036934 7389339 9162954 11411841 14276493 18017924 22797173 28306978 33588688
38677 33588688 37370903 38876575 38410270 36979418 35215185 32834775 29304802 24798224
38669 24798224 20196423 16270149 13190091 10790426 8926496 7469400 6253866 5214482
38661 5214482 4413828 3840486 3349267 2876556 2517851 2294600 2049327 1704550 1430505
38652 1430505 1382911 1433790 1357694 1165540 1045447 1045358 1025326 910385 805424 820928 913292
38641 913292 955753 899428 814551 789394 811823 775733 630032 482163 475134 584010 647115
$$ packed form
38706F80253L4062P7647R6859P8978P6784R7949P4951M781q354Q0079J71160J83412
38694A648561J75061K21526K89978L30437L84177N03000O55274Q08567J020353
38685F036934J352405J773615K248887K864652L741431M779249N509805N281710
38677C3588688L782215J505672m66305j430852j764233k380410l529973m506578
38669B4798224m601801l926274l080058k399665j863930j457096j215534j039384
38661E214482q00654n73342m91219m72711l58705k23251k45273l44777k74045
38652A430505m7594N0879p6096j92154j20093q9k0032j14941j04961J5504R2364
38641I13292M2461n6325q4877k5157K2429l6090j45701j47869p029J08876O3105
$$ plain form
38630 647115 600605 543696 536811 490389 340667 200455 210928 331664 399350 340092 223234
38619 223234 148608 163838 253309 341258 345579 274977 217804 204521 171043 100850 86096 171109
38607 171109 253020 242279 214493 276623 373515 373778 287791 253113 333874 463141 559863 582701
38595 582701 491986 286540 75409 -4873 43970 97829 98738 123033 232034 348757 346494
38584 346494 216655 88982 79655 147075 134423 -27086 -202225 -203641 -28433 156274 248116
38573 248116 290408 299961 191529 -33258 -183190 -112961 52657 94611 16107 3022 113740
38562 113740 199188 143740 22939 -29546 1851 30623 -5620 -80074 -111565 -52584 53124
38551 53124 129268 179616 263695 346794 301151 121400 -1037 67300 201203 214346 134500
$$ packed form
38630F47115m6510n6909o885m6422j49722j40212J0473J20736O7686n9258j16858
38619B23234p4626J5230Q9471Q7949M321p0602n7173j3283l3478p0193j4754Q5013
38607A71109Q1911j0741k7786O2130R6892K63q5987l4678Q0761J29267R6722K2838
38595E82701r0715k05446k11131q0282M8843N3859R09K4295J09001J16723k263
38584C46494j29839j27673r327O7420j2652j61509j75139j416J75208J84707R1842
38573B48116M2292R553j08432k24787j49932P0229J65618M1954p8504j3085J10718
38562A13740Q5448n5448j20801n2485L1397K8772l6243p4454l1491N8981J05708
38551E3124P6144N0348Q4079Q3099m5643j79751j22437O8337J33903J3143p9846
$$ plain form
38540 134500 101453 99538 16641 -99156 -92614 8389 9679 -117891 -172108 -49254 92181
38529 92181 98551 44642 62213 122146 137242 144811 230267 361256 433767 415273 337553 223074
38517 223074 115336 97159 171750 202873 82556 -109725 -217144 -201396 -123624 -13648
38507 -13648 109883 157446 59642 -90776 -126584 -20178 107649 164117 144705 53798 -84376
38496 -84376 -158132 -82978 16235 -71827 -308817 -403888 -231796 -41601 -94615 -274074 -269986
38485 -269986 -37590 171613 192297 117669 75012 55739 37648 79411 184404 226946 140697
38474 140697 55033 105239 207766 179235 12779 -123064 -127280 -56838 13250 72756 106406
38463 106406 76990 13576 5706 71854 128597 121308 89805 71377 38232 -22793 -60584 -44309
$$ packed form
38540A34500l3047j915q2897j15797O542J01003J290j27570n4217J22854J41435
38529I2181O370n3909J7571N9933J5096P569Q5456J30989P2511j8494p7720j14479
38517B23074j07738j8177P4591L1123j20317j92281j07419J5748P7772J09976
38507a3648J23531M7563r7804j50418l5808J06406J27827N6468j9412r0907j38174
38496h4376p3756P5154R9213q8062k36990r5071J72092J90195n3014j79459M088
38485b69986K32396K09203K0684p4628m2657j9273j8091M1763J04993M2542q6249
38474A40697q5664N0206J02527k8531j66456j35843m216P0442P0088N9506L3650
38463A06406k9416o3414p870O6148N6743p289l1503j8428l3145o1025l7791J6275
$$ plain form
38451 -44309 -18912 -24164 -30562 -4174 33982 56256 65162 47951 -18559 -78891 -21058 148028
38439 148028 255738 179782 17742 -57061 -22367 22540 36691 56293 81660 77488 66176
38428 66176 107232 196213 282503 366791 478022 575395 594032 591323 727470 1060741 1442980
38417 1442980 1655343 1596590 1327689 992894 717974 542189 429159 349244 319352 340737
38407 340737 361389 355420 372673 433619 451690 373976 334445 514283 872355 1177265 1328576
38396 1328576 1495848 1880602 2454927 3002539 3335534 3413868 3318681 3160236 2972339 2683921
38386 2683921 2244602 1758653 1398293 1190057 1010646 812438 706966 761078 850143 822626
38376 822626 708916 645993 669739 712512 758907 860464 995369 1039706 919889 714858
$$ packed form
38451d4309K5397n252o398K6388L8156K2274Q906j7211o6510o0332N7833J69086
38439A48028J07710p5956j62040p4803L4694M4907J4151J9602K5367m172j1312
38428F6176M1056Q8981Q6290Q4288J11231R7373J8637k709J36147L33271L82239
38417A442980K12363n8753k68901l34795k74920j75785j13030p9915k9892K1385
38407C40737K0652n969J7253O0946J8071p7714l9531J79838L58072L04910J51311
38396A328576J67272L84754N74325N47612L32995P8334r5187j58445j87897k88418
38386B683921m39319m85949l60360k08236j79411j98208j05472N4112Q9065k7517
38376H22626j13710o2923K3746M2773M6395J01557J34905M4337j19817k05031
$$ plain form
38366 714858 565185 529169 556016 558377 484114 350833 237982 221378 291438 355933 345807
38355 345807 293358 268612 259938 186006 41942 -45129 26168 173698 234651 202132 224464
38344 224464 343405 386848 222075 -9107 -62092 72542 172884 106132 -28719 -102071
38334 -102071 -128614 -166672 -180532 -115098 -22356 2545 -29161 -13051 98597 234980 295526
38323 295526 249248 144085 52671 11105 -5181 -38917 -85957 -104574 -93620 -108359 -169094
38312 -169094 -203449 -129417 30860 164968 182176 81419 -64147 -149852 -96499 73289
38302 73289 219699 205329 46160 -100023 -113538 -38407 521 -37251 -82919 -81157 -64953
38291 -64953 -84552 -122540 -130892 -114829 -117445 -139892 -144398 -132301 -146543 -184719 -183516 -118495
$$ packed form
38366G14858j49673l6016K6847K361p4263j33281j12851j6604P0060O4495j0126
38355C45807n2449k4746q674p3932j44064q7071P1297J47530O0953l2519K2332
38344B24464J18941M3443j64773k31182n2985J34634J00342o6752j34851p3352
38334a02071k6543l8058j3860O5434R2742K4901l1706J6110J11648J36383O0546
38323B95526m6278j05163r1414m1566j6286l3736m7040j8617J0954j4739o0735
38312a69094l4355P4032J60277J34108J7208j00757j45566q5705N3353J69788
38302G3289J46410j4370j59169j46183j3515P5131L8928l7772m5668J762J6204
38291f4953j9599l7988q352J6063k616k2447m506J2097j4242l8176J203O5021
$$ plain form
38279 -118495 -51299 -38262 -54939 -58002 -60119 -83388 -91786 -40899 40839 86300 76621 37251
38267 37251 -18466 -80036 -107382 -73394 -12398 32121 72642 128559 159106 126840 86440 113761
38255 113761 175541 174545 109420 80740 135750 209936 235644 214896 169618 110735 74942 103440
38243 103440 161368 161795 91806 32373 31980 47337 35652 15909 3048 -31567 -90738 -122969
38231 -122969 -107883 -91767 -92637 -54888 41295 107673 65208 -29165 -59155 -7818 47195 66383
38219 66383 83780 113931 110343 44425 -32071 -43841 14602 76714 87383 58202 31382 18088
38207 18088 4200 331 36069 102140 155550 196644 271714 367414 385668 286771 179553 182611
38195 182611 262680 310692 312755 320182 303335 191728 43309 11484 122066 225938 208073
$$ packed form
38279a18495O7196J3037j6677l063k117k3269q398N0887Q1738M5461r679l9370
38267C7251n5717o1570k7346L3988O0996M4519M0521N5917L0547l2266m0400K7321
38255A13761O1780r96o5125k8680N5010P4186K5708k0748m5278n8883l5793K8498
38243A03440N7928M27o9989n9433l93J5357j1685j9743j2861l4615n9171l2231
38231a22969J5086J6116q70L7749R6183O6378m2465r4373k9990N1337N5013J9188
38219F6383J7397L0151l588o5918p6496j1770N8443O2112J0669k9181k6820j3294
38207A8088j3888l869L5738O6071N3410M1094P5070R5700J8254r8897j07218L058
38195A82611Q0069M8012K063P427j6847j11607j48419l1825J10582J03872j7865
$$ plain form
38184 208073 114807 37360 -2908 -7231 39516 105053 115667 75757 75926 140413 182199 153986
38172 153986 118743 120838 122944 127611 208141 342407 383580 301622 279771 430369 589841
38161 589841 582396 525971 634507 832654 849501 649842 489046 526349 649991 738640 839784
38150 839784 988281 1078556 1058482 1061408 1188374 1321425 1328640 1314907 1466105 1749185 1992883
38139 1992883 2202122 2545271 3042013 3526633 3978081 4634960 5662689 6934722 8325890
38130 8325890 10034557 12388170 15498207 19412923 24456784 30855710 37764120 43037241
38122 43037241 44492458 41557722 35621919 28862547 22861024 18144626 14568651 11827479
38114 11827479 9700093 8069760 6853079 5939579 5208982 4590449 4064207 3607132 3177286
$$ packed form
38184B08073r3266p7447m0268m323M6747O5537J0614l9910J69O4487M1786k8213
38172A53986l5243K095K106M667Q0530J34266M1173q1958k1851J50598J59472
38161E89841p445n6425J08536J98147J6847j99659j60796L7303J23642Q8649J01144
38150H39784J48497R0275k0074K926J26966J33051P215j3733J51198K83080K43698
38139A992883K09239L43149M96742M84620M51448O56879J027729J272033J391168
38130H325890J708667K353613L110037L914716N043861O398926O908410N273121
38122D3037241J455217k934736n935803o759372o001523m716398l575975k741172
38114A1827479k127386j630333j216681r13500p30597o18533n26242m57075m29846
$$ plain form
38105 3177286 2750521 2334712 1953382 1644786 1449061 1349519 1258700 1121519 998080 971772
38095 971772 1007479 988803 876066 735333 622777 536421 479267 470651 483254 458546 401463
38084 401463 381835 428829 492614 514398 472674 375180 272136 245032 303057 339177 284829
38073 284829 237081 297880 367423 287660 134045 127805 270379 327350 212908 116057 154289
38062 154289 174499 46756 -90183 -67848 35577 71051 93139 220674 361308 332312
38052 332312 174076 97868 164868 243618 267513 318798 440422 547784 564020 505051 407169
38041 407169 287651 188375 151037 142590 96727 20688 -23854 -21008 3932 50124 110551 124559
38029 124559 60672 -7901 -13949 -11714 -60571 -78314 28755 158727 127761 -43479 -150775
$$ packed form
38105C177286m26765m15809l81330l08596j95725r9542r0819j37181j23439k6308
38095I71772L5707j8676j12737j40733j12556q6356n7154q616J2603k4708n7083
38084D01463j9628M6994O3785K1784m1724r7494j03044k7104N8025L6120n4348
38073B84829m7748O0799O9543p9763j53615o240J42574N6971j14442r6851L8232
38062A54289K0210j27743j36939K2335J03425L5474K2088J27535J40634k8996
38052C32312j58236p6208O7000P8750K3895N1285J21624J07362J6236n8969r7882
38041D07169j19518r9276l7338q447m5863p6039m4542K846K4940M6192O0427J4008
38029A24559o3887o8573o048K235m8857j7743J07069J29972l0966j71240j07296
$$ plain form
38018 -150775 -102973 -5749 55866 118816 190538 189865 109982 78308 171320 300245 356324 353915
38006 353915 357181 366683 348058 292423 200967 87026 17286 56776 153716 184568 129416 81730
37994 81730 68963 13821 -83630 -87588 67254 251157 317243 281952 228587 150333 11759
37983 11759 -125438 -166666 -118337 -56571 -16310 2807 -15402 -59603 -56783 28707 120854 138362
37971 138362 106013 76032 25841 -57743 -84316 8212 103176 54724 -64864 -62335 48124
37960 48124 34832 -180335 -349652 -220709 120749 376165 402845 304012 209654 130852 35029
37949 35029 -66894 -147488 -191166 -165142 -37647 139603 235813 178619 42731 -42940 -38615
37938 -38615 -1104 14063 2234 -18402 -31483 -25573 -8362 -898 14297 98443 250290 340232
$$ packed form
38018a50775M7802R7224O1615O2950P1722o73p9883l1674R3012J28925N6079k409
38006C53915L266R502j8625n5635r1456j13941o9740L9490R6940L0852n5152m7686
37994H1730j2767n5142r7451l958J54842J83903O6086l5291n3365p8254j38574
37983A1759j37197m1228M8329O1766M0261J9117j8209m4201K820Q5490R2147J7508
37971A38362l2349k9981n0191q3584k6573R2528R4964m8452j19588K529J10459
37960D8124j3292k15167j69317J28943L41458K55416K6680r8833r4358p8802r5823
37949C5029j01923q0594m3678K6024J27495J77250R6210n7194j35888q5671M325
37938c8615L7511J5167j1829k0636j3081N910J7211P464J5195Q4146J51847Q9942
$$ plain form
37926 340232 251044 66336 -5719 84426 155772 68789 -65655 -64555 44959 79361 -16788
37915 -16788 -111793 -114466 -94314 -121485 -130296 -39331 91798 142661 115584 120931 192110 226632
37903 226632 141010 775 -59802 -999 99227 164428 199554 244504 302947 350095 377223
37892 377223 388421 372419 318369 248641 198017 174141 180474 251941 395454 510499 472647
37881 472647 317476 230566 300285 393166 366389 295535 346444 491524 538226 433844 355465
37870 355465 447061 640248 833717 1092306 1501567 1918689 2071451 1903138 1644584 1499571
37860 1499571 1412173 1231203 972886 780136 691958 609008 476088 353964 282626 205151
37850 205151 89885 17260 55023 130430 132500 84986 101531 195899 254315 201276 92661
$$ packed form
37926C40232q9188j84708p2055R0145P1346q6983j34444J100J09514L4402r6149
37915a6788r5005k673K0152k7171q811R0965J31129N0863k7077N347P1179L4522
37903B26632q5622j40235o0577N8803J00226O5201L5126M4950N8443M7148K7128
37892C77223J1198j6002n4050o9728n0624k3876O333P1467J43513J15045l7852
37881D72647j55171q6910O9719R2881k6777p0854N0909J45080M6702j04382p8379
37870C55465R1596J93187J93469K58589M09261M17122J52762j68313k58554j45013
37860A499571q7398j80970k58317j92750q8178q2950j32920j22124p1338p7475
37850B05151j15266p2625L7763P5407K070m7514J6545R4368N8416n3039j08615
$$ plain form
37839 92661 24730 33492 104770 205681 276898 261558 177694 113206 123640 177015 212054 202036
37827 202036 149707 73084 15321 21420 82934 137530 135690 89183 61539 123222 279703 425947
37815 425947 441016 363148 367593 502714 586629 493420 386284 457438 573545 473197 239241
37804 239241 216392 444678 558231 361949 138267 174307 311747 250019 41873 -40010
37794 -40010 41747 100338 89336 136133 251154 293420 233362 205622 269987 320277 270037
37783 270037 173351 130697 187385 322534 445961 448100 346141 303323 398886 494089 464676
37772 464676 425678 533666 699548 733510 663886 647440 654821 544351 391696 419980 607006
37761 607006 689094 592479 539426 650398 754060 712525 649553 700318 776316 745224 645532
$$ packed form
37839I2661o7931Q762P1278J00911P1217j5340q3864o4488J0434N3375L5039j0018
37827B02036n2329p6623n7763O099O1514N4596j840m6507k7644O1683J56481J46244
37815D25947J5069p7868M445J35121Q3915r3209j07136P1154J16107j00348k33956
37804B39241k2849K28286J13553j96282k23682L6040J37440o1728k08146q1883
37794d0010Q1757N8591j1002M6797J15021M2266o0058k7740O4365N0290n0240
37783B70037r6686m2654N6688J35149J23427K139j01959m2818R5563R5203k9413
37772D64676l8998J07988J65882L3962o9624j6446P381j10470j52655K8284J87026
37761F07006Q2088r6615n3053J10972J03662m1535o2972N0765P5998l1092r9692
$$ plain form
37750 645532 570863 521031 502967 595066 770622 839606 717771 581358 597753 675261 658428
37739 658428 609241 683796 851856 958128 982957 1032606 1115190 1121202 1018848 908518 873646
37728 873646 901080 958519 1048107 1164648 1269153 1320766 1309631 1271964 1277982 1358000 1438869
37717 1438869 1426490 1352769 1341094 1415818 1469011 1444477 1419572 1458698 1523746 1582293 1656026
37706 1656026 1703085 1624596 1473475 1470477 1688603 1901184 1897211 1777202 1753856 1819985 1838054
37695 1838054 1832393 1936737 2120651 2218090 2199773 2185899 2198680 2132928 1993433 1940272 2039443
37684 2039443 2156580 2171901 2141319 2165548 2237122 2299830 2342614 2352105 2273396 2103553 1946209
37673 1946209 1898224 1945936 2029763 2133611 2239949 2271995 2178098 2036356 1986029 2065788 2186172
$$ packed form
37750F45532p4669m9832j8064R2099J75556O8984j21835j36413J6395P7508j6833
37739F58428m9187P4555J68060J06272K4829M9649Q2584O012j02354j10330l4872
37728H73646K7434N7439Q9588J16541J04505N1613j1135l7667O018Q0018Q0869
37717A438869j2379p3721j1675P4724N3193k4534k4905L9126O5048N8547P3733
37706A656026M7059p8489j51121k998K18126K12581l973j20009k3346O6129J8069
37695A838054n661J04344J83914R7439j8317j3874J2781o5752j39495n3161R9171
37684B039443J17137J5321l0582K4229P1574O2708M2784R491p8709j69843j57344
37673A946209m7985M7712Q3827J03848J06338L2046r3897j41742n0327P9759J20384
$$ plain form
37662 2186172 2250747 2239225 2176129 2091413 2033266 2053491 2131393 2155183 2043135 1866376 1780842
37651 1780842 1830292 1890828 1842697 1721763 1637050 1603496 1555140 1491067 1490506 1569059 1622825
37640 1622825 1561515 1430286 1353990 1400162 1522267 1603370 1547682 1370748 1199916 1140495
37630 1140495 1154132 1128729 1046999 1000456 1044991 1137426 1217484 1256398 1223571 1116609 1034352
37619 1034352 1094010 1245834 1297350 1166048 983140 895181 894195 911085 941315 986551 996135
37608 996135 971099 1010985 1141418 1205451 1065787 829755 724381 803729 921573 953739
37598 953739 906784 825951 731652 658526 651411 700251 747773 766746 776245 794439 825626 868162
37586 868162 884383 803343 619755 453195 432905 545493 664003 707466 705280 715714 742119
$$ packed form
37662B186172O4575j1522o3096q4716n8147K0225P7902K3790j12048j76759q5534
37651A780842M9450O0536m8131j20934q4713l3554m8356o4073n61P8553N3766
37640A622825o1310j31229p6296M6172J22105Q1103n5688j76934j70832n9421
37630A140495J3637k5403q1730m6543M4535R2435Q0058L8914l2827j06962q2257
37619A034352N9658J51824N1516j31302j82908q7959r86J6890L0230M5236R584
37608I96135k5036L9886J30433O4033j39664k36032j05374P9348J17844L2166
37598I53739m6955q0833r4299p3126p115M8840M7522J8973R499J8194L1187M2536
37586H68162J6221q1040j83588j66560k0290J12588J18510M3463k186J0434K6405
$$ plain form
37575 742119 736920 662020 550109 502984 586885 730378 793280 744087 682571 670476 650946
37564 650946 578184 507493 487624 479358 467948 541559 743888 944846 987509 894694 805232
37553 805232 764584 707550 607967 520111 488161 511371 577260 648947 656938 584678 518332 530202
37541 530202 565250 532092 451952 420055 467214 553277 645446 706915 667580 518121 383989
37530 383989 389990 489971 541880 513033 494439 539876 605890 639136 627817 578977 519333 492612
37518 492612 497784 481700 444579 462571 536053 537976 419916 334114 402743 501249 463319 381372
37506 381372 465304 679363 777936 674056 523351 447669 423401 456356 607077 789802
37496 789802 796010 605613 454225 495001 601924 615892 580670 598114 629852 599737 552271
$$ packed form
37575G42119n199p4900j11911m7125Q3901J43493O2902m9193o1516j2095j9530
37564F50946p2762p0691j9869q266j1410P3611K02329K00958M2663r2815q9462
37553H05232m0648n7034r9583q7856l1950K3210O5889P1687P991p2260o6346J1870
37541E30202L5048l3158q0140l1897M7159Q6063R2169O1469l9335j49459j34132
37530C83989O001R9981N1909k8847j8594M5437O6014L3246j1319m8840n9644k6721
37518D92612N172j6084l7121J7992P3482J923j18060q5802O8629R8506l7930q1947
37506C81372Q3932K14059R8573j03880j50705p5682k4268L2955J50721J82725
37496G89802O208j90397j51388M0776J06923J3968l5222J7444L1738l0115m7466
$$ plain form
37485 552271 558662 579744 554657 518800 516001 508639 490784 556245 711381 757618 549370 270286
37473 270286 241433 498896 759819 797073 666762 551934 549210 652149 805221 911932
37463 911932 888841 766651 668669 661139 697103 725020 763413 832663 896077 918150 916573 910817
37451 910817 879631 817149 773271 783888 812211 816853 826146 872853 901821 838292 726558 693914
37439 693914 767946 834948 814540 773670 802733 867017 874871 832419 820389 846818 839014 786126
37427 786126 780120 876492 995977 1020812 947948 903706 1015956 1274538 1505225 1514449 1302855
37416 1302855 1093374 1080511 1203392 1269558 1249465 1284913 1410016 1458273 1319951 1128168
37406 1128168 1074413 1156557 1230294 1224384 1187263 1178736 1215033 1276908 1302254 1230612 1112977
$$ packed form
37485E52271O391K1082k5087l5857k799p362j7855O5461J55136M6237k08248k79084
37473B70286k8853K57463K60923L7254j30311j14828k724J02939J53072J06711
37463I11932k3091j22190r7982p530L5964K7917L8393O9250O3414K2073j577n756
37451I10817l1186o2482m3878J0617K8323M642R293M6707K8968o3529j11734l2644
37439F93914P4032O7002k0408m0870K9063O4284P854m2452j2030K6429p804n2888
37427G86126o006R6372J19485K4835p2864m4242J12250K58582K30687R224k11594
37416A302855k09481j2863J22881O6166k0093L5448J25103M8257j38322j91783
37406A128168n3755Q2144P3737n910l7121q527L6297O1875K5346p1642j17635
$$ plain form
37395 1112977 1090746 1196605 1281925 1234185 1151584 1176749 1265425 1280411 1233605 1250277 1331455
37384 1331455 1337333 1212580 1069911 1024228 1073094 1167952 1287391 1403067 1463879 1449264 1380420
37373 1380420 1277781 1169985 1126423 1197407 1327398 1402373 1376367 1289977 1193947 1129248 1144352
37362 1144352 1238656 1316456 1291177 1210946 1190083 1247370 1308730 1333190 1328165 1278647 1185404
37351 1185404 1139622 1216953 1315310 1254441 1044084 894514 927143 1026292 1036528 970162 935960
37340 935960 967567 1013199 1025306 985906 898626 816817 827487 946921 1072004 1089987 1009289
37329 1009289 937494 952307 1034857 1117638 1158716 1158460 1124001 1046608 931464 830764 806091
37318 806091 854644 910863 924913 898810 849467 793155 762837 769689 751773 649979 531429
$$ packed form
37395A112977k2231J05859Q5320m7740q2601K5165Q8676J4986m6806J6672Q1178
37384A331455N878j24753j42669m5683M8866R4858J19439J15676O0812j4615o8844
37373A380420j02639j07796m3562P0984J29991P4975k6006q6390r6030o4699J5104
37362A144352R4304P7800k5279q0231k0863N7287O1360K4460n025m9518r3243
37351A185404m5782P7331R8357o0869k10357j49570L2629R9149J0236o6366l4202
37340I35960L1607M5632J2107l9400q7280q1809J0670J19434J25083J7983q0698
37329A009289p1795J4813Q2550Q2781M1078k56l4459p7393j15144j00700k4673
37318H06091M8553N6219J4050k6103m9343n6312l0318O852j7916j01794j18550
$$ plain form
37307 531429 523317 616097 667620 625215 587012 601385 586014 520689 528289 652783 745777 711712
37295 711712 678291 759232 836173 776077 688166 730785 816802 768162 633305 577138 565250
37284 565250 451595 298611 300373 431003 476124 397591 368035 442063 489465 473262 501497
37273 501497 570964 551289 467111 496922 626909 612572 384651 196693 236994 368928 409452
37262 409452 406969 461702 497025 412855 292660 268038 315268 346743 371737 415698 405583
37251 405583 285221 141433 84839 96330 97119 77058 64701 67605 112586 234747 368529
37240 368529 378763 258024 154663 153978 189727 221450 307493 426170 431129 296178 210125
37229 210125 299624 439505 472384 434959 416475 369195 234398 109984 116223 209056 273527
$$ packed form
37307E31429q112R2780N1523m2405l8203J4373j5371o5325P600J24494R2994l4065
37295G11712l3421Q0941P6941o0096q7911M2619Q6017m8640j34857n6167j1888
37284E65250j13655j52984J762J30630M5121p8533k9556P4028M7402j6203K8235
37273E01497O9467j9675q4178K9811J29987j4337k27921j87958M0301J31934M0524
37262D09452k483N4733L5323q4170j20195k4622M7230L1475K4994M3961j0115
37251D05583j20362j43788n6594J1491P89k0061j2357K904M4981J22161J33782
37240C68529J0234j20739j03361o85L5749L1723Q6043J18677M959j34951q6053
37229B10125Q9499J39881L2879l7425j8484m7280j34797j24414O239R2833O4471
$$ plain form
37218 273527 285510 254940 151391 19809 10385 140696 195955 42441 -129873 -87051 83193
37207 83193 128998 34555 -3076 76225 133555 95142 42691 33670 28847 10412 5063 -11344
37195 -11344 -77767 -128381 -68242 41317 39546 -84348 -161846 -92439 29125 77023 54565
37184 54565 29660 14016 -19264 -59037 -63226 -21376 27267 36481 2220 -40156 -74324 -129856
37172 -129856 -210654 -232898 -115950 82538 220438 251070 238900 209334 128626 38728 40488
37161 40488 108515 103652 20458 22114 151017 223518 134975 51286 130022 252544 237657 147278
37149 147278 147953 210802 200987 159503 230200 366365 371950 221210 100604 116870 170288 152800
37137 152800 99151 97567 178715 313776 416700 364741 138252 -84501 -105713 40353 150576
$$ packed form
37218B73527J1983l0570j03549j31582r424J30311N5259j53514j72314M2822J70244
37207H3193M5805r4443l7631P9301N7330l8413n2451r021m823j8435n349j6407
37195a1344o6423n0614O0139J09559j771j23894p7498O9407J21564M7898k2458
37184E4565k4905j5644l3280l9773m189M1850M8643R214l4261m2376l4168n5532
37172a29856q0798k2244J16948J98488J37900L0632j2170k9566q0708q9898J760
37161D0488O8027m863q3194J656J28903P2501q8543q3689P8736J22522j4887r0379
37149A47278O75O2849r815m1484P0697J36165N585j50740j20606J6266N3418j7488
37137A52800n3649j584Q1148J35061J02924n1959k26489k22753k1212J46066J10223
$$ plain form
37126 150576 141829 120384 168702 227649 224070 181977 163100 192832 267201 347812 348516 221578
37114 221578 57158 960 71404 151243 157310 117909 75374 14658 -78807 -161060 -161770 -44349
37102 -44349 157729 335305 374294 282303 198949 222341 283115 265859 191640 173087 225541
37091 225541 238017 131896 -39446 -161874 -178516 -135204 -133448 -215854 -293008 -247375 -118805
37080 -118805 -80259 -185823 -268026 -172994 15702 103614 47419 -34504 -51512 -21390 -838
37069 -838 -31793 -124306 -225781 -254764 -210746 -172902 -153242 -72405 62130 109992 27798 -19485
37057 -19485 86947 213641 191880 91121 74072 108094 54244 -48685 -38261 82045 147610
37046 147610 108532 76485 99033 103800 82273 121149 216302 247899 188686 160333 223233 272178
$$ packed form
37126A50576q747k1445M8318N8947l579m2093j8877K9732P4369Q0611P04j26938
37114B21578j64420n6198P0444P9839O067l9401m2535o0716r3465q2253p10J17421
37102d4349K02078J77576L8989r1991q3354K3392O0774j7256p4219j8553N2454
37091B25541J2476j06121j71342j22428j6642M3312J756q2406p7154M5633J28570
37080a18805L8546j05564q2203R5032J88696Q7912n6195q1923j7008L0122K0552
37069h38l0955r2513j01475k8983M4018L7844J9660Q0837J34535M7862q2194m7283
37057a9485J06432J26694k1761j00759j7049L4022n3850j02929J0424J20306O5565
37046A47610l9078l2047K2548M767k1527L8876R5153L1597n9213k8353O2900M8945
$$ plain form
37034 272178 216220 126834 125711 229133 375155 518462 629114 660422 582322 421309 240548
37023 240548 97319 14645 -30250 -73805 -107555 -93215 -48410 -40906 -68837 -47029 39076
37012 39076 86678 56450 63241 176162 265475 196238 55545 17549 81492 125586 135458 179008
37000 179008 217320 156324 60833 104397 293060 427082 374379 227160 142973 156652 198688
36989 198688 209624 193251 200158 264932 346198 377591 387482 460511 548710 481244 245554 77131
36977 77131 132210 250037 219363 109052 110714 200906 218661 172373 200591 296180 328779
36966 328779 293740 292297 306284 235520 123014 102552 154394 150372 107266 152594 272675
36955 272675 346624 401354 569632 810130 934985 917774 927338 1063878 1301332 1660136
$$ packed form
37034B72178n5958q9386j123J03422J46022J43307J10652L1308p8100j61013j80761
37023B40548j43229q2674m4895m3555l3750J4340M4805P504k7931K1808Q6105
37012C9076M7602l0228O791J12921Q9313o9237j40693l7996O3943M4094R872M3550
37000A79008L8312o0996r5491M3564J88663J34022n2703j47219q4187J3679M2036
36989A98688J0936j6373O907O4774Q1266L1393R891P3029Q8199o7466k35690j68423
36977G7131N5079J17827l0674j10311J662R0192J7755m6288K8218R5589L2599
36966C28779l5039j443J3987p0764j12506k0462N1842m022m3106M5328J20081
36955B72675P3949N4730J68278K40498J24855j7211R564J36540K37454L58804
$$ plain form
36945 1660136 2187209 2823931 3564598 4623743 6056336 7298558 7589300 6906613 6027104
36936 6027104 5582670 5546768 5744071 6240898 6912480 7182237 6681189 5808910 5186139 4855190
36926 4855190 4483701 4075428 3931008 4065929 4216849 4366646 4760824 5437160 6262213
36917 6262213 7438359 9346283 11676603 13326273 13614729 13203083 13248166 13831702 13821145
36908 13821145 12338194 9843228 7520266 5973574 4916161 3935739 3074324 2562497
36900 2562497 2354354 2186917 1940672 1706279 1557381 1455394 1365604 1303670 1255625 1182486
36890 1182486 1113331 1113946 1158720 1158868 1127121 1178206 1336710 1481936 1535971 1575784 1678528
36879 1678528 1764687 1699698 1486449 1256135 1095748 968758 810460 643247 560804 602425
$$ packed form
36945A660136N27073O36722P40667J059145J432593J242222K90742o82687q79509
36936F027104m44434l5902J97303M96827O71582K69757n01048q72279o22771l30949
36926D855190l71489m08273j44420J34921J50920J49797L94178O76336Q25053
36917F262213J176146J907924K330320J649670K88456m11646M5083N83536j0557
36908A3821145j482951k494966k322962j546692j057413r80422q61415n11827
36900B562497k08143j67437k46245k34393j48898j01987q9790o1934m8045p3139
36890A182486o9155O15M4774J48l1747N1085J58504J45226N4035L9813J02744
36879A678528Q6159o4989k13249k30314j60387j26990j58298j67213q2443M1621
$$ plain form
36869 602425 678929 670001 583729 537606 560928 529864 373548 227741 251184 375858 407737
36858 407737 331082 328911 496151 703451 787522 735255 624590 504443 403847 369715 418342
36847 418342 495879 539758 555996 611672 767143 1019796 1305397 1567457 1821897 2123824
36837 2123824 2510161 3063790 3965655 5255467 6502319 6999096 6486527 5499777 4787907
36828 4787907 4565031 4580863 4731502 5189076 5937627 6569563 6691602 6311770 5715565 5142379
36818 5142379 4687854 4366951 4142077 3962418 3852789 3915594 4214405 4713087 5364487 6235128
36808 6235128 7502328 9232266 11060003 12221037 12230592 11580500 11365920 11981597 12533108
36799 12533108 11893182 10056783 8009206 6483032 5415293 4555467 3958830 3682860 3485236
$$ packed form
36869F02425P6504q928q6272m6123K3322l1064j56316j45807K3443J24674L1879
36858D07737p6655k171J67240K07300Q4071n2267j10665j20147j00596l4132M8627
36847D18342P7537M3879J6238N5676J55471K52653K85601K62060K54440L01927
36837B123824L86337N53629R01865J289812J246852M96777n12569r86750p11870
36828D787907k22876J5832J50639M57574P48551O31936J22039l79832n96205n73186
36818E142379m54525l20903k24874j79659j09629O2805K98811M98682O51400Q70641
36808F235128J267200J729938J827737J161034R555o50092k14580O15677N51511
36799A2533108o39926j836399k047577j526174j067739q59826n96637k75970j97624
$$ plain form
36790 3485236 3128005 2699067 2396576 2210566 2014670 1798136 1632026 1526077 1441561 1353651
36780 1353651 1240630 1105586 1016203 1009063 990464 880062 785202 835892 922912 846426 663542
36769 663542 607930 704588 766374 748669 780837 846299 780385 620924 606645 761376 832700
36758 832700 733659 687993 809315 884245 745271 552449 517351 607024 692811 756046 795961
36747 795961 764563 727279 853906 1123347 1276382 1185825 1034166 1010034 1083671 1199509
36737 1199509 1413660 1692649 1841321 1795164 1748991 1854007 2028172 2195044 2443553 2803392
36727 2803392 3131332 3381335 3721250 4216034 4670788 4975296 5331270 5922868 6612564
36718 6612564 7195262 7735810 8421936 9261311 10128511 10949702 11669550 12198839 12536727
$$ packed form
36790C485236l57231m28938l02491j86010j95896k16534j66110j05949q4516q7910
36780A353651j13021j35044q9383p140j8599j10402r4860N0690Q7020p6486j82884
36769F63542n5612R6658O1786j7705L2168O5462o5914j59461j4279J54731P1324
36758H32700r9041m5666J21322P4930j38974j92822l5098Q9673Q5787O3235L9915
36747G95961l1398l7284J26627K69441J53035r0557j51659k4132P3637J15838
36737A199509K14151K78989J48672m6157m6173J05016J74165J66872K48509L59839
36727B803392L27940K50003L39915M94784M54754L04508L55974N91598O89696
36718F612564N82698N40548O86126Q39375Q67200Q21191P19848N29289L37888
$$ plain form
36709 12536727 12772384 12864239 12641135 12125310 11584597 11129576 10549096 9715012 8852167
36700 8852167 8192962 7638844 7001828 6338425 5802403 5378188 4983607 4638440 4334305
36691 4334305 3949674 3484926 3158798 3081244 3061931 2930199 2793029 2774763 2767276 2664487
36681 2664487 2580614 2590134 2509099 2199998 1854183 1700948 1661272 1556374 1431881 1395657
36671 1395657 1352925 1194564 1051335 1074506 1150025 1108490 1030604 1059558 1091991 951129 711900
36660 711900 573203 547906 533357 537236 589645 596611 522228 534564 721323 857291 728159
36649 728159 494375 440886 541799 576274 516768 491483 496349 448378 410011 473127 529303
36638 529303 433421 292783 320882 490608 587218 530659 419840 335469 298483 335291 409761
$$ packed form
36709A2536727K35657R1855k23104n15825n40713m55021n80480q34084q62845
36700H852167o59205n54118o37016o63403n36022m24215l94581l45167l04135
36691D334305l84631m64748l26128p7554j9313j31732j37170j8266p487j02789
36681B664487q3873R520q1035l09101l45815j53235l9676j04898j24493l6224
36671A395657m2732j58361j43229K3171P5519m1535p7886K8954L2433j40862k39229
36660G11900j38697k5297j4549L879N2409O966p4383J2336J86759J35968j29132
36649G28159k33784n3489J00913L4475n9506k5285M866m7971l8367O3116N6176
36638E29303r5882j40638K8099J69726R6610n6559j10819q4371l6986L6808P4470
$$ plain form
36627 409761 397859 278902 208166 258588 277798 161954 59824 119013 243938 299473 330756
36616 330756 380943 334330 162948 79966 205794 329204 254462 133089 174932 279275
36606 279275 255064 179682 223934 317575 295108 203121 186284 234478 284052 381534 526478
36595 526478 573408 504398 539860 753881 874980 721955 521722 510651 547565 439032
36585 439032 321568 374737 469681 460685 514619 782826 1057834 1132461 1182483 1410959 1652868
36574 1652868 1740507 1908235 2408304 3113654 3962512 5311803 7184692 8566198 8285844
36565 8285844 6483037 4483206 3274059 2745379 2379897 1990230 1632051 1332087 1114756
36556 1114756 996535 888220 729318 639786 691209 696800 522318 385495 501358 670960
$$ packed form
36627D09761j1902j18957p0736N0422J9210j15844j02130N9189J24925N5535L1283
36616C30756N0187m6613j71382q2982J25828J23410p4742j21373M1843J04343
36606B79275k4211p5382M4252R3641k2467r1987j6837M8194M9574R7482J44944
36595E26478M6930o9010L5462K14021J21099j53025k00233j1071L6914j08533
36585D39032j17464N3169R4944q996N3934K68207K75008P4627N0022K28476K41909
36574A652868Q7639J67728N00069P05350Q48858J349291J872889J381506k80354
36565H285844j802807j999831j209147n28680l65482l89667l58179k99964k17331
36556A114756j18221j08315j58902q9532N1423N591j74482j36823J15863J69602
$$ plain form
36546 670960 609915 438232 426347 507934 489459 481444 640922 745655 542692 277767 335572
36535 335572 578723 605970 456568 468204 611345 567515 341370 219831 233067 196202
36525 196202 159465 285735 425085 342014 200384 281573 414046 262432 -15000 -20711
36515 -20711 153960 113558 -81972 -31801 233785 292126 98215 50895 287370 519355
36505 519355 579439 575697 521448 337268 173937 232876 357057 288315 173203 292184 488048
36494 488048 438312 284759 374283 580072 530322 317716 314112 466806 457234 371017 518485
36483 518485 778552 821792 785922 1017037 1361787 1461297 1515753 1979929 2743176 3434264
36473 3434264 4296436 5866967 7946028 9716971 10719097 10955919 10410857 9368135 8794096
$$ packed form
36546F70960o1045j71683j1885Q1587j8475q015J59478J04733k02963k64925N7805
36535C35572K43151K7247j49402J1636J43141m3830k26145j21539J3236l6865
36525A96202l6737J26270J39350q3071j41630Q1189J32473j51614k77432n711
36515b0711J74671m0402j95530N0171K65586N8341j93911m7320K36475K31985
36505E19355O0084l742n4249j84180j63331N8939J24181o8742j15112J18981J95864
36494D88048m9736j53553Q9524K05789m9750k12606l604J52694r572q6217J47468
36483E18485K60067M3240l5870K31115L44750R9510N4456M64176P63247O91088
36473C434264Q62172J570531K079061J770943J002126K36822n45062j042722n74039
$$ plain form
36464 8794096 9278765 9891299 9247158 7465229 5860897 4950371 4121568 3157289 2611148
36455 2611148 2560352 2369782 1918595 1796526 2063035 2044442 1598122 1372220 1565813 1617444
36445 1617444 1367930 1342135 1614434 1579734 1135560 930181 1155031 1238392 1003003 970009
36435 970009 1252939 1316086 1086005 1129930 1493894 1558457 1265448 1257814 1601702 1651964 1380044
36424 1380044 1487938 1995162 2120628 1801964 1870006 2452225 2718719 2507061 2627089 3221542
36414 3221542 3457538 3231158 3495633 4450165 5115557 5199117 5628589 6697252 7478167
36405 7478167 7678911 8245398 9462376 10301752 10361443 10588276 11349511 11686256 11231854
36396 11231854 10931967 11101058 10768849 9726122 9125867 9258967 8920901 7795893 7149838
$$ packed form
36464H794096M84669O12534o44141j781929j604332r10526q28803r64279n46141
36455B611148n0796j90570m51187j22069K66509j8593m46320k25902J93593N1631
36445A617444k49514k5795K72299l4700m44174k05379K24850Q3361k35389l2994
36435I70009K82930O3147k30081M3925L63964O4563k93009p634L43888N0262k71920
36424A380044J07894N07224J25466l18664O8042N82219K66494k11658J20028N94453
36414C221542K35996k26380K64475R54532O65392Q3560M29472J068663P80915
36405G478167K00744N66487J216978Q39376N9691K26833P61235L36745m54402
36396A1231854k99887J69091l32209j042727o00255J33100l38066j125008o46055
$$ plain form
36387 7149838 7314110 6966720 5826390 5402611 6052249 6115392 5102249 4731273 5552338
36378 5552338 5762928 4793454 4620489 5910972 6545526 5787985 5964733 7946546 9244755
36369 9244755 8939686 9835352 13048653 15637837 16712879 20047957 26922476 33192282
36361 33192282 38173541 48332418 65858051 83816634 102965899 141558390 209326267
36354 209326267 276989980 295139274 248873512 175627061 121240684 94965378 78071040
36347 78071040 59721446 45544424 39018761 34160866 27271156 22041589 20517044 19040550
36339 19040550 15609406 13190651 13361233 13334564 11504862 10206618 10876290 11467566 10646795
36330 10646795 10142089 11037819 11641054 10806281 9910236 9903184 9558261 8154559 6995760
$$ packed form
36387G149838J64272l47390j140330m23779O49638O3143j013143l70976Q21065
36378E552338K10590r69474j72965J290483O34554p57541J76748J981813J298209
36369I244755l05069Q95666L213301K589184J075042L335078O874519O269806
36361C3192282M981259J0158877J7525633J7958583J9149265L8592491O7767877
36354B09326267O7663713J8149294m6265762p3246451n4386377k6275306j6894338
36347G8071040j8349594j4177022o525663m857895o889710n229567j524545j476494
36339A9040550l431144k418755J70582k6669j829702j298244O69672N91276q20771
36330A0646795n04706Q95730O03235q34773q96045p052l44923j403702j158799
$$ plain form
36321 6995760 6850547 6551581 5433641 4651609 4844459 4859014 3989282 3270313 3409012
36312 3409012 3515210 2974889 2604384 2895001 2990508 2421405 2065744 2410598 2578802 2041708
36302 2041708 1645082 1973426 2265994 1913719 1551802 1725102 1863982 1504648 1215785
36293 1215785 1427942 1576241 1241633 964514 1140806 1261695 996794 888653 1230630
36284 1230630 1384678 969729 633169 871239 1131935 873509 520401 573435 696388 479662
36274 479662 262721 427521 650654 581298 530916 802813 1030865 845180 553375 550172
36264 550172 656940 601939 560977 705078 788950 658209 596532 755270 826831 661086
36254 661086 585535 751294 814757 637061 617840 933583 1128797 909705 701478 952055
$$ packed form
36321F995760j45213k98966j117940p82032J92850J4555q69732p18969J38699
36312C409012J06198n40321l70505K90617R5507n69103l55661L44854J68204n37094
36302B041708l96626L28344K92568l52275l61917J73300J38880l59334k88863
36293A215785K12157J48299l34608k77119J76292J20889k64901j08141L41977
36284A230630J54048m14949l36560K38070K60696k58426l53108N3034J22953k16726
36274D79662k16941J64800K23133o9356n0382K71897K28052j85685k91805l203
36264E50172J06768n5001m0962J44101Q3872j30741o1677J58738P1561j65745
36254F61086p5551J65759O3463j77696j9221L15743J95214k19092k08227K50577
$$ plain form
36244 952055 1454982 1784124 1856365 1703380 1259235 725833 568168 807439 901227 625108
36234 625108 429075 595326 736133 530576 290800 344240 469524 405621 344150 462559
36224 462559 519077 355321 268258 450451 588428 446632 320789 465339 589720 396188
36214 396188 135484 144623 269081 219014 104794 162086 296834 320489 311693 378882 391458
36203 391458 272753 217904 322599 357901 194870 65783 126254 168211 55086 16743
36193 16743 202054 356529 268762 139299 185915 266594 204843 116913 124570 113131 39141
36182 39141 87808 272352 295708 69334 -70024 69374 208176 133086 85697 278189
36172 278189 473600 411969 242282 180595 138665 27657 23442 192863 265739 113214 30250
$$ packed form
36244I52055N02927L29142P2241j52985m44145n33402j57665K39271R3788k76119
36234F25108j96033J66251J40807k05557k39776N3440J25284o3903o1471J18409
36224D62559N6518j63756q7063J82193J37977j41796j25843J44550J24381j93532
36214C96188k60704R139J24458n0067j14220N7292J34748K3655q796O7189J2576
36203C91458j18705n4849J04695L5302j63031j29087O0471M1957j13125l8343
36193A6743J85311J54475q7767j29463M6616Q0679o1751q7930P657j1439p3990
36182C9141M8667J84544K3356k26374j39358J39398J38802p5090m7389J92492
36172B78189J95411o1631j69687o1687m1930j11008m215J69421P2876j52525q2964
$$ plain form
36161 30250 201197 330914 183676 36600 172407 351552 255971 71952 138580 341568
36151 341568 346390 169287 62600 64401 71327 129983 275519 314851 134248 -16599 101594
36140 101594 307983 311957 177746 123764 107398 -21523 -171702 -171127 -89360 -85322 -119017
36129 -119017 -88756 -50688 -54858 5430 152357 197600 76343 2754 73179 69209 -98707
36118 -98707 -152359 51594 199536 55845 -99155 23215 178438 25113 -256201 -287572
36108 -287572 -133026 -94248 -125483 20001 262591 328420 250038 258976 325277 260373 137504
36097 137504 161818 253687 198195 76796 111280 210167 127291 -41147 7661 228393 287733
36086 287733 146136 108393 275911 395272 322185 237655 294638 382653 366014 294324 264685
$$ packed form
36161C0250J70947J29717j47238j47076J35807J79145r5581j84019O6628K02988
36151C41568M822j77103j06687J801O926N8656J45536L9332j80603j50847J18193
36140A01594K06389L974j34211n3982j6366j28921j50179N75Q1767M038l3695
36129a19017L0261L8068m170O0288J46927M5243j21257p3589P0425l970j67916
36118i8707n3652K03953J47942j43691j55000J22370J55223j53325k81314l1371
36108b87572J54546L8778l1235J45484K42590O5829p8382Q938O6301o4904j22869
36097A37504K4314R1869n5492j21399L4484R8887q2876j68438M8808K20732N9340
36086B87733j41597l7743J67518J19361p3087q4530N6983Q8015j6639p1690k9639
$$ plain form
36075 264685 270454 265377 235228 179043 131691 170946 288221 332641 214279 57231 8099
36064 8099 20909 -8072 -35689 16942 90395 109742 137434 218430 230897 92075 -44609
36053 -44609 -8993 117693 157934 109145 62039 12144 -46321 -12325 130700 198496 89935
36042 89935 -10270 67069 185323 157307 72265 94592 143916 72057 -27488 10029 111871
36031 111871 133258 167791 380200 677981 865223 987236 1201543 1428914 1468682 1382216
36021 1382216 1448827 1794234 2340465 3063399 4009064 5048217 5830643 6019407 5508058
36012 5508058 4509860 3498090 2870413 2567498 2222945 1746024 1437809 1435832 1474018 1399473
36002 1399473 1453250 1727620 1853703 1681221 1772769 2591891 3565528 3685534 2859529 1952297
$$ packed form
36075B64685N769n077l0149n6185m7352L9255J17275M4420j18362j57048m9132
36064H099J2810k8981k7617N2631P3453J9347K7692Q0996J2467j38822j36684
36053d4609L5616J26686M0241m8789m7106m9895n8465L3996J43025O7796j08561
36042H9935j00205P7339J18254k8016q5042K2327M9324p1859r9545L7517J01842
36031A11871K1387L4533K12409K97781J87242J22013K14307K27371L9768q6466
36021A382216O6611L45407N46231P22934R45665J039153P82426J88764n11349
36012E508058r98198j011770o27677l02915l44553m76921l08215j977L8186p4545
36002A399473N3777K74370J26083j72482R1548Q19122R73637J20006q26005r07232
$$ plain form
35992 1952297 1559146 1436999 1193381 872218 664615 554544 479655 478874 515250 451018
35982 451018 301236 235959 275936 265540 178053 159008 237271 274434 227211 195570 199509
35971 199509 161266 100993 104890 132701 101057 89286 196014 282772 161807 -52045 -102096
35960 -102096 -11969 1297 -50120 29650 211155 269646 191830 164462 184618 82713 -79435
35949 -79435 -51138 151103 242092 150947 91609 113991 22107 -183762 -225515 -33601 101997
35938 101997 22238 -52645 52153 157850 63140 -126087 -213013 -197584 -158899 -84434 12801
35927 12801 20668 -78699 -137829 -82875 -23340 -29248 -16602 50967 70593 9966 -7490 76934
35915 76934 158225 168791 167937 163215 68833 -85736 -138306 -65256 -41982 -150757 -252478 -231604
$$ packed form
35992A952297l93151j22147k43618l21163k07603j10071p4889p81L6376o4232
35982D51018j49782o5277L9977j0396q7487j9045P8263L7163m7223l1641L939
35971A99509l8243o0273L897K7811l1644j1771J06728Q6758j20965k13852n0051
35960a02096R0127J3266n1417P9770J81505N8491p7816k7368K0156j01905j62148
35949g9435K8297K02241R0989r1145n9338K2382r1884k05869m1753J91914J35598
35938A01997p9759p4883J04798J05697r4710j89227q6926J5429L8685P4465R7235
35927A2801P867r9367n9130N4954N9535n908J2646O7569J9626o0627j7456Q4424
35915G6934Q1291J0566q54m722r4382j54569n2570P3050K3274j08775j01721K0874
$$ plain form
35903 -231604 -152663 -99083 -67208 -75690 -159325 -216042 -106639 59583 21224 -201480 -282069
35892 -282069 -90078 103542 65733 -58951 -37023 85821 119485 35627 -60358 -117161 -137067
35881 -137067 -107737 -49476 -20343 -12652 27954 66445 34734 15584 140724 305397 262552
35870 262552 32675 -86193 18084 120151 66090 -538 38683 59823 -16349 -33688 88953
35859 88953 147100 -9049 -186066 -159764 -43878 -66946 -175638 -156382 -14718 51877 -21881
35848 -21881 -114135 -130544 -81859 -3086 46752 -28008 -230365 -397903 -380435 -218362 -54874
35837 -54874 29444 16436 -83963 -180018 -151106 -39607 -29912 -150095 -189441 -31409 140330
35826 140330 128377 17479 -6011 42395 32297 -32112 -63493 -81777 -148476 -200067 -138375
$$ packed form
35903b31604P8941N3580L1875q482q3635n6717J09403J66222l8359k22704q0589
35892b82069J91991J93620l7809j24684K1928J22844L3664q3858r5985n6803j9906
35881a37067K9330N8261K9133P691M0606L8491l1711j9150J25140J64673m2845
35870B62552k29877j18868J04277J02067n4061o6628L9221K1140p6172j7339J22641
35859H8953N8147j56149j77017K6302J15886k3068j08692J9256J41664O6595p3758
35848b1881r2254j6409M8685P8773M9838p4760k02357j67538J7468J62073J63488
35837e4874Q4318j3008j00399r6055K8912J11499R695j20183l9346J58032J71739
35826A40330j1953j10898k3490M8406j0098o4409l1381j8284o6699n1591O1692
$$ plain form
35815 -138375 -12744 60229 82646 115909 117978 19347 -101163 -98010 15759 84462 35093
35804 35093 -48153 -66525 -14315 52848 78943 45537 -6788 -24026 -20871 -51065 -91514 -65221
35792 -65221 2704 -8559 -110058 -153946 -54625 88631 162273 179803 174180 112177 13145
35781 13145 -9879 59964 70495 -61043 -192520 -172628 -61500 5887 29578 62468 55510
35770 55510 -44075 -149857 -153503 -90450 -47090 -8786 56470 78026 6236 -48631 30690 165163
35758 165163 194253 116339 53979 48967 49351 43056 57866 76282 74795 92031 149049 175604
35746 175604 121153 48082 7432 -63442 -193713 -259485 -168412 -42102 -39134 -111398 -129361
35735 -129361 -136808 -252339 -400441 -392561 -241625 -154362 -214186 -296408 -309889 -302568 -292885 -208962
$$ packed form
35815a38375J25631P2973K2417L3263K069r8631j20510L153J13769O8703m9369
35804C5093q3246j8372N2210O7163K6095l3406n2325j7238L155l0194m0449K6293
35792f5221O7925j1263j01499m3888R9321J43256P3642J7530n623o2003r9032
35781A3145k3024O9843J0531j31538j31477J9892J11128O7387K3691L2890o958
35770E5510r9585j05782l646O3053M3360L8304O5256K1556p1790n4867P9321J34473
35758A65163K9090p7914o2360n012L84o295J4810J8416j487J7236N7018K6555
35746A75604n4451p3071m0650p0874j30271o5772R1073J26310K968p2264j7963
35735a29361p447j15531j48102P880J50936Q7263n9824q2222j3481P321R683Q3923
$$ plain form
35723 -208962 -60410 14561 -46315 -132107 -143113 -130939 -169702 -214231 -185003 -98007 -17210
35712 -17210 44138 88254 70312 -31664 -132231 -125402 -40139 -16162 -111888 -215269 -187700
35701 -187700 -43902 72459 69592 -5874 -66532 -89868 -88618 -50239 22461 64256 28253
35690 28253 -22900 -623 61526 47544 -64728 -171292 -183786 -105256 26636 163045 217941
35679 217941 139171 8197 -47862 -34898 -50476 -83460 -27169 102879 159699 111260 97205
35668 97205 176910 224338 165680 120148 179020 229007 145729 5123 -56975 -58681 -82887 -97023
35656 -97023 -34484 40080 16184 -81684 -146978 -160267 -169466 -164103 -100589 -1176 81718 140022
35644 140022 157580 73381 -95402 -192964 -115777 25659 69151 35460 51951 119232 119599
$$ packed form
35723b08962J48552P4971o0876q5792j1006J2174l8763m4529K9228Q6996Q0797
35712a7210O1348M4116j7942j01976j00567O829Q5263K3977r5726j03381K7569
35701a87700J43798J16361k867p5466o0658k3336J250L8379P2700M1795l6003
35690B8253n1153K2277O2149j3982j12272j06564j2494P8530J31892J36409N4896
35679B17941p8770j30974n6059J2964j5578l2984N6291J30048N6820m8439j4055
35668I7205P9705M7428n8658m5532N8872M9987q3278j40606o2098j706k4206j4136
35656i7023O2539P4564k3896r7868o5294j3289r199N363O3514R9413Q2894N8304
35644A40022J7558q4199j68783r7562P7187J41436M3492l3691J6491O7281L67
$$ plain form
35633 119599 16707 -102153 -159479 -141943 -53383 70875 132416 60905 -81201 -162415 -116501
35622 -116501 39589 245063 383996 334222 127181 -27967 18701 179218 275352 260080
35612 260080 188740 87735 -17620 -51235 1397 30575 -16169 -10678 143941 305883 287313
35601 287313 143844 65223 73802 58587 30597 90037 177425 119575 -68104 -171231 -107560
35590 -107560 -42247 -106751 -206656 -203789 -125095 -82700 -102823 -131074 -131386 -110279 -93735 -110542
35578 -110542 -149741 -138747 -32305 92807 118045 44444 -18490 -14888 -577 -44844 -155962
35567 -155962 -289256 -356277 -268714 -64901 63105 -11536 -153209 -124809 88598 269418
35557 269418 264761 136330 10481 -61401 -65398 1763 72367 45880 -60083 -105242 -22377
$$ packed form
35633A19599j02892j18860n7326J7536Q8560J24258O1541p1511j42106q1214M5914
35622a16501J56090K05474J38933m9774k07041j55148M6668J60517R6134j5272
35612B60080p1340j01005j05355l3615N2632K9178m6744N491J54619J61942j8570
35601B87313j43469p8621Q579j5215k7990N9440Q7388n7850j87679j03127O3671
35590a07560O5313o4504r9905K867P8694M2395k0123k8251l12K1107J6544j6807
35578a10542l9199J0994J06442J25112K5238p3601o2934L602J4311m4267j11118
35567a55962j33294o7021Q7563K03813J28006p4641j41673K8400K13407J80820
35557B69418m657j28431j25849p1882l997O7161P0604k6487j05963m5159Q2865
$$ plain form
35546 -22377 86257 107414 79555 119223 240376 325001 266311 97663 -39818 -57572 -19686
35535 -19686 -37851 -92184 -59466 68073 132283 47353 -51740 -15465 87954 92521 -12021
35524 -12021 -105565 -134717 -120119 -44265 86656 135991 -6955 -208746 -239585 -109162 -31463
35513 -31463 -66459 -47325 97781 203830 144907 34928 20900 47873 -20149 -166356 -254877
35502 -254877 -225255 -133947 -48352 9439 44249 74529 112434 129978 84710 -10612 -98774
35491 -98774 -159431 -210509 -232908 -184324 -96889 -64814 -110954 -152852 -127668 -70660 -43796 -58560
35479 -58560 -90695 -109373 -85793 -34056 -29976 -114914 -203662 -176468 -37137 115915 234540
35468 234540 314307 290661 109689 -109656 -167238 -59699 7861 -72826 -173555 -155816 -60595
$$ packed form
35546b2377J08634K1157k7859L9668J21153Q4625n8690j68648j37481j7754L7886
35535a9686j8165n4333L2718J27539O4210q4930r9093L6275J03419M567j04542
35524a2021r3544k9152J4598P5854J30921M9335j42946k01791l0839J30423P7699
35513c1463l4996J9134J45106J06049n8923j09979j4028K6973o8022j46207q8521
35502b54877K9622R1308Q5595N7791L4810L0280L7905J7544m5268r5322q8162
35491i8774o0657n1078k2399M8584Q7435L2075m6140m1898K5184N7008K6864j4764
35479e8560l2135j8678K3580N1737M080q4938q8748K7194J39331J53052J18625
35468B34540P9767k3646j80972k19345n7582J07539O7560q0687j00729J7739R5221
$$ plain form
35457 -60595 14224 61448 83457 16811 -132329 -207981 -104499 56965 101142 58384 82908
35446 82908 169189 141631 -60897 -256151 -242704 -49851 115788 118038 7240 -95933 -154753
35435 -154753 -213095 -280587 -301320 -254145 -209477 -230988 -276781 -269882 -221426 -198705 -207258 -201532
35423 -201532 -184303 -186995 -173079 -87994 649 -41897 -197543 -278834 -189887 -65639 -65677 -151712
35411 -151712 -183863 -144192 -125712 -144662 -107185 20824 119849 53381 -147345 -298722 -273714
35400 -273714 -152347 -115808 -205794 -272409 -195840 -66042 -50070 -150050 -220710 -193863 -142390
35389 -142390 -120469 -88071 -30888 -17654 -71418 -98654 -30468 54182 36211 -75007 -165478
35378 -165478 -166799 -107784 -45459 -12006 -17905 -56080 -101373 -127814 -119096 -60729 46050 153947
$$ packed form
35457f0595P4819M7224K2009o6646j49140p5652J03482J61464M4177m2758K4524
35446H2908Q6281k7558k02528j95254J3447J92853J65639K250j10798j03173n8820
35435a54753n8342o7492k0733M7175M4668k1511m5793O899M8456K2721q553N726
35423b01532J7229k692J3916Q5085Q8643m2546j55646q1291Q8947J24248l8q6035
35411a51712l2151L9671J8480j8950L7477J28009R9025o6468k00726j51377K5008
35400b73714J21367L6539q9986o6615P6569J29798J5972r9980p0660K6847N1473
35389a42390K1921L2398N7183J3234n3764k7236O8186Q4650j7971j11218r0471
35378a65478j321N9015O2325L3453n899l8175m5293k6441Q718N8367J06779J07897
$$ plain form
35366 153947 192707 142654 55573 -12759 -61157 -117084 -176375 -192255 -127251 -15418 42772
35355 42772 -18618 -141687 -213036 -220989 -252554 -308338 -249408 -18282 204158 201787 7648
35344 7648 -161472 -198309 -176066 -167154 -165855 -185060 -259362 -331571 -289953 -148541 -50415 -61193
35332 -61193 -95140 -78718 -51246 -61855 -93663 -130918 -180296 -193828 -100492 53398 134348
35321 134348 127360 157741 257572 278949 126369 -77795 -167670 -145923 -113778 -105163 -102612 -116673
35309 -116673 -137999 -99676 8548 76733 29191 -47319 -41659 3388 -19473 -86252 -82510 -4123
35297 -4123 28054 -40977 -115446 -89385 10502 73421 58387 43888 103887 169766 97456 -102753
35285 -102753 -216558 -109711 43627 -6340 -194088 -220723 -21170 128687 49899 -73230
$$ packed form
35366A53947L8760n0053q7081o8332m8398n5927n9291j5880O5004J11833N8190
35355D2772o1390j23069p1349p953l1565n5784N8930K31126K22440k371j94139
35344G648j69120l6837K2243Q912J299j9205p4302p2209M1618J41412R8126j0778
35332f1193l3947J6422K7472j0609l1808l7255m9378j3532R3336J53890Q0950
35321A34348o988L0381R9831K1377j52580k04164q9875K1747L2145Q615K551j4061
35309a16673k1326L8323J08224O8185m7542p6510N660M5047k2861o6779L742P8387
35297d123L2177o9031p4469K6061R9887O2919j5034j4499N9999O5879p2310k00209
35285a02753j13805J06847J53338m9967j87748k6635J99553J49857p8788j23129
$$ plain form
35275 -73230 -24290 94899 73576 -35813 -25925 95989 124101 -274 -112605 -104657 -60639
35264 -60639 -71678 -97965 -82712 -65355 -108408 -201188 -286645 -320038 -278744 -174357 -64048
35253 -64048 2944 40541 76394 82309 27707 -32983 -15722 72956 154292 186423 167840 73894
35241 73894 -93758 -219386 -169804 9854 117878 42198 -118204 -209392 -200259 -155666 -113360
35230 -113360 -52721 50389 177545 262428 235668 108406 -8151 -19102 40482 72640 65395
35219 65395 79157 104140 59995 -38415 -48479 91642 225852 161263 -66885 -224382 -164935
35208 -164935 8004 92877 31194 -60895 -71835 -31461 -38232 -98342 -112078 -27863 65996
35197 65996 57190 -34339 -94159 -84692 -86773 -155914 -225256 -203222 -106901 -29678 -7551 9855
$$ packed form
35275g3230M8940J19189k1323j09389R888J21914K8112j24375j12331P948M4018
35264f0639j1039k6287J5253J7357m3053r2780q5457l3393M1294J04387J10309
35253f4048O6992L7597L5853N915n4602o0690J7261Q8678Q1336L2131j8583r3946
35241G3894j67652j25628M9582J79658J08024p5680j60402r1188R133M4593M2306
35230a13360O0639J03110J27156Q4883k6760j27262j16557j0951N9584L2158p245
35219F5395J3762K4983m4145r8410j0064J40121J34210o4589k28148j57497N9447
35208a64935J72939Q4873o1683r2089j0940M0374o771o0110j3736Q4215R3859
35197F5996q806r1529n9820R467k081o9141o9342K2034R6321P7223K2127J7406
$$ plain form
35185 9855 60204 110138 116627 90227 59052 12182 -67113 -134642 -117224 -18344 62478 37767
35173 37767 -77565 -198079 -248987 -202378 -86349 13082 10732 -80262 -156527 -160372 -142634
35162 -142634 -147166 -119058 -11109 93262 76850 -36341 -116810 -109286 -65166 -27898 -11117
35151 -11117 -62654 -201226 -295232 -171189 123144 319161 250070 40281 -89711 -78974
35141 -78974 -12001 31353 20755 -37915 -79856 -24575 95906 141971 60405 -27197 -1684
35130 -1684 88496 119553 55324 -61003 -181121 -237451 -161172 -6184 54276 -42241 -135186
35119 -135186 -77504 39739 54446 10398 64524 184741 166565 -45819 -256403 -283709 -173131
35108 -173131 -79085 -57888 -55241 -21777 31000 59707 39242 -5309 -23969 -15022 -36282 -112026
$$ packed form
35185I855N0349M9934O489k6400l1175m6870p9295o7529J7418R8880Q0822k4711
35173C7767j15332j20514n0908M6609J16029R9431k350r0994p6265l845J7738
35162a42634m532K8108J07949J04371j6412j13191q0469P524M4120L7268J6781
35151a1117n1537j38572r4006J24043K94333J96017o9091k09789j29992J0737
35141g8974O6973M3354j0598n8670m1941N5281J20481M6065q1566q7602K5513
35130a684R0180L1057o4229j16327j20118n6330P6279J54988O0460r6517r2945
35119a35186N7682J17243J4707m4048N4126J20217j8176k12384k10584k7306J10578
35108a73131R4046K1197K647L3464N2777K8707k0465m4551j8660Q947k1260p5744
$$ plain form
35096 -112026 -182863 -196405 -183090 -177824 -141417 -48398 20805 -12665 -86244 -85685 -25255 -8262
35084 -8262 -49544 -78642 -89348 -132362 -171093 -106263 41451 125595 78818 -17256 -94148 -176339
35072 -176339 -252123 -222017 -61155 96133 131420 98264 109044 162462 189968 192380 208986
35061 208986 203281 104533 -54971 -155528 -149144 -111742 -116645 -134976 -103212 -34016 897 -18484
35049 -18484 -28198 17873 58838 -1237 -140452 -212812 -131079 5002 26021 -99804 -246578
35038 -246578 -294021 -236512 -140295 -69059 -57486 -91440 -104257 -49756 19486 8717 -84991
35027 -84991 -167056 -177760 -148789 -112671 -47953 44989 97852 65263 -788 -30009 -35131 -67262
35015 -67262 -112521 -110504 -56542 -12815 -17694 -43745 -54332 -50764 -44923 -25140 22739 81267
$$ packed form
35096a12026p0837j3542J3315N266L6407R3019O9203l3470p3579N59O0430J6993
35084h262m1282k9098j0706m3014l8731O4830J47714Q4144m6777r6074p6892q2191
35072a76339p5784L0106J60862J57288L5287l3156J0780N3418K7506K412J6606
35061B08986n705r8748j59504j00557O384L7402m903j8331L1764O9196L4913j9381
35049a8484r714M6071M0965o0075j39215p2360Q1733J36081K1019j25825j46774
35038b46578m7443N7509R6217P1236J1573l3954j2817N4501O9242j0769r3708
35027h4991q2065j0704K8971L6118O4718R2942N2863l2589o6051k9221n122l2131
35015f7262m5259K017N3962M3727m879k6051j0587L568N841J9783M7879N8528
$$ plain form
35003 81267 114069 106939 80834 65808 72061 85863 85132 57746 13696 -15566 812 58993
34991 58993 110180 96658 3518 -125630 -218941 -223299 -142812 -45910 -12882 -51901 -86727 -54740
34979 -54740 12854 51678 67424 102998 124592 45239 -119434 -222530 -164915 -20557 78133
34968 78133 104769 111783 102864 34033 -80522 -153833 -125051 -19222 91334 146735 132782
34957 132782 91159 81789 108115 108624 49518 -21209 -55461 -87382 -167685 -257542 -270557 -203490
34945 -203490 -145031 -150094 -170576 -127902 -10890 115773 178443 161748 113131 74119 24695
34934 24695 -61646 -126730 -78499 54304 124147 68299 -89 17328 34564 -75576 -255422
34923 -255422 -333055 -277523 -227944 -271657 -336486 -329323 -262474 -201471 -177851 -191318 -226829 -242273
$$ packed form
35003H1267L2802p130k6105j5026O253J3802p31k7386m4050k9262J6378N8181
34991E8993N1187j3522r3140j29148r3311m358Q0487R6902L3028l9019l4826L1987
34979e4740O7594L8824J5746L5574K1594p9353j64673j03096N7615J44358R8690
34968G8133K6636P014q919o8831j14555p3311K8782J05829J10556N5401j3953
34957A32782m1623r370K6326N09n9106p0727l4252l1921q0303q9857j3015O7067
34945b03490N8459n063k0482M2674J17012J26663O2670j6695m8617l9012m9424
34934B4695q6341o5084M8231J32803O9843n5848o8388J7417J7236j10140j79846
34923b55422p7633N5532M9579m3713o4829P163O6849O1003K3620j3467l5511j5444
$$ plain form
34911 -242273 -202785 -144568 -140085 -185345 -189194 -96235 38420 119412 108724 38385 -30679 -50588
34899 -50588 -22724 2807 -11859 -45625 -57814 -43206 -15346 19223 27140 -48720 -186031 -249257
34887 -249257 -150171 12882 75211 11319 -88150 -180827 -270792 -290820 -161496 38253 130706
34876 130706 85482 41342 58448 28705 -110181 -246054 -264316 -195270 -97392 50763 224577
34865 224577 271771 117454 -63970 -61398 65771 81197 -70769 -199858 -167301 -55119
34855 -55119 17099 71327 160136 207739 111771 -56525 -107065 13155 152874 186152 185587
34844 185587 270399 369804 287052 -10158 -308447 -407350 -344140 -283639 -279793 -256647 -171100
34833 -171100 -76123 -32103 -45331 -94360 -150325 -177780 -168252 -151568 -129396 -50329 84491
$$ packed form
34911b42273L9488N8217M483m5260l849R2959J34655Q0992j0688p0339o9064j9909
34899e0588K7864K5531j4666l3766j2189J4608K7860L4569P917p5860j37311o3226
34887b49257R9086J63053O2329o3892r9469r2677q9965k0028J29324J99749R2453
34876A30706m5224m4140J7106k9743j38886j35873j8262O9046R7878J48155J73814
34865B24577M7194j54317j81424K572J27169J5426j51966j29089L2557J12182
34855e5119P2218N4228Q8809M7603r5968j68296n0540J20220J39719L3278n65
34844A85587Q4812R9405q2752k97210k98289r8903O3210O0501L846K3146Q5547
34833a71100R4977M4020j3228m9029n5965k7455R528J6684K2172P9067J34820
$$ plain form
34822 84491 163370 112023 30576 52216 122886 83679 -60324 -139827 -93104 -42723 -60419
34811 -60419 -53039 31618 66924 -55499 -228959 -276673 -199912 -144290 -182730 -257087 -294164
34800 -294164 -271348 -192674 -86611 -9412 9759 565 -9930 -37941 -82161 -93022 -54858
34789 -54858 -22487 -17991 19953 109068 143089 42807 -95597 -126122 -63851 -39207 -86779
34778 -86779 -119541 -93507 -59432 -43679 -2683 76752 133698 123776 76947 40089 26410 33838
34766 33838 48939 28107 -54062 -134009 -116900 -18166 34374 -35543 -162704 -242632 -245952 -192386
34754 -192386 -92247 20845 62102 -14292 -124665 -135602 -32081 63385 55603 -846 12832
34743 12832 108159 167904 104739 -14936 -53782 14445 70307 8113 -130069 -219947 -210626
$$ packed form
34822H4491P8879n1347q1447K1640P0670l9207j44003p9503M6723N0381j7696
34811f0419P380Q4657L5306j22423j73460m7714P6761N5622l8440p4357l7077
34800b94164K2816P8674J06063P7199J9171r194j0495k8011m4220j0861L8164
34789e4858L2371M496L7944Q9115L4021j00282j38404l0525O2271K4644m7572
34778h6779l2762K6034L4075J5753M0996P9435N6946r922m6829l6858j3679P428
34766C3838J5101k0832q2169p9947J7109R8734N2540o9917j27161p9928l320N3566
34754a92386J00139J13092M1257p6394j10373j0937J03521R5466p782n6449J3678
34743A2832R5327N9745o3165j19675l8846O8227N5862o2194j38182q9878R321
$$ plain form
34732 -210626 -156805 -118608 -97476 -76411 -60349 -47250 -4937 80991 160536 164351 89980 6657
34720 6657 -29222 -29318 -32009 -41823 -42019 -42488 -66150 -92293 -70903 -13175 -10210 -112735 -232334
34707 -232334 -231055 -98697 26559 25711 -70103 -140003 -117934 -41216 16698 23270 1833 -7248
34695 -7248 6911 21722 26947 52674 119864 175973 131260 -24409 -180714 -212680 -110523
34684 -110523 15799 51139 -16694 -93871 -80481 20839 105740 92023 22425 8741 87438
34673 87438 182637 217335 203176 187571 157135 52322 -125544 -272520 -281641 -174324 -95816
34662 -95816 -157184 -303770 -379881 -314859 -190505 -115618 -100904 -95759 -87464 -100434 -131911 -148065
34650 -148065 -123830 -47239 77367 185989 170373 6701 -177542 -242819 -198649 -140622 -81901
$$ packed form
34732b10626N3821L8197K1132K1065J6062J3099M2313Q5928P9545L815p4371q3323
34720F657l5879r6k691r814j96m69k3662k6143K1390N7728K965j02525j19599
34707b32334J279J32358J25256q48r5814o9900K2069P6718N7914O572k1437r081
34695g248J4159J4811N225K5727O7190N6109m4713j55669j56305l1966J02157
34684a10523J26322L5340o7833p7177J3390J01320Q4901j3717o9598j3684P8697
34673H7438R5199L4698j4159j5605l0436j04813j77866j46976r121J07317P8508
34662i5816o1368j46586p6111O5022J24354P4887J4714N145Q295j2970l1477j6154
34650a48065K4235P6591J24606J08622j5616j63672j84243o5277M4170N8027N8721
$$ plain form
34639 -81901 31523 168393 215110 141246 41504 -7670 -25253 -42425 -54052 -77339 -146493
34628 -146493 -217893 -194104 -81169 -6823 -32451 -61398 1561 104597 134782 60615 -72972
34617 -72972 -201014 -236564 -122906 44630 68601 -93128 -243250 -221107 -127283 -130662 -184527
34606 -184527 -134641 -19993 -25331 -153552 -189735 -44284 82513 -13445 -249718 -383512
34596 -383512 -320600 -168974 -57505 -30031 -79250 -160901 -181059 -78315 66870 98413 -12456
34585 -12456 -118716 -100183 -30767 -58341 -175036 -225978 -141304 -35920 -33449 -97604 -121460
34574 -121460 -103283 -120440 -171530 -171702 -105622 -65895 -104257 -143071 -92733 12477 61697 12798
34562 12798 -65220 -80405 -14102 65727 76172 10937 -49933 -38773 18848 55906 57247 44859
$$ packed form
34639h1901J13424J36870M6717p3864r9742m9174j7583j7172j1627k3287o9154
34628a46493p1400K3789J12935P4346k5628k8947O2959J03036L0185p4167j33587
34617g2972j28042l5550J13658J67536K3971j61729j50122K2143R3824l379n3865
34606a84527M9886J14648n338j28221l6183J45451J26797r5958k36273j33794
34596c83512O2912J51626J11469K7474m9219q1651k0158J02744J45185L1543j10869
34585a2456j06260J8533O9416k7574j16695n0942Q4674J05384K471o4155k3856
34574a21460J8177j7157n1090j72O6080L9727l8362l8814N0338J05210M9220m8899
34562A2798p8018j5185O6303P9829J0445o5235o0870J1160N7621L7058J341j2388
$$ plain form
34550 44859 13194 -40202 -59022 -6769 31480 -44259 -157558 -130492 33423 120649 27654
34539 27654 -67551 27405 226970 298209 186664 49238 15533 68547 139913 186830 171348
34528 171348 75085 -47035 -104617 -73169 -6351 37259 27922 -41618 -130912 -152164 -65187
34517 -65187 57201 122495 134465 142348 130826 65726 4789 31031 90666 40498 -123526
34506 -123526 -227265 -164497 -55864 -70320 -183430 -232139 -160163 -82029 -101532 -176399 -203561
34495 -203561 -158810 -90495 -26770 34333 63642 12822 -97005 -164992 -120209 5251 133182
34484 133182 209481 191274 47602 -162145 -284004 -233156 -109516 -60878 -88511 -96541 -74270
34473 -74270 -84285 -102942 -39313 82760 124705 44185 -45017 -59876 -43264 -29153 24958
$$ packed form
34550D4859l1665n3396j8820N2253L8249p5739j13299K7066J63915Q7226r2995
34539B7654r5205R4956J99565P1239j11545j37426l3705N3014P1366M6917j5482
34528A71348r6263j22120n7582L1448O6818M3610r337o9540q9294k1252Q6977
34517f5187J22388O5294J1970P883j1522o5100o0937K6242N9635n0168j64024
34506a23526j03739O2768J08633j4456j13110m8709P1976P8134j9503p4867k7162
34495b03561M4751O8315O3725O1103K9309n0820j09827o7987M4783J25460J27931
34484A33182P6299j8207j43672k09747j21859N0848J23640M8638k7633q030K2271
34473g4270j0015j8657O3629J22073M1945q0520q9202j4859J6612J4111N4111
$$ plain form
34462 24958 104167 95646 -26439 -121006 -87244 -18175 -38849 -116888 -148943 -119015 -55682 51170
34450 51170 170335 185446 63597 -47434 -29500 18507 -39793 -135242 -122500 -49787 -75970
34439 -75970 -178751 -178422 -39877 66649 29050 -70214 -118914 -115269 -97873 -69059 -32139 -264
34427 -264 53701 158087 250764 233219 115284 -1532 -75430 -140885 -185505 -146714 -42478
34416 -42478 22171 -664 -62460 -130856 -222962 -315218 -341589 -302288 -263580 -236316 -169852 -79652
34404 -79652 -57663 -129171 -212359 -246210 -252082 -249512 -221661 -183674 -173915 -160842 -75725 44769
34392 44769 73335 -25192 -147238 -209685 -228740 -218287 -153615 -76225 -89722 -197196 -281582
34381 -281582 -301998 -356868 -477145 -517070 -365722 -135856 -12459 -13733 -27231 2881 51917
$$ packed form
34462B4958P9209q521j22085r4567L3762O9069k0674p8039l2055K9928O3333J06852
34450E1170J19165J5111j21849j11031J7934M8007n8300r5449J2742P2713k6183
34439g5970j02781L29J38545J06526l7599r9264m8700L645J7396K8814L6920L1875
34427b64N3965J04386R2677j7545j17935j16816p3898o5455m4620L8791J04236
34416d2478O4649k2835o1796o8396r2106r2256k6371L9301L8708K7264O6464R0200
34404g9652K1989p1508q3188l3851n872K570K7851L7987R759J3073Q5117J20494
34392D4769K8566r8527j22046o2447j9055J0453O4672P7390j3497j07474q4386
34381b81582k0416n4870j20277l9925J51348K29866J23397j274j3498L0112M9036
$$ plain form
34370 51917 109680 173208 188101 107619 -16032 -82538 -56480 28072 120165 148575 43811
34359 43811 -149877 -257047 -169552 -6429 29071 -99110 -260897 -359137 -391470 -342969 -178007
34348 -178007 32288 115212 2831 -155739 -165765 -18529 116581 100982 -36685 -168504
34338 -168504 -218124 -218762 -240887 -293571 -313518 -244328 -106669 17019 56474 9203 -64281
34327 -64281 -96661 -76382 -52768 -65901 -83196 -35439 90617 238965 372627 526431 735131
34316 735131 937557 1003075 863817 595564 349680 212051 146943 80904 9422 -15449
34306 -15449 14344 35944 6449 -34781 -31512 5433 24778 11485 -11778 -35988 -72804 -125898
34294 -125898 -187559 -240390 -238941 -136878 26563 121816 74628 -25359 -31585 78483 203158
$$ packed form
34370E1917N7763O3528J4893q0482j23651o6506K6058Q4552R2093K8410j04764
34359D3811j93688j07170Q7495J63123L5500j28181j61787r8240l2333M8501J64962
34348a78007K10295Q2924j12381j58570j0026J47236J35110j5599j37667j31819
34338a68504m9620o38k2125n2684j9947O9190J37659J23688L9455m7271p3484
34327f4281l2380K0279K3614j3133j7295M7757J26056J48348J33662J53804K08700
34316G35131K02426O5518j39258k68253k45884j37629o5108o6039p1482k4871
34306a5449K9793K1600k9495m1230L269L6945J9345j3293k3263k4210l6816n3094
34294a25898o1661n2831J449J02063J63441R5253m7188r9987o226J10068J24675
$$ plain form
34283 203158 266157 279833 269568 219970 113630 -27421 -150628 -202222 -169721 -118903 -142882
34272 -142882 -236610 -279374 -193795 -57388 11402 11604 22266 69355 121790 165352 189346 156362
34260 156362 75531 36359 70083 62856 -68930 -208570 -199860 -94465 -55476 -84713 -61503
34249 -61503 -9722 -79744 -253745 -314398 -169903 3500 29472 -41610 -69923 -33535 4401
34238 4401 14557 -1073 -37013 -53729 -7980 63673 92805 102727 151044 173542 68151 -75938
34226 -75938 -57107 107181 172234 46469 -79342 -76130 -76422 -183889 -248837 -138185 -3612
34215 -3612 -43043 -173886 -190980 -108078 -92209 -165686 -216633 -224560 -243389 -226108 -93432 70602
34203 70602 107282 30252 -17658 -11134 -34208 -62334 15190 157129 183704 59719 -43373
$$ packed form
34283B03158O2999J3676j0265m9598j06340j41051j23207n1594L2501N0818k3979
34272a42882r3728m2764Q5579J36407O8790K02J0662M7089N2435M3562K3994l2984
34260A56362q0831l9172L3724p227j31786j39640Q710J05395L8989k9237K3210
34249f1503N1781p0022j74001o0653J44495J73403K5972p1082k8313L6388L7936
34238D401J0156j5630l5940j6716M5749P1653K9132R922M8317K2498j05391j44089
34226g5938J8831J64288O5053j25765j25811L212k92j07467o4948J10652J34573
34215c612l9431j30843j7094Q2902J5869p3477n0947p927j8829J7281J32676J64034
34203G0602L6680p7030m7910O524k3074k8126P7524J41939K6575j23985j03092
$$ plain form
34192 -43373 -16942 43732 30509 -19528 -36540 -40998 -68485 -90851 -92243 -124085 -213427 -301965
34180 -301965 -333707 -321175 -277155 -172757 -22763 73578 49327 -37685 -95511 -122255 -169061
34169 -169061 -228158 -241532 -203277 -176513 -197342 -218440 -178359 -95434 -51516 -85751 -146271
34158 -146271 -167506 -156080 -155708 -158759 -123746 -72551 -86838 -186587 -285694 -302254 -252378 -203267
34146 -203267 -191332 -215269 -250369 -244319 -163200 -63118 -42450 -103610 -150028 -142074 -148839 -208197
34134 -208197 -254448 -242612 -226626 -244354 -242121 -189840 -148181 -136076 -66990 75947 143551
34123 143551 37785 -104467 -103917 1071 60879 71904 125406 182867 125443 -14271 -86409
34112 -86409 -73429 -100029 -196528 -256999 -250514 -273108 -347249 -356259 -241621 -104586 -44288 -37303
$$ packed form
34192d3373K6431O0674j3223n0037j7012m458k7487k2366j392l1842q9342q8538
34180c01965l1742J2532M4020J04398J49994R6341k4251q7012n7826k6744m6806
34169a69061n9097j3374L8255K6764k0829k1098M0081Q2925M3918l4235o0520
34158a46271k1235J1426L72l051L5013N1195j4287r9749r9107j6560M9876M9111
34146b03267J1935k3937l5100O050Q1119J00082K0668o1160m6418P954o765n9358
34134b08197m6251J1836J5986j7728K233N2281M1659J2105O9086J42937O7604
34123A43551j05766j42252N50J04988N9808J1025N3502N7461n7424j39714p2138
34112h6409J2980k6600r6499o0471O485k2594p4141r010J14638J37035O0298O985
$$ plain form
34100 -37303 -42061 -84690 -166477 -208756 -170866 -123063 -130826 -156615 -141240 -98928 -70623 -59879
34088 -59879 -69772 -127772 -219686 -270543 -246231 -210024 -225512 -261942 -249059 -177861 -97528 -48646
34076 -48646 -40045 -64432 -104472 -135310 -132424 -76356 21731 81084 -1275 -203425 -338420 -256208
34064 -256208 -46359 67117 3846 -120792 -202689 -261430 -323148 -334400 -260455 -168180 -138492
34053 -138492 -163077 -183232 -174771 -148455 -114178 -82719 -65511 -51158 -19746 11465 1172 -53221
34041 -53221 -110838 -142062 -142329 -106883 -48786 -23466 -67809 -128996 -122960 -50357 12004 15391
34029 15391 -30903 -99439 -138465 -72800 91675 211409 168791 49052 21905 89604 113670
34018 113670 64371 50063 85718 38015 -134898 -274104 -247231 -133005 -72457 -66694 -39854
$$ packed form
34100c7303m758m2629q1787m2279L7890M7803p763k5789J5375M2312K8305J0744
34088e9879r893n8000r1914n0857K4312L6207j5488l6430J2883P1198Q0333M8882
34076d8646Q601k4387m0040l0838K886N6068R8087N9353q2359k02150j34995Q2212
34064b56208K09849J13476o3271j24638q1897n8741o1718j1252P3945R2275K9688
34053a38492k4585k0155Q461K6316L4277L1459J7208J4353L1412L1211j0293n4393
34041e3221n7617l1224k67L5446N8097K5320m4343o1187O036P2603O2361L387
34029A5391m6294o8536l9026O5665J64475J19734m2618j19739k7147O7699K4066
34018A13670m9299j4308L5655m7703j72913j39206K6873J14226O0548N763K6840
$$ plain form
34007 -39854 2846 3816 -33372 -69222 -113770 -193891 -277400 -305446 -263839 -168357 -30543 106268
33995 106268 152628 61843 -99973 -220804 -250426 -214340 -162703 -130306 -106423 -33959 112224
33984 112224 251242 272244 181962 91533 57522 35066 -8984 -52574 -100138 -179097 -231596
33973 -231596 -153042 18942 106203 45498 -12952 48792 128401 84275 -32789 -78006 -36994
33962 -36994 2183 16894 31558 -2623 -142005 -298534 -314225 -182375 -55172 -26071 -34238
33951 -34238 -5229 32166 13389 -61570 -139546 -175016 -154365 -97087 -43741 -16630 -2238 2689
33939 2689 -37717 -135728 -224955 -230154 -167527 -113225 -94203 -77669 -51121 -35453 -18755 45093
33927 45093 147513 194956 110191 -60042 -172981 -129802 20560 126807 91940 -28058
$$ packed form
34007c9854M2700R70l7188l5850m4548q0121q3509k8046M1607R5482J37814J36811
33995A06268M6360r0785j61816j20831k9622L6086N1637L2397K3883P2464J46183
33984A12224J39018K1002r0282r0429l4011k2456m4050m3590m7564p8959n2499
33973b31596P8554J71984Q7261o0705n8450O1744P9609m4126j17064m5217M1012
33962c6994L9177J4711J4664l4181j39382j56529j5691J31850J27203K9101q167
33951c4238K9009L7395j8777p4959p7976l5470K0651N7278N3346K7111J4392M927
33939B689m0406r8011q9227n199O2627N4302J9022J6534K6548J5668J6698O3848
33927D5093J02420M7443q4765j70233j12939M3179J50362J06247l4867j19998
$$ plain form
33917 -28058 -103279 -87068 -44713 -33450 -28715 2663 26712 -1890 -51778 -50191 4864 24575
33905 24575 -61942 -205963 -274855 -201218 -75700 -41922 -96268 -78985 81059 213876 124565
33894 124565 -107431 -216876 -122010 -12805 -35808 -89557 -31178 85035 118909 71661 45735
33883 45735 57653 44918 13548 35378 114912 177350 182176 150914 93324 795 -92039 -127164
33871 -127164 -107043 -85301 -77514 -54779 -23517 -32174 -83076 -107482 -60205 9737 22334 -23640
33859 -23640 -46207 5139 60780 2821 -168519 -302102 -278081 -167724 -131013 -197521 -256649
33848 -256649 -242898 -203336 -178048 -148548 -129265 -173180 -246298 -235332 -132911 -71124 -104556
33837 -104556 -114191 -17970 80511 73765 31659 55200 84999 26520 -49036 -21764 45829 178
$$ packed form
33917b8058p5221J6211M2355J1263M735L1378K4049k8602m9888J587N5055J9711
33905B4575q6517j44021o8892P3637J25518L3778n4346J7283J60044J32817q9311
33894A24565k31996j09445R4866J09205k3003n3749N8379J16213L3874m7248k5926
33883D5735J1918j2735l1370K1830P9534O2438M826l1262n7590r2529r2834l5125
33871a27164K0121K1742P787K2735L1262q657n0902k4406M7277O9942J2597m5974
33859b3640k2567N1346N5641n7959j71340j33583K4021J10357L6711o6508n9128
33848b56649J3751L9562K5288K9500J9283m3915p3118J0966J02421O1787l3432
33837a04556r635R6221R8481o746m2106K3541K9799n8479p5556K7272O7593m5651
$$ plain form
33825 178 -135616 -195450 -150093 -145358 -244272 -322352 -271345 -151305 -73284 -50389 -32570 -571
33813 -571 35862 75135 115852 145553 151234 117044 29144 -84713 -153532 -137017 -58196 60192
33801 60192 208752 306359 229631 10556 -130012 -67483 38896 -8720 -149349 -198299 -153194
33790 -153194 -135557 -128172 -33375 76039 51626 -21751 77158 296253 329315 104005 -85340
33779 -85340 -49078 20278 -82594 -229458 -215568 -116135 -117374 -175661 -121745 21820 88963
33768 88963 47426 -6397 -49858 -104453 -81522 99621 289711 251232 2484 -210268 -269858
33757 -269858 -277122 -280916 -186374 3391 103172 20574 -82555 -32630 112945 194117 177135
33746 177135 119237 27269 -99449 -175081 -122866 -7046 52762 42579 17149 -30079 -127767
$$ packed form
33825A78j35794n9834M5357M735r8914p8080N1007J20040P8021K2895J7819L1999
33813e71L6433L9273M0717K9701N681l4190q7900j13857o8819J6515P8821J18388
33801F0192J48560R7607p6728k19075j40568O2529J06379m7616j40629m8950M5105
33790a53194J7637P385R4797J09414k4413p3377R8909K19095L3062k25310j89345
33779h5340L6262O9356j02872j46864J3890R9433j239n8287N3916J43565O7143
33768H8963m1537n3823m3461n4595K2931J81143J90090l8479k48748k12752n9590
33757b69858p264l794R4542J89765R9781q2598j03129M9925J45575Q1172j6982
33746A77135n7898r1968j26718p5632N2215J15820N9808j0183k5430m7228r7688
$$ plain form
33735 -127767 -210932 -188748 -98237 -50912 -49777 -8134 62276 50496 -48442 -100972 -56740 -29638
33723 -29638 -77417 -76422 55954 172546 105994 -52410 -91371 -21674 -45954 -205720 -303771
33712 -303771 -227084 -119442 -128520 -174813 -115647 13497 87207 105042 140056 154738 62767
33701 62767 -65537 -60947 71143 120934 -32530 -258179 -372883 -359703 -291335 -167767 29624
33690 29624 205302 231745 142203 95313 132999 112111 -63990 -264237 -289452 -149579 -53342
33679 -53342 -126051 -258023 -278047 -181960 -107804 -137137 -210534 -226583 -153702 -43616 17257
33668 17257 -18769 -93126 -81921 34899 99789 -23102 -221681 -260258 -119480 -27286 -107191
33657 -107191 -196205 -128082 -16545 -71850 -253221 -317455 -169297 32859 121583 102877 69624
$$ packed form
33735a27767q3165K2184R0511M7325J135M1643P0410j1780r8938n2530M4232K7102
33723b9638m7779R95J32376J16592o6552j58404l8961O9697k4280j59766r8051
33712c03771P6687J07642r078m6293N9166J29144P3710J7835L5014J4682r1971
33701F2767j28304M590J32090M9791j53464k25649j14704J3180O8368J23568J97391
33690B9624J75678K6443q9542m6890L7686k0888j76101k00247k5215J39873R6237
33679e3342p2709j31972k0024R6087P4156k9333p3397j6049P2881J10086O0873
33668A7257l6026p4357J1205J16820O4890j22891j98579l8577J40778R2194p9905
33657a07191q9014O8123J11537n5305j81371o4234J48158K02156Q8724j8706l3253
$$ plain form
33646 69624 71707 109139 148126 120157 -97 -110430 -83389 38195 70365 -58367 -203265
33635 -203265 -202994 -77919 29692 24114 -94162 -266331 -399654 -419367 -351689 -298028 -290604
33624 -290604 -255162 -166216 -135614 -246678 -377498 -325297 -86924 114492 106716 -37577 -138694
33613 -138694 -148769 -151828 -170884 -110942 66789 226139 210331 54085 -75582 -119622 -167511
33602 -167511 -252111 -268217 -162676 -55357 -61537 -119377 -123858 -116142 -178214 -236568 -167015 -36099
33590 -36099 -26553 -143057 -206221 -147381 -89841 -96989 -66417 36375 51607 -126989 -341637
33579 -341637 -366493 -200451 -18309 76280 103080 84055 21058 -39545 -45856 -26628 -41916
33568 -41916 -73585 -58502 -7972 459 -54824 -105473 -89381 -26442 11550 -18708 -78097 -71823
$$ packed form
33646F9624K083L7432L8987k7969j20254j10333K7041J21584L2170j28732j44898
33635b03265K71J25075J07611n578j18276j72169j33323j9713O7678N3661P424
33624b90604L5442Q8946L0602j11064j30820N2201K38373K01416p776j44293j01117
33613a38694j0075l059j9056N9942J77731J59350j5808j56246j29667m4040m7889
33602a67511q4600j6106J05541J07319o180n7840m481P716o2072n8354O9553J30916
33590c6099R546j16504o3164N8840N7540p148L0572J02792J5232j78596k14648
33579c41637k4856J66042J82142R4589K6800j9025o2997o0603o311J9228j5288
33568d1916l1669J5083N0530Q431n5283n0649J6092O2939L7992l0258n9389O274
$$ plain form
33556 -71823 36020 143181 113299 -37530 -151502 -147754 -116275 -142183 -161670 -91086 1987
33545 1987 -16704 -149610 -268858 -281897 -201158 -83633 9589 25980 -22898 -49817 -7410
33534 -7410 31651 -12129 -92408 -118973 -117015 -178942 -287684 -321890 -238390 -130557 -89856 -112367
33522 -112367 -158384 -202931 -202423 -112422 16935 49876 -69957 -223414 -248237 -132776 -19047
33511 -19047 -25917 -121651 -185022 -156061 -85668 -39699 -9322 42195 88104 69452 -129 -48780
33499 -48780 -63874 -97911 -149711 -155484 -122444 -136831 -191631 -161003 -30599 13255 -140051
33488 -140051 -314120 -292255 -149495 -120205 -223024 -265895 -187412 -132156 -164815 -159765 -50723
33477 -50723 26663 -46683 -179961 -214176 -129494 -11022 78513 101081 26978 -94811 -149295
$$ packed form
33556g1823J07843J07161k9882j50829j13972L748L1479k5908j9487P0584R3073
33545A987j8691j32906j19248j3039Q0739J17525R3222J6391m8878k6919M2407
33534g410L9061m3780q0279k6565J958o1927j08742l4206Q3500J07833M0701k2511
33522a12367m6017m4547N08R0001J29357L2941j19833j53457k4823J15461J13729
33511a9047o870r5734o3371K8961P0393M5969L0377N1517M5909j8652o9581m8651
33499d8780j5094l4037n1800n773L3040j4387n4800L0628J30404M3854j53306
33488a40051j74069K1865J42760K9290j02819m2871P8483N5256l2659N050J09042
33477e0723P7386p3346j33278l4215Q4682J18472Q9535K2568p4103j21789n4484
$$ plain form
33466 -149295 -117041 -117685 -215073 -300572 -269481 -191639 -180457 -198546 -139528 -20902 58722 92211
33454 92211 133433 140711 27863 -140039 -184086 -76749 -2550 -86030 -205203 -180486 -39406
33443 -39406 40445 -5397 -65543 -56062 -57867 -184730 -387638 -485761 -389108 -215622 -148635
33432 -148635 -218236 -279275 -202164 -33747 60969 -4966 -140685 -188235 -114631 -53221 -130328
33421 -130328 -289634 -357790 -275809 -166615 -135425 -112792 8091 164936 198430 92688
33411 92688 -6982 -16627 -6332 -42575 -80426 -68973 -40523 -28537 -8013 14718 -32597 -150908
33399 -150908 -210749 -131656 -20893 -21271 -109751 -167287 -166012 -153494 -123650 -52315 -7670 -68725
33387 -68725 -167537 -168190 -79483 -28497 -37643 -6783 70671 63983 -67163 -174648 -139827 -45997
$$ packed form
33466a49295L2254o44r7388q5499L1091P7842J1182j8089N9018J18626P9624L3489
33454I2211M1222P278j12848j67902m4047J07337P4199q3480j19173K4717J41080
33443c9406P9851m5842o0146R481j805j26863k02908r8123R6653J73486O6987
33432a48635o9601o1039P7111J68417R4716o5935j35719m7550P3604O1410p7107
33421a30328j59306o8156Q1981J09194L1190K2633J20883J56845L3494j05742
33411I2688r9670r645J0295l6243l7851J1453K8450J1986K0524K2731m7315j18311
33399a50908n9841P9093J10763l78q8480n7536J275J2518K9844P1335M4645o1055
33387f8725r8812o53Q8707N0986r146L0860P7454o688j31146j07485L4821R3830
$$ plain form
33375 -45997 -30431 -80764 -90303 -30049 40902 75285 60290 -4254 -76264 -80069 -16179 3514
33363 3514 -90283 -199544 -179856 -35551 100050 141754 116849 77164 37153 -3407 -40707
33352 -40707 -70582 -75978 -37024 17852 24878 -10597 5145 109122 198372 172663 76971 2348
33340 2348 -64525 -161336 -207416 -115207 13924 7762 -85531 -48337 142638 243158 116380
33329 116380 -46075 -22995 104227 105662 -44230 -172453 -185674 -140442 -76496 20999 92194
33318 92194 21131 -174209 -319876 -309602 -227927 -193986 -201432 -192012 -184845 -224584 -263862 -213769
33306 -213769 -94344 -33149 -98237 -210938 -260332 -246421 -252931 -305085 -324849 -246913 -126728
33295 -126728 -83498 -153131 -246140 -253191 -154623 -23187 45500 6967 -84533 -107848 -10408
$$ packed form
33375d5997J5566n0333r539O0254P0951L4383j4995o4544p2010l805O3890J9693
33363C514r3797j09261J9688J44305J35601M1704k4905l9685m0011m0560l7300
33352d0707k9875n396L8954N4876P026l5475J5742J03977Q9250k5709r5692p4623
33340B348o6873r6811m6080R2209J29131o162r3293L7194J90975J00520j26778
33329A16380j62455K3080J27222J435j49892j28223j3221M5232O3946R7495P1195
33318I2194p1063j95340j45667J0274Q1675L3941p446R420P167l9739l9278N0093
33306b13769J19425O1195o5088j12701m9394J3911o510n2154j9764P7936J20185
33295a26728M3230o9633r3009p051R8568J31436O8687l8533r1500k3315R7440
$$ plain form
33284 -10408 97030 65211 -69803 -105697 36693 175208 121627 -40887 -93723 -24500 -36237
33273 -36237 -214367 -378440 -338145 -149498 -9719 5622 -16735 174 24589 -6607 -86682
33262 -86682 -147160 -145252 -119142 -137589 -192446 -187291 -78829 16556 -51800 -251457 -383630
33251 -383630 -336823 -213262 -152586 -136188 -57117 87359 182066 151301 44682 -35265 -34297
33240 -34297 27242 89194 106127 80642 35794 -34538 -143955 -247016 -267910 -216396 -194055
33229 -194055 -245152 -287061 -247147 -176463 -140981 -89958 43235 174503 157431 20015 -41607
33218 -41607 70090 227330 261930 161205 20453 -97596 -178511 -209107 -198728 -197227 -219525
33207 -219525 -196352 -71516 90841 174848 163689 140962 152615 154280 111295 71257 91316
$$ packed form
33284a0408J07438l1819j35014l5894J42390J38515n3581j62514n2836O9223j1737
33273c6237j78130j64073M0295J88647J39779J5341k2357J6909K4415l1196q0075
33262h6682o0478J908K6110j8447n4857N155J08462R5385o8356j99657j32173
33251c83630M6807J23561O0676J6398P9071J44476R4707l0765j06619p9947R68
33240c4297O1539O1952J6933k5485m4848p0332j09417j03061k0894N1514K2341
33229a94055n1097m1909L9914P0684L5482N1023J33193J31268j7072j37416o1622
33218d1607J11697J57240L4600j00725j40752j18049q0915l0596J0379J501k2298
33207b19525K3173J24836J62357Q4007j1159k2727J1653J665m2985m0038K0059
$$ plain form
33196 91316 142751 142613 62854 -35747 -77197 -46469 12405 47180 31083 -33812 -116686 -161046
33184 -161046 -119367 -7571 90047 96832 20801 -64646 -106193 -104120 -69209 -520 74925 93538
33172 93538 31130 -46368 -59542 -21453 -11824 -58622 -108535 -115715 -91765 -52455 12020 77431
33160 77431 68380 -35674 -132410 -116289 -33034 -21919 -112842 -181319 -130296 -24714 12018
33149 12018 -31080 -62570 -39930 -31660 -114432 -257951 -346943 -310023 -203439 -150139 -201683
33138 -201683 -292275 -341580 -353763 -365620 -343306 -224214 -54259 23016 -48602 -148983 -130608
33127 -130608 6861 140986 167663 69519 -96819 -225543 -227313 -128042 -56529 -88009 -158534
33116 -158534 -179840 -158238 -132603 -84537 -7114 18443 -65421 -167991 -168525 -109101 -125609 -218608
$$ packed form
33196I1316N1435j38p9759r8601m1450L0728N8874L4775j6097o4895q2874m4360
33184a61046M1679J11796R7618O785p6031q5447m1547K073L4911O8689P5445J8613
33172I3538o2408p7498j3174L8089R629m6798m9913p180K3950L9310O4475O5411
33160G7431r051j04054r6736J6121Q3255J1115r0923o8477N1023J05582L6732
33149A2018m3098l1490K2640Q270q2772j43519q8992L6920J06584N3300n1544
33138b01683r0592m9305j2183j1857K2314J19092J69955P7275p1618j00381J8375
33127a30608J37469J34125K6677r8144j66338j28724j770R9271P1513l1480p0525
33116a58534k1306K1602K5635M8066P7423K5557q3864j02570n34N9424j6508r2999
$$ plain form
33104 -218608 -249891 -166180 -73481 -60971 -83725 -65706 -16307 657 -54521 -164583 -244868
$$ packed form
33104b18608l1283Q3711R2699J2510k2754J8019M9399J6964n5178j10062q0285
$$ [...]
##END NTUPLES=NMR SPECTRUM
##END=
