##TITLE=31Pdec_SR117_0
 D2O, 24 sc
 15.4.2022
##JCAMPDX= 6.0         $$ Bruker NMR JCAMP-DX V2.0
##DATA TYPE= NMR SPECTRUM
##DATA CLASS= NTUPLES
##ORIGIN= UXNMR, Bruker Analytische Messtechnik GmbH
##OWNER= root
$$ XWIN-NMR		Version 3.5
$$ Fri Apr 15 14:22:54 2022 Russian Standard Time (UT+4h)  she@DPX200
##.OBSERVE FREQUENCY= 81.013821
##.OBSERVE NUCLEUS= ^31P
##.ACQUISITION MODE= SIMULTANEOUS
##.ACQUISITION SCHEME= undefined
##.AVERAGES= 24
##.DIGITISER RES= 16
##SPECTROMETER/DATA SYSTEM= spect
##.PULSE SEQUENCE= zgpg30
##.SOLVENT NAME= D2O
##.SHIFT REFERENCE= (INTERNAL, D2O, 0, 248.564)
##AUDIT TRAIL= $$ (NUMBER, WHEN, WHO, WHERE, WHAT)
$$ ##TITLE= Audit trail, XWIN-NMR		Version 3.5
$$ ##JCAMPDX= 5.01
$$ ##ORIGIN= Bruker BioSpin GmbH
$$ ##OWNER= she
$$ F:/spectra/data/she/nmr/P31/1/pdata/1/auditp.txt
$$ ##AUDIT TRAIL=  $$ (NUMBER, WHEN, WHO, WHERE, WHAT)
(   1,<2022-04-15 14:21:51.68 +0400>,<she>,<DPX200>,
      <created by zg, POWCHK disabled, PULCHK disabled
       configuration hash MD5:
       00 E9 B6 7A A2 85 ED C7 34 08 36 98 17 FE 4E 26
       data hash MD5: 32K
       87 49 81 FA E3 C3 40 0D 20 CB EA 38 C7 F7 60 29>)
(   2,<2022-04-15 14:21:56.09 +0400>,<she>,<DPX200>,
      <Start of raw data processing
       efp BC_mod = 2 LB = 1 FT_mod = 6 PKNL = 1 PHC0 = -9469.633 PHC1 = -144.9246 SI = 64K 
       data hash MD5: 64K
       EE 9C E8 C8 F7 69 27 C1 5D 5C BF 94 C6 6B AE BE>)
(   3,<2022-04-15 14:22:13.26 +0400>,<she>,<DPX200>,
      <pk PHC0 = 2.729069 PHC1 = 0 
       data hash MD5: 64K
       D7 EC BC FD 64 B0 FC DA 30 82 99 5D 18 99 64 33>)
$$ ##END=
$$ 
$$ hash MD5
$$ 6E D4 05 D7 FA 78 2A 25 FD 56 24 F5 86 C7 79 91
##$RELAX= 
##$RELAX= 
##$RELAX= 
##$RELAX= 
##$RELAX= 
##$RELAX= 
##$RELAX= 
##$RELAX= 
$$ Bruker specific parameters
$$ --------------------------
##$DU= <F:/spectra>
##$EXPNO= 1
##$NAME= <P31>
##$PROCNO= 1
##$TYPE= <nmr>
##$USER= <she>
##$AMP= (0..31)
100 100 100 100 100 100 100 100 100 100 100 100 100 100 100 100 100 100 
100 100 100 100 100 100 100 100 100 100 100 100 100 100 
##$AQSEQ= 0
##$AQ_mod= 1
##$AUNM= <au_zg>
##$AUTOPOS= <>
##$BF1= 81.014009
##$BF2= 200.13
##$BF3= 200.13
##$BF4= 200.13
##$BF5= 200.13
##$BF6= 200.13
##$BF7= 200.13
##$BF8= 200.13
##$BYTORDA= 1
##$CFDGTYP= 0
##$CFRGTYP= 5
##$CHEMSTR= <none>
##$CNST= (0..31)
1 1 145 1 1 1 1 1 1 1 1 1 1 1 1 1 1 1 1 1 1 1 1 1 1 1 1 1 1 1 1 1 
##$CPDPRG= <waltz16>
##$CPDPRG1= <>
##$CPDPRG2= <waltz16>
##$CPDPRG3= <>
##$CPDPRG4= <mlev>
##$CPDPRG5= <mlev>
##$CPDPRG6= <mlev>
##$CPDPRG7= <mlev>
##$CPDPRG8= <mlev>
##$CPDPRGB= <>
##$CPDPRGT= <>
##$D= (0..31)
0 1 0 0 0 0 0 0 0 0 0 0.03 2e-05 3e-06 0 0 0 0 0 0 0 0 0 0 0 0 0 0 0 0 
0 0 
##$DATE= 1650018111
##$DBL= (0..7)
120 120 120 11 120 120 24 19 
##$DBP= (0..7)
150 150 150 150 150 150 150 150 
##$DBP07= 0
##$DBPNAM0= <>
##$DBPNAM1= <>
##$DBPNAM2= <>
##$DBPNAM3= <>
##$DBPNAM4= <>
##$DBPNAM5= <>
##$DBPNAM6= <>
##$DBPNAM7= <>
##$DBPOAL= (0..7)
0.5 0.5 0.5 0.5 0.5 0.5 0.5 0.5 
##$DBPOFFS= (0..7)
0 0 0 0 0 0 0 0 
##$DE= 6
$$ [...]
##$SUBNAM2= <"">
##$SUBNAM3= <"">
##$SUBNAM4= <"">
##$SUBNAM5= <"">
##$SUBNAM6= <"">
##$SUBNAM7= <"">
##$SUBNAM8= <"">
##$SUBNAM9= <"">
##$SW= 501.771253377433
##$SWIBOX= (0..15)
0 1 3 0 0 0 0 0 0 0 0 0 0 0 0 0 
##$SW_h= 40650.406504065
##$TD= 32768
##$TD0= 1
##$TE= 0
##$TE2= 300
##$TE3= 300
##$TEG= 300
##$TL= (0..7)
0 120 53 12 22 120 120 120 
##$TP= (0..7)
150 150 150 150 150 150 150 150 
##$TP07= 0
##$TPNAME0= <>
##$TPNAME1= <>
##$TPNAME2= <>
##$TPNAME3= <>
##$TPNAME4= <>
##$TPNAME5= <>
##$TPNAME6= <>
##$TPNAME7= <>
##$TPOAL= (0..7)
0.5 0.5 0.5 0.5 0.5 0.5 0.5 0.5 
##$TPOFFS= (0..7)
0 0 0 0 0 0 0 0 
##$TUNHIN= 0
##$TUNHOUT= 0
##$TUNXOUT= 0
##$USERA1= <user>
##$USERA2= <user>
##$USERA3= <user>
##$USERA4= <user>
##$USERA5= <user>
##$V9= 5
##$VALIST= <valist>
##$VCLIST= <CCCCCCCCCCCCCCC>
##$VD= 0
##$VDLIST= <DDDDDDDDDDDDDDD>
##$VPLIST= <PPPPPPPPPPPPPPP>
##$VTLIST= <TTTTTTTTTTTTTTT>
##$WBST= 1024
##$WBSW= 4
##$XGAIN= (0..3)
0 0 0 0 
##$XL= 0
##$YL= 0
##$YMAX_a= 961
##$YMIN_a= -1009
##$ZGOPTNS= <>
##$ZL1= 120
##$ZL2= 120
##$ZL3= 120
##$ZL4= 120
##$ABSF1= 0
##$ABSF2= 0
##$ABSG= 0
##$ABSL= 0
##$ALPHA= 0
##$AQORDER= 0
##$ASSFAC= 0
##$ASSFACI= 0
##$ASSFACX= 0
##$ASSWID= 0
##$AUNMP= <proc_1d>
##$AZFE= 0.1
##$AZFW= 0.5
##$BCFW= 0
##$BC_mod= 2
##$BYTORDP= 0
##$COROFFS= 0
##$CY= -3
##$DATMOD= 1
##$DC= 0
##$DFILT= <>
##$DTYPP= 0
##$F1P= 0
##$F2P= 0
##$FCOR= 1
##$FTSIZE= 65536
##$FT_mod= 6
##$GAMMA= 0
##$GB= 0
##$INTBC= 1
##$INTSCL= 5.30512e-09
##$ISEN= 30
##$LB= 1
##$LEV0= 0
##$LPBIN= 0
##$MAXI= 10000
##$MC2= 0
##$MEAN= 0
##$ME_mod= 0
##$MI= 50
##$NCOEF= 0
##$NC_proc= -9
##$NLEV= 6
##$NOISF1= 182.463
##$NOISF2= 159.3651
##$NSP= 0
##$NTH_PI= 0
##$NZP= 0
##$OFFSET= 248.5645
##$PC= 4
##$PHC0= -9466.903
##$PHC1= -144.9246
##$PH_mod= 1
##$PKNL= yes
##$PPARMOD= 0
##$PSCAL= 0
##$PSIGN= 0
##$REVERSE= no
##$SF= 81.014009
##$SI= 65536
##$SIGF1= 159.3651
##$SIGF2= -187.1042
##$SINO= 113.3802
##$SIOLD= 16384
##$SREGLST= <1H.CDCl3>
##$SSB= 0
##$STSI= 65536
##$STSR= 0
##$SW_p= 40650.406504065
##$SYMM= 0
##$S_DEV= 0
##$TDeff= 32768
##$TDoff= 0
##$TI= <>
##$TILT= no
##$TM1= 0
##$TM2= 0
##$TOPLEV= 0
##$USERP1= <user>
##$USERP2= <user>
##$USERP3= <user>
##$USERP4= <user>
##$USERP5= <user>
##$WDW= 1
##$XDIM= 65536
##$YMAX_p= 201056212
##$YMIN_p= -299817340
$$ End of Bruker specific parameters
$$ ---------------------------------
##NTUPLES= NMR SPECTRUM
##VAR_NAME=  FREQUENCY,     SPECTRUM/REAL,   SPECTRUM/IMAG
##SYMBOL=    X,             R,               I
##VAR_TYPE=  INDEPENDENT,   DEPENDENT,       DEPENDENT
##VAR_FORM=  AFFN,          ASDF,            ASDF
##VAR_DIM=   65536,         65536,           65536
##UNITS=     HZ,            ARBITRARY UNITS, ARBITRARY UNITS
##FACTOR=    0.620285442955139, 1,           1
##FIRST=     20137.2065510759, 0,            0
##LAST=      -20513.1999529892, 0,           0
##MIN=       -20513.1999529892, -299817340,  0
##MAX=       20137.2065510759, 201056212,    0
$$ Real data points
##PAGE= N=1
##DATA TABLE= (X++(R..R)), XYDATA
$$ [...]
12948a6260757M159811R240610K331802p082086m147330O946618Q444966k127523
$$ -16260757 -12100946 -2860336 -528534 -7610620 -11757950 -4811332 3633634 1506111
12940A506111p545624P10414Q342260J921926r198055q124522L729670J1083180
$$ 1506111 -6039513 -5329099 3013161 4935087 -4262968 -12387490 -8657820 2425360
12932B425360Q197395K865337K12997l087783p787273p526953Q05745J0357422
$$ 2425360 10622755 13488092 13701089 10613306 2826033 -4700920 -3895175 6462247
12924F462247J2149560M960209n061105j0922140r419415k750910K778076K049026
$$ 6462247 18611807 23572016 18510911 7588771 -1830644 -4581554 -1803478 245548
12916B45548l476117o990210l669953L941912Q181802M129147m364836p879835
$$ 245548 -3230569 -10220779 -13890732 -9948820 -1767018 2362129 -2002707 -9882542
12908i882542k448313M870732N318198Q57106N12335N329830O300924m03810n929350
$$ -9882542 -12330855 -7460123 -2141925 -1284819 -772484 4557346 10858270 10454460 4525110
12899D525110k253457N024820N429129p36295m382191j813681J824736J905506
$$ 4525110 2271653 7296473 12725602 11989307 7607116 5793435 7618171 9523677
12891I523677m86141k539313k759776p4332M777309P049571K302256o592361j1136566
$$ 9523677 9037536 6498223 3738447 3664115 8441424 15490995 17793251 11200890 64324
12882F4324o902092J635002O721879N325499P30570k203174k258389k038478l126856
$$ 64324 -6837768 -5202766 1519113 6844612 7575182 5372008 3113619 1075141 -2051715
12873b051715l229469k68921L182936L677946K858664M067376N139454K017711
$$ -2051715 -5281184 -5550105 -2367169 1310777 4169441 8236817 13376271 15393982
12865A5393982k019958j40771N358459N061355j720369n296829k516925j783367
$$ 15393982 13374024 13233253 18591712 23653067 21932698 16635869 14118944 12335577
12857A2335577o324333p141351k60912M072428j29112k163295N541907R917774
$$ 12335577 6011244 -1130107 -1391019 2681409 2552297 389002 5930909 15848683
12849A5848683k318180j8728550j7141674P3479J0303373N429990n91292J344912
$$ 15848683 13530503 -5198047 -22339721 -22266242 -11962869 -6532879 -7124171 -5779259
12841e779259L664331J096416Q11418O468122R371546L707071l579760n577447
$$ -5779259 -2114928 -1018512 -207094 6261028 15632574 19339645 15759885 10182438
12833A0182438n216567n440684k375234M046298M806528l896066j1413771p170577
$$ 10182438 4965871 -474813 -2850047 1196251 6002779 2106713 -9307058 -16477635
12825a6477635L687921Q087648K356032n759955p648643r86354R110874J2793175
$$ -16477635 -12789714 -4702066 -2346034 -8105989 -15754632 -16740986 -7630112 5163063
12817E163063M849293o850016r488557k823094J178553k221569l979618J291343
$$ 5163063 10012356 3162340 -6326217 -9149311 -7970758 -10192327 -14171945 -12880602
12809a2880602M703224j584040r668703p373024L279405R699065O117066j562251
$$ -12880602 -8177378 -9761418 -19430121 -26803145 -23523740 -13824675 -7707609 -9269860
12801i269860n217779k175966M088912O781424K384922l841885m008927N24577
$$ -9269860 -14487639 -16663605 -12574693 -5793269 -3408347 -7250232 -11259159 -10734582
12793a0734582J394913k245059k273640L223215N737709J447740k319947j184289
$$ -10734582 -9339669 -11584728 -13858368 -10635153 -4897444 -3449704 -5769651 -6953940
12785f953940q20834l362609j291214O348037P013532m285391j1937916k596376
$$ -6953940 -7774774 -11137383 -12428597 -6080560 932972 -3352419 -15290335 -17886711
12777a7886711J2057554J2606765J289198m495402j43322L779805K035687p89539
$$ -17886711 -5829157 6777608 8066806 3571404 3428082 7207887 9243574 8454035
12769H454035l262511p596133r325364k381399P395096Q850441L265957N41734
$$ 8454035 5191524 -2404609 -11729973 -14111372 -6716276 2134165 5400122 5941856
12761E941856R97216k326472o174578q54998R176952Q402441l999542j0964081
$$ 5941856 6939072 4612600 -1561978 -2416976 6759976 15162417 11162875 198794
12753A98794m363385L772317L027928l65096J336912L386116j74933m516076l498450
$$ 198794 -4164591 -392274 2635654 2270558 3607470 6993586 6818653 2302577 -1195873
12744a195873l05406K86701K96957J501297K25254l481562k303239M851629P175502
$$ -1195873 -1501279 -1214578 -917621 583676 808930 -2672632 -4975871 -124242 7051260
12735G051260r97349q687556m853617L644137L537038l339010m190910L681648
$$ 7051260 6053911 -2633645 -7487262 -3843125 -306087 -3645097 -7836007 -4154359
12727d154359R839777P503569J527253j607282k650183n649061j0473405j1988312
$$ -4154359 5685418 13188987 14716240 13108958 10458775 4809714 -5663691 -17652003
12719a7652003n729519N299179J0738651M152812o562083p377880K517238R002255
$$ -17652003 -23381522 -18082343 -7343692 -3190880 -9752963 -17130843 -14613605 -5611350
12711e611350L573037n048573n578210k0861L334479L715321M884441N458958
$$ -5611350 -2038313 -7086886 -12665096 -12685957 -9351478 -5636157 -751716 4707242
12703D707242K363824j343827j462772o60800k718047l912425M82343N907055
$$ 4707242 7071066 5727239 4264467 3603667 885620 -3026805 -2544462 3362593
12695C362593M696006j361145m510232l613046l318014l814934j698401J367160
$$ 3362593 8058599 6697454 2187222 -1425824 -4743838 -8558772 -10257173 -8890013
12687h890013J149267J65183M161104J0460698J0173909J895085o279467q415225
$$ -8890013 -7740746 -7575563 -3414459 7046239 17220148 19115233 12835766 4420541
12679D420541n702015n56706M893356N239598k950595j2036397j0016835K265615
$$ 4420541 -1281474 -1838180 3055176 8294774 5344179 -6692218 -16709053 -14443438
12671a4443438J0868353P798598J85070k663737j363381q21524j064134K91467
$$ -14443438 -3575085 4223513 4408583 1744846 381465 -440059 -1504193 -1212726
12663a212726K234408K178726l18657m509764q945810r571743k850215P329981
$$ -1212726 1021682 3200408 2881751 -1628013 -10573823 -20145566 -22995781 -15665800
12655a5665800J1598155O395154j652615m610588j681161K763112M767957L007480
$$ -15665800 -4067645 2327509 674894 -3935694 -5616855 -2853743 1914214 4921694
12647D921694l90352q93499K500467L953109j058036p002123n643436M02508J627314
$$ 4921694 4531342 3637843 6138310 10091419 9033383 2031260 -3612176 -3209668 -1582354
12638a582354k324695k693168J905520K536757l436286o492581j363530L573965
$$ -1582354 -3907049 -6600217 -4694697 -2157940 -5594226 -12086807 -13450337 -9876372
12630i876372R58861l167246q76467L849089L296302j13534Q43719M846496M687622
$$ -9876372 -8917511 -12084757 -12961224 -9112135 -5815833 -5929367 -5085648 -239152 4448470
12621D448470l60048m016061k565508J904817N425627M467351j855964q094124
$$ 4448470 4088422 72361 -2493147 -588330 4837297 9304648 7448684 -645440
12613f45440o555870J269068M914234Q25614j625769L623881P969687K537348
$$ -645440 -7201310 -5932242 -1018008 -192394 -1818163 1805718 9775405 12312753
12605A2312753o060971o282962p0512J998340j941475m892065l628689m14953
$$ 12312753 6251782 -31180 -101692 1896648 -44827 -4936892 -8565581 -8980534
12597h980534L261551M841224q90581j1220815j2089219J937036J4075867Q013878
$$ -8980534 -5718983 -877759 -1768340 -12989155 -25078374 -23141338 -9065471 -1051593
12589a051593n307191l921416R476324J2271411m42647q879195j811509P931090
$$ -1051593 -6358784 -10280200 -803876 11467535 11024888 2145693 334184 8265274
12581H265274P795999K992540R14594j769806o510181n624544J913746M364495
$$ 8265274 16061273 19053813 19968407 18198601 11688420 6063876 7977622 12342117
12573A2342117k747932p163700j160211M788426J682896j962783K066248M633258
$$ 12342117 9594185 2430485 1270274 6058700 7741596 5778813 7845061 12478319
12565A2478319l241874j0886969m768587P628712J0060360L295772p55657j396483
$$ 12478319 9236445 -1650524 -6419111 1209601 11269961 14565733 13810076 12413593
12557A2413593n322180q145092j058750R142472P816792k744746o541738n8117
$$ 12413593 7091413 -1053679 -2112429 7030043 14846835 12102089 5560351 5502234
12549E502234M574932J899259q61366n64542k085883m391888j038556M240858
$$ 5502234 10077166 11976425 11115059 10550517 8464634 4072746 3034190 7275048
12541G275048J217695o212458l324016Q747149J1333926j135014j0843768n554326
$$ 7275048 8492743 2280285 -1043731 7703418 19037344 17902330 7058562 1504236
12533A504236L439971L561638P19046K752082K049831q113656j5881993q562913
$$ 1504236 4944207 8505845 9224891 11976973 14026804 5913148 -9968845 -18531758
12525a8531758M599669P062700J990035L800801J0483132O958204o821152j3314146
$$ -18531758 -13932089 -6869389 -4879354 -1078553 9404579 16362783 9541631 -3772515
12517c772515n025008M574088L046259l895777m575281J316138N652639M354800
$$ -3772515 -8797523 -4223435 -1177176 -5072953 -9648234 -8332096 -2679457 1675343
12509A675343K1010l260564l116702k1692K504805J560846j025786j493274K5989
$$ 1675343 1696353 -1564211 -4680913 -4702605 -2197800 -636954 -1662740 -3156014 -3130025
12500c130025P09159N39306J506310K692768J584236q24094j405954l3726J448924
$$ -3130025 -2420866 -1881560 -375250 2317518 3901754 3077660 1671706 1637980 3086904
12491C086904K919358L454653r85362j0360794j5316040q355479L187985O196157
$$ 3086904 6006262 9460915 8475553 -1885241 -17201281 -25556760 -22368775 -16172618
12483a6172618J295281O44788O987992R642741M013580j48703L553315O305658
$$ -16172618 -14877337 -14232549 -7244557 2398184 6411764 6263061 9816376 16122034
12475A6122034j80680p735984m164670O229986Q112944k625329j4395201j6555920
$$ 16122034 15941354 8205370 4040700 10270686 18383630 15758301 1363100 -15192820
12467a5192820r981329q66726O519685R256252N808898n72622l754360j835357
$$ -15192820 -25174149 -26040875 -19521190 -10264938 -4456040 -5028662 -8783022 -10618379
12459a0618379J682198M104235O046952P228772N077378p24169o403231q417548
$$ -10618379 -8936181 -4831946 1215006 8443778 13521156 12796987 6393756 -2023792
12451b023792o448762j607636M491190Q327473O578500R42208l124379l589034
$$ -2023792 -8472554 -10080190 -5589000 2738473 9316973 10259181 7134802 3545768
12443C545768l374093l569810q76152N083335P581840J401046q039373j0409933
$$ 3545768 171675 -3398135 -4274287 809048 8390888 9791934 1752561 -8657372
12435h657372l718414M095716O426671M956423M065259L648099R44985l417117
$$ -8657372 -12375786 -8280070 -1853399 3103024 7168283 10816382 11761367 8344250
12427H344250n137970j841934L243624M197055r87553p154453o955210q1249M782983
$$ 8344250 3206280 1364346 4607970 8805025 7817472 663019 -6292191 -6373440 -1590457
12418a590457L75161q441594r601813o7480Q888659O358389l167560n980624J634283
$$ -1590457 -1215296 -9656890 -19258703 -19326183 -10437524 -4079135 -7246695 -13227319 -11593036
12409a1593036Q361021M275699m641610m789317N350971J2035317M870591q305228
$$ -11593036 -3232015 1043684 -3597926 -8387243 -3036272 8999045 13869636 5564408
12401E564408j1398236j396485Q681031Q516515K844187L38299r92819p417648
$$ 5564408 -5833828 -7230313 1450718 9967233 12811420 13149719 12156900 4739252
12393D739252j3938804q780610O269171J3945637N366823o324214n158143M750631
$$ 4739252 -9199552 -17980162 -11710991 2234646 7601469 1277255 -3880888 869743
12385H69743P597919M57763m942287k646372Q4448k280079m362806q42590L920611
$$ 869743 8467662 8925425 3983138 1336766 1421214 -858865 -5221671 -6064261 -2143650
12376b143650L903562J136178M96865J003508o45469k478960k85614M471078N796162
$$ -2143650 1759912 2896090 3392955 4396463 3750994 1272034 986420 5457498 11253660
12367A1253660R25626o904954j1705136q535829K233755J1986529J0383648j315334
$$ 11253660 12179286 5274332 -6430804 -14966633 -12732878 -746349 9637299 8321965
12359H321965r132865l713924P146307J0092520M513148J25508M81960k3287l688300
$$ 8321965 -810900 -4524824 2621483 12714003 17227151 17352659 17834619 17811332 14123032
12350A4123032n061359j034226L487278L170709j059070n276493o693427l309697
$$ 14123032 9061673 8027447 11514725 14685434 13626364 8349871 1656444 -1653253
12342a653253M079499Q585543L711192n286613n799106L020236O216822m965519
$$ -1653253 2426246 11011789 14722981 9436368 3637262 6657498 12874320 7908801
12334G908801j7303733j3051678L870425J3109837O752164j864908m90274M929028
$$ 7908801 -9394932 -22446610 -18576185 -5466348 1285816 -579092 -1069366 3859662
12326C859662K860130m734275o772308r53131L995448K615599q09343j385904
$$ 3859662 6719792 1985517 -4786791 -5739922 -1744474 871125 61782 -1324122
12318a324122n11208n77988k71866N66719j799294p176558p189643L225313J4843230
$$ -1324122 -1835330 -2413318 -2685184 -2118465 -3917759 -11094317 -18283960 -15058647 -215417
12309b15417J4464390L675047l589609j695517Q18501j577705j825304N096596
$$ -215417 14248973 17924020 14334411 12638894 13457395 11879690 10054386 15150982
12301A5150982J0054266L346195q233545j0784723m348297j010643m607776o391202
$$ 15150982 25205248 28551443 20317898 9533175 5184878 4174235 -433541 -6824743
12293f824743j699843K281446o77876n966458o274593j764581K643298M013065
$$ -6824743 -8524586 -6243140 -6921016 -12887474 -19162067 -20926648 -18283350 -14270285
12285a4270285J886260k354540m219548q0623O084252O646222J970152j45375
$$ -14270285 -12384025 -14738565 -18958113 -19038736 -12954484 -6308262 -4338110 -4483485
12277d483485K255469K840870K35991J619538Q004282Q583584k075842j2851481
$$ -4483485 -2228016 612854 848845 2468383 10472665 19056249 16980407 4128926
12269D128926j2212183n041329j849536j167610L705690R019345P065068J661680
$$ 4128926 -8083257 -13124586 -14974122 -16141732 -12436042 -3416697 3648371 5310051
12261E310051R56918O76472p338871j4738836o371315J0876011J2946160l725587
$$ 5310051 6266969 6943441 -395430 -15134266 -21505581 -10629570 2316590 -1408997
12253a408997j4018368l141811R976681M236001r199257n935714J1908491J9689361
$$ -1408997 -15427365 -18569176 -8592495 -4356494 -13555751 -19491465 -7582974 12106387
12245A2106387Q119990o292485q977187n061690m685382o759559m952599P31872
$$ 12106387 20226377 13933892 4956705 -104985 -4790367 -11549926 -16502525 -15770653
12237a5770653N405065O203326L814267J542141L403129Q102054P145116l335049
$$ -15770653 -10365588 -4162262 -347995 1194146 4597275 12699329 19844445 16509396
12229A6509396j2244456o672337O466942P147969p340096j5775713m356433J1619106
$$ 16509396 4264940 -2407397 4059545 11207514 3867418 -11908295 -16264728 -4645622
12221d645622J0465419m202263j1324609m220096M016250M519049L453408N911939
$$ -4645622 5819797 1617534 -9707075 -13927171 -9910921 -5391872 -1938464 3973475
12213C973475N764631j023738o284343k870165J982076j746348q720027n246791
$$ 3973475 9738106 8714368 2430025 -440140 1541936 -204412 -8924439 -14171230
12205a4171230Q070714J4622722N199529q837971j1698519l288150M709384O204694
$$ -14171230 -6100516 8522206 13721735 4883764 -6814755 -10102905 -5393521 811173
12197H11173M592797K943610N32483j403785P7411K447121l29427o523522o618505
$$ 811173 5403970 8347580 8880063 7476278 7553689 10000810 9671383 3147861 -3470644
12188c470644J682288Q050079N054987n32650l87553Q21110m592249j0524371
$$ -3470644 -1788356 6261723 11316710 10784060 10396507 11217617 6625368 -3899003
12180c899003n665073N300842O565014k849722o462003K184186Q094127J35857
$$ -3899003 -9564076 -4263234 2301780 -547942 -7009945 -4825759 3268368 3404225
12172C404225r294722m246754Q208488Q996750l149032j1334603p025125O55141
$$ 3404225 -5890497 -10137251 -1928763 7067987 3918955 -7415648 -14440773 -13785632
12164a3785632L017716L150343N011574M856012J87154l096464O9326M927326
$$ -13785632 -10767916 -7617573 -2605999 2250013 2437167 -659297 -589971 4337355
12156D337355M141202j302422m691607l221045L63952K913543L218676J408590
$$ 4337355 8478557 7176135 2484528 -736517 -372565 2540978 5759654 7168244
12148G168244n67916Q2195K954978L810355L56882m013394m911193k886521j760526
$$ 7168244 6600328 6682523 9637501 13447856 13804738 9791344 4880151 1993630 233104
12139B33104k820300l563813j559208K368121M837864L575981P32452J219566
$$ 233104 -2587196 -6151009 -7710217 -5342096 -504232 3071749 3804201 5023767
12131E023767O028932R282714N368902k884653p934065p914305p094219o548709
$$ 5023767 11052699 20335413 25704315 22819662 14885597 6971292 -122927 -6671636
12123f671636k367947M836275O818072q49345j0150998r676238R95410J1389991
$$ -6671636 -9039583 -4203308 2614764 1765419 -8385579 -18061817 -17066407 -5676416
12115e676416J2770634O301346m01473j682752R04372Q51084m554761q905537
$$ -5676416 7094218 13395564 12994091 11311339 12215711 13066795 8512034 -393503
12107c93503m478124N358828Q644396J257786p319245q357495n179026l797764
$$ -393503 -4871627 487201 9131597 10389383 3070138 -5287357 -10466383 -14264147
12099a4264147j190829P024982J3906279R084289l350612q170037q87121O390758
$$ -14264147 -15454976 -8429994 5476285 14560574 11209962 3039925 2152804 8543562
12091H543562M292281r03302l99046J661513l665841j2926310j3348878j942841
$$ 8543562 12835843 11932541 11533495 13195008 9529167 -3397143 -16746021 -18688862
12083a8688862R247261R312821J507889l984234l601322r15573J609968M015985
$$ -18688862 -9441601 -128780 1379109 -2605125 -6206447 -7122020 -5512052 -1496067
12075a496067M221978k8739m514433k049798N192848N642271m393285j2155691
$$ -1496067 2725911 2697172 -1817261 -3867059 1325789 6968060 2574775 -9580916
12067i580916n799826O871352R070127M7975n215744p33866K571730k036854m751153
$$ -9580916 -15380742 -8509390 560737 608712 -4607032 -5340898 -2769168 -4806022 -9557175
12058i557175K292212Q597874J765096j0020596r119083L564799R916668K987878
$$ -9557175 -7264963 1332911 3098007 -6922589 -16041672 -12476873 -2560205 427673
12050D27673l936351k48536O347744M831406j614159l336725k12982J147289J94619
$$ 427673 -3508678 -3757214 2590530 7421936 5807777 2471052 2258070 3405359 3599978
12041C599978J340882L272871K15951o416907p435397O32700R020772P734214
$$ 3599978 4940860 8213731 8429682 2012775 -5422622 -4789922 4230850 11965064
12033A1965064j800864r270117p788929m6798O228236N852858l2664n434345n072448
$$ 11965064 10164200 894083 -6894846 -6941644 -713408 5139450 5106786 -327559 -5400007
12024e400007J42684M120691L150089J72436p69343j054064l427311m116686K602244
$$ -5400007 -5257323 -1136632 2013457 2185893 1416550 362486 -3064825 -7181511 -4579267
12015d579267J1637424R500700n455761j5756805p650891P268095P534817n870270
$$ -4579267 7058157 16558857 11103096 -4653709 -12304600 -5036505 2498312 -3371958
12007c371958j0551763K674073J5103250Q609158p166679j0040619K647666J3189128
$$ -3371958 -13923721 -11249648 3853602 12462760 5296081 -4744538 -2096872 11092256
11999A1092256J0053363j03192o833617q908766r452067p993097k891815L521357
$$ 11092256 21145619 21042427 14208810 5300044 -4152023 -12145120 -15036935 -11515578
11991a1515578O676335M757223L06407k187033o57725J985644J807344N16103
$$ -11515578 -4839243 -82020 224387 -1962646 -2620371 -634727 1172617 1688720
11983A688720L357213R072405R177378J018240o510236o268316l418235m486000
$$ 1688720 5045933 14118338 23295716 24313956 17803720 11535404 8117169 3631169
11975C631169m803676J557486P078329R34492j0810821j1639357R5265Q873733
$$ 3631169 -1172507 384979 7463308 8397800 -2413021 -14052378 -13957113 -5083380
11967e083380O403569J832238L450782N862334K433220k816058m160430m009791
$$ -5083380 1320189 3152427 6603209 12465543 14898763 12082705 7922275 3912484
11959C912484n318287l804052L395319R403024O803165j208104o560893p212634
$$ 3912484 -1405803 -5209855 -1814536 7588488 14391653 13183549 6622656 -589978
11951e89978n425530j566824L110904L631890j220429m171541L28637O491339
$$ -589978 -6015508 -7582332 -4471428 -839538 -2059967 -6231508 -5902871 588468
11943E88468N391217k081911p912250p966925l257445M557018J1263818R348345
$$ 588468 5979685 3897774 -4014476 -11981401 -15238846 -10681828 581990 9930335
11935I930335j707639r316624k361483J1649463J5120251M240490p153667p924969
$$ 9930335 8222696 -1093928 -3455411 8194052 23314303 27554793 20401126 12476157
11927A2476157k614786r27228l526949l898353P60292N619077M018946m506026
$$ 12476157 9861371 8934143 5407194 1508841 2269133 7888210 11907156 7401130
11919G401130j1950995r500373J154297Q135774M331344l002576l161988K601753
$$ 7401130 -4549865 -14050238 -12895941 -4760167 -428823 -3431399 -6593387 -3991634
11911c991634M735085P86767k574827j593401K96278N84473R75962J379682p24818
$$ -3991634 743451 1530218 -1044609 -2638010 -2341732 -1757259 -781297 598385 -126433
11902a26433l272865o67763N810628P519269J834123k781186L4961M568679K677039
$$ -126433 -3399298 -4067061 1743567 9262836 11096959 8315773 8350734 12919413 15596452
11893A5596452l638005o815070n357942k814521N82503O377454J0377957N917048
$$ 15596452 11958447 5143377 -214565 -3029086 -2446583 3930871 14308828 20225876
11885B0225876n123091j2391502r710415j435887N081769P139903M997347p22069
$$ 20225876 15102785 2711283 -6999132 -8435019 -3353250 3786653 8784000 8061931
11877H061931o328931n687306J490837O639574L243348l281734l375537K176263
$$ 8061931 1733000 -3954306 -2463469 4176105 7419453 4137719 762182 2938445
11869B938445M012911p62925m960542m050636k532898l584518k188008M557088
$$ 2938445 6951356 6188431 1227889 -2822747 -5355645 -8940163 -11128171 -6571083
11861f571083R037061M427727k650697k058062K685322N23989o924730o780359
$$ -6571083 2465978 6893705 4243008 2184946 4870268 5394257 -1530473 -8310832
11853h310832K928756Q762970M040286k93142M709988R744806K605844j1123798
$$ -8310832 -5382076 3380894 7421180 7128038 11838026 21582832 24188676 13064878
11845A3064878j6445572j0512179k214336L929151R074129R308459n14712j2622722
$$ 13064878 -3380694 -13892873 -16107209 -12178058 -3103929 6204530 5689818 -6932904
11837f932904j1454856M008941J6334211J2735038N74127n991981m522867j903320
$$ -6932904 -18387760 -14378819 1955392 14690430 15264557 9272576 4749709 2846389
11829B846389j417533q88790O23319J532166J027558q52007l994634o020484l136817
$$ 2846389 1428856 540066 1163385 2695551 3723109 2871102 -1123532 -7144016 -10280833
11820a0280833L399536O061281O86894o637171p369409j848579K734207L127514
$$ -10280833 -6881297 -820016 -133122 -6770293 -14139702 -15988281 -13254074 -10126560
11812a0126560K470456K937253K378898n07861k816727j752596J012188K076872
$$ -10126560 -7656104 -4718851 -2339953 -2847814 -5664541 -7417137 -6404949 -4328077
11804d328077J427391J830552L609594L009541k625483r606424j0611797l227262
$$ -4328077 -2900686 -1070134 2539460 5549001 2923518 -6682906 -17294703 -20521965
11796b0521965O471455J0416874O945670Q68695l011852l579169j793014R69239
$$ -20521965 -14050510 -3633636 3312034 4180729 1168877 -2410292 -4203306 -3234067
11788c234067K808432K577990J786671K773891M806908M631985J118409l441772
$$ -3234067 -425635 2152355 3939026 6712917 11519825 16151810 17270219 13828447
11780A3828447o893532q917124q657559m336484L083408Q808002Q932405M452051
$$ 13828447 6934915 -1982209 -10639768 -14976252 -11892844 -3084842 5847563 10299614
11772A0299614p05403l638702l455122q17637J881389K031649J62436o7946L155891
$$ 10299614 9594211 5955509 2500387 1682750 3564139 5595788 5758224 5690278 8846169
11763H846169O600647N590586k29194o111226o692638j110009N354753N479006
$$ 8846169 15446816 21037402 20808208 14696982 8004344 6894335 12249088 17728094
11755A7728094j837862q614714o456606K189435O289064O77101p275291q190063
$$ 17728094 15890232 7275518 818912 3008347 9297411 9974512 2699221 -5490842
11747e490842k536843K521680L765694L528896L320259K139938L48878l93103
$$ -5490842 -8027685 -5506005 -1740311 1788585 5108844 7248782 7597660 7204557
11739G204557j021885l792882o833962n214813J353167O804618O666169L343051
$$ 7204557 6182672 2389790 -4444172 -9658985 -8305818 -1501200 5164969 8508020
11731H508020J106555M4247j681520l115431k244338k09625L53197k21323K03793
$$ 8508020 9614575 9658822 7977302 4861871 2617533 2407908 2761105 2539782 2743575
11722B743575R38706o85966l943548m609127j379058J523883L78056k375286j506596
$$ 2743575 3682281 2996315 -947233 -5556360 -6935418 -5411535 -5033479 -7408765 -8915361
11713h915361L453422P086941M698714j825948n746716k820527L600937N723628
$$ -8915361 -5461939 1625002 6323716 4497768 -1248948 -4069475 -468538 5255090
11705E255090J03709p939023j0257827n105976J964638N501762M996080K444117
$$ 5255090 5358799 -2580224 -12838051 -17944027 -15979389 -10477627 -5481547 -3037430
11697c037430o91447k754274k003241N30701J652170J232823K775978O444701
$$ -3037430 -3728877 -6483151 -8486392 -7955691 -6303521 -5070698 -2294720 4149981
11689D149981O562415J91468o549081o379804j188815K085021K533567M237482
$$ 4149981 10712396 10903864 4354783 -2025021 -3213836 -1128815 1404752 5642234
11681E642234O260489L201478l813013o273452j339903K770584q99633p414573
$$ 5642234 11902723 15104201 11291188 5017736 3677833 6448417 5548784 -1865789
11673a865789p534257q05011N248147N859264L094136P53257O6222J54976k76951
$$ -1865789 -9400046 -10205057 -4956910 902354 3996490 4749747 4815969 4970945 4693994
11664D693994j478693j622863J175922N033217N404247J346433k736982l327363
$$ 4693994 3215301 1592438 2768360 7801577 13205824 14552257 11815275 8487912
11656H487912j986395j284355q92471n83211k446828o078918o011988O75609P579606
$$ 8487912 6501517 5217162 4324691 3741480 1294652 -4784266 -10796254 -10120645 -2541039
11647b541039O038688k753432q834841o318951M22908M139080L303738J260422
$$ -2541039 3497649 744217 -8090624 -14409575 -13986667 -9847587 -6543849 -5283427
11639e283427J87737j034322l682656o014126m491126J572377P842571R235276
$$ -5283427 -5095690 -6130012 -9812668 -15826794 -20317920 -18745543 -10902972 -1667696
11631a667696N823218K207295J321146J735046J205823k93269j648415j866090
$$ -1667696 4155522 6362817 7683963 9419009 10624832 10331563 8683148 6817058
11623F817058j47071K435047K308091j534408l560050J142676P138563M484768
$$ 6817058 6669987 9105034 11413125 9878717 6318667 7461343 14599906 19084674
11615A9084674n416122r821265l346410L801748J849481m051621l371521L564488
$$ 19084674 13668552 3847287 500877 4302625 6152106 2100485 -1271036 2293452
11607B293452Q117084O629600K284340k195414n429413m506724R24477M784562
$$ 2293452 10410536 17040136 19324476 17129062 11699649 7192925 8117402 12901964
11599A2901964J980537l608113n426411m333222m601337m228727J336284Q775457
$$ 12901964 14882501 11274388 5847977 1514755 -3086582 -7315309 -5979025 2796432
11591B796432J0061681M650950n28322k262693l442174m871383l470484Q75229
$$ 2796432 12858113 17509063 16980741 14718048 11275874 6404491 2934007 3809236
11583C809236M263528M995939M277132J356080m904336j0215046q189023J77567
$$ 3809236 8072764 13068703 17345835 18701915 13797579 3582533 -4606490 -4428923
11575d428923O898277O962475K222394l570261p452293o430654m61842N131065
$$ -4428923 2469354 9431829 11654223 8083962 631669 -5798985 -6260827 -1129762
11567a129762O036979N027361N588199M287859k058965o896692k842947M042072
$$ -1129762 4907217 9934578 15522777 19810636 17751671 10854979 8012032 12054104
11559A2054104K132228o092674p115007R44147M570760k904048j0370856o659425
$$ 12054104 14186332 8093658 978651 1922798 6493558 3589510 -6781346 -13440771
11551a3440771L283377P749661M358998o88604k407018m8197M055927M862669
$$ -13440771 -10157394 -2407733 1951265 1262661 -1144357 -1192554 2863373 7726042
11543G726042m66151o236536m080016L864705O907912K391165q48611J381188
$$ 7726042 7259891 1023355 -3056661 808044 7715956 10107121 9258510 10639698
11535A0639698J550520m635800q372460j823679P542519P062989k924129j0636103
$$ 10639698 12190218 7554418 -818042 -2641721 4900798 11963787 9039658 -1596445
11527a596445q844281j408618L890501L191309j290898l625340m67806M320992
$$ -1596445 -10440726 -11849344 -7958843 -4767534 -6058432 -9683772 -10151578 -5830586
11519e830586M892011K178361J305761J724366j197414n308404l340895L482333
$$ -5830586 -938575 1239786 2545547 4269913 3072499 -2235905 -5576800 -2094467
11511b094467N420440L20484k729147M73351K695229L2919n83245M173100N755372
$$ -2094467 3325973 3646457 917310 1390661 4085890 4118809 3535564 7708664 13464036
11502A3464036q86177o414740k258993M873441N146513J645367J853890K695267
$$ 13464036 12577859 6163119 3904126 8777567 13924080 15569447 17423337 20118604
11494B0118604k335113q774751p703145r99349K595963J879383J946556L152968
$$ 20118604 17783491 9008740 1305595 306246 2902209 4781592 6728148 9881116
11486I881116K443806J303325J955816M37294o348390j1984003r339928k395160
$$ 9881116 12324922 13628247 15584063 16021357 9672967 -2311036 -11650964 -14046124
11478a4046124J175649K671187O143597O727794j167482j0092780q820075p60459
$$ -14046124 -12870475 -10199288 -4055691 2672103 1504621 -8588159 -17408234 -18168693
11470a8168693J972198r67248M13003P012699R244793M807644K014966M123698
$$ -18168693 -16196495 -17163743 -16750740 -9738041 -493248 4314396 6329362 10453060
11462A0453060M856263J350106j809014l078797n622447p389410k792821M453944
$$ 10453060 15309323 16659429 14850415 11771618 6149171 -1240239 -4033060 420884
11454D20884L958877l958492p396416j839718M149359N119858N595059O479282
$$ 420884 4379761 421269 -6975147 -8814865 -4665506 454352 6049411 12528693
11446A2528693M10728j2321870j8073901r308274K874630N546595K003104K271873
$$ 12528693 12939421 617551 -17456350 -26764624 -23889994 -18343399 -16340295 -14068422
11438a4068422N466837L850264k188951n067292k305280J628131L326235K929102
$$ -14068422 -8601585 -4751321 -6940272 -12007564 -14312844 -12684713 -9358478 -6429376
11430f429376R39390j588727k080691L1149J874504K131281K768585L221484n25000
$$ -6429376 -5489986 -7078713 -9159404 -9128255 -7253751 -5122470 -2353885 867599 342599
11421C42599p367278r183375k721105M089442L912439P20961J548391M778063
$$ 342599 -7024679 -16208054 -18929159 -14839717 -10927278 -10206317 -8657926 -3879863
11413c879863N159614L849066L784273J171598p057900j2305417m434447R364950
$$ -3879863 1279751 5128817 8913090 10084688 3026788 -9278629 -13713076 -4348126
11405d348126J0786784k926663j3335763p239758M928049O628259l4355o10016
$$ -4348126 6438658 3511995 -9823768 -17063526 -12135477 -5507218 -5541573 -6151589
11397f151589P050916J0213686K940834m829641m576296k271183n433296q119128
$$ -6151589 899327 11113013 14053847 9224206 4647910 2376727 -3056569 -11175697
11389a1175697j574782P604507N921163l339035k947415R295130J3475702j520706
$$ -11175697 -12750479 -5145972 775191 -2563844 -5511259 3783871 17259573 15738867
11381A5738867j7429015j2290688O172218J2397993J077343q058987k652171O162259
$$ 15738867 -1690148 -13980836 -7808618 4589375 5666718 -2392269 -5044440 1117819
11373A117819N102914j882939m621688l142883k539335j750060J736912L562875
$$ 1117819 6220733 4337794 -283894 -3426777 -5966112 -7716172 -5979260 -2416385
11365b416385o85968n778006l621786M188093R306091Q717762N475834M91118
$$ -2416385 -3102353 -8880359 -12502145 -8314052 992039 9709801 15185635 15676753
11357A5676753p082912j2702509r351016J208024Q308249O090037O22615Q9729
$$ 15676753 8593841 -4108668 -13459684 -12251660 -3943411 2146626 2769241 2858970
11349B858970L791026N517390L389004M46591k248752o580269j1159121j0342651
$$ 2858970 6649996 12167386 15556390 16002981 13754229 7173960 -3985161 -14327812
11341a4327812k312319O531930R343418P463797O325595N775606J312286o282825
$$ -14327812 -16640131 -10108201 -764783 6699014 13024609 18800215 20112501 13829676
11333A3829676j0319630p955488l166731J237172O354045R979775O457205k096746
$$ 13829676 3510046 -4445442 -7612173 -6375001 -20956 9958819 16416024 14319278
11325A4319278m783176J437417M636350l665983j3227009j0052256J894729P807988
$$ 14319278 9536102 10973519 15609869 11943886 -1283123 -11335379 -9440650 -1632662
11317a632662M607356J629064K976884M173501L863533M294281K204260o100144
$$ -1632662 2974694 4603758 7580642 11754143 15617676 19911957 22116217 16016073
11309A6016073j2793037p560832L230153M003554m208975n122776M431331R142634
$$ 16016073 3223036 -4337796 -1107643 2895911 -1313064 -6435840 -2004509 7138125
11301G138125K584152k594250M74470O78514p104939q496648M309044J3879682
$$ 7138125 9722277 7128027 7602497 8281011 1176072 -7320576 -3011532 10868150
11293A0868150M557114r784716p591310N209400O966966k958411n941387K363813
$$ 10868150 15425264 5640548 -1950762 3258638 10225604 7267193 1325806 3689619
11285C689619O675987M10526m963816k611709o85444l805080l441144M682963
$$ 3689619 10365606 10776132 5812316 3200607 2515163 -1289917 -4731061 -48098
11277d8098R802689K987169p522353q287060O03060P913294O504028r63047p390695
$$ -48098 9754591 12741760 5219407 -3067653 -2464593 5448701 11952729 10989682 3598987
11268C598987p440508j691489L108184J729806j706553M75436O690960P548183
$$ 3598987 -3841521 -5533010 -2424826 -695020 -2401573 -1926137 4764823 12313006
11260A2313006O74788n489276m938429j468607O35500L417185P458649O485764
$$ 12313006 12987794 7498518 2560089 1091482 1726982 5144167 12602816 19088580
11252A9088580k760978j2002157j0738532l7738R549768J0752498M910539k363644
$$ 19088580 16327602 4325445 -6413087 -6450825 3098943 13851441 18761980 16398336
11244A6398336n762262l054208K234818L126968k216530p017313m701202K021118
$$ 16398336 10636074 7581866 9816684 12943652 10727122 3709809 -991393 1029725
11236A029725N479671L671190R66515m19567l350342q761780j0894565l756739
$$ 1029725 6509396 10180586 11147101 10727534 7377192 -1384588 -12279153 -16035892
11228a6035892R125720J5880241R367169l450295r238940m651344O59751j172952
$$ -16035892 -6910172 8970069 18337238 14886943 5648003 996659 1656410 483458
11220D83458n561191m695024o72834o21151l269694j536291L367716L071903j631566
$$ 483458 -5077733 -9772757 -10445591 -11066742 -14336436 -15872727 -12505011 -9433108 -11064674
11211a1064674O52333J1958852J6931159M379636j3551252j6335843k912006Q693897
$$ -11064674 -10412341 1546511 18477670 22857306 9306054 -7029789 -9941795 -1247898
11203a247898O873869j588016n812211m929107l469962j854875J919867O095087
$$ -1247898 5625971 4037955 -1774256 -6703363 -10173325 -12028200 -10108333 -4013246
11195d013246O614751K761554k385248n570197m960170j62407O378549R226931
$$ -4013246 2601505 5363059 2977811 -2592386 -7552556 -7714963 -1336414 7890517
11187G890517M445396n200150j1435488q179456K172995J0851923J1288154M978129
$$ 7890517 12335913 7135763 -4299725 -12479181 -10306186 545737 11833891 16812020
11179A6812020j659943m870049n725616n409145k373032L758140Q589640O870893
$$ 16812020 15152077 10282028 4556412 -852733 -3225765 532375 9122015 15992908
11171A5992908q90317q379717r721349m263995L748918Q596098P423782K901654
$$ 15992908 15102591 6722874 -2998475 -7262470 -3513552 5082546 12506328 15407982
11163A5407982L09592Q93569N59158l248054o890760n833582j277821K324474
$$ 15407982 15717574 16611143 17170301 13922247 7031487 1197905 -79916 2244558
11155B244558L244721J784165k622919q152907q431665q05412O786645N912932
$$ 2244558 5489279 7273444 4650525 -3502382 -11934047 -12739459 -5952814 -39882
11147c9882J343979L557562R693675O332758p142594j3806601m151848Q842416
$$ -39882 1304097 4861659 14555334 20888092 13745498 -61103 -4212951 4629465
11139D629465R331020O15902m392498l782879l674117l294226J518855N943893
$$ 4629465 13960485 14576387 10183889 6401010 2726893 -567333 951522 6895415
11131F895415K865211k635408j157473K880577j615343j0121271p176629O496048
$$ 6895415 9760626 7125218 5967745 8848322 7232979 -2888292 -10064921 -3568873
11123c568873J2511366M148232l701454o49236L615707k10635m417183j046778
$$ -3568873 8942493 13090725 9389271 8740035 12355742 12145107 7727924 6681146
11115F681146K110327k781497p414140l149006J202991m517032j0736837l431928
$$ 6681146 8791473 6009976 -1404164 -4553170 -3350179 -7867211 -18604048 -22035976
11107b2035976J0000567J2001716M002698J290130M423017N29678r081044q464204
$$ -22035976 -12035409 -33693 3969005 5259135 9682152 10211830 1130786 -7333418
11099g333418L525159Q430573r26869q175376j614631O497122J747955q959004
$$ -7333418 -3808259 4622314 3695445 -4479931 -6094562 402560 2150515 -6808489
11091f808489j0458399k394143N260083R220317J1544070R671188J390223o105752
$$ -6808489 -17266888 -19661031 -14400948 -5180631 6363439 16034627 17424850 11319098
11083A1319098m406036K854053N280108Q77787l320871l017388o56198N88379
$$ 11319098 6913062 9767115 15047223 15925010 12604139 9586751 8930553 9518932
11075I518932K4835k151229m709678m990065j903907K437816N393926N145735
$$ 9518932 9543767 7392538 2682860 -2307205 -4211112 -1773296 3620630 8766365
11067H766365J30957p370682q811475O49861J0890052P453682n940977j0099215
$$ 8766365 8897322 1526640 -7284835 -6634974 4255078 11708760 5767783 -4331432
11059d331432R47215J0312607M771906n640971o051003K69834K077727P85237
$$ -4331432 -3384217 6928390 11700296 6059325 8322 278156 2355883 3141120
11051C141120L875000P058997J154587r157841j1047788m339566K7939l10120
$$ 3141120 7016120 14075117 15229704 6071863 -4975925 -9315491 -9287552 -9597672
11043i597672K133403P123489M918206n668601j2570683q079235J150460N998179
$$ -9597672 -7464269 -340780 4577426 -1091175 -13661858 -21741093 -20590633 -14592454
11035a4592454O273259N912920N579399M210677J618178k571680p212038p499477
$$ -14592454 -8319195 -2406275 3173124 7383801 9001979 6430299 -781739 -8281216
11027h281216j075103N677858N403437J333183J667060N178352L819812k191630
$$ -8281216 -9356319 -3678461 1724976 3058159 4725219 9903571 13723383 11531753
11019A1531753m707034k496663k277018m526566k763027J470225j232345r347359
$$ 11531753 6824719 4328056 2051038 -2475528 -5238555 -3768330 -5000675 -14348034
11011a4348034q729187L604368J1086111L323275n782713K13947J3641159J5019541
$$ -14348034 -23077221 -19472853 -8386742 -5063467 -10846180 -10632233 3008926 18028467
11003A8028467L105025n884891m659648k166885m700772o585732l369170k52984
$$ 18028467 21133492 15248601 10588953 8422068 3721296 -2864436 -6233606 -6486590
10995f486590j348110j477517M067741R627532O827531k739874r451225p629813
$$ -6486590 -7834700 -9312217 -5244476 4383056 11210587 8470713 -980512 -8610325
10987h610325k30272O412338P814621K922910m890912q979625n534091J584361
$$ -8610325 -8840597 -2428259 5386362 8309272 3418360 -5561265 -11095356 -9510995
10979i510995N413770M594273L340065L183024P41887m355399n780115K72281
$$ -9510995 -4097225 497048 3837113 7020137 7762024 3406625 -2373490 -2101209
10971b101209P174380O222763k03152k246585J792380L178921k108190o046528
$$ -2101209 5073171 11295934 11092782 8846197 10638577 13817498 11709308 5662780
10963E662780j696254M947688M196663k235455m601815l95786L029993N25709
$$ 5662780 3966526 8914214 13110877 10875422 6273607 5877821 8907814 9433523
10955I433523m379932o275876m668980k107750l86779l97658j952092k349288
$$ 9433523 5053591 -1222285 -5891265 -7999015 -8385794 -8783452 -10735544 -13084832
10947a3084832J545767Q364608J2072333Q360315k23289o570510o025739r65439
$$ -13084832 -11539065 -3174457 8897876 17258191 17034902 10464392 4438653 3473214
10939C473214J950789j64498k601838L6219N018076M923102q15554m879951l434040
$$ 3473214 5424003 5259505 2657667 2693886 7711962 12635064 11819510 6939559 3505519
10930C505519n24031Q73262K962429M752270J25297r675516j2554785l199040
$$ 3505519 2981488 3854750 6817179 11569449 11694746 2019230 -10535555 -13734595
10922a3734595O257953L968033l217350k191901M601775N591153J315553J510895
$$ -13734595 -7476642 -3508609 -6725959 -8917860 -4316085 1275068 2590621 4101516
10914D101516N220396K458335n901564q609703m580240l950071o872062j482914
$$ 4101516 9321912 11780247 5878683 -2731020 -7311260 -11261331 -18133393 -19616307
10906a9616307J2077535J6157303L118996j0133082p059312M757865Q259517K352923
$$ -19616307 -7538772 8618531 11737527 1604445 -5454867 -697002 7562515 9915438
10898I915438j934801j068929k02734j061938j258188j245238k005800n81918
$$ 9915438 7980637 6911708 6708974 5647036 4388848 3143610 1137810 555892
10890E55892L686436M494198j499807o892820m570483O05544O49596k332913k205334
$$ 555892 4242328 8736526 7236719 343899 -4226584 -3621040 -2971444 -5304357 -7509691
10881g509691q37205k554151l303889K041817P545246M842696j336491q27036
$$ -7509691 -8346896 -10901047 -14204936 -12163119 -4617873 224823 -1111668 -1938704
10873a938704L306162O9821q161207p668767K696273P952932J417700m698441
$$ -1938704 1367458 1437279 -6723928 -14392695 -11696422 -3743490 -2325790 -7024231
10865g024231l17576O523346M688982j960968l255540K29862J152438m38943P28021
$$ -7024231 -7341807 -818461 3870521 1909553 -1345987 -1116125 36313 -402630 325391
10856C25391L175913R00010m347688m227962K374697O537276K362760n232895
$$ 325391 3501304 4401314 53626 -4174336 -1799639 4737637 7100397 1867502
10848A867502q773211p487132m479470k65102N595796R695501P382833j95796
$$ 1867502 -6905709 -14392841 -18872311 -19137413 -13541617 -3846116 3536717 3340921
10840C340921o031997n383828j178365L94732k064912l929495j286367L362321
$$ 3340921 -2691076 -8074904 -9253269 -8858537 -10923449 -14852944 -16139311 -12776990
10832a2776990L974160j050967o054687m577323K688757Q596963Q104884L626677
$$ -12776990 -8802830 -9853797 -15908484 -20485807 -17797050 -9200087 -1095203 2531474
10824B531474O08452K25763m75165k326281k220221J204989L818055J130355m713414
$$ 2531474 3139926 3365689 2890524 564243 -1655978 -450989 3367066 4497421 -215993
10815b15993o694167j652797N385953O552557k46664q562152r441346j102867
$$ -215993 -6910160 -8562957 -3177004 3375553 3128889 -5433263 -14874609 -15977476
10807a5977476P860712P405985j614837p910453m270367L215762M636246M98089
$$ -15977476 -8116764 -710779 -2325616 -10236069 -14506436 -11290674 -6654428 -6156339
10799f156339m01292M689172Q288861M085549m193038q501506o609776k952347
$$ -6156339 -6557631 -1868459 6420402 10505951 6312913 -2188593 -8798369 -11750716
10791a1750716j711545k041699M6294N805953J0263815O955802k631499q402581
$$ -11750716 -13462261 -15503960 -15457666 -9651713 612102 7567904 4936405 -3466176
10783c466176m146456L556375M682655q5950k571182j112100q83234j602219K560791
$$ -3466176 -7612632 -4056257 626398 540448 -2030734 -3142834 -4026068 -5628287 -3067496
10774c067496R130815O816843n818558j3911442p085519M316700M902974k685999
$$ -3067496 6063319 12880162 7061604 -6849838 -13935357 -9618657 -4715683 -7401682
10766g401682l869120M083320R120510M312721l013369m549956k127946j162339
$$ -7401682 -11270802 -7187482 1933028 6245749 3232380 -1317576 -3445522 -4607861
10758d607861j798682j870715k096125k901517j003046N323072J0897325R043659
$$ -4607861 -6406543 -8277258 -10373383 -13274900 -14277946 -8954874 1942451 10986110
10750A0986110Q55447n576255n009356n96805R69333k632952p371932p556653
$$ 10986110 11841557 6265302 1255946 659141 1628474 -1004478 -8376410 -15933063
10742a5933063j670124O087464R851847P913532M109100K725545K837188k1056
$$ -15933063 -17603187 -11515723 -1663876 6249656 10358756 13084301 15921489 15900433
10734A5900433o128403q956833l548706M856666O114633r06792o155013k642782
$$ 15900433 9772030 815197 -2733509 2123157 8237790 7330998 1175985 -1466797
10726a466797L664364L392147k217190m144889P16306O550234P879013M442093
$$ -1466797 2197567 5589714 3372524 -772365 -56059 6494175 14373188 18815281
10718A8815281k221020r387021j0894511k814470P931418R369467O31138o463499
$$ 18815281 16594261 7207240 -3687271 -6501741 1429677 10799144 11430282 4966783
10710D966783m401860Q77172J774915J89889N40258K80627m264432q777148o332927
$$ 4966783 564923 1442095 3217010 3406899 3947157 4227784 -36648 -8813796 -15146723
10701a5146723J881667Q579796J0066144P738979L174274k288173n927574o728225
$$ -15146723 -13265056 -4685260 5380884 13119863 16294137 14005964 8078390 1350165
10693A350165o909837o553960k096545N278645P268917J457085j681656N189568
$$ 1350165 -5559672 -12113632 -14210177 -8931532 -1662615 -205530 -1887186 3302382
10685C302382J1449538L632746j0718920j1787093J757663R951841K704457n631919
$$ 3302382 14751920 18384666 7665746 -4121347 -2363684 7588157 10292614 4660695
10677D660695j568911N368815K80115j0547942r352218L365707Q518901j783301
$$ 4660695 3091784 8460599 8740714 -1807228 -11159446 -7793739 725162 -1058139
10669a058139j2023959o966460O408307J0602392K389997n508791l808723L040539
$$ -1058139 -13082098 -20048558 -13640251 -3037859 -647862 -6156653 -9965376 -6924837
10661f924837O407507M764683K175152J017385M44483m32037j246081j436185
$$ -6924837 -517330 4247353 6422505 7439890 7884373 7452336 6206255 4770070
10653D770070o64328J177847L311614M358646L980880K920723R55824l013459
$$ 4770070 4105742 5283589 8595203 12953849 16934729 19855452 20811276 17797817
10645A7797817p743494r123465n175249L28747K038916k00177j446126J727278
$$ 17797817 10054323 930858 -4244391 -3915644 -1876728 -2076905 -3523031 -1795753
10637a795753O870643Q267745L032317n283395r343673n690272O59317K037271
$$ -1795753 5074890 13342635 16374952 11091557 1747884 -3942388 -3283071 -1245800
10629a245800j662974l084611J203563N192894K794641k707409m009099n69294
$$ -1245800 -2908774 -5993385 -4789822 403072 3197713 490304 -3518795 -4088089
10621d088089K256288K253187J982336K554054J843044r65443l611668l783451
$$ -4088089 -1831801 421386 2403722 4957776 6800820 5835377 2223709 -1559742
10613a559742j086878K906925M545801J013554m272714l908209K489568N887421
$$ -1559742 -2646620 260305 4806106 5819660 1546946 -2361263 128305 6015726
10605F015726J674901j744888L565071J0444527O983665l805584q138765k926006
$$ 6015726 7690627 5945739 9510810 19955337 26939002 23133418 14994653 12068647
10597A2068647P85872l613385r137240p446042J34087P047549R029892N339413
$$ 12068647 12854519 9241134 103894 -7342148 -7208061 -160512 8869380 14208793
10589A4208793q68957l497794j055674m28182n715946q841690j933503P337265
$$ 14208793 13339836 9842042 8786368 8358186 2642240 -6199450 -8132953 -795688
10581g95688O926933Q63163J129089M376700j789207j1866219o963260J1490402
$$ -795688 6131245 6994408 8123497 12500197 10710990 -1155229 -8118489 3371913
10573C371913J8987723N983258p353083n326677J4027m925117j0109277l009325
$$ 3371913 22359636 28342894 20989811 15663134 15677161 10752044 642767 -2366558
10565b366558N693202Q77130q557804m796590O949214O980013n366716j1317627
$$ -2366558 3326644 4203774 -4354030 -9150620 -2201406 4778607 -588109 -11905736
10557a1905736l383971N603582N149465J82103j445822J50800J961623L270317
$$ -11905736 -15289707 -9686125 -4536660 -4354557 -5800379 -5649579 -3687956 -417639
10549d17639L358735J627773K03103O73434O24648j380757j948790P00657K576004
$$ -417639 2941096 4568869 4771972 5445406 6070054 4689297 2740507 3441164 6017168
10540F017168J543127J308429K307136j352395r137228j0157879p93694O361461
$$ 6017168 7560295 8868724 11175860 9823465 686237 -9471642 -10265336 -3903875
10532c903875J947174m671440k103500L712924J957644k882313k67700O208448
$$ -3903875 -1956701 -6628141 -8731641 -5018717 -3061073 -5943386 -6211086 -2638
10524b638N345307j726823m516293r72222K114496J979172J024047K3507l34950
$$ -2638 5342669 3615846 -900447 -1872669 241827 2220999 3245046 3268553 2933603
10515B933603K147887M298656n40701p996546n117341O252513Q331751j981846
$$ 2933603 5081490 9380146 8839445 842899 -4274442 1978071 10309822 8327976
10507H327976n673173L737720O904986l989863p360083O477556J2003186m750146
$$ 8327976 2654803 6392523 13297509 9307646 1947563 8425119 20428305 15678159
10499A5678159j4258965M942599K1967474O249414j4862802n882649R375348l121534
$$ 15678159 1419194 6361793 28329267 34578681 19715879 13833230 23208578 20087044
10491B0087044j1746946K1173127L8140454m2062084j60919485j58705804n783646
$$ 20087044 8340098 29513225 67653679 25591595 -135327890 -294033694 -299817340
10484b99817340J30810304J13335278J3563231j9373244K4011485M1922667L971462
$$ -299817340 -169007036 -55671758 -42108527 -61481771 -37470286 4452381 8423843
10477H423843k1201919k23444J8839745L571160j3363433m383600P283826q01810
$$ 8423843 -12778076 -13001520 5838225 9409385 -3954048 -8337648 -1053822 -1855632
10469a855632j0947340m661140M611644K519367k28633N777404Q683207N06231
$$ -1855632 -12802972 -17464112 -12852468 -10333101 -10561734 -4784330 3898877 4405108
10461D405108n859838j023048M322697R40184l297764r18006K395245J755004
$$ 4405108 -1454730 -2477778 1844919 2785103 -512661 -1430667 964578 2719582
10453B719582R36491K03573m894932r319351l491458N957459L077931q346212
$$ 2719582 3656073 3859646 -1035286 -10354637 -13846095 -7888636 -4810705 -13156917
10445a3156917p816577O868357J4300356M597728o609635o590254k275986m13905
$$ -13156917 -20973494 -14105137 195219 4792947 -1816688 -8406942 -10682928 -11096833
10437a1096833L882839R602896N497637o905626j0122101l79624M494128k652205
$$ -11096833 -7213994 2388902 7886539 980913 -9141188 -9520812 -5026684 -7678889
10429g678889n097785N183006R805026k853333j3306778k737783J3746226J1705113
$$ -7678889 -12776674 -7593668 2211358 -641975 -13948753 -16686536 -2940310 8764803
10421H764803k962289o599894L037943P893395J902356l673146l255947k522180
$$ 8764803 5802514 -797380 2240563 10133958 12036314 8363168 5107221 2585041
10413B585041k741940N89339M292302L03969q363494j0209178l537905K291535
$$ 2585041 -156899 432440 4724742 5028711 -3334783 -13543961 -17081866 -14790331
10405a4790331L451287N231067Q706502P756859J553139k192326J80463K289139
$$ -14790331 -11339044 -6107977 2598525 10355384 11908523 9716197 9896660 12185799
10397A2185799j944398r225656j1537614n522116M170882Q592274L272313m771027
$$ 12185799 10241401 1015745 -10521869 -16043985 -11873103 -3280829 -8516 -4779543
10389d779543l780198N910778R804231J14769j0797520q136950K874868O214730
$$ -4779543 -8559741 -2648963 7155268 7270037 -3527483 -11664433 -8789565 -2574835
10381b574835M96924j562120L322039M169140l241413p817073k139833M756213
$$ -2574835 -2077911 -3640031 -317992 3851148 609735 -7207338 -9347171 -4590958
10373d590958K791149k956299k503057J724900M81752n000347m658326K957802
$$ -4590958 -1799809 -4756108 -7259165 -5534265 -5052513 -10052860 -14711186 -11753384
10365a1753384P338537K189398n331794n867789l18506M623055P131300R241829
$$ -11753384 -4414847 -2225449 -7557243 -13425032 -13743538 -9120483 -1989183 7252646
10357G252646R173780L129805o017710r945933o400806k345877k668979k874492
$$ 7252646 16426426 19556231 13538521 3592588 -2808218 -5154095 -7823074 -10697566
10349a0697566J793517O456965L868947k561047k838978L466924N478989k112094
$$ -10697566 -8904049 -2447084 1421863 -1139184 -3978162 -511238 4967751 2855657
10341B855657r844006o860082L289720P632943J124563q156603j0348437m426628
$$ 2855657 -6988349 -13848431 -10558711 -2925768 -1801205 -9957808 -20306245 -24732873
10333b4732873L353624P274811O553457M301772L836427N318741N636495K310573
$$ -24732873 -21379249 -14104438 -7550981 -3249209 587218 5905959 11542454 13853027
10325A3853027k649900m148109O9711N780715O023456j082171r425913j1222419
$$ 13853027 11203127 7055018 7124729 12905444 18928900 17846729 8420816 -2801603
10317b801603n564755J381962M310992L659266K024609R2169j318608M33153M913340
$$ -2801603 -8366358 -6984396 -2673404 985862 3010471 3102640 1784032 2217185 7130525
10308G130525N706239j274604q869460o068595N456916J0904199J899110j1156697
$$ 7130525 12836764 11562160 2692700 -3375895 2081021 12985220 14884330 3727633
10300C727633j2654122k351937N970889M295685o09807m0193L284627J183102
$$ 3727633 -8926489 -11278426 -5307537 -1011852 -1621659 -1661852 1622775 2805877
10292B805877n610325p836237k100887L722681K748800n98824J322342O334817
$$ 2805877 -2804448 -10640685 -12741572 -9018891 -6270091 -6868915 -5546573 788244
10284G88244N933274p16728n615801m917305l705110n381165n403198m62539M021347
$$ 788244 6721518 6004790 388989 -4528316 -8233426 -13614591 -19017789 -19480328 -15458981
10275a5458981K361788j424284J73205N957958Q026438L988712l67794n12395
$$ -15458981 -13097193 -14521477 -14348272 -8390314 -363876 3624836 3257042 2744647
10267B744647J102364O9632l593085n885052l649630J838530N727467M869636
$$ 2744647 3847011 3916643 323558 -5561494 -9211124 -7372594 -1645127 3224509
10259C224509J947918J834359M285281M471385R20249k483732l353424l561462
$$ 3224509 5172427 7006786 11292067 15763452 16683701 14199969 10846545 7285083
10251G285083l767025j988772O79616O62450q0138L830146Q724532L805404r570128
$$ 7285083 3518058 1529286 2208902 2871352 2791214 6621360 15345892 19151296 9581168
10242I581168j4598627l632880Q128851N550984l530629l687599K361030K420526
$$ 9581168 -5017459 -8650339 -521488 5029496 1498867 -2188732 172298 2592824
10234B592824r23945K958931Q304572K7998j6473415j8141108m08668J3631793
$$ 2592824 1668879 4627810 12932382 12960380 -3513035 -21654143 -22062811 -8431018
10226h431018P894275m716053n822237K019991N908712M162450K568391N96723
$$ -8431018 -536743 -5252796 -11075033 -9055042 -3146330 1016120 3584511 4181234
10218D181234m194681o351612m18351P474983P656377J588236k140349k203500
$$ 4181234 -13447 -6365059 -6783410 691573 8347950 9936186 7795837 5592337
10210E592337m301137q889672r031518j058455R237855J2626725N955794m538120
$$ 5592337 1291200 -7598472 -16629990 -17688445 -8450590 4176135 10131929 5593809
10202E593809r180235n478896r19633j811261l553793P98759O980758N875744
$$ 5593809 -3586426 -9065322 -9984955 -11796216 -15350009 -14551250 -7570492 -1694748
10194a694748J28968k24757K575695l328516j4924675j3066022O554890K1376205
$$ -1694748 -1565780 -1790537 785158 -2543358 -17468033 -30534055 -23979165 -2602960
10186b602960J3664097l509283p949454p81525J678328l134623m063527J439765
$$ -2602960 11061137 7551854 -397600 -1179125 499203 -2635420 -6698947 -5259182
10178e259182M773737K828237J65906k796577q124182r921728j637927Q669263
$$ -5259182 -485445 2342792 2508698 -287879 -8412061 -18333789 -19971716 -11302453
10170a1302453P001207m069955q475281j712235M782414N093802N963444R227951
$$ -11302453 -4301246 -8371201 -16846482 -18558717 -13776303 -8682501 -2719057 6508894
10162F508894O149711m311701r394602l354341K013055k044817n723638J366876
$$ 6508894 12658605 8346904 -1047698 -4402039 -2388984 -4433801 -10157439 -8790563
10154h790563J0425996P201008m665404j0303043o476805j661241J445991O666058
$$ -8790563 1635433 8836441 4171037 -6132006 -12608811 -14270052 -12824061 -6158003
10146f158003J0444088M684283o047497p121883K945233Q041663m95650r630640
$$ -6158003 4286085 8970368 2922871 -4199012 -1253779 6787884 6292234 -3338406
10138c338406n379411N058591N336987m531203r799655m215040L162012M523086
$$ -3338406 -8717817 -3659226 1677761 -2853442 -12653097 -16868137 -13706125 -9183039
10130i183039L424973M935343O502999M225938N71239o0058J526223J505415j222744
$$ -9183039 -5758066 -822723 5680276 9906214 10477453 10417395 11943618 13449033 12226289
10121A2226289m985089p707731p000766j807235M169896N383415K417849J304331
$$ 12226289 7241200 -466531 -7467297 -9274532 -5104636 278779 2696628 4000959
10113D000959L248777K597870k116127m199241q89155K58499n486669j0020572
$$ 4000959 7249736 9847606 7731479 3532238 2643083 2901582 -2585087 -12605659
10105a2605659n329717K303176K820061o51795Q54045M443777J141181n115912
$$ -12605659 -17935376 -15632200 -12812139 -13463934 -12609889 -8166112 -7024931 -12140843
10097a2140843k364109O995995P864825j737091n985809K281404R118349K419085
$$ -12140843 -14504952 -7508957 355868 -1381223 -7367032 -5085628 4032721 6451806
10089F451806q992181j0538095l120054K641815L080180J223457j555668l624594
$$ 6451806 -2540375 -13078470 -16198524 -13556709 -10476529 -9253072 -10808740 -14433334
10081a4433334o87030N949479P028861n46008o693245l758924J632637K209177
$$ -14433334 -15120364 -9170885 -2142024 -2688032 -9381277 -13140201 -11507564 -9298387
10073i298387L417478J0298124J2971426J869833j1900585j0367143K992188Q270340
$$ -9298387 -5880909 4417215 17388641 19258474 7357889 -3009254 -17066 8253274
10065H253274k32156p834532m395232K991068N527967M717336L739802M79636
$$ 8253274 8021118 186586 -4208646 -1217578 4310389 9027725 12767527 13247163
10057A3247163n094977p532283m805751j517163k35247J086981J424567k734037
$$ 13247163 8152186 619903 -4185848 -5703011 -5938258 -4851277 -3426710 -6160747
10049f160747p113523k253642R780874J3832098K970995r875118r521967J277110
$$ -6160747 -13274270 -15527912 -5747038 8085060 11056055 1180937 -8341030 -7063920
10041g063920P837794L433150m851688o741402J81492Q246180P322612k220505
$$ -7063920 773874 4207024 -644664 -7386066 -7204574 1041606 8364218 6143713
10033F143713o928429J961890J2387410O410929j0720614j4828537N81650J2518168
$$ 6143713 -784716 1177174 13564584 19975513 9254899 -5573638 -4991988 7526180
10025G526180L098846j3553536j4352554r37858Q622404R291675Q878900P026246
$$ 7526180 10625026 -2928510 -17281064 -18218922 -9596518 -304843 8574057 15600303
10017A5600303k571868j2951396r861571L048706O758691k938579q908642j346665
$$ 15600303 13028435 77039 -9784532 -6735826 22865 -2915714 -11824356 -13171021
10009a3171021P691466O586976J715327J742828J690323l983772p348151j183218
$$ -13171021 -5479555 1107421 2822748 4565576 6255899 2272127 -5076024 -6259242
10001f259242N168604L53944q594109p413045J668242N158567J746184J992899
$$ -6259242 -1090638 -736694 -9330803 -16743848 -15075606 -9917039 -8170855 -6177956
9993f177956P223794P285597j2299m458565j353683J440262j534452m852703l313058
$$ -6177956 1045838 8331435 8319136 3860571 2506888 3947150 2412698 -2440005 -5753063
9984e753063L30482K893650N090119N329971N92990m290670j165935N464681K352836
$$ -5753063 -5422581 -2528931 2561188 7891159 8484149 4193479 3027544 8492225 10845061
9975A0845061q944517j0386101L510434J4011551P101021m274707k588677N894467
$$ 10845061 1900544 -8485557 -4975123 9036428 16137449 11862742 9274065 15168532
9967A5168532M446436n163066q504409m595402m304676q022086o351881k16310
$$ 15168532 19614968 14451902 5947493 1352091 -2952585 -10974671 -17326552 -17542862
9959a7542862M80280k961368M20478R400330J0787058L241998P9010M553908L624550
$$ -17542862 -17062582 -20023950 -19603472 -10203142 583916 3825914 3904924 8458832 12083382
9950A2083382o977109j2490511m241995M200231n08106r124246n840574N685111
$$ 12083382 5106273 -7384238 -11626233 -7426002 -7934108 -17058354 -22898928 -17213817
9942a7213817R373214J862980n708490o683432m852874l055872J245857Q004206
$$ -17213817 -7840603 -5977623 -11686113 -18369545 -23222419 -26278291 -25032434 -17028228
9934a7028228J2138943J1116736P940599M900297K02211o772701j1216302p744546
$$ -17028228 -4889285 6227451 14168050 19068347 19270558 12497857 1281555 -6462991
9926f462991J551373P493424M287154k761955m381854q00519n48863m888556m131192
$$ -6462991 -4911618 2581806 6868960 4107005 -274849 -1075368 -1624231 -6512787 -10643979
9917a0643979N147979J0955922L993202n781395m372288L346068K451944o635961
$$ -10643979 -5496000 5459922 9453124 3671729 -700559 2645509 5097453 -1538508
9909a538508r822217k980427M242679O583244P422685O008042j855789j0882546
$$ -1538508 -11360725 -14341152 -10098473 -3515229 3907456 9915498 8059709 -2822837
9901b822837j1256842n294961k292906n52971O217771J0367828J653474q728019
$$ -2822837 -14079679 -19374640 -21667546 -22220517 -16002746 -5634918 -3981444 -12709463
9893a2709463l138360Q710470L282490j3317866j3130508L196240O557675o623827
$$ -12709463 -15847823 -7137353 -3854863 -17172729 -30303237 -27106997 -20549322 -27173149
9885b7173149q207379N627176M794695j4180038j6481817Q68751n841384l6833416
$$ -27173149 -35380528 -29753352 -24958657 -39138695 -55620512 -54751761 -60593145 -97426561
9877i7426561j8740603P5561136J46881511R4780729k7305169q0572367l5113396
$$ -97426561 -116167164 -40606028 106275483 201056212 173751043 93178676 58065280
9870E8065280J0388695n083968l0354361j4143203J0951927J849927j8453242
$$ 58065280 68453975 63370007 33015646 18872443 29824370 31674297 13221055
9863A3221055j2467109M242370J381784p654760K273963J6042050P781848q874666
$$ 13221055 753946 4996316 6378100 -1276660 997303 17039353 24821201 15946535
9855A5946535o821004M747611J182409r869323n144565Q673748Q231831k861523
$$ 15946535 9125531 13873142 15055551 5186228 41663 8715411 16947242 14085719
9847A4085719l857989K487121j792551j1397529o338632Q193386Q398682n279530
$$ 14085719 10227730 12714851 10922300 -475229 -6813861 1379525 9778207 4498677
9839D498677q130153N866073J4660981N354310q498144j2022330o824735R84048
$$ 4498677 -3631476 2234597 16895578 22249888 13751744 1729414 -5095321 -4111273
9831d111273R148730J2167704M834324n270883o072219q90094k217401q295800
$$ -4111273 5037457 17205161 22039485 16768602 10696383 9806289 7588888 -706912
9823g06912o053192M313635Q972072M678177K373079N393815M759366j390377
$$ -706912 -6760104 -2446469 6525603 11203780 13576859 18970674 23730040 22339663
9815B2339663l707919n16408j685318r289586j2464498o547977m12311M15550
$$ 22339663 18631744 18115336 16430018 7140432 -5324066 -11872043 -12284354 -11868804
9807a1868804J591167N516961N177823j133740m036402P26339M154234p4354m189402
$$ -11868804 -10277637 -4760676 417147 -716593 -4752995 -4026656 127578 53224 -4136178
9798d136178L10930Q238465Q640737j03540j0078185j3101072o062154O862618
$$ -4136178 -3825248 4413217 13053954 12950414 2872229 -10228843 -16290997 -9428379
9790i428379J4676790R235579l485744r276042m135524J930691J140246k198632
$$ -9428379 5248411 14483990 10998246 1722204 -2413320 -482629 657617 -1541015
9782a541015j612054J381635K380713J848756K244262K851345K062352P76261
$$ -1541015 -3153069 -1771434 609279 2458035 4702297 7553642 9615994 10392255
9774A0392255K25442l26442j554141k261316o44832L899289R012783Q808981l52758
$$ 10392255 10617697 10291255 8737114 6475798 5830966 9730255 18743038 27552019 27199261
9765B7199261j1666420j2672711k274632N912006L273510j504627R79623M028692
$$ 27199261 15532841 2860130 585498 6497504 9771014 8266387 9246010 13274702
9757A3274702j732822r177906o335075J471716Q23295n047418k415731O320346
$$ 13274702 11541880 2363974 -3971101 -2499385 -1676090 -6723508 -9139239 -2818893
9749b818893N851524l473623n158153L362327N611169l502954p589424J687504
$$ -2818893 3032631 -440992 -5599145 -2236818 3374351 -128603 -7718027 -6030523
9741f030523R232664L188319n252188l584282O61953k742538o121669M15608P962212
$$ -6030523 3202141 6390460 1138272 -2446010 -1784057 -4526595 -10648264 -10232656 -2270444
9732b270444L750323n159551l867987M280136M683201k245555k963692M481487
$$ -2270444 1479879 -3679672 -7547659 -3267523 1415678 -829877 -3793569 687918
9724F87918P700529J652188m496671l666395P28871M271981O618578N890087k36140
$$ 687918 8388447 10040635 5543964 1877569 2606440 6878421 13496999 19387086 19150946
9715A9150946o914209o566162j291566p0414l807241m846822j685484j431595
$$ 19150946 12236737 5670575 4379009 4308595 501354 -4345468 -6030952 -7462547
9707g462547n509753n717137J116629O199379K686734l205250k326483L599599
$$ -7462547 -12972300 -18689437 -17572808 -11373429 -8686695 -11891945 -14218428 -10618829
9699a0618829O085213K868875o43414m88555J398000J356284j215761l537796
$$ -10618829 -4533616 -1664741 -2308155 -2796710 -1398710 -42426 -1258187 -4795983
9691d795983k543985J248903L222248n850n139565n224813J558818R247731J0955491
$$ -4795983 -7339968 -6091065 -2868817 -2874667 -8014232 -13239045 -11680227 -2432496 8522995
9682H522995N668547k269407p553124p137380k029605K843210K710633j873481
$$ 8522995 14191542 11922135 4369011 -2768369 -4797974 -1954764 755869 -1117612
9674a117612n336142l267260K764259O908174M874695j736170o584065m874491
$$ -1117612 -6453754 -9721014 -6956755 -48581 4826114 3089944 -3494121 -8368612
9666h368612J332973N535611M387338M63297k409407k829421m23263M243874O877367
$$ -8368612 -7035639 -1500028 2887310 3350607 941200 -1888221 -2311484 1932390 8809757
9657H809757K501934n761441p445057J070942R633567Q035146M10076k631092
$$ 8809757 11311691 5550250 -1894807 -823865 8809702 16844848 17254924 14623832
9649A4623832r57719k970072r324083j0946617m466059J602479p7966n333607
$$ 14623832 13666113 10696041 1371958 -9574659 -14040718 -12438239 -12516205 -17849812
9641a7849812n982129p83293N835576J0394321J1115630O719290r20541o101519
$$ -17849812 -23831941 -24615234 -18779658 -8385337 2730293 9449583 8529042 2427523
9633B427523m940268N26922N635356P384690M587089j646461o196496m112407
$$ 2427523 -2512745 -1985823 3649533 11034223 15621312 13974851 7778355 3665948
9625C665948J525006J971193m247709p813362k564194M293740L023857l449492
$$ 3665948 5190954 7162147 2914438 -4898924 -7463118 -3169378 -145521 -3595013
9617c595013m302713K445938P680821N358509Q4127j360297J040019L070489K615860
$$ -3595013 -7897726 -5451788 2229033 7587542 7671669 6311372 7351391 10421880 13037740
9608A3037740L51232k321358l575797k188562O4040k06698k923831l971339j287530
$$ 13037740 13388972 11067614 7491817 5303255 5367295 5160597 2236766 -1734573 -3022103
9599c022103J742678J347696j028820j370824M10224K61882l659961p376126n539090
$$ -3022103 -1279425 68271 -960549 -2331373 -1921149 -1659267 -5319228 -12695354 -18234444
9590a8234444J499065P175776O318924J782385O99653M241198N391228o05906
$$ -18234444 -16735379 -9559603 -3240679 -1458294 -758641 3482557 8873785 8267879
9582H267879p861856p125328R57422O373364L312528l351917o536833n549396
$$ 8267879 406023 -6719305 -5761883 611481 3924009 572092 -5964741 -11514137
9574a1514137l263091l22738L418408N556607L807340j37199k582888j640141
$$ -11514137 -14777228 -15099966 -11681558 -6124951 -2317611 -2454810 -5037698 -6677839
9566f677839K570314P857876Q616144M31930j0753601j1438561J389331J2389377
$$ -6677839 -4107525 3750351 12366495 12798425 2044824 -9393737 -8004406 4384971
9558D384971P342554n645476o928998N839879J4455714P205264n481862q331861
$$ 4384971 11727525 6082049 -846949 4992930 19448644 26653908 21172046 12840185
9550A2840185j860137L051119K110391p09717k494650l012967r86974K913158
$$ 12840185 10980048 14031167 16141558 15431841 12937191 9924224 8937250 11850408
9542A1850408K633093n601176j4716216j3899268k801808Q509848J2303254Q886807
$$ 11850408 14483501 8882325 -5833891 -19733159 -22534967 -14025119 -1721865 7164942
9534G164942J410901o874469j0675559o247670K022106N591883L115322R87598
$$ 7164942 8575843 1701374 -8974185 -15221855 -13199749 -7607866 -4492544 -3504946
9526c504946K104890K053606j656974m549039k663912J678857M853250O174115
$$ -3504946 -1400056 653550 -1003424 -5552463 -8216375 -6537518 -1684268 4489847
9518D489847M267973l205515j2034051j1836809l53695J0013528Q019204l23547
$$ 4489847 8757820 5552305 -6481746 -18318555 -18672250 -8658722 -639518 -963065
9510i63065j230474N861576Q475258J052918p122806o543352l01184K427733j045180
$$ -963065 -2193539 3668037 12143295 13196213 6073407 -469945 -771129 1656604 611424
9501F11424n876034o887047k849670L330864O247292L043928j792335j153532
$$ 611424 -5264610 -12151657 -15001327 -11670463 -5423171 -2379243 -4171578 -5325110
9493e325110L862229M134435l381772q939967l483707P127381R750369K285685
$$ -5325110 -1462881 2671554 -710218 -9650185 -13133892 -6006511 3743858 6029543
9485F029543m826060m177772Q48303M632406O421197O033595J027503o840579
$$ 6029543 1203483 -2974289 -2125986 2506420 8927617 14961212 15988715 9148136
9477I148136r339476k389761O110630O028257j059898n109984k662982m27831
$$ 9148136 -191340 -2581101 3529529 9557786 8497888 3387904 724922 297091
9469B97091l256562o173352k097591O934478J0825010L211063j0011387j5385267
$$ 297091 -2959471 -9132823 -11230414 -4295936 6529074 9740137 -271250 -15656517
9461a5656517o366614P747540J1386513K171161n488619n86262Q071757N094284
$$ -15656517 -22023131 -14275591 -2889078 -717917 -6206536 -6792798 1278959 6373243
9453F373243o988349j0281523J137314J1307247N880664p182216j0604136k435054
$$ 6373243 -615106 -10896629 -9759315 1547932 7428596 246380 -10357756 -12792810
9445a2792810M658971L807666P58901J129158K405491J054349j166647j567653
$$ -12792810 -8133839 -4326173 -3567272 -2438114 -32623 1021726 -144921 -1712574
9437a712574j117305j527742k164433k012270j015493J441754N176105O174487
$$ -1712574 -2829879 -4357621 -6522054 -8534324 -9549817 -8108063 -2931958 3242529
9429C242529P00214o624487n924622L730184J0477076N441154l971824m505005
$$ 3242529 3942743 -2681744 -8606366 -4876182 5600894 11042048 7070224 2565219
9421B565219L376285O419422j180915q893042n470445M678119Q250966J740706
$$ 2565219 5941504 12360926 11180011 2286969 -3183476 1494643 9745609 11486315
9413A1486315n406352n573048k210445j551380k541075q20911K130773J257476
$$ 11486315 6079963 506915 -1703530 -3254910 -5795985 -6616896 -4486123 -3228647
9405c228647k686080l626033k61527J767843j09028m17246M952833J0290727P357901
$$ -3228647 -5914727 -9540760 -9802287 -8034444 -8143472 -8560718 -3607885 6682842 14040743
9396A4040743k338317r218646q134705l044278N48428J837174K117619J227659
$$ 14040743 11702426 2483780 -5650925 -8695203 -8146775 -6309601 -4191982 -2964323
9388b964323n06665l22088L335474O817038M605671k874106p684089l130570O857996
$$ -2964323 -3470988 -3793076 -457602 6359436 10965107 8091001 406912 -2723658 4134338
9379D134338J0721276L100524p920951j1015938n825256j001992j86439J337456
$$ 4134338 14855614 17956138 10035187 -980751 -6806007 -7807999 -7994438 -6656982
9371f656982N168900N161498j006332n122173j103328L594884n88647q579413
$$ -6656982 -1488082 3673416 2667084 -2455089 -3558417 36467 -552180 -9131593
9363i131593p733773J645662O473163J439394m367052m141276l036288n235921
$$ -9131593 -16865366 -15219704 -8746541 -7307147 -11674199 -15815475 -18851763 -24087684
9355b4087684m109607N139690J3056522Q361362l414749o684874J552290Q708591
$$ -24087684 -28197291 -23057601 -10001079 -1639717 -5054466 -11739340 -10187050 -1478459
9347a478459O621614K069340L256830O520447L901100l144228o303538l225781
$$ -1478459 5143155 7212495 10469325 16989772 20890872 17746644 11443106 8217325
9339H217325M04687N48075q30198j635177l053745n021926m395741r54951K50199
$$ 8217325 8622012 9170087 8339889 6704712 3650967 -1370959 -5766700 -6721651 -6471452
9330f471452l026422m934880l43812N452203L860348k922823m612829Q16035M240495
$$ -6471452 -9497874 -14432754 -14776566 -9324363 -5464015 -8386838 -12999667 -12183632 -7943137
9321g943137J224634m26073N182733J0354038N295903n878949j0849672o233011
$$ -7943137 -6718503 -7144576 -1961843 8392195 13688098 7809149 -3040523 -9273534
9313i273534R33138N476686P539696N997176m44314n899737k244797P105684R177583
$$ -9273534 -8340396 -2863710 4675986 10673162 10228848 4329111 2084314 9189998 18367581
9304A8367581J97559q189612o298985K745K87808m135252m302190J046241M138551
$$ 18367581 18565140 10375528 4076543 4079288 4367096 231844 -4070346 -3024105 1114446
9295A114446R18241l314431k318628K885098O605726N913443K936045P64816p83640
$$ 1114446 2032687 -1281744 -3600372 -715274 5890452 11803895 14739940 15504756 14721116
9286A4721116l771329o915249n302846J899276P023456K902255n861877q168797
$$ 14721116 10949787 4034538 -1268308 630968 7654424 10556679 4694802 -3473995
9278c473995k312331K575570K138753K689129O863548N528376o283804j5622264
$$ -3473995 -5786326 -3210756 -1072003 1617126 8480674 14009050 7725246 -7897018
9270g897018p986669Q628772J2689457Q11105p293359L02521R438382L181941
$$ -7897018 -15883687 -7254915 5434542 6245647 -1047712 -745191 8693191 11875132
9262A1875132j0526906j0826928L659000J2571448M098572r015050r536186J000230
$$ 11875132 1348226 -9478702 -5819702 6751746 10850318 1835268 -7700918 -6700688
9254f700688Q277417N966542L0472l410394m500281m920637m627899l632757j627117
$$ -6700688 1576729 7543271 7573743 4163349 -336932 -5257569 -9885468 -13518225 -15145342
9245a5145342L095497R097144Q963317j421044j3094923j3239358l472396K244987
$$ -15145342 -12049845 -2952701 6010616 4589572 -8505351 -21744709 -25217105 -22972118
9237b2972118r01090k153602N246587J1573289O619005l198400n492443j116530
$$ -22972118 -23873208 -26026810 -20780223 -9206934 -2587929 -5786329 -11278772 -12395302
9229a2395302M88855r16636K203982Q712326Q529955j80801o526580l012958M167161
$$ -12395302 -11906447 -12823083 -10619101 -1906775 6623180 6442379 -84201 -3097159 1070002
9220A070002N377597K11402m630557m758816j629780M07808r40797k553173M62420
$$ 1070002 6447599 6659001 2028444 -2730372 -4360152 -3952344 -4893141 -7446314 -6983894
9211f983894N830383M584075m646548r676664j999483Q066971O341533k114087
$$ -6983894 -1153511 3430564 -1215984 -10892648 -12892131 -4825160 1516373 -597714
9203e97714j729979O206694N507529n525155r201744J370824R227540J450884
$$ -597714 -2327693 3879001 9386530 3861375 -5340369 -3969545 5257995 6708879
9195F708879r575714p465174K163659M294896J02913Q36363N337484L547666k826376
$$ 6708879 -2866835 -10332009 -8168350 -3873454 -3770541 -2934178 2403306 5950972 3124596
9186C124596k594796M015960N202422j101597l293297L152448P137251M48588
$$ 3124596 529800 4545760 9748182 8646585 5353288 8505736 15642987 16091575
9178A6091575q706280r009341k483702J579904J521903K259362L961360J910976
$$ 16091575 7385295 -1624046 -4107748 -2527844 -1005941 1253421 5214781 7125757
9170G125757l369179m936751m42559K899837j055379o782183m097543N915496
$$ 7125757 3756578 -1180173 -1622732 1277105 221726 -6560457 -10658000 -4742504
9162d742504J0469680L055914o296152n133180L421727O106144o90275p422669
$$ -4742504 5727176 8783090 2486938 -2646242 775485 6881629 6191354 -1231315
9154a231315o921934k458145J110891L809088N458418L771980M73102K8986K19868
$$ -1231315 -8153249 -10611394 -9500503 -5691415 -232997 3538983 4012085 4041071 4260939
9145D260939n048991j1372271o352229Q537842J4329045J822292j2718858j1360076
$$ 4260939 -788052 -12160323 -18512552 -9974710 4354335 6176627 -6542231 -17902307
9137a7902307J26151N735542N229166Q055486J1141133M267648p307782p446607
$$ -17902307 -17776156 -12040614 -6811448 1244038 12385171 16652819 9345037 1898430
9129A898430M039929R411914O17812r357677p890690L98963M967230M511093L253908
$$ 1898430 5938359 15350273 15968085 6610408 -1280282 -881319 4085911 8597004 11850912
9120A1850912J962317l40376k604484m211327n324715l235499M219214J0939418
$$ 11850912 13813229 13472853 10868369 6657042 1332327 -1903172 2316042 13255460
9112A3255460P563968m117587j1327397p423059K55787K413355j115067n146997
$$ 13255460 20819428 16701841 5374444 -2048615 -1792828 620527 -494540 -5641537
9104e641537n792756j038155P130443R901417L65985j3505493j5279702j964066
$$ -5641537 -11434293 -12472448 -5342005 4559412 4925397 -8580096 -23859798 -25823864
9096b5823864J1465307J2618193N322611j310588n153559o280065j676493P190712
$$ -25823864 -14358557 -1740364 3582247 2271659 -2881900 -9161965 -10838458 -3647746
9088c647746J1213094O108091m16504j196513l57630l660287p074670m224275
$$ -3647746 7565348 13673439 13256935 12060422 11702792 8042505 967835 -3256440
9080c256440K245817N804278N860819M152951j319856r682001j2006377l227007
$$ -3256440 -1010623 4793655 10654474 14807425 13487569 3805568 -8200809 -11427816
9072a1427816P154393P172007l83804l997602j344254J063073J756307M387828
$$ -11427816 -4273423 2898584 2514780 -1482822 -2827076 -1764003 -7696 4380132
9064D380132O421469J703579o000551n758382K634692O666438M82992o158329
$$ 4380132 10801601 12505180 6504629 746247 3380939 10047377 10530369 4372040
9056D372040l949250J872153J301560m740296p472618m197887n35732m45318j166131
$$ 4372040 422790 2294943 3596503 -1143793 -8616411 -12814298 -13350030 -13795348 -14961479
9047a4961479J192082N647646P666581M625467j122551m394360k399848K341750
$$ -14961479 -13769397 -8121751 -455170 4170297 3047746 -1346614 -3746462 -1404712
9039a404712M726031K223039l144832o891810n519624L11515N071951L299045
$$ -1404712 3321319 5544358 2399526 -4492284 -10011908 -9700393 -4628442 -1329397
9031a329397l254534o545635k469597L787847N945532N425889O461415O905184
$$ -1329397 -4583931 -11129566 -13599163 -9811316 -3865784 1560105 8021520 14926704
9023A4926704K116479m389159l974051K879336N308638j480519p705481l464092
$$ 14926704 17043183 12654024 8679973 11559309 16867947 15387428 7681947 4217855
9015D217855N326728M574521p428598j6712413j2223216J31295O544651L406028
$$ 4217855 9544583 14119104 6690506 -10021907 -22245123 -22113828 -15569177 -12163149
9007a2163149m26758J643148M572882J043791n241774l658255O717043J3530663
$$ -12163149 -12589907 -10946759 -6373877 -5330086 -10571860 -14230115 -7513072 6017591
8999F017591P962807k588427n732968k350310l527253j1204028j3538296k836993
$$ 6017591 13980398 11391971 5659003 3308693 -218560 -11422588 -24960884 -27797877
8991b7797877J1624852J5410509P303710j739809m416913l653611l945664l876950
$$ -27797877 -16173025 -762516 6541194 4801385 384472 -3269139 -7214803 -11091753
8983a1091753j63715N561935P905492M139331k882374p627161o506034m11827
$$ -11091753 -11255468 -5693533 2211959 6351290 3468916 -4158245 -10664279 -11076106
8975a1076106O127727Q631502O305686K028788j193724k836920l626211l271881
$$ -11076106 -4948379 3683123 9988809 12017597 10823873 7986953 4360742 1088861
8967A088861j202202J062519P24122k270522m152307k129807J329872J756070
$$ 1088861 -113341 949178 1673300 -597222 -4749529 -6879336 -5549464 -3793394
8959c793394o44011j194237J909452M556160L147178K75203K99160K195991J781085
$$ -3793394 -4437405 -5631642 -3722190 833970 3981148 4256351 4555511 6751502 8532587
8950H532587p21269j333570k45558k139384o742574o372336K310860J0309090
$$ 8532587 7811318 6477748 6232190 4092806 -2649768 -9022104 -6711244 3597846
8942C597846P379620k721718o786472o92431N854739M545828o99273k435015j333858
$$ 3597846 10977466 8255748 1469276 776845 6631584 11177412 10478139 8043124 6709266
8933F709266k309178m501205l238704P70508K153223n8954j307944L32306J709610
$$ 6709266 4400088 -101117 -3339821 -2569313 -416090 -475044 -1782988 -1450682 258928
8924B58928J327381J750541L165211J246745m749610p636652j561018Q135297
$$ 258928 1586309 3336850 6502061 7748806 2999196 -4637456 -6198474 1936823
8916A936823J0371323K248161p674000j0052573m593065J831758L877658K330666
$$ 1936823 12308146 14556307 6882307 -3170266 -7763331 -5931573 -2053915 276751
8908B76751Q73795P34998N68505P37130L536811P305483N355142m047609j1046197
$$ 276751 1150546 1885544 2454049 3191179 6727990 14033473 19388615 15341006 4294809
8899D294809n825978N584489P813706j285792o997747o86617O578941K051988
$$ 4294809 -1531169 4053320 11867026 10581234 3583487 2896870 9475811 11527799
8891A1527799q052051q514056J188340P103971K215672n359354o227138j038885
$$ 11527799 3475748 -5038308 -3849968 3254003 5469675 110321 -6116817 -7155702
8883g155702M201157N851189L400045j212469l766030k251757n82533k533175
$$ -7155702 -2954545 2896644 6296689 5084220 1318190 -933567 -1516100 -4049275
8875d049275m326307m15808N842696O287518J189314j512526L91590J355855k87777
$$ -4049275 -8375582 -8791390 -2948694 3338824 4528138 3015612 3407202 4763057 4475280
8866D475280j03314J627204r08716o065695l839848O828439J2611488N245268
$$ 4475280 4371966 5999170 5090454 -975241 -4815089 2013350 14624838 19870106
8858A9870106n259201o239817p91298M73111k793643l702266k294499l192137
$$ 19870106 14610905 8371088 7579790 8052901 5259258 1556992 -737507 -3929644
8850c929644l373566L607491J2654645J0437937m295865j5878987j1724519K059439
$$ -3929644 -7303210 -3695719 8958926 19396863 15100998 -777989 -12502508 -10443069
8842a0443069J0359828P416333k59654m632780l846043r06245P81340J07957j606527
$$ -10443069 -83241 7333092 7073438 2440658 -1405385 -2311630 -1530290 -1422333 -3028860
8833c028860k533537k271800j539718o45365O90764K406569L777283L674605J253291
$$ -3028860 -5562397 -7834197 -9373915 -10019280 -9328516 -6921947 -3144664 529941 1783232
8824A783232k455314m207983k040193J454367K342753J159500J452426L237233
$$ 1783232 -672082 -4880065 -6920258 -5465891 -3123138 -1963638 -511212 2726021
8816B726021L292616J698736J416820J152724k993615p463585l185921Q654773
$$ 2726021 6018637 7717373 9134193 10286917 7293302 -170283 -3356204 5298569
8808E298569J4066241N984456m651579o297669l730735n678693o798112J589500
$$ 5298569 19364810 25349266 20697687 14400018 10669283 4990590 -1807522 -218022
8800b18022J1108534O434075p994986j2138365j571500O196789O04636p046901
$$ -218022 10890512 17324587 9329601 -2808764 -4380264 1816525 2421161 -4625740
8792d625740n315668m73042j541703l770578l58418K962607m81070l756824J277471
$$ -4625740 -9941408 -10414450 -11956153 -15726731 -16085149 -13122542 -13603612 -17360436 -16082965
8783a6082965P224823L518595l179658L67350R395789P938774k980949o111522
$$ -16082965 -8858142 -5339547 -8519205 -8151855 1243934 9182708 6201759 90237
8775I0237K212746N692072l103365r531828k577456O178358L403429l031474O24851
$$ 90237 2302983 7995055 4891690 -4640138 -7217594 -1039236 2364193 -667281 -42430
8766d2430Q771855O487980l592421n480627K685709O227114j41682l820340K806772
$$ -42430 8729425 15217405 11624984 6144357 8830066 15057180 14915498 11095158 13901930
8757A3901930Q408315J186104j1521466j3608139k658128Q405905Q487201p44792
$$ 13901930 22310245 23496349 11974883 -1633256 -4291384 4114521 12601722 11856930
8749A1856930r314291r124134q92075O310798M191045n163334j1720648r253436
$$ 11856930 2542639 -6581495 -7473570 -1162772 3028273 -2135061 -13855709 -23109145
8741b3109145k48025R724006J5871181J3374900J650377r941288j0320865k007990
$$ -23109145 -23357170 -13633164 2238017 15612917 17263294 7322006 -2998859 -5006849
8733e006849K421429N34570K849420J1441223J2309239j391763j4188732j0438927
$$ -5006849 -2585420 -2050850 798570 12239793 24549032 23157269 8968537 -1470390
8725a470390J164259K071723o809736r129267p05987O116331M116748k89161r88379
$$ -1470390 -306131 1765592 -5044144 -14173411 -14879398 -8763067 -4646319 -4935480 -5923859
8716e923859M23682K528891O115882P452107K050177m698566l404692L104479
$$ -5923859 -5500177 -2971286 3144596 10596703 12646880 7948314 4543622 7648101
8708G648101L117624m410220q303293m171218J66922L40268J219757M024761K901699
$$ 7648101 10765725 6355505 -1947788 -6119006 -5952084 -5611816 -4392059 -367298 2534401
8699B534401j796626j926698K662172K306219m018452n004606K456414O379895
$$ 2534401 737775 -1188923 1473249 3779468 -238984 -5243590 -2787176 3592719
8691C592719Q25825l609061L48420L879686J97802k072430L172321N239772l999280
$$ 3592719 4418544 809483 1157903 5037589 5235391 3162961 6335282 11575054 7575774
8682G575774j2177304n861562N632981N455555k955594l992553K797410M953947
$$ 7575774 -4601530 -10463092 -4830111 625444 -2330150 -6322703 -3525293 1428654
8674A428654J038130J040879N520506M513681k827519n801813r10804L020058
$$ 1428654 2466784 3507663 9028169 13541850 10714331 4912518 4001714 7021772
8666G021772P67445k299684j730284l54394o78105j020477p83906j179149q81912
$$ 7021772 7789217 5489533 3759249 3404855 2726750 1706273 922367 -256782 -1138694
8657a138694J454924K540162q1033j931523P82338L234058J066273l6005M605223
$$ -1138694 316230 2856392 2775359 843836 1626174 4860232 5926505 5890500 10495723
8648A0495723O507636k566151j2976045r997366K146111P402925L760290K254964
$$ 10495723 17003359 14437208 1461163 -8536203 -6390092 1012833 4773123 7028087
8640G028087M230265R54506n994727n837039K03965N97578l491182j9697Q113948
$$ 7028087 11258352 12212858 6218131 381092 585057 1182635 -2308547 -2328244 5785704
8631E785704M566840r412576j2563839L34749P591783k800145j2852488o484126
$$ 5785704 10352544 939968 -11623871 -11289122 -3697339 -6497484 -19349972 -25834098
8623b5834098L887689K361499j832156N812397J5656079J0617499j729415j187015
$$ -25834098 -21946409 -19584910 -21417066 -15604669 51410 10668909 8939494 7752479
8615G752479R765819R971386m608396j4513556p685518M605020P112066m90064
$$ 7752479 17518298 27489684 22881288 8367732 682214 5287234 12399300 11909236
8607A1909236q816005j0769715m941834L974172P303088K466945j405503L607354
$$ 11909236 3093231 -7676484 -12618318 -8644146 -1341058 1125887 -279616 3327738
8599C327738J0320734O756613l893768p408488p89808M121666K70130n031353
$$ 3327738 13648472 20405085 16511317 9102829 8313021 12434687 12704817 7673464
8591G673464l668637J455224L099119J19580l067527k105946M182537J1630125
$$ 7673464 4004827 5460051 8559170 8678750 5611223 3505277 7687814 19317939
8583A9317939J1882840J323098j1969437j6321883j0545448l583556j514900k015017
$$ 19317939 31200779 32523877 20554440 4232557 -6312891 -9896447 -11411347 -13426364
8575a3426364r54881K442970O686505Q522474M086815m664134q128990j168966
$$ -13426364 -14381245 -11938275 -5251770 3270704 7357519 2693385 -5435605 -6604571
8567f604571P001645M726529l893294m905581L038392O385325j019277p492401
$$ -6604571 397074 5123603 1230309 -3675272 -636880 5748445 4729168 -2763233
8559b763233j743844R736883J2285776K961592p626250r631436l432357L432936
$$ -2763233 -4507077 5229806 17515582 20477174 12850924 3219488 -212869 3220067
8551C220067M341679n39303m559375k156956L990858O514876L369002o12307k196967
$$ 3220067 7561746 7022443 2463068 306112 4296970 10811846 14180848 13568541 11371574
8542A1371574l731189o915010q314670m351768K934973P952131P223363J878097
$$ 11371574 7640385 725375 -7589295 -11941063 -9006090 -1053959 6169404 8047501
8534H047501l372354l836383N4680K375110m19133l588665r07045N132166O503331
$$ 8047501 4675147 838764 893444 3268554 2849421 -739244 -1646289 3485877 9989208
8525I989208J642175k941232k579680R94371M507199N525274J261940o834460
$$ 9989208 11631383 8690151 6110471 7104842 11612041 17137315 18399255 11564795
8517A1564795r308575j20191R807332M394191j1499126j4701133K212861J7395696
$$ 11564795 2256220 2136029 11943361 16337552 4838426 -9862707 -7649846 9745850
8509I745850J1055463o179543j1936423n648858l329864p367751m631060O906558
$$ 9745850 20801313 14621770 2685347 -2963511 -6293375 -13661126 -18292186 -11385628
8501a1385628J2240913M526022l267086o7169O105333L353362m600527o645865
$$ -11385628 855285 5381307 2114221 2047052 8152385 11505747 6905220 259355
8493B59355k746934r95896k107214J7791N026332N852658J694674Q0228L707892
$$ 259355 -2487579 -3483475 -5590689 -5572898 -546566 5306092 7000766 7080994 10788886
8484A0788886M930420k053531j0859699j1078311k758705L821221K168041k288976
$$ 10788886 15719306 13665775 2806076 -8272235 -11030940 -7209719 -5041678 -7330654
8476g330654n70651O580385Q759997K16013j0732966j1533217k070879N762437
$$ -7330654 -7901305 -1320920 7439077 7655090 -3077876 -14611093 -16681972 -10919535
8468a0919535N297618L035033N675903Q230848K982258o162553q410249k040806
$$ -10919535 -5621917 -2586884 3089019 11319867 14302125 8139572 -270677 -2311483
8460b311483M248270M621220J449611j893698m233647k876168L428701P636439
$$ -2311483 1936787 6558007 8007618 6113920 1880273 -995895 2432806 10069245
8452A0069245J515612r212178r302864L148580J1645853N183617o138214q430358
$$ 10069245 11584857 2372679 -6930185 -3781605 7864248 13047865 6909651 -1520707
8444a520707m348744l779339m643278J617354J1573072J2736120L057363o249897
$$ -1520707 -5869451 -9648790 -14292068 -12674714 -1101642 11634478 14691841 8441944
8436H441944p349290l646253p15683J91320j041397l864360m065153J439020P658446
$$ 8441944 1092654 -2553599 -3269282 -3077962 -4119359 -7983719 -12048872 -10609852 -2951406
8427b951406P703866L865757L154008M613773K446694q91496J462507N032572
$$ -2951406 4752460 8618217 11772225 16385998 18832692 17941196 19403703 24436275
8419B4436275j748945j5651858j8260663l507266J0578612P200703n756255r471863
$$ 24436275 22687330 7035472 -11225191 -14732457 -4153845 3046858 -2709397 -12181260
8411a2181260r18542P287459P067697K099695k015514l868650l170516K37380
$$ -12181260 -13099802 -5812343 1255354 3355049 1339535 -2529115 -5699631 -5462251
8403e462251L788157L818998R0299l991549m739902p97610N057617O618677R44183
$$ -5462251 -1674094 2144904 2235203 -1756346 -6496248 -7293858 -2236241 4382436 5326619
8394E326619n887188n364884J450719N661780M043389J856387J520134q27923
$$ 5326619 -560569 -5925453 -4474734 1187046 5230435 7086822 8606956 7779033
8386G779033m948542m081449K584823O076442J993603k005742K71548L172862
$$ 7779033 2830491 -1250958 1333865 7410307 9403910 7398168 7669716 10842578
8378A0842578L11890l923210l126394l71566j321814l462445j902247P45405k10171
$$ 10842578 11154468 7231258 4104864 3733298 2411484 -1050961 -2953208 -2207803 -2417974
8369b417974k116008j22380L422280L189008j47187k427193k757194j744358J335864
$$ -2417974 -4533982 -4656362 -1234082 1954926 1807739 -619454 -3376648 -5121006 -3785142
8360c785142M537255L452354k15123N76709M627068J887883p605288r033843L590994
$$ -3785142 752113 4204467 3989344 4566053 9193121 11081004 3475716 -5558127 -1967133
8351a967133J4669884J0481160J31900k224796j029039o466870j1662046m910728
$$ -1967133 12702751 23183911 23315811 21091015 20061976 13595106 1933060 -2977668
8343b977668N657526L540828o978423p356121L726243R464328L803984k105698
$$ -2977668 2679858 6220686 -757737 -8113858 -4387615 5076713 8880697 6774999
8335F774999k460628l475771o193508m002372Q02456j159295o197020r18811J1631234
$$ 6774999 4314371 838600 -5354908 -9357280 -8554824 -9714119 -15911139 -16829950 -5198716
8326e198716J2342405k171337j1290826k255052J1151515J2177539M211195j118772
$$ -5198716 7143689 4972352 -6318474 -8573526 2577989 14755528 18966723 17847951
8318A7847951k221598k413165q23666J308923j810491q504053q520303p35169
$$ 17847951 15626353 13213188 12389522 13698445 11887954 3383901 -5136402 -5871571
8310e871571L029801j468051l417620K211389M756467j217271m085505L012082
$$ -5871571 -2841770 -4309821 -7727441 -5516052 -759585 -1976856 -6062361 -3050279
8302c050279P055370k499264j2942105p838495O282571J1323144N010379r86423
$$ -3050279 4005091 1505827 -11436278 -19274773 -12992202 -1669058 3341321 2354898
8294B354898j717448r69131K94461K510593J241245m585442o175648Q01933N388253
$$ 2354898 637450 -331681 -37220 2473373 3714618 -870824 -7046472 -6244539 -856286
8285h56286j072741p554449m70726J1921814J1656074n0488o610954l777245k447525
$$ -856286 -1929027 -9483476 -9954202 1967612 13623686 13573198 6962244 3184999 737474
8276G37474n797827m488752L602979P488329J301274o352289o130023J90611N311561
$$ 737474 -5060353 -9549105 -5946126 1542203 2843477 -3508812 -9638835 -9448224 -4136663
8267d136663N263922Q26129l247137j344087M894375O100515m46750l941629K653217
$$ -4136663 1127259 1953388 -1293749 -2637836 2256539 8357054 7910304 3968675 6621892
8258F621892Q409812J712118q077668m889181N648021M373179q348792j2083335
$$ 6621892 15031704 16743822 8666154 3776973 9424994 13798173 5449381 -6633954
8250f633954l97607Q633647K457822p188732n653803K626720N521250K494664
$$ -6633954 -7031561 1602086 4059908 -3128824 -8782627 -6155907 -634657 1860007
8242A860007L37087J02567p73882j186852R9525L46302j330701j078075J798425
$$ 1860007 2197094 2299661 1525779 338927 438452 784754 -545947 -1624022 174403
8233A74403K121603j358906k411987J409658L324592j059913n816879m761730
$$ 174403 2296006 937100 -1474887 -65229 3259363 2199450 -3617429 -8379159
8225h379159r19885N84819J062393L102041M403890L140963K399621L526939K501706
$$ -8379159 -9299044 -8714225 -7651832 -4549791 -145901 2995062 5394683 8921622 11423328
8216A1423328j526684k348201K446350N300834N56395n881599o568437l964980
$$ 11423328 9896644 7548443 9994793 15295627 15852022 9970423 3401986 -562994
8208e62994l196803j568547M457966Q924472M497765m261082p204994m161406
$$ -562994 -3759797 -5328344 -870378 8054094 12551859 8290777 1085783 -3075623
8200c075623k734509l848144j762560L053080L741143M02757J336558P968515
$$ -3075623 -5810132 -9658276 -11420836 -8367756 -4626613 -4223856 -2887298 5081217
8192E081217R844322K23941j2183431j4119888m690255N439299Q157341M734716
$$ 5081217 14925539 15149480 2966049 -11153839 -15844094 -10404795 -2247454 2487262
8184B487262K42041k663887l557737k328963J60604J572597N42051j070486l82119
$$ 2487262 2729303 65416 -3492321 -5821284 -5660680 -4088083 -3546032 -4616518 -4998637
8175d998637K111719K588009p36929m570900m817045j895892Q83596K449529L821091
$$ -4998637 -2886918 -298909 -1035838 -5606738 -10423783 -12319675 -11436079 -8986550 -5165459
8166e165459M183150J761237j626602j923640M94506O90359k496405l306796K249846
$$ -5165459 -982309 778928 -847674 -2771314 -2276808 -1586449 -4082854 -7389650 -5139804
8157e139804Q964366Q689525J752915l195030q03415M009796K936655m484451
$$ -5139804 3824562 12514087 14267002 11071972 10268557 14278353 17215008 12730557
8149A2730557j0251511q638714l363399q79824k90983L407171P822194M809959
$$ 12730557 2479046 -6159668 -9523067 -10402891 -10693874 -7286703 535491 5345450
8141E345450m316930o686273K455421R317698J820310r707395p435192N316234
$$ 5345450 1028520 -5657753 -3202332 6115366 7935676 -1771719 -9206911 -3890677
8133c890677R189752N3787n625847O65018O368242R64288o785734o219722k925182
$$ -3890677 5299075 5352862 -272985 392033 6760275 7724563 938829 -5280893 -8206075
8124h206075n138180n839593M302395J5994340J2304838m237367j3695336p052218
$$ -8206075 -13344255 -19183848 -14881453 1112887 13417725 9180358 -4514978 -11567196
8116a1567196L665911N474125N24213k391037j546655j322424l728084n846326
$$ -11567196 -7901285 -2427160 -1902947 -4293984 -5840639 -7163063 -10891147 -16737473
8108a6737473l432076M059078J0512092P869367k741681q942454k179520R250099
$$ -16737473 -20169549 -16110471 -5598379 2270988 -470693 -9413147 -11592667 -2342568
8100b342568J0189871j178156j1947434j2030809m216741L527198P461484P936754
$$ -2342568 7847303 6669147 -5278287 -17309096 -21525837 -17998639 -10537155 -2600401
8092b600401O229711L811335J296991j911426m513146k969544J876518K856453
$$ -2600401 3629310 7440645 8737636 6826210 2313064 -656480 1220038 4076491
8084D076491k764188o347332k68181Q371352P582427l19594k723686K373596M421274
$$ 4076491 1312303 -5035029 -5303210 3068142 10650569 10330975 7607289 9980885 14402159
8075A4402159k70882k790613J087253K919213k589994p195968l162469L447055
$$ 14402159 14131277 11340664 12427917 15347130 12757136 5561168 2398699 5845754
8067E845754L255074j503533k573913N93612K490976J880880J423128P62566j872829
$$ 5845754 9100828 7597295 5023382 5616994 8107970 9988850 11411978 12174544 10301715
8058A0301715m153249k909524l38734o87854l282174m382221l178473r04738K643950
$$ 10301715 6148466 3238942 2900208 2212354 -1069820 -5452041 -8630514 -9535252 -6891302
8049f891302O645741P138137K813319r78296K83235K886672J156539l123681m610143
$$ -6891302 -245561 6892576 9705895 8727599 9010834 11897506 13054045 9930364 5320221
8040E320221l750548m216347m265855K60428O121262N377046j934435o664921
$$ 5320221 1569673 -2646674 -6912529 -6652101 -530839 4846207 2911772 -3753149
8032c753149l681609J564956K038023j762642m640160l742485K0849M027514N418410
$$ -3753149 -7434758 -5869802 -3831779 -5594421 -10234581 -13977066 -13956217 -9928703 -4510293
8023d510293L325651O21550Q61674L418704M556994K939666P74184o4923K32327
$$ -4510293 -1184642 -563092 298582 3717286 8274280 11213946 11988130 11923207 12155534
8014A2155534Q89357P17930j741480n082707m664118L85870L287922j140045o807492
$$ 12155534 13044891 13762821 12021341 6938634 2274516 2660386 5948308 4808263 -1999229
8005a999229m249368M026226O223910o95438o565800m133596J085920J954146
$$ -1999229 -6248597 -2222371 4001539 3306101 -3259699 -7393295 -6307375 -4353229
7997d353229R11483K963799N451485L309997j159712k562131k401799n704298
$$ -4353229 -3441746 -477947 4973538 8283535 7123823 4561692 2159893 -3544405
7989c544405r955658o975573L670578J1613577Q882324l6384n109381l424439
$$ -3544405 -13500063 -20475636 -16805058 -5191481 3690843 3654459 -1454922 -4879361
$$ [...]
##END NTUPLES=NMR SPECTRUM
##END=
