##TITLE=31Pdec_SR116_F
 , 24 sc
 5.4.2022
##JCAMPDX= 6.0         $$ Bruker NMR JCAMP-DX V2.0
##DATA TYPE= NMR SPECTRUM
##DATA CLASS= NTUPLES
##ORIGIN= UXNMR, Bruker Analytische Messtechnik GmbH
##OWNER= root
$$ XWIN-NMR		Version 3.5
$$ Tue Apr  5 10:55:35 2022 Russian Standard Time (UT+4h)  she@DPX200
##.OBSERVE FREQUENCY= 81.013821
##.OBSERVE NUCLEUS= ^31P
##.ACQUISITION MODE= SIMULTANEOUS
##.ACQUISITION SCHEME= undefined
##.AVERAGES= 24
##.DIGITISER RES= 16
##SPECTROMETER/DATA SYSTEM= spect
##.PULSE SEQUENCE= zgpg30
##.SOLVENT NAME= CDCl3
##.SHIFT REFERENCE= (INTERNAL, CDCl3, 0, 248.564)
##AUDIT TRAIL= $$ (NUMBER, WHEN, WHO, WHERE, WHAT)
$$ ##TITLE= Audit trail, XWIN-NMR		Version 3.5
$$ ##JCAMPDX= 5.01
$$ ##ORIGIN= Bruker BioSpin GmbH
$$ ##OWNER= she
$$ F:/spectra/data/she/nmr/P31/1/pdata/1/auditp.txt
$$ ##AUDIT TRAIL=  $$ (NUMBER, WHEN, WHO, WHERE, WHAT)
(   1,<2022-04-05 10:54:31.45 +0400>,<she>,<DPX200>,
      <created by zg, POWCHK disabled, PULCHK disabled
       configuration hash MD5:
       00 E9 B6 7A A2 85 ED C7 34 08 36 98 17 FE 4E 26
       data hash MD5: 32K
       32 9E 1B 4F 57 33 48 9F FE D1 58 59 74 54 D3 B4>)
(   2,<2022-04-05 10:54:33.75 +0400>,<she>,<DPX200>,
      <Start of raw data processing
       efp BC_mod = 2 LB = 1 FT_mod = 6 PKNL = 1 PHC0 = -9545.229 PHC1 = 100.2756 SI = 64K 
       data hash MD5: 64K
       6C 7C A9 54 AF D0 36 E1 F8 87 45 E2 C8 C5 13 80>)
(   3,<2022-04-05 10:54:57.62 +0400>,<she>,<DPX200>,
      <pk PHC0 = -27.05594 PHC1 = 53 
       data hash MD5: 64K
       4E 22 49 08 35 BE 8D 3D 41 4F 74 0D 58 1E F7 A1>)
$$ ##END=
$$ 
$$ hash MD5
$$ 60 11 A1 AA C6 5C 2F 45 CA 1D 04 B1 7A B1 5E EE
##$RELAX= 
##$RELAX= 
##$RELAX= 
##$RELAX= 
##$RELAX= 
##$RELAX= 
##$RELAX= 
##$RELAX= 
$$ Bruker specific parameters
$$ --------------------------
##$DU= <F:/spectra>
##$EXPNO= 1
##$NAME= <P31>
##$PROCNO= 1
##$TYPE= <nmr>
##$USER= <she>
##$AMP= (0..31)
100 100 100 100 100 100 100 100 100 100 100 100 100 100 100 100 100 100 
100 100 100 100 100 100 100 100 100 100 100 100 100 100 
##$AQSEQ= 0
##$AQ_mod= 1
##$AUNM= <au_zg>
##$AUTOPOS= <>
##$BF1= 81.014009
##$BF2= 200.13
##$BF3= 200.13
##$BF4= 200.13
##$BF5= 200.13
##$BF6= 200.13
##$BF7= 200.13
##$BF8= 200.13
##$BYTORDA= 1
##$CFDGTYP= 0
##$CFRGTYP= 5
##$CHEMSTR= <none>
##$CNST= (0..31)
1 1 145 1 1 1 1 1 1 1 1 1 1 1 1 1 1 1 1 1 1 1 1 1 1 1 1 1 1 1 1 1 
##$CPDPRG= <waltz16>
##$CPDPRG1= <>
##$CPDPRG2= <waltz16>
##$CPDPRG3= <>
##$CPDPRG4= <mlev>
##$CPDPRG5= <mlev>
##$CPDPRG6= <mlev>
##$CPDPRG7= <mlev>
##$CPDPRG8= <mlev>
##$CPDPRGB= <>
##$CPDPRGT= <>
##$D= (0..31)
0 1 0 0 0 0 0 0 0 0 0 0.03 2e-05 3e-06 0 0 0 0 0 0 0 0 0 0 0 0 0 0 0 0 
0 0 
##$DATE= 1649141670
##$DBL= (0..7)
120 120 120 11 120 120 24 19 
##$DBP= (0..7)
150 150 150 150 150 150 150 150 
##$DBP07= 0
##$DBPNAM0= <>
##$DBPNAM1= <>
##$DBPNAM2= <>
##$DBPNAM3= <>
##$DBPNAM4= <>
##$DBPNAM5= <>
##$DBPNAM6= <>
##$DBPNAM7= <>
##$DBPOAL= (0..7)
0.5 0.5 0.5 0.5 0.5 0.5 0.5 0.5 
##$DBPOFFS= (0..7)
0 0 0 0 0 0 0 0 
$$ [...]
##$SUBNAM2= <"">
##$SUBNAM3= <"">
##$SUBNAM4= <"">
##$SUBNAM5= <"">
##$SUBNAM6= <"">
##$SUBNAM7= <"">
##$SUBNAM8= <"">
##$SUBNAM9= <"">
##$SW= 501.771253377433
##$SWIBOX= (0..15)
0 1 3 0 0 0 0 0 0 0 0 0 0 0 0 0 
##$SW_h= 40650.406504065
##$TD= 32768
##$TD0= 1
##$TE= 0
##$TE2= 300
##$TE3= 300
##$TEG= 300
##$TL= (0..7)
0 120 53 12 22 120 120 120 
##$TP= (0..7)
150 150 150 150 150 150 150 150 
##$TP07= 0
##$TPNAME0= <>
##$TPNAME1= <>
##$TPNAME2= <>
##$TPNAME3= <>
##$TPNAME4= <>
##$TPNAME5= <>
##$TPNAME6= <>
##$TPNAME7= <>
##$TPOAL= (0..7)
0.5 0.5 0.5 0.5 0.5 0.5 0.5 0.5 
##$TPOFFS= (0..7)
0 0 0 0 0 0 0 0 
##$TUNHIN= 0
##$TUNHOUT= 0
##$TUNXOUT= 0
##$USERA1= <user>
##$USERA2= <user>
##$USERA3= <user>
##$USERA4= <user>
##$USERA5= <user>
##$V9= 5
##$VALIST= <valist>
##$VCLIST= <CCCCCCCCCCCCCCC>
##$VD= 0
##$VDLIST= <DDDDDDDDDDDDDDD>
##$VPLIST= <PPPPPPPPPPPPPPP>
##$VTLIST= <TTTTTTTTTTTTTTT>
##$WBST= 1024
##$WBSW= 4
##$XGAIN= (0..3)
0 0 0 0 
##$XL= 0
##$YL= 0
##$YMAX_a= 20035
##$YMIN_a= -48485
##$ZGOPTNS= <>
##$ZL1= 120
##$ZL2= 120
##$ZL3= 120
##$ZL4= 120
##$ABSF1= 0
##$ABSF2= 0
##$ABSG= 0
##$ABSL= 0
##$ALPHA= 0
##$AQORDER= 0
##$ASSFAC= 0
##$ASSFACI= 0
##$ASSFACX= 0
##$ASSWID= 0
##$AUNMP= <proc_1d>
##$AZFE= 0.1
##$AZFW= 0.5
##$BCFW= 0
##$BC_mod= 2
##$BYTORDP= 0
##$COROFFS= 0
##$CY= -3
##$DATMOD= 1
##$DC= 0
##$DFILT= <>
##$DTYPP= 0
##$F1P= 0
##$F2P= 0
##$FCOR= 1
##$FTSIZE= 65536
##$FT_mod= 6
##$GAMMA= 0
##$GB= 0
##$INTBC= 1
##$INTSCL= 5.30512e-09
##$ISEN= 30
##$LB= 1
##$LEV0= 0
##$LPBIN= 0
##$MAXI= 10000
##$MC2= 0
##$MEAN= 0
##$ME_mod= 0
##$MI= 50
##$NCOEF= 0
##$NC_proc= -6
##$NLEV= 6
##$NOISF1= 182.463
##$NOISF2= 159.3651
##$NSP= 0
##$NTH_PI= 0
##$NZP= 0
##$OFFSET= 248.5645
##$PC= 4
##$PHC0= -9572.284
##$PHC1= 153.2756
##$PH_mod= 1
##$PKNL= yes
##$PPARMOD= 0
##$PSCAL= 0
##$PSIGN= 0
##$REVERSE= no
##$SF= 81.014009
##$SI= 65536
##$SIGF1= 159.3651
##$SIGF2= -187.1042
##$SINO= 113.3802
##$SIOLD= 16384
##$SREGLST= <1H.CDCl3>
##$SSB= 0
##$STSI= 65536
##$STSR= 0
##$SW_p= 40650.406504065
##$SYMM= 0
##$S_DEV= 0
##$TDeff= 32768
##$TDoff= 0
##$TI= <>
##$TILT= no
##$TM1= 0
##$TM2= 0
##$TOPLEV= 0
##$USERP1= <user>
##$USERP2= <user>
##$USERP3= <user>
##$USERP4= <user>
##$USERP5= <user>
##$WDW= 1
##$XDIM= 65536
##$YMAX_p= 293754362
##$YMIN_p= -47255110
$$ End of Bruker specific parameters
$$ ---------------------------------
##NTUPLES= NMR SPECTRUM
##VAR_NAME=  FREQUENCY,     SPECTRUM/REAL,   SPECTRUM/IMAG
##SYMBOL=    X,             R,               I
##VAR_TYPE=  INDEPENDENT,   DEPENDENT,       DEPENDENT
##VAR_FORM=  AFFN,          ASDF,            ASDF
##VAR_DIM=   65536,         65536,           65536
##UNITS=     HZ,            ARBITRARY UNITS, ARBITRARY UNITS
##FACTOR=    0.620285442955139, 1,           1
##FIRST=     20137.2065510759, 0,            0
##LAST=      -20513.1999529892, 0,           0
##MIN=       -20513.1999529892, -47255110,   0
##MAX=       20137.2065510759, 293754362,    0
$$ Real data points
##PAGE= N=1
##DATA TABLE= (X++(R..R)), XYDATA
$$ [...]
38486C991641R07266R29440J184514R43719L44810L25430O99294L38987o19020
38477I046081p97267k7338K69954m47026r82156n77830o1154j14388j65389K03706
38467F347193L86280J31799K42162J003949J403846Q31691J45124Q0423J3880
38458A0586347o35104j133578p65276k08442l27180o62810l83582K50674O11631
38449G332680R10818J387625J268433J9602j191635r21469K53408N37555l47698
38440I249319r38771m57913K10497K38210P4736M07400J030314J384449J412938
38431A2611179J279355Q35174m4543r50514j258718q28964j01658M18519N97797
38422A2557627O27012O69597O72055N76388N34157O30096N41200l8984o45697
$$ plain form
38486 3991641 4898907 5828347 7012861 7956580 8301390 8626820 9326114 9665101 9046081
38477 9046081 8248814 8221476 8491430 8044404 7062248 6484418 6423264 6308876 6143487 6347193
38467 6347193 6733473 6865272 7107434 8111383 9515229 10346920 10492044 10572467 10586347
38458 10586347 9951243 8817665 8052389 7843947 7516767 6853957 6470375 6721049 7332680
38449 7332680 8243498 9631123 10899556 10919158 9727523 8806054 9059462 9597017 9249319
38440 9249319 8310548 7852635 8063132 8301342 8376078 8783478 9813792 11198241 12611179
38431 12611179 13890534 14725708 14681165 13730651 12471933 11642969 11541311 11959830 12557627
38422 12557627 13184639 13854236 14526291 15102679 15636836 16266932 16808132 16769148 16123451
38413A6123451l63668Q29232J642363R22264p99804j744910q31994J137072K311670
38404A9225676J716996K10470o85787p47234j087667j993839j937763P1956K144733
38395A6917541J486384j503031l297023j897653O50647J415495L57320n74992
38387A3554688o31395n93780p57257n66862p8309j06396p40469r85966k01396
38378H892858J005574J613976J329867P05517M69925P62414R06555K33427q16906
38369A5103207j081847l76509J26572k88187p51112l29544L57173K13252m73244
38360A2499761o13366j98313j65339o84612r66681o90802l73008l00248k21612
38351H285780j31619l14942n75626m07373N6215K15193P0348R6126J25689m51656
$$ plain form
38413 16123451 15759783 16589015 18231378 19153642 18353838 16608928 15776934 16914006 19225676
38404 19225676 20942672 21153142 20467355 19720121 18632454 16638615 14700852 14772808 16917541
38395 16917541 18403925 16900894 13603871 11706218 12356865 13772360 14129680 13554688
38387 13554688 12923293 12329513 11572256 11005394 10927085 10820689 10080220 9094254 8892858
38378 8892858 9898432 11512408 12842275 13547792 14017717 14780131 15686686 15920113 15103207
38369 15103207 14021360 13644851 13771423 13483236 12732124 12402580 12759753 12973005 12499761
38360 12499761 11886395 11688082 11522743 10838131 9871450 9180648 8807640 8507392 8285780
38351 8285780 8154161 7839219 7263593 6856220 6912435 7127628 7197976 7294102 7419791 6968135
38341F968135j310635j290873k08553O39035L22610m17589m25504J60591L05213
38332D742430l08585q79353n93444L98203J175729J037558K45368l02187j99174
38323E316545k6991m37026j123786j241362n79393K50998O07260K75295n59084
38314B482456j225510q77480L73271J110071L69689p25483l87911J068977J502201
38305C690281J33894j239263r34318K29702L93568n54333j061245l20993P16369
38296A053662Q17453R435o90949o05547o4675J98252P7227J92358Q30748J261991
38286C079955O95856l84724p18307p2249M10540p0003q57526r66081m90842j54703
38276D71916o0743K26587O77731P56434L66723J18894M48448R44107Q47805K5102
$$ plain form
38341 6968135 5657500 4366627 4158074 4797109 5119719 4702130 4276626 4437217 4742430
38332 4742430 4433845 3554492 2961048 3359251 4534980 5572538 5817906 5515719 5316545
38323 5316545 5289554 4852528 3728742 2487380 1907987 2158985 2766245 3041540 2482456
38314 2482456 1256946 379466 752737 1862808 2232497 1507014 1119103 2188080 3690281
38305 3690281 3824175 2584912 1650594 1880296 2273864 1719531 658286 337293 1053662
38296 1053662 1871115 1880550 1189601 584054 519379 717631 794858 987216 1817964 3079955
38286 3079955 3775811 3391087 2672780 2600531 3011071 2941068 2083542 1117461 626619 471916
38276 471916 411173 637760 1315491 2071925 2438648 2557542 3005990 3950097 4797902 4823004
38266D823004q15808r07220l08512J80423O4261j79388J69602Q85780R50562k3910
38256D838794j139281j322988o51175j15155l27931r19090j137231o82816J04957
38247a351916O68195P54135N76359M66199M29455K22340j37976k33872J96235
38238A589154P70605Q13875J46769o96240j046541p15873j6006O00868P88969
38229B235580M21237k55846o83187n51231k65056m14820p69261m48453O34075
38220i6962J277433N94739n52900o68332K84193J001760Q09330K74578q2048l66890
38210B474901m56159O3572P47830M75252o98780j259413m75961M89555N44357
38201A905154K38311L00130J53351o51374r63302J78713J441337R57500o24395
$$ plain form
38266 4823004 4007196 3099976 2791464 2971887 3036148 2856760 3026362 3912142 4862704 4838794
38256 4838794 3699513 2376525 1725350 1610195 1282264 363174 -774057 -1456873 -1351916
38247 -1351916 -683721 70414 646773 1112972 1542427 1764767 1626791 1392919 1589154
38238 1589154 2359759 3173634 3320403 2624163 1577622 861749 845743 1446611 2235580
38229 2235580 2656817 2400971 1717784 1166553 901497 486677 -282584 -731037 -96962
38220 -96962 1180471 1775210 1222310 553978 838171 1839931 2649261 2923839 2841791 2474901
38210 2474901 2018742 2082314 2830144 3305396 2606616 1347203 871242 1360797 1905154
38201 1905154 2143465 2443595 2596946 1945572 982270 1160983 2602320 3559820 2935425
38192B935425j048509Q0943R85010O84337N2579k16894n09445p54197q1692J287962
38182C415519J702478N32832o63268m44993M83611O69879J04431k40875j60941
38173E398673k09707m42744k98961L94843J062119J038936K69000n85247o92596
38164E934316J7245N98433K13943p02464j034961m71761L76051J026109J316236
38155G273147Q59401m59149j589844j277889O3260P97339M47882J52775N39839
38146F806761P63364J70067n67907o84639m34630l09151k32134p3162P2343M35387
38136E946299J240694J679428P13067q92538j147387J27202Q75744J20457n41674
38127H121292J10541P73841J15242o61302R2242J436378J313931o2590p08527
$$ plain form
38192 2935425 1886916 1967859 2952869 3637206 3689785 3472891 2963446 2209249 2127557 3415519
38182 3415519 5117997 5650829 4987561 4542568 5026179 5696058 5800489 5559614 5398673
38173 5398673 5188966 4746222 4447261 4842104 5904223 6943159 7212159 6626912 5934316
38164 5934316 5951561 6549994 6763937 6061473 5026512 4554751 4930802 5956911 7273147
38155 7273147 8132548 7673399 6083555 4805666 4868926 5666265 6114147 6266922 6806761
38146 6806761 7570125 7740192 7172285 6487646 6053016 5743865 5511731 5438569 5510912 5946299
38136 5946299 7186993 8866421 9579488 8686950 7539563 7666765 8542509 8662966 8121292
38127 8121292 8231833 9005674 9120916 8459614 8551856 9988234 11302165 11239575 10531048
38118A0531048o9306N66370M99146L46499M20998K42890k31313m13464j86979
38109A1705889L3587K15809N18095N11233j52370o96850k45604N09803K22036
38100A2621628q15256j003921m9363N37770j18220r25797n89629N33028J124071
38091A1314311O60732j99297n68743k39844K02658J13429l34842l78660R6346
38082A0666090K87664j42669l56367K77372J056500J129301Q16758O69489K78426
38073A4682564o20017r49917Q4004J131548M56181j136340j330954J28410J208537
38064A3654016Q46986J29376o701Q051p5475L22890J047629R55616j8618m03859
38054A6459911L86325J007609N10386r2110K58773Q61496P29834L93179O88835
$$ plain form
38118 10531048 10461742 11028112 11527258 11873757 12294755 12537645 12306332 11892868 11705889
38109 11705889 11739476 11955285 12473380 12984613 12832243 12135393 11889789 12399592 12621628
38100 12621628 11806372 10802451 10753088 11290858 11172638 10246841 9657212 10190240 11314311
38091 11314311 11975043 11775746 11207003 10967159 11169817 11283246 10948404 10569744 10666090
38082 10666090 10953754 10811085 10454718 10732090 11788590 12917891 13734649 14404138 14682564
38073 14682564 14062547 13112630 13196634 14328182 14784363 13648023 12317069 12445479 13654016
38064 13654016 14501002 14630378 14623677 14631728 14556253 14879143 15926772 16882388 16863770 16459911
38054 16459911 16846236 17853845 18364231 18272121 18530894 19392390 20122224 20515403 21204238
38045B1204238R71507J88605j108873j467978p60735k57722o98142j484712j752527
38036A4833661j344699p14014m23765o81242j086926j099755p92449n61456j56677
38027G972678R36117K013576J523424m42023j541533k22483J948799K483493J430766
38018A6102814P93617J121107Q46712q15003k316926k041200p38811m28694j494570
38009A1029046k195023j164769O26520J096853k26608j628951j477212j87518
38001E872338O62495M82709J0082p0224K37615P98910J432548J493870N48177
37992A1468520n08223l01191Q78878J230696J16265r78918q21912j52409j9767
37983A0911939J2578N74538P83120l43316j717975j472283L4627N38393p58455
$$ plain form
38045 21204238 22175745 22364350 21255477 19787499 19026764 18769042 18070900 16586188 14833661
38036 14833661 13488962 12774948 12351183 11669941 10583015 9483260 8690811 8129355 7972678
38027 7972678 8908795 10922371 12445795 12003772 10462239 10239756 12188555 14672048 16102814
38018 16102814 16896431 18017538 18864250 18049247 15732321 13691121 12952310 12523616 11029046
38009 11029046 8834023 7669254 8295774 9392627 9166019 7537068 6059856 5872338
38001 5872338 6534833 7017542 7027624 6957400 7195015 7993925 9426473 10920343 11468520
37992 11468520 10960297 10659106 11537984 12768680 12884945 11906027 11084115 10931706 10911939
37983 10911939 10924517 11499055 12282175 11938859 10220884 8748601 8783228 9321621 8563166
37974H563166k037919j577579k4752Q51995N34312q3500k28251j5609J09193L2569
37964F123625j2240K03858O63314J153051J441955J315224O04512m87524j221800
37955I783975j019563l07387n001j49101P2892P34816P76378k41519j170805r89595
37945G485090m16835o17933j203575r84395r7540K37429k04037m33764r0589N7707
37935C731558l33545n72107k63941R613j79573m45222n28635p69439j092254o90179
37925a133724N34418J304282P04877l17159l09328N16319P19898j26450r19254
37916I73879p50321k5165M17323M07342K48242R0973j40J84578O57337R37848
37906C141896N76884j85676p23418q65455r39721j005255o64944J32186P14919
$$ plain form
37974 8563166 6525247 4947668 4922916 5774911 6309223 6225723 5997472 5981863 6091056 6123625
37964 6123625 6111385 6315243 6978557 8131608 9573563 10888787 11493299 11005775 9783975
37955 9783975 8764412 8457025 8452024 8302923 8375815 9110631 9887009 9645490 8474685 7485090
37945 7485090 7068255 6450322 5246747 4262352 4164812 4402241 4198204 3764440 3673851 3731558
37935 3731558 3398013 2825906 2561965 2571578 2392005 1946783 1418148 648709 -443545 -1133724
37925 -1133724 -599306 704976 1409853 1092694 783366 1299685 2019583 1893133 973879
37916 973879 223558 198393 615716 1023058 1271300 1362273 1362133 1546711 2204048 3141896
37906 3141896 3718780 3533104 2809686 1944231 1004510 -745 -665689 -533503 181416
37897A81416N91799K26297K56195L66574j36777q61913o48285M64268Q81912k49865
37887A071621j538473j206562L56366J215485O16646l12239n09995k44230j16054
37878f67435j1974L30462N78178L39349q4913j04188L29772P51423P88680M23489
37868B672843r3186l59696j68678R0467k16671r99628j315832n67452O21231J171926
37858H35324Q40979K52550p0346j58658k20850l39427n51378q35124r71713p00725
37848a919368m2555P11762J259001J373895R46425K18029k07778L1328N51567
37839B922306O86216L26394j22492m70466q32336j017126n66662L64096Q68266
37830B158196M63768j82603k46123Q5363J23039j08884o2296K09383J42583j53066
$$ plain form
37897 181416 773215 999512 1255707 1622281 1485504 623591 -24694 439574 1321486 1071621
37887 1071621 -466852 -1673414 -1317048 -101563 515083 202844 -307151 -551381 -667435
37878 -667435 -679409 -348947 229231 568580 483667 379479 709251 1460674 2249354 2672843
37868 2672843 2579657 2219961 2051283 2141750 1925079 925451 -390381 -957833 -336602 835324
37858 835324 1676303 1928853 1858507 1699849 1478999 1139572 588194 -246930 -1218643 -1919368
37848 -1919368 -1961923 -1250161 8840 1382735 2329160 2547189 2339411 2370739 2922306
37839 2922306 3608522 3934916 3812424 3341958 2509622 1492496 925834 1289930 2158196
37830 2158196 2621964 2439361 2193238 2278601 2401640 2292756 2230460 2439843 2582426 2429360
37820B429360J16585J037824J637168J361092R37412J164714J745443K052048
37812A2481646K182804K358839K113530J218773O80639J403622K375246J819880
37804B6634979j9455j011982k36373Q30318P75140J70541O3242P2355o41355j627247
37794B5010163j886352j633626j786669k118834j475124K28217J656695J964794
37786A9959264J836445K161761K675566K579824J834987J055330M32022m87534
37778C2047665j879890l079513l311566k731909k221375k138968j922099j245885
37770A3516460q37773j357747k066096j756729o79970j50344l50097j86287M36869
37761F568286J35713j375419k158397q65551R83108J252981L36246N6629N71457
$$ plain form
37820 2429360 2545945 3583769 5220937 6582029 7519441 8684155 10429598 12481646
37812 12481646 14664450 17023289 19136819 20355592 21036231 22439853 24815099 26634979
37804 26634979 26615524 25603542 25367169 26197487 26972627 27143168 27206410 27278765 26637410 25010163
37794 25010163 23123811 21490185 19703516 17584682 16109558 16337775 17994470 19959264
37786 19959264 21795709 23957470 26633036 29212860 31047847 32103177 32535199 32047665
37778 32047665 30167775 27088262 23776696 21044787 18823412 16684444 14762345 13516460
37770 13516460 12678687 11320940 9254844 7498115 6818145 6667801 6317704 6131417 6568286
37761 6568286 6703999 5328580 3170183 2304632 3287740 4540721 4876967 4933596 5505053
37752E505053O57070L37609P34256J565173J320466R8789j71953J105301K107253
37743A3259017J551664O86678J125199K390394K947583K370069J246018N5337
37735B5631959p14418l78628Q74805J634932J028036n8712m74306n16765j044706
37726B5982197j849561k163449j980314j648304r43519J76908P17092j0412q78976
37717A7401662l57592J139823J976733J892206J997089K389135J858523K51892
37709B8549471q82966p40821o00795j696854l170772l398394k349883j352090
37701A4356896j153690j421935j753392k043473j984943j199154R943P44136N39953
37692F094341j52064o28979o87907n80304n14991m32773k13091M8881J06513o6195
$$ plain form
37752 5505053 6162123 6499732 7233988 8799161 10119627 10218416 10046463 11151764 13259017
37743 13259017 14810681 15497359 16622558 19012952 21960535 24330604 25576622 25631959
37735 25631959 24917541 24538913 25413718 27048650 28076686 28017974 27543668 27026903 25982197
37726 25982197 24132636 21969187 19988873 18340569 17397050 17573958 18291050 18280638 17401662
37717 17401662 17044070 18183893 20160626 22052832 24049921 26439056 28297579 28549471
37709 28549471 27666505 26925684 26324889 24628035 21457263 18058869 15708986 14356896
37701 14356896 13203206 11781271 10027879 7984406 5999463 4800309 4810252 5554388 6094341
37692 6094341 5942277 5313298 4625391 4045087 3530096 3097323 2884232 2933113 3039626 2973431
37682B973431j71034m4236K7401j85107k98274J03237M94877p0646j331943j754065
37672b56359o54413N82948L66489p65785r21222L87423J646614J587202O81345
37663B654242m7225m83499q97861r41215k34071O16875O70448K1003m54783m75511
37653D28403m49498l69224J62571P25235K70809r91227j241241M64039K405009
37644A404876K179856j32538k133477k191718j049304k32311r2505J5131M15792
37635a816198P07285M42745k11828n73834k16067M01757M46365l4053o3373O27756
37625b89445Q61938j38902j102423m37667J014744R81456n97885j228353K49671
37616f86866J729151J096757n47570p70492N34454J467126J205768O22332K51337
$$ plain form
37682 2973431 2802397 2758161 2785562 2600455 2302181 2405418 2900295 2829649 1497706 -256359
37672 -256359 -910772 -327824 38665 -727120 -1648342 -1260919 385695 1972897 2654242
37663 2654242 2607017 2123518 1225657 284442 50371 667246 1337694 1358697 903914 428403
37653 428403 -21095 -390319 -227748 497487 768296 -222931 -1464172 -1000133 1404876
37644 1404876 3584732 3452194 1318717 -873001 -1922305 -2154616 -2247121 -2231990 -1816198
37635 -1816198 -1108913 -666168 -877996 -1451830 -1667897 -1266140 -819775 -853828 -917201 -289445
37625 -289445 572493 433591 -668832 -1106499 -91755 889701 291816 -936537 -686866
37616 -686866 1042285 2139042 1591472 820980 1355434 2822560 4028328 4650660 4901997
37607D901997k53083o58877j17462J097705J525138O93775j26683M4265N06960
37598G613735L11875j39150N4704P06960Q87589L56996k86023o17637p45999p60219
37588G382831n09406m3165J73773k56100j059832j386084p23588L04835N05393
37579D388657l31551j035452p06424o9521k69403r02863o10017N68413J012461
37570B044300L3522r46870n11221O81176R86832J05534q06041q84545m02464j7851
37560B82372M0609J3476K41637P09803Q74210L07816m69190m97226J38228K63906
37550A905641n41251j124458n15759M99861O13867o850k00346K42293M39812N852
37540A318662m77611n55202l80053o7727M21015O93714K32831n68517o71322N8909
$$ plain form
37607 4901997 4648914 3990037 3872575 4970280 6495418 7189193 7062510 7106775 7613735
37598 7613735 7925610 7786460 7841164 8548124 9435713 9792709 9506686 8889049 8143050 7382831
37588 7382831 6873425 6830260 7004033 6747933 5688101 4302017 3578429 3883264 4388657
37579 4388657 4057106 3021654 2315230 2245709 1976306 1073443 463426 1031839 2044300
37570 2044300 2077822 1130952 619731 1300907 2287739 2393273 1587232 702687 300223 282372
37560 282372 322981 336457 578094 1287897 2162107 2469923 2000733 1503507 1641735 1905641
37550 1905641 1364390 239932 -275827 224034 837901 831051 630705 872998 1312810 1318662
37540 1318662 841051 285849 -94204 -161931 259084 952798 1185629 617112 -54210 4699
37530D699N27624K7396p03908o09980J74530O15817K17877m35144m96440J45102
37520e32427P51235N67849k61864q26066n96740o7784P6686m7137N8267K95746
37510e82235K14188m9266M4519M39190N72798M08273M36769O36431M20388k43935
37500B297120o56031n37218l79726l86750j17379M32308M95565j42970n35779
37491D69140k7237O11074L80064l81944o03785r5789L91351L59851j7388m12904
37481F72433n89043l68840Q6196K77165R2223N2600L60811L65105l40684r63040
37471c55074n70912M11352P74134K22041m74042p18096m96228J68572J087135
37462D8882J420439N01846q57643j057184J27379J173249R04836j07947o96525
$$ plain form
37530 4699 532323 559719 -144189 -754169 -579639 36178 254055 -181089 -677529 -532427
37520 -532427 218808 786657 524793 -301273 -898013 -965797 -889111 -936248 -877981 -582235
37510 -582235 -368047 -417313 -372794 66396 639194 1047467 1484236 2120667 2541055 2297120
37500 2297120 1641089 1103871 724145 337395 220016 652324 1147889 1004919 469140
37491 469140 441903 1052977 1433041 1051097 447312 351523 742874 1102725 1085337 672433
37481 672433 83390 -285450 -199254 77911 170134 222734 583545 948650 607966 -355074
37471 -355074 -925986 -514634 259500 481541 7499 -710597 -1206825 -1038253 48882
37462 48882 1469321 1971167 1113524 56340 183719 1356968 2261804 2153857 1457332
37453A457332o38382l97185j36396J83769K46374k39441q27716p54181l6922M77096
37443f65652L05627J6857L26918Q70992N73720o50793j353266l96770J160068
37434A87701J162805o46354k006673j071909J131623K129327J122416m20769r02607
37425F85560k54613M82582M47002k49428o52624o9673Q56756Q36343j25179n78773
37415A377953O4874M95671k64897j124186q64379l07083n94401p47402N56585
37406a407265J942293J127920r30020j136420O20452J208739l49324j227190N3665
37397i7150Q32981r00676k518841q92721K215664K747103N43355r94062m60440
37388D75213K35414j02402k76452M41371Q75689K99928k51618N350L14362o167
$$ plain form
37453 1457332 818950 421765 285369 469138 715512 476071 -351645 -1105826 -1142748 -665652
37443 -665652 -360025 -343168 -16250 854742 1428462 777669 -575597 -972367 187701
37434 187701 1350506 704152 -1302521 -2374430 -1242807 886520 2008936 1588167 685560
37425 685560 430947 913529 1360531 1111103 458479 388806 1245562 2081905 1956726 1377953
37415 1377953 1442827 1938498 1673601 549415 -314964 -622047 -1216448 -1963850 -1407265
37406 -1407265 535028 1662948 732928 -403492 216960 1425699 1076375 -150815 -97150
37397 -97150 735831 -164845 -2683686 -3576407 -1360743 1386360 1929715 935653 475213
37388 475213 710627 608225 331773 773144 1648833 1948761 1697143 1702493 2016855 2010688
37378B010688m13348m13413m01715n06481j04926P79499J031461J75747p26701
37369A430811o85821j42514J2211k37162l67389j35510M17363R81539P96841n34356
37359A536013j935739j815183l23775P59936O51951M00653O43903M55085o27952
37350b55108j305858o40374J59732k57026r87045m17148R07196J143580K52947
37341a399104o6138N87693O69539m69351j218057k41017J260907J256916j62155
37332B19233j074318n24720M48468O58570L25716K33545L25242P0421l14079j28469
37322B39609M16466K32644q76647j564490p77012O54504J241721R40111P80579
37313A287485Q92979M24737o15138j017768l06446L73492J6270p05804n61592
$$ plain form
37378 2010688 1597340 1183927 782212 275731 170805 950304 1981765 2157512 1430811
37369 1430811 744990 602476 614687 377525 10136 -125374 291989 1273528 2070369 1536013
37359 1536013 -399726 -2214909 -2538684 -1778748 -1126797 -726144 -82241 372844 -255108
37350 -255108 -1560966 -2201340 -2041608 -2298634 -3285679 -3702827 -2795631 -1652051 -1399104
37341 -1399104 -1465242 -877549 -208010 -677361 -1895418 -2136435 -875528 381388 219233
37332 219233 -855085 -1379805 -931337 -272767 52949 286494 611736 682157 368078 239609
37322 239609 656075 888719 12072 -1552418 -2329430 -1674926 -433205 506906 1287485
37313 1287485 2180464 2605201 1990063 972295 665849 1039341 1055611 349807 -211785
37304b11785L79862R64665N92708j72378m76342j36738K41486k3277p54714r42727
37294e39240j47023N76979Q0127r47022q20432M67772J111735L14935n71469m43827
37284i17465j44033o11554j019569k93678Q53296J085147N71359K75232J07859
37275i3406m05759n42542M81810J498108P81870r17095j162441L58928J308146
37266A307619M06965p72792o31999R9865J49951q1517K89971P44605M21761p6318
37256A858111K25875O30414k44498j864607k138362m38907J461560J837994R16049
37247B243629j70321r35773j266894p74299M62383J254621O00657p47449j121222
37238d54668j85880P37527O46709L5003k38634j84723j48914M4931N41570P50782
$$ plain form
37304 -211785 168077 1132742 1725450 1553072 1076730 939992 1181478 1158201 403487 -539240
37294 -539240 -686263 -109284 -29157 -976179 -1796611 -1328839 -217104 97831 -473638 -917465
37284 -917465 -1061498 -1673052 -2692621 -2986299 -2133003 -1047856 -476497 -201265 -93406
37275 -93406 -499165 -1041707 -559897 938211 1720081 802986 -359455 -527 1307619
37266 1307619 1714584 941792 309793 409658 559609 478092 768063 1512668 1934429 1858111
37256 1858111 2083986 2714400 2469902 605295 -1533067 -1971974 -510414 1327580 2243629
37247 2243629 2073308 1137535 -129359 -903658 -441275 813346 1414003 666554 -454668
37238 -454668 -640548 96979 743688 778691 540057 355334 206420 251351 792921 1543703
37228A543703K16356l57432j06409L98441l2522r81635o98845J096383K393495
37219C471535J658593p7386r85920r73853j056722j259881q28584N3817M28305
37210D29904K09542J76103M23898K76063k58641l77664O948M7398m63948o55634
37200a86031j43277K70654L8730k09897J04037M71312K89712q2372j17334n9241
37190C76293j81364j765P10589R79889l8493j364633j293528P2521Q78343J97121
37180C34973p59566n83208L65605P20128P3344o86296o81067N485O23669N86059
37170h74K603m35441k02569L90741N63305J62999q5266K96118P23236M43904j81807
37159A676949j50877N54050P87112n4535j074539j204446o99462m53236m15275
$$ plain form
37228 1543703 1760059 1402627 1296218 1694659 1662137 680502 -18343 1078040 3471535
37219 3471535 5130128 5052742 4066822 3092969 2036247 776366 -52218 1599 429904
37210 429904 639446 815549 1239447 1515510 1256869 879205 886153 933551 469603 -186031
37200 -186031 -329308 -58654 -19924 -229821 -125784 345528 635240 552868 435534 376293
37190 376293 194929 193164 903753 1883642 1845149 480516 -813012 -740491 137852 334973
37180 334973 -424593 -1007801 -642196 77932 151276 -535020 -1216087 -1210602 -586933 -874
37170 -874 1729 -433712 -636281 -245540 317765 480764 395498 691616 1414852 1858756 1676949
37159 1676949 1526072 2080122 2867234 2812699 1738160 533714 -165748 -618984 -1034259
37150a034259J49658J041703J080016m5411j053642q28950M9333L56735M9512
37141b35305R77L68923M07824j15630m01222J44154R02374P77443m35178j773133
37131c58773k043125r11592P51974J597687J084964K4038m01947n750M09544K88311
37121D35331n0253j20617J2941P9372J90601N60603Q47583L72663q66858j840434
37111c79068j529201j86057Q83751Q63150K60809o0226j10479l58704n47923k1239
37101a185187Q27651P21614m70778j152221k82564Q90000O26322o05992p81221
37092a412376O74741K089785J875794L23033j234397j889742j399750k0416J302997
37083C09669J423408L22350o45687l97081N25478Q08352J31154n77135m64884
$$ plain form
37150 -1034259 -884601 157102 1237118 1191707 138065 -690885 -641552 -284817 -235305
37141 -235305 -234328 134595 542419 426789 25567 169721 1072095 1849538 1414360 -358773
37131 -358773 -2401898 -3313490 -2561516 -963829 121135 145173 -256774 -262524 147020 435331
37121 435331 385078 264461 277402 356774 547375 1107978 1955561 2328224 1461366 -379068
37111 -379068 -1908269 -2094326 -1210575 -347425 -86616 -146842 -257321 -616025 -1163948 -1185187
37101 -1185187 -357536 364078 -106700 -1258921 -1541485 -651485 -25163 -631155 -1412376
37092 -1412376 -737635 1352150 3227944 3550977 2316580 426838 -972912 -993328 309669
37083 309669 1733077 2055427 1409740 1012659 1538137 2346489 2477643 1900508 1435624
37074A435624K28082N89393K02022l41753k51957K47846Q1094j012787j679085
37065e01521o51178J223056J820725N24728j049224j319604n34529J93209N14750
37056B20412O69105N24076j50921q54816p75245L7732O80890O33096L35460L28935
37046A648724L60401j43005r14438q68188L70490J536524J166039k73094q57982
37037B025471J4290P48157J58025n60677J38781J429250J365761O4250o21972
37028D761336k66696k86915j053034j097404R4850Q94801K88424l02444N61517
37019C594435J929849K166743J526372J206468J113553N16164n7292M32676J536802
37010A3965770J901971J335926N82343l66043j847073k914041k264389o64504
$$ plain form
37074 1435624 1663706 2253099 2455121 2113368 1861411 2109257 2190351 1177564 -501521
37065 -501521 -1152699 70357 1891082 2415810 1366586 46982 -487547 -294338 220412
37056 220412 889517 1413593 1262672 407856 -367389 -329657 351233 984329 1319789 1648724
37046 1648724 2009125 1866120 951682 83494 453984 1990508 3156547 2883453 2025471
37037 2025471 2039761 2787918 2945943 2385266 2524047 3953297 5319058 5383308 4761336
37028 4761336 4494640 4207725 3154691 2057287 2152137 3046938 3335362 3032918 3594435
37019 3594435 5524284 7691027 9217399 10423867 11537420 12053584 11996292 12428968 13965770
37010 13965770 15867741 17203667 17786010 17419967 15572894 12658853 10394464 9729960
37002I729960l14341j567602k334736j288865K56224N39073k27922p46745o62436
36993C382610m67698k70401J04303K83472k62016j158972j362468n40973L75482
36984H3339L04132n94041r84972J3527J551221J949812Q71114k75108m25054k80516
36974B213454p83046j261902n70671O58859P51403k49176n44612M15342Q96052
36965A525703l19865j839305j656795J5853J354506J511832J127926P20116M5823
36956B485794q76424j290571o64184M99178J162709Q19103p1438n76412k46931
36947A240824L86778M51501j58666o77188n09341J12139O50726Q79096P21354
36938C097223P8592p96094j251835r82948l91701R7184N22052Q35936O14274r1728
$$ plain form
37002 9729960 9415619 7848017 5513281 4224416 4480640 5019713 4791791 4045046 3382610
36993 3382610 2914912 2644511 2748814 3032286 2770270 1611298 248830 -292143 83339
36984 83339 387471 -206570 -1191542 -1178015 373206 2323018 3194132 2919024 2493970 2213454
36974 2213454 1430408 168506 -402165 256694 1008097 758921 214309 629651 1525703
36965 1525703 1205838 -633467 -2290262 -2274409 -919903 591929 1719855 2439971 2485794
36956 2485794 1609370 318799 -345385 153793 1316502 2135605 2064167 1487755 1240824
36947 1240824 1627602 2079103 1920437 1243249 733908 846047 1496773 2375869 3097223
36938 3097223 3175815 2379721 1127886 144938 -246763 -149579 372473 1208409 1822683 1730955
36928A730955l59310K90670Q38185J45706j058037r66478N80682J643583Q97073
36919C743029n33873q18753K8025N24841N9602m86447l80543o9183k02215n63361
36909A301122n58480j59321K29854M19061L99206M9096n24689o91593m4362P76329
36899A196223P68532k1879n76697l75088P3200K64856L50733M85258M44773K78029
36889B887940M37074Q08202N71813l97151j015469o21924m1754p5160q8858N82785
36879C047498R75998J0628j202395p18639R98661J551307L68988m63728K75591
36870D843909J044880L38819p76735o32018K30271J93384o29872q06355j45592
36861C660691J57458k70258m55121J13595O95078O36876K51041j0642k01681l28211
$$ plain form
36928 1730955 1371645 1662315 2500500 2646206 1588169 621691 1202373 2845956 3743029
36919 3743029 3209156 2390403 2418428 2943269 3002871 2516424 2135881 2066698 1864483 1301122
36909 1301122 742642 583321 813175 1232236 1631442 1680538 1155849 464256 419894 1196223
36899 1196223 1964755 1942876 1366179 991091 1064291 1329147 1679880 2165138 2609911 2887940
36889 2887940 3325014 4133216 4705029 4307878 3292409 2670485 2628731 2553571 2464713 3047498
36879 3047498 4023496 4034124 2831729 2113090 3111751 4663058 5032046 4568318 4843909
36870 4843909 5888789 6227608 5450873 4818855 5049126 5242510 4612638 3806283 3660691
36861 3660691 3818149 3547891 3092770 3206365 3901443 4538319 4789360 4778718 4577037 4248826
36851D248826p6111M91839P31506L35042j51271j11482L04714M52590j8610q08286
36841E398757j155843m75526Q42994J509028P75326m46367o74499J58957P97659
36832F730486O36504L73486M70574L17935m25195r00380m36789J64107o0944m67489
36822F402295J85739J450573J580174J97086j036336p97706K67206R08993R74035
36813A0132059Q90411N85980j0912k87123Q5964K80339l22552o68300M34554J867342
36803A2987762J351194r49033k195274r02123R27625R09710l49861p20891M5770
36794A1104879M69617N0645l19743k93802l74926l69459M85419J668392J593546
36785A4014568J50167p95495j13761J064489J354128J006239P80317N04196K4847
$$ plain form
36851 4248826 4172715 4664554 5396060 5731102 5579831 5468349 5773063 6225653 6207043 5398757
36841 5398757 4242914 3767388 4610382 6119410 6894736 6448369 5773870 5932827 6730486
36832 6730486 7366990 7740476 8211050 8528985 8103790 7203410 6766621 6930728 6869784 6402295
36822 6402295 6588034 8038607 9618781 9815867 8779531 7981825 8249031 9158024 10132059
36813 10132059 11022470 11608450 11597538 11310415 11396379 11676718 11354166 10685866 11120420 12987762
36803 12987762 14338956 13389923 11194649 10292526 11220151 12129861 11780000 11059109 11104879
36794 11104879 11574496 11625141 11305398 11011596 10636670 10267211 10752630 12421022 14014568
36785 14014568 14164735 13369240 13255479 14319968 15674096 16680335 17460652 17964848 17989695
36776A7989695J68397J265439J952614J101130j10574J22632J353740J754326
36768B5597399J280191J625434L071139L790359K873562J891495K398129L629072
36760D6156780L992482L499448L255463L483351L563275L515414M030480N175432
36752G6672125O202322O643595O730928O785637P006363P790180R403254J1292996
36744A38527400J2581853J3409306J4947156J7737117K0712262K2250748K1496840
36737B61662682J8132339J1689931K269410q214511j6657509k1135516k2146583
36730B25600243k1299768j9499888j6911487j3968965j1409094r463496p885108
36723A25162437o755413o388327o350877n640389m282322l713384m757298o083828
$$ plain form
36776 17989695 18158092 19423531 21376145 22477275 22366701 22489333 23843073 25597399
36768 25597399 26877590 28503024 31574163 35364522 38238084 40129579 42527708 46156780
36760 46156780 50149262 53648710 56904173 60387524 63950799 67466213 71496693 76672125
36752 76672125 82874447 89518042 96248970 103034607 110040970 117831150 127234404 138527400
36744 138527400 151109253 164518559 179465715 197202832 217915094 240165842 261662682
36737 261662682 279795021 291484952 293754362 285539851 268882342 247746826 225600243
36730 225600243 204300475 184800587 167889100 153920135 142511041 133047545 125162437
36723 125162437 118407024 112018697 105667820 100027431 95745109 92031725 87274427 81190599
36715H1190599n813016m088250k743163k658827k880221k493976j973050k095874
36707E6444222k636731k826789k314221j147594L31930J129352K70802j455772
36699D7795199j749338J05522J742052R26993r78963j032591O52218J140177m76624
36690D8124645j607232m90547R94567O73207l22373J94420J552980J586211O96071
36681E1401949J243518L260223M129994K990546K318891L983974O411793P310409
36673H3051297P048281P408466Q610478R581143J0056434J0458299J0382200Q961116
36665A55557714O350354L486543Q06977j620921l319603m012991m422315n217656
36657A47608102n823704n498572m776068m403605l762536k100417m88001m53672
$$ plain form
36715 81190599 75377583 71289333 68546170 65887343 63007122 60513146 58540096 56444222
36707 56444222 53807491 50980702 48666481 47518887 47850817 48980169 49250971 47795199
36699 47795199 46045861 46151383 47893435 48820428 47841465 46808874 47461092 48601269 48124645
36690 48124645 46517413 46026866 47021433 47694640 47372267 47566687 49119667 50705878 51401949
36681 51401949 52645467 55905690 60035684 63026230 65345121 69329095 75740888 83051297
36673 83051297 90099578 97508044 106118522 115699665 125756099 136214398 146596598 155557714
36665 155557714 161908068 165394611 166201588 164580667 161261064 157248073 152825758 147608102
36657 147608102 141784398 136285826 131509758 127106153 123343617 121243200 120755199 120301527
36649A20301527j266159q78496P51204J722705J495702J536726K399204K812922
36641A28875335K339427K339731L312064L730901K752649J709149J500082Q68827
36633A47428165r86846k377741j845706r14389j673116l277390l505808k470744
36625A30376425j931034j842474o09925J581296K605582J744757O64026O42290
36617A33230943J028290R31366M69282j97036j297985k406136k552607j834796
36609A27371321j430067j741776k099233k481360l728363n665648o868740o828017
36601I6528117o544845o456048n765771m557636m365302n470914n782421m006323
36593E3578857k021218k133839l561062l867223k707770j748807j633529j520855
$$ plain form
36649 120301527 119035368 118156872 118908076 120630781 122126483 123663209 126062413 128875335
36641 128875335 131214762 133554493 136866557 140597458 143350107 145059256 146559338 147428165
36633 147428165 146441319 144063578 142217872 141303483 139630367 136352977 132847169 130376425
36625 130376425 128445391 126602917 125992992 127574288 130179870 131924627 132588653 133230943
36617 133230943 134259233 135190599 135659881 135462845 134164860 131758724 129206117 127371321
36609 127371321 125941254 124199478 122100245 119618885 115890522 110224874 103356134 96528117
36601 96528117 89983272 83527224 77761453 73203817 68838515 63367601 57585180 53578857
36593 53578857 51557639 49423800 45862738 41995515 39287745 37538938 35905409 34384554
36585C4384554j330292j925065k839855k235125P8382J615959M82135j844006
36577B6386687k482603r69829M82408J82398j101311j643166j019616j61403J84719
36568A9858284J53674N7781j78657n92386p95265n16470j54896k31034n34183
36559A7066848m20653J83876P06702P78023N44076K18678q077K63659J134742
36550B0467874J728440J041137m09280r13961R7356J211408J113896M08005M66604
36541B5211479J362603K023279J909390J516023J465771J916778K703479L465912
36533D1574714L833449L890627M117353M550848M587953M027332L560590L621158
36525G3764024L529027K591510J340404P10873N84567K13107l58414m16121J23339
$$ plain form
36585 34384554 33054262 31129197 28289342 26054217 26132599 27748558 28230693 26386687
36577 26386687 23904084 22934255 23416663 23599061 22497750 20854584 19834968 19673565 19858284
36568 19858284 20011958 20069739 19891082 19298696 18503431 17986961 17832065 17601031 17066848
36559 17066848 16646195 16830071 17536773 18314796 18858872 19077550 19069473 19333132 20467874
36550 20467874 22196314 23237451 22828171 21914210 22011566 23222974 24336870 24744875 25211479
36541 25211479 26574082 28597361 30506751 32022774 33488545 35405323 38108802 41574714
36533 41574714 45408163 49298790 53416143 57966991 62554944 66582276 70142866 73764024
36525 73764024 77293051 79884561 81224965 81935838 82520405 82733512 82375098 81958977 82082316
36516H2082316N84558N81737K97121j30636o17703o96246K2152R96685J188711
36507H4308695L31686q86003j768785k107062j963683j643837j603787j758313
36499G2908911j331873j35699O36034q3087j501248k010203j545125j517039k603926
36490F2816745m009581m863823n023707m500168l412443k524735k533137k867360
36482C3081791k538733j968652k314891l131871k757284j233750n83486j507403
36474A7045721k088197r21531N65531M55594p80745j492090j469321j487730j373909
36465H453323m87557O09097P70320O9776n32220p81709r51207p11609K39982R84843
36455G663039M70272o40923q69937k78242j53045o21051n22754L13199O38065
$$ plain form
36516 82082316 82666874 83248611 83545732 83415096 82797393 82101147 82123299 83119984 84308695
36507 84308695 84640381 83754378 81985593 79878531 77914848 76271011 74667224 72908911
36499 72908911 71577038 71441339 72077373 71994286 70493038 68482835 66937710 65420671 62816745
36490 62816745 58807164 53943341 48919634 44419466 41007023 38482288 35949151 33081791
36482 33081791 30543058 28574406 26259515 23127644 20370360 19136610 18553124 17045721
36474 17045721 14957524 14035993 14601524 15057118 14276373 12784283 11314962 9827232 8453323
36465 8453323 7965766 8574863 9345183 9414959 8882739 8101030 7149823 6438214 6678196 7663039
36455 7663039 8133311 7492388 6622451 6344209 6191164 5570113 5047359 5360558 5998623
36446E998623k3710n65269k60534Q7815k91611q26154o90262r4106L11132M02283
36436D048207K97689n9001m66193m23536N977J23874k17952k92989K11961O00951
36426C828988L85669O4178P1784K604m00062n29758o6388J65473m71736j126739
36416A924013o81164M24142Q56307L95818j5458N9309J25700n7449o7705K34373
36406C197886L42143l0054m82163o07834n32703n23260n28715l28734J62334P98430
36396A467330J176686Q57748m5736p12405m96760K07591M67324k371o50772r13684
36386A354951o79148r0573N41789P49542L76913p9213j08435O9440j1651j76429
36376A947186k408K13269j03454n84913l50189L47565K75881o90041j115582l02255
$$ plain form
36446 5998623 5974913 5409644 5149110 5236925 4945314 4119160 3428898 3334792 3645924 4048207
36436 4048207 4345896 4286895 3820702 3397166 3403143 3527017 3309065 3016076 3228037 3828988
36426 3828988 4214657 4278835 4350619 4353223 3953161 3423403 3357015 3522488 3050752 1924013
36416 1924013 1242849 1666991 2523298 2919116 2903658 2962967 3088667 3031218 2963513 3197886
36406 3197886 3540029 3509975 3027812 2419978 1887275 1364015 835300 506566 668900 1467330
36396 1467330 2644016 3501764 3456028 2743623 2246863 2454454 2921778 2919407 2268635 1354951
36386 1354951 675803 585230 1127019 1876561 2253474 2174261 2065826 2135266 2123615 1947186
36376 1947186 1944778 2158047 2054593 1469680 1119491 1467056 1742937 1052896 -62686 -364941
36366c64941M38729r2392q90414l17565J134925J502719M02103m83395j34267
36357A195502L95288n6744r29561j079260n71287j54879J88547Q71111J434069
36348A292786J039166J971m99146k46877j91531o29711n86286L88702J129922
36339A698996N69629n01487o54362n7932p958o13826o40059K31866O85175k4086
36329F85956o33551J85292J527987J414086k48977j467890j021609j3771O8356
36320D95879l97294m2864J045845J267893l528j260404r51683K79966O52496l8454
36310A047852k97120M60442Q61070j27986j342155j156216L88M84942J19443J65890
36300B16550Q39865Q36841l12184j239023q32652J92020O89169O76139N58331
$$ plain form
36366 -364941 73788 -18604 -909018 -1226583 -91658 1411061 1813164 1329769 1195502
36357 1195502 1590790 1534046 604485 -474775 -1046062 -1200941 -1012394 -141283 1292786
36348 1292786 2331952 2333923 1834777 1587900 1396369 766658 180372 569074 1698996
36339 1698996 2268625 1767138 1112776 1054844 1046886 433060 -206999 24867 710042 685956
36329 685956 52405 237697 1765684 3179770 2930793 1462903 441294 427523 495879
36320 495879 98585 55721 1101566 2369459 2365931 1105527 153844 433810 1086306 1047852
36310 1047852 750732 1211174 2072244 1944258 602103 -554113 -553725 -68783 50660 216550
36300 216550 1056415 1893256 1581072 342049 -490603 -298583 390586 1066725 1625056
36291A625056N5478r28772j470680r12248m9216J72949J72145O12957Q18544m7026
36281D9187j074432p91059L44166O57981J00932J54007R54076R01612m09222j200001
36271c12753l83927O44392L67853m87274m69850J77408L40500J65352N08182R70099
36261A519982M11675q11077r77194L88620J600815J109826m53397j323026r21584
36252E44640k31424j49285l59924q9622N91505Q28630K66950l88187m28843j77655
36242D06785l16839o34839l76709L52098O25293K17247n1748J97933K35814l73778
36232B81257p87071j81761P94222Q94484P1277n68748l25205L84836P34296L37682
36222A635269m60584q40329l73931K28701p6843r57292q90709M30907J249997
$$ plain form
36291 1625056 1680534 751762 -718918 -1631166 -1680382 -1507433 -1335288 -722331 96213 49187
36281 49187 -1025245 -1816304 -1472138 -814157 -713225 -559218 394858 1296470 887248 -312753
36271 -312753 -696680 -52288 315565 -171709 -641559 -464151 -123651 41701 549883 1519982
36261 1519982 1931657 1120580 143386 532006 2132821 3242647 2789250 1466224 544640
36252 544640 313216 163931 -195993 -285615 305890 1134520 1401470 1013283 584440 406785
36242 406785 89946 -544893 -921602 -569504 55789 273036 221288 419221 655035 281257
36232 281257 -505814 -687575 106647 1001131 1072408 503660 178455 563291 1297587 1635269
36222 1635269 1174685 334356 -39575 189126 112283 -845009 -1735718 -1304811 -54814
36213e4814L41110q75593m35792R81619J057508m40700j248226j50395J257108
36204D31825J190086K03797j69309Q6653r9984p77750r00973j54098N30121M59035
36194G99403J28003K67061O89438O63284M2813n52788o15093l19954q1726J00148
36184A120589M94924R83391R93887K49326p05633r74963k44965Q52568J273794
36175D042918N21654p74706j359346o96170L40334N19184j93880p49698n64834
36166A085456j27443M2081J14599K97354L20194N3081j29623p1644j27600k69583
36156A186872J47700J110750J492783P27854j23840n3412K22861l63693j146670
36147C201205p13117O48227J309084Q05623K05919J22791J45941K50481R20905
$$ plain form
36213 -54814 286296 -589297 -1025089 -43470 1014038 573338 -674888 -825283 431825
36204 431825 1621911 1825708 1656399 1743052 1643068 865318 -35655 -189753 340368 799403
36194 799403 927406 1194467 1883905 2547189 2590002 2037214 1422121 1102167 1020441 1120589
36184 1120589 1615513 2598904 3592791 3842117 3136484 2161521 1916556 2769124 4042918
36175 4042918 4564572 3789866 2430520 1734350 2074684 2593868 2399988 1650290 1085456
36166 1085456 958013 1000094 1114693 1412047 1732241 1785322 1655699 1584055 1456455 1186872
36156 1186872 1334572 2445322 3938105 4665959 4542119 4488707 4711568 4347875 3201205
36147 3201205 2488088 3136315 4445399 5251022 5456941 5579732 5725673 5976154 6897059
36138F897059J666294J269555p5461p04115j12291K27705n19378j040528j92002
36129G416838R00396O46525m43327p57412k00827m834m68722o39410q6610N02701
36119F865318N63309K83454p9935m91440o81788l30061K42990M07605K49704L92281
36109G421437P94637P14173L8371l43160R2625O33547M40591j36482j09695O40639
36099A0186683J206555R94108N60589Q14931J750910K401861K035772J076283
36091B1027692O56645J386833K750717L690946L618915K814633J964357J433728
36083C9344466J072268P12998N75873Q01532P57797m56077k579289m040264l819644
36074C2369660k783957k344747k422427j934747r44720p98716j914285k864319
$$ plain form
36138 6897059 8563353 9832908 9757447 9053332 8941041 9168746 8649368 7608840 7416838
36129 7416838 8317234 8963759 8520432 7763020 7562193 7557359 7088637 6449227 6362617 6865318
36119 6865318 7428627 7712081 7632146 7140706 6458918 6128857 6371847 6779452 7029156 7421437
36109 7421437 8216074 8930247 8968618 8625458 8718083 9351630 9792221 9655739 9546044 10186683
36099 10186683 11393238 12387346 12947935 13762866 15513776 17915637 19951409 21027692
36091 21027692 21684337 23071170 25821887 29512833 33131748 35946381 37910738 39344466
36083 39344466 40416734 41129732 41705605 42507137 43264934 42808857 40229568 36189304 32369660
36074 32369660 29585703 27240956 24818529 22883782 21939062 21140346 19226061 16361742
36066A6361742k338482r44825k41976p30666j583253j813945j062279K70705J084829
36057I001850L58688j484137k558931j615756L51457J384725R51437R2600m09950
36048F071983p69381j092857q27469J63504R02973M63489o68969j165942n81247
36039B496084K20642L75421M9935j41778j57707l55100o15750m14787K14675N24127
36029B195762J05690n28759p46967n50970j57163M54914J016824P64973m22551
36020B131753j352437r62253J19323N39222K13925Q0771K92495J75576j94196
36011A044179q216N95431N15540l25718o02230K49704J008025N70876m51759q99823
36001A696009o57932k51253J18029L47531J95687r0780J00190N09584J33016q97286
$$ plain form
36066 16361742 14023260 13078435 12836459 12105793 10522540 8708595 7646316 7917021 9001850
36057 9001850 9360538 7876401 5317470 3701714 4053171 5437896 6389333 6481933 6071983
36048 6071983 5302602 4209745 3382276 3545780 4448753 4912242 4243273 3077331 2496084
36039 2496084 2716726 3092147 3142082 3000304 2842597 2487497 1871747 1456960 1671635 2195762
36029 2195762 2301452 1772693 1025726 474756 317593 772507 1789331 2554304 2131753
36020 2131753 779316 -182937 -63614 475608 689533 770304 1062799 1238375 1044179
36011 1044179 1035963 1631394 2146934 1821216 1218986 1468690 2476715 3047591 2595832 1696009
36001 1696009 1038077 786824 904853 1252384 1448071 1357291 1457481 1967065 2100081 1202795
35991A202795j089900k8270O78888J0287o52992J29272J316221J134354O5764
35982B766419j18645N83773O35967k19226o39709j17024L35251J21616j07301
35973C241121J02030K72316P3478j50397k17782l57425m85208k95753n7821k11229
35963A913330l17538L20506J157452R85509l5536n32125k18658l10342j217447
35954A745151j583214m65321J001528J219550L34999k78736k0197M85961N33960
35945B973681J28154k14755k3494O03985R24192L60929o10879r52220m39075J20282
35935B870800J09758j92080k87001j19789J42853L74405L70536L0982l05646l03422
35925B691396k96650p47613j182088o91074M65265R07410J12076p43271m53253
$$ plain form
35991 1202795 112895 84625 763513 773800 120808 250080 1566301 2700655 2766419
35982 2766419 2647774 3231547 3867514 3648288 3008579 2891555 3226806 3348422 3241121
35973 3241121 3343151 3615467 3688945 3538548 3320766 2963341 2478133 2182380 2124559 1913330
35963 1913330 1595792 1916298 3073750 4059259 4023723 3491598 3272940 2962598 1745151
35954 1745151 161937 -303384 698144 1917694 2252693 1973957 1953760 2439721 2973681
35945 2973681 3101835 2887080 2863586 3467571 4391763 4752692 4141813 3189593 2750518 2870800
35935 2870800 2980558 2788478 2501477 2381688 2524541 2898946 3269482 3300464 2994818 2691396
35925 2691396 2394746 1647133 465045 -226029 239236 1146646 1258722 515451 62198
35916F2198O04458J206169R51768M63871L06778L69534K49379j43999m56406l36814
35906C276936J6214K2256m23118o81165k93735K99695M40066J70404n0717o7155
35896B709681O8701L26976L38150l97805j361977j160403L57528J409106Q32760
35887C122717j16770r727L53039j89061n30241P30435K050203R96728j317839
35878E089484j584268K43252Q92455n23075j083071N32885J570036J40502j381688
35869C896512o19245O97161J08527j099592m65061J000617O61623r40157j105886
35860B134499K83398R26560L96411N13050J571927J774048O73971j03709m9564
35851H120591n01349j503290j085188J146981K579427J371315p04557j017037
$$ plain form
35916 62198 666656 1872825 2824593 3288464 3595242 3964776 4214155 4070156 3613750 3276936
35906 3276936 3293150 3315406 2892288 2211123 1917388 2217083 2657149 2827553 2776836 2709681
35896 2709681 2778382 3105358 3443508 3045703 1683726 523323 880851 2289957 3122717
35887 3122717 3005947 2996220 3349259 3160198 2629957 3360392 5410595 6407323 5089484
35878 5089484 3505216 3748468 4640923 4117848 3034777 3567662 5137698 5278200 3896512
35869 3896512 3277267 3974428 4082955 2983363 2518302 3518919 4180542 3240385 2134499
35860 2134499 2417897 3344457 3740868 4253918 5825845 7599893 8273864 8170155 8120591
35851 8120591 7619242 6115952 5030764 6177745 8757172 10128487 9423930 8406893
35843H406893K35860J015030O63016J72388J64338M16990R02670J729666K278612
35834A5985463J730987M79155m5029Q43696K183528K500252J402204j91506j156871
35825B3731879j209055q42514n28451l23995j97485k08868j96311J78992P86857
35816B1191049R77614N38665J26873L39806R68720J581248K108071K403344K143123
35807C2378513J730361K186667L371835L631879K346858J401538K513554M429366
35799E3990571M861016M167985M644234O751418Q753593R986349J1737177J4501472
35791A19393815J7046909J9016091K1864295K5774497K7677144K4063415J4599378
35784B69435544J912238j0749299k0534005k5388730k5326365k2619603j9514294
$$ plain form
35843 8406893 8642753 9657783 10320799 10493187 10657525 11074515 11977185 13706851 15985463
35834 15985463 17716450 18195605 18150576 18994272 21177800 23678052 25080256 24888750 23731879
35825 23731879 22522824 21680310 21151859 20827864 20630379 20421511 20225200 20404192 21191049
35816 21191049 22168663 22707328 22834201 23174007 24142727 25723975 27832046 30235390 32378513
35807 32378513 34108874 36295541 39667376 43299255 45646113 47047651 49561205 53990571
35799 53990571 58851587 63019572 67663806 74415224 83168817 93155166 104892343 119393815
35791 119393815 136440724 155456815 177321110 203095607 230772751 254836166 269435544
35784 269435544 271347782 260598483 240064478 214675748 189349383 166729780 147215486
35777A47215486j6408669j3017330r984313p979335o255370l672325n23159K012345
35769I1387330L678397N151717O765856Q428306J0245595J1921658J2023054R341282
35761A58943195M882082J200670l10728m98403r81924k721653n919389j0034939
35753A44558911j3594745j5003605j4026248j1927222j0030387q719742p794987
35746F3461975o986276n975199m640981l474774l120419l381242l326599k502434
35738C0054051j387827n68536j96116l67940j131906j808610j291694L77064J603111
35729B5281597J205025L8865l08405K23436N10295M31713J057497K465598L091767
35720C3997388K100041R68693J432325K937294L756899L892100M891037O978594
$$ plain form
35777 147215486 130806817 117789487 107805174 99825839 93570469 89898144 89374985 91387330
35769 91387330 95065727 100217444 106983300 115411606 125657201 137578859 149601913 158943195
35761 158943195 163825277 165025947 164715219 164216816 163234892 160513239 154593850 144558911
35753 144558911 130964166 115960561 101934313 90007091 79976704 71256962 63461975
35746 63461975 56475699 50500500 45859519 42384745 39264326 35883084 32556485 30054051
35738 30054051 28666224 28097688 27901572 27533632 26401726 24593116 23301422 23678486 25281597
35729 25281597 26486622 26525487 26217082 26440518 26950813 27382526 28440023 30905621 33997388
35720 33997388 36097429 37066122 38498447 41435741 45192640 49084740 53975777 60954371
35712F0954371Q520434Q811065R333508J1180587J2983150J2909915J1405096
35705A36098126J0251812R925582R717002R711397J0498117J1129720R521079
35698B06852835N238557J62651m024111p367667j0198058j1920898j2193876j1907619
35690A54641814j1906620j1773727j0863185r593325q715049q116435p349482
35683H6323991o636204o363722o173809n506372m564823l900931l530109l237608
35675D6410413l193753l424773l273502k354285j508100j729994k548805k601771
35667B5775430j572053m44438K5094j1113l08906r04637j489172j411515o71031
35658A8987659j63565n68683j493466j953915j343883P4299J239441J048504l57757
$$ plain form
35712 60954371 69474805 78285870 87619378 98799965 111783115 124693030 136098126
35705 136098126 146349938 156275520 165992522 175703919 186202036 197331756 206852835
35698 206852835 212091392 212254043 208229932 200862265 190664207 178743309 166549433 154641814
35690 154641814 142735194 130961467 120098282 110504957 101789908 93673473 86323991
35683 86323991 79687787 73324065 67150256 61643884 57079061 53178130 49648021 46410413
35675 46410413 43216660 39791887 36518385 34164100 32656000 30926006 28377201 25775430
35667 25775430 24203377 23758939 23784033 23772920 23464014 22559377 21070205 19658690 18987659
35658 18987659 18824094 18255411 16761945 14808030 13464147 13538446 14777887 15826391 15468634
35649A5468634j320825n08196J156833J490767J8602j312168q30316O59234J230295
35640A6052860M56549m38969n01890R3518R27289J887674K634893K556802J828759
35631B5497485J778790L399354N847437P292603P287670P453756R310575J1937104
35623G9804774J2553717R461665L899641j113808l337466k656782o51584N33016
35615I8493173o82321m305122q560435j1171395j1225506r647789p851909o408603
35607C8640093n222672m336668l833692l265526k088128p36140l74877j225162
35599A7557228j988112j598192p88499r11488j747204j817055p41066J95223J24970
35590H285805k06355o943J67514l70881r83247p65379j81246j95527m67077P318
$$ plain form
35649 15468634 14147809 13639613 14796446 16287213 16305815 14993647 14163331 14822565 16052860
35640 16052860 16509409 16070440 15568550 15662068 16589357 18477031 21111924 23668726 25497485
35631 25497485 27276275 30675629 36523066 43815669 51103339 58557095 67867670 79804774
35623 79804774 92358491 101820156 105719797 104605989 101268523 98611741 97960157 98493173
35615 98493173 97810852 93505730 84945295 73773900 62548394 52900605 45048696 38640093
35607 38640093 33417421 29080753 25247061 21981535 19893407 19157267 18782390 17557228
35599 17557228 15569116 13970924 13182425 12270937 10523733 8706678 7965612 8160835 8285805
35590 8285805 8079450 8072507 8240021 7869140 6885893 6120514 5939268 5743741 5276664 5283982
35580E283982R29938J089026M44535M2859n1797p69722j793691j472695L17526
35571D019961J330750J74962j440968j246250K76033R31604J46222o73471n80579
35562B938264q0123J98568L12406L98535M00532M44582N95072L98801m26342j138220
35552D042075q32693J08063N36872K83362J57302L33052Q1803p27869j158586
35543B823381o47559J45404M28890L53735M81725Q42363R87786N69550l47292
35534E637983j161992j019876J74692J197932Q06052n11275j090647l97707M13745
35525D048907M14860N2351p1089k32287o25558n56629L82203J288971J215437
35516E917166O53791N71392O84158J17092p01205m68530P03577J120038O0887
$$ plain form
35580 5283982 6213920 7302946 7747481 7790340 7738543 6968821 5175130 3702435 4019961
35571 4019961 5350711 5525673 4084705 2838455 3114488 4046092 4192314 3518843 2938264
35562 2938264 2858141 3056709 3369115 3767650 4168182 4612764 5207836 5606637 5180295 4042075
35552 4042075 3209382 3317445 3854317 4137679 4294981 4628033 4709836 3981967 2823381
35543 2823381 2175822 2321226 2750116 3103851 3585576 4427939 5415725 5985275 5637983
35534 5637983 4475991 3456115 3630807 4828739 5634791 5123516 4032869 3635162 4048907
35525 4048907 4463767 4516118 4445029 4212742 3587184 3030555 3412758 4701729 5917166
35516 5917166 6570957 7142349 7826507 7943599 7242394 6773864 7477441 8597479 8658366
35507H658366j012644o51258M46412O83607N9965n1190P67620J435823J312167
35498A1648868J194255J742586K184301J692499J138453J981975L796571M570931
35490B9950439L745943L404983N587285R547214J2863854J4670711J6514822J9908496
35482A16193747K3726037K4348032J8697679P934391j884002m509847j77183L585756
35474A87914610m10772j1167173k1020867k4344511k2258738j8779494j5546238
35467G4386817j2050406q651909o631710o016716n521117m511822l514894k931292
35459B4556951k565307k295521k074127j488614m45292O0438q43779k222341k325059
35450A0357349j104717j56338j86869l41723k41451o39784j403958r75136R38898
$$ plain form
35507 8658366 7645722 6994464 7440876 8124483 8184448 8133258 8900878 10336701 11648868
35498 11648868 12843123 14585709 16770010 18462509 19600962 21582937 25379508 29950439
35490 29950439 33696382 37101365 42688650 52235864 65099718 79770429 96285251 116193747
35482 116193747 139919784 164267816 182965495 190899886 189015884 184506037 184328854 187914610
35474 187914610 187503838 176336665 155315798 130971287 108712549 89933055 74386817
35467 74386817 62336411 53684502 47052792 41036076 35514959 31003137 27488243 24556951
35459 24556951 21991644 19696123 17621996 16133382 15688090 15748528 14904749 12682408 10357349
35450 10357349 9252632 9096294 8909425 8567702 8326251 7686467 6282509 5307373 6246271
35441F246271K111252R52019p75907n53242R06415Q78695q67893j692439l32575
35432F872596J232437R93370l78302j247383j445774j488965j012985K49805J125689
35423D900488M44315r56457j359026o81358j88908j92819J44074Q80953J007356
35414C998618K72246l08000j49087R0732j66749n45741o21906n42125l13957L49404
35404B063435J022173O61589o64916j377668n13559Q47309J173921M95742j41975
35395C566051l15388k68910j10483k068m28178j239993j209646K68517J757937
35386B017839J450726k75017j443434j253209o80532m69400k17421L06159N19770
35377d4519K51515K77668R67855J491319J088511J92939m42825q66947j339496
$$ plain form
35441 6246271 8357523 9309542 8533635 7980393 8886808 9765503 8897610 7205171 6872596
35432 6872596 8105033 9098403 8720101 7472718 6026944 4537979 3524994 3774799 4900488
35423 4900488 5344803 4388346 3029320 2347962 2159054 1966235 2110309 2991262 3998618
35414 3998618 4270864 3962864 3813777 3904509 3737760 3192019 2570113 2027988 1714031 2063435
35404 2063435 3085608 3747197 3082281 1704613 1191054 2038363 3212284 3708026 3566051
35395 3566051 3250663 2981753 2871270 2869202 2441024 1201031 -8615 259902 2017839
35386 2017839 3468565 3193548 1750114 496905 -183627 -653027 -870448 -564289 -44519
35377 -44519 206996 484664 1452519 2943838 4032349 4225288 3782463 2915516 1576020
35368A576020j386674m69337Q41150J369746Q77461K31336M3311m6374n04661
35359B531978r95331q06642J20532J051266J296411Q59139J88749m02505q52175
35350B991422j064639q56723k24385N46130J069038J046230M09417m56161q15610
35341B644719l59417K54523K01216k75194j96709N52302R45013M46868j02752
35332D110569J14392N40325J81119p72780j256421q44845o0744N24803P00570
35323C236988M08479j35045l79523j24755J11817j5296j8399M57540P06947k691
35313D246062j065007j320317p30289j38284J72954M66785N30143l203o06554
35304A552290m46512K38745N89049N71496O50051N18435k59283q59097k91172
$$ plain form
35368 1576020 189346 -279991 561159 1930905 2808366 3039702 3083013 3036639 2531978
35359 2531978 1536647 730005 850537 1901803 3198214 4057353 4246102 3843597 2991422
35350 2991422 1926783 1070060 845675 1391805 2460843 3507073 3916490 3460329 2644719
35341 2644719 2285302 2539825 2741041 2465847 2269138 2821440 3766453 4213321 4110569
35332 4110569 4224961 4765286 4946405 4173625 2917204 2072359 2011615 2536418 3236988
35323 3236988 3645467 3510422 3130899 3006144 3117961 3102665 3084266 3541806 4248753 4246062
35313 4246062 3181055 1860738 1130449 992165 1165119 1631904 2162047 2158844 1552290
35304 1552290 1105778 1344523 1933572 2505068 3155119 3673554 3414271 2555174 2264002
35295B264002N74408K09271p00399j26029J574045J700136m17779k033799j160566
35286A883290N88919R21917J62742k62340m38588r13818r07004J49179Q43662
35277B027959r7627j283829o63252J074407J597217N61357l77359n43306o83583
35268A611984p93964k8793J235280J533156O41133k30682n84731r75183j243308
35259A164892n59582O33724Q44096m8152o24086m05192l64048o89442l65852N24844
35249A11202N06292n37859p76843L88407J073703J88617n63175K40035J072256
35240A702635J82319j108807o10220Q21980O71424q83010j240269K36803J253697
35231A026552M27636p23111n68312K33988L93766J44926K90914N07991R2627n56632
$$ plain form
35295 2264002 2838410 3047681 2347282 2221253 3795298 5495434 5077655 3043856 1883290
35286 1883290 2472209 3394126 3556868 3294528 2855940 1942122 1035118 1184297 2027959
35277 2027959 1930332 646503 -16749 1057658 2654875 3216232 2838873 2295567 1611984
35268 1611984 818020 789227 2024507 3557663 4198796 3968114 3383383 2408200 1164892
35259 1164892 605310 1239034 2083130 2034978 1410892 1005700 641652 -47790 -413642 111202
35249 111202 617494 79635 -697208 -308801 764902 953519 390344 630379 1702635
35240 1702635 1884954 776147 165927 987907 1659331 776321 -463948 -227145 1026552
35231 1026552 1454188 731077 162765 396753 790519 935445 1226359 1734350 1826977 1270345
35221A270345n72803q7628J29289J6327J10413M21375M32225P1985j89227j77921
35211A424380k11289m25980n35403l54733r7973l7495j64891k21648J00152Q24163
35201B99283J363266Q91115n41822j639842j260582N7519P60034L82502K8877
35192C40350N25550J119531O86115n28716j299617j146003o83993l85041O588
35183a365236O18223R19999N48376J2479k2724K77672K83117m8711j84778K8706
35173A067123J54138n462p1112J32911J41833k85862m54742K85366J163372O95558
35163B823123j055668k048838p99862J478961K318748J104347m70322r21191n73502
35154A855796l27685k03731O2985R2277l46327m42128M37271J238241M94639j141344
$$ plain form
35221 1270345 697542 609914 739203 755530 865943 1287318 1719543 1791528 1602301 1424380
35211 1424380 1213091 787111 251708 -103025 -200998 -238493 -403384 -625032 -524880 299283
35201 299283 1662549 2553664 2011842 372000 -888582 -831063 -71029 311473 340350
35192 340350 865900 1985431 2671546 2142830 843213 -302790 -986783 -1371824 -1365236
35183 -1365236 -747013 172986 721362 733841 711117 988789 1271906 1223195 1038417 1067123
35173 1067123 1221261 1215799 1144687 1277598 1419431 1133569 678827 964193 2127565 2823123
35163 2823123 1767455 -281383 -1081245 397716 2716464 3820811 3350489 2429298 1855796
35154 1855796 1528111 1324380 1387365 1479642 1133315 691187 1128458 2366699 2861338 1719994
35144A719994j400918K94258J754099J061130p70378j409140m44426M88061L16590
35135A609270k83435l97738k25564l58884o01189l19820L71179N66295j63015
35126A97099r96476q01975L61756J243655R93601J56643k76295j97902j16975
35117E63131q6658J70674L76223J3195n59525m53974K21037L86127k46375p19801
35107c35946n11802k77128l13079K29263J621202K438543J507168j32898o89122
35098C536201j77533L6372m29062p76419p49362q53910j018207o42062M377k9373
35088a098978o38425o09980L65376J026847M33037o32426p96986J63090J244205
35079e44240J319792R4340j507132j928198o32107R99025J245461K58757l89956
$$ plain form
35144 1719994 319076 613334 2367433 3428563 2658185 1249045 804619 1292680 1609270
35135 1609270 1325835 928097 702533 343649 -257540 -577360 -206181 360114 197099
35126 197099 -799377 -1601352 -1239596 4059 997660 1154303 878008 680106 563131
35117 563131 476473 647147 1023370 1036565 477040 23066 244103 630230 383855 -335946
35107 -335946 -847748 -1124876 -1437955 -1208692 412510 2851053 4358221 4225323 3536201
35098 3536201 3358668 3395040 2965978 2189559 1440197 586287 -431920 -1073982 -1069605 -1098978
35088 -1098978 -1737403 -2347383 -1982007 -955160 -522123 -1154549 -1951535 -1788445 -544240
35079 -544240 775552 869892 -637240 -2565438 -3197545 -2198520 -953059 -694302 -1084258
35070a084258r9259K30281K8358j41848P9913J93194O336R7488N53791N80716
35060D44712r326k51047L06529P12969K58255k80174l9564M68854M27689J58338
35050B197235K71791L36874k71184r72831q02688l8197K92020L6770j86872k66258
35040E96660m83957n36690J9274O34428M11573l02326l24964M28593Q15015L76861
35030A634467j5203J99426L08825l32323j061430q80725p857M28868l7204o73911
35020d37067n94908J39396O62061L77067l36460o29196k42512K82577M48060L61163
35010C0181K90070J93616O468j09052j43371l36288n32613j27000Q11657J122465
35000A206133P4293j323417j504782m07425O36649P46541K40018k35541l43445
$$ plain form
35070 -1084258 -1183517 -953236 -924878 -1066726 -986813 -793619 -787283 -689795 -136004 444712
35060 444712 435386 184339 490868 1203837 1462092 1181918 1142354 1611208 2038897 2197235
35050 2197235 2469026 2805900 2534716 1561885 759197 721000 1013020 1049790 862918 596660
35040 596660 112703 -423987 -404713 229715 641288 338962 13998 442591 1257606 1634467
35030 1634467 1619264 1818690 2127515 1795192 733762 -146963 -154820 274048 236844 -437067
35020 -437067 -1031975 -892579 -230518 146549 -189911 -819107 -1061619 -779042 -330982 30181
35010 30181 320251 513867 520335 411283 267912 -68376 -600989 -727989 83668 1206133
35000 1206133 1280426 -42991 -1547773 -1955198 -1318549 -572008 -331990 -567531 -910976
34991i10976M4093P06368R55757M41457j75817j55434J27926q7411m93545k47828
34981B04590L85493L90076j72472k74380J19568p7243r61971j180459j90506O95953
34971a061351M04880k85176k51994K20513L61373L45358N35960L99167m46559
34962B22171j051846m80094M73923M47148k94128m67956m2611n9561m64490q9144
34952a806588J053073J397794L40555o17329j72172P57569N28488p05836j332140
34943e56586o53129L43147N52850Q5020k63610k00658j01851j74090J8685Q39927
34933a10295J611766J090078p61412k184316j588600L60197J569894J136586K9151
34924A153049o54263p66297l62363O11091J423964Q81622o85532j234939J11432
$$ plain form
34991 -910976 -866883 -160515 795242 1236699 1060882 905448 1033374 945963 452418 204590
34981 204590 590083 980159 807687 533307 652875 575632 -386339 -1566798 -1757304 -1061351
34971 -1061351 -656471 -941647 -1193641 -973128 -611755 -266397 269563 668730 222171
34962 222171 -829675 -1309769 -835846 -388698 -682826 -1150782 -1193393 -1252954 -1717444 -1806588
34952 -1806588 -753515 644279 984834 367505 195333 952902 1481390 775554 -556586
34943 -556586 -1209715 -866568 -313718 -228698 -492308 -692966 -794817 -968907 -950222 -110295
34933 -110295 1501471 2591549 1830137 -354179 -1942779 -1582582 -12688 1123898 1153049
34924 1153049 498786 -267511 -629874 -18783 1405181 2286803 1601271 366332 477764
34915D77764J460799Q80555o07304p06831M71362P73617l62439j166777o55063
34906E65683m5327l05972n20448J27078O87075K44261k88647J17190N42414k49297
34896H74010j271815p12581Q29994J018704m39543j227655j05799J228830J002733
34887A196878K1367l3363O21653N93735j82660n21612j30880K0535n21050r73634
34877I0969o48233Q9743N39588N24433K19598j88368l88641j12443L17592K04169
34867F48407m63550p84390j95709O29066P06273J12851k73510j32726P335j83901
34857G0146l29637j30186P5225j3195k7231L96744P98012N22159j49946l98299
34847H13792k10063k95165o68427n45515N8581o80j012799j445064j45568J586644
$$ plain form
34915 477764 1938563 2819118 2211814 1504983 1976345 2749962 2387523 1220746 565683
34906 565683 520356 214384 -306064 -178986 508089 752350 463703 580893 1123307 874010
34896 874010 -397805 -1110386 -280392 738312 298769 -928886 -1034685 194145 1196878
34887 1196878 1218245 1184882 1806535 2400270 2217610 1695998 1565118 1585653 1064603 90969
34877 90969 -557264 -467521 72067 596500 816098 627730 239089 126646 444238 648407
34867 648407 184857 -599533 -795242 -166176 540097 652948 379438 246712 254047 70146
34857 70146 -259491 -389677 -314452 -327647 -354878 41866 839878 1362037 1212091 813792
34847 813792 603729 308564 -359863 -905378 -846797 -847477 -1860276 -3305340 -3450908 -1864264
34837a864264J649941J02782j173341j254830q14411k68207O74839J476240Q92686
34828e78565p48623j351577n0257J378070J232681L07833J34268L63087k13495
34819D73422j146882r42654L43054J086342N57790k72412m39082n7893M06252
34810G937O99824N22219j81030o63116j93202O58914P07801Q18l26594k2685r4060
34799A116826r63782j648617j250895j22138R05800J417319J215400L35619m08932
34790E96600p7094Q33471P59145n18632j295969n43685M24994O3165r29670p49290
34780a436965P64993K086326K176228J247290k47898j866689k578522j504447
34772a359684M95071J347449L74311p75938m37573Q28323J203431J72750r63567
$$ plain form
34837 -1864264 -214323 -111541 -1284882 -2539712 -3354123 -3622330 -2947491 -1471251 -578565
34828 -578565 -1327188 -2678765 -2729022 -1350952 -118271 189562 323830 686917 473422
34819 473422 -673460 -1616114 -1273060 -186718 371072 98660 -340422 -398315 7937
34810 7937 707761 1229980 1048950 385834 192632 851546 1559347 1560165 1233571 1210886 1116826
34799 1116826 153044 -1495573 -2746468 -2868606 -1962806 -545487 669913 1005532 596600
34790 596600 519506 1352977 2112122 1593490 297521 -246164 178830 241995 -687675 -1436965
34780 -1436965 -671972 1414354 3590582 4837872 4589974 2723285 144763 -1359684
34772 -1359684 -864613 482836 857147 81209 -356364 471959 1675390 1848140 884573
34763H84573j007692l33836j09783o30529r82685k86847J122273J939576J237079
34754A832129n07059j745961j337867K19096J210835O27811n82269p42166K39110
34745g86341P45772j06557j100975q31393R3102J53880m72504k14629J111702
34736a407943J732259O30937q41078r88776p6024N10686L92720K62291M54703
34727F69775O29048N48865K53326k90022r40657j101458m28665M44013O03750
34718C87975O1379l84060k70291J27881L26897N9464o00604j124319q75902K2603
34708b268977O22931L82882r3639p6186J96917J61890J7537K52397N82118L51602
34698A29472l27093p70805p90179o87123m82821l4994L73850M59539N92078J071897
$$ plain form
34763 884573 -123119 -456955 -566738 -1197267 -2179952 -2466799 -1344526 595050 1832129
34754 1832129 1325070 -420891 -1758758 -1539662 -328827 298984 -283285 -1025451 -786341
34745 -786341 -40569 -147126 -1248101 -2079494 -1986392 -1832512 -2305016 -2519645 -1407943
34736 -1407943 324316 955253 114175 -874601 -950625 -439939 -47219 215072 669775
34727 669775 1298823 1847688 2101014 1810992 870335 -231123 -659788 -215775 387975
34718 387975 449354 65294 -204997 -77116 249781 309245 -291359 -1415678 -2291580 -2268977
34708 -2268977 -1646046 -1263164 -1356803 -1432989 -1236072 -1074182 -1056645 -804248 -222130 129472
34698 129472 -197621 -968426 -1758605 -2445728 -2928549 -2963543 -2589693 -2130154 -1538076 -466179
34688d66179J207949L18140p41486n11754P44589J242659L53908n41543l62452
34679A243831Q0804l33284j155416j204682m47884J13869Q406k36966n3878M41857
34669a543343P22989M99293N8055k6861L52608O02815L03543o9879K6165J04667
34659A030052n53517j324931r04237M66289J067318L45285k58893J77782N41189
34650E86337j48274p68485R99J169316Q76180n32864j052941k18361M33798P9930
34640D25635l38770j49008m9812m74161n86648J24120P15162L47028k48621m3351
34630b78426N63257N66128R5594j1653J93204p249n09245m87688J10506M44829
34620F79257K11913J4829J48317J56743j47534l41154l70708o92945j017051k69673
$$ plain form
34688 -466179 741770 1059910 318424 -193330 551259 1793918 2147826 1606283 1243831
34679 1243831 1324635 991351 -164065 -1368747 -1816631 -1702762 -1694356 -1931322 -1985200 -1543343
34669 -1543343 -820354 -321061 -263006 -289867 62741 665556 969099 899220 925385 1030052
34659 1030052 476535 -848396 -1752633 -1286344 -219026 126259 -132634 45148 586337
34650 586337 438063 -330422 -329423 839893 1716073 1183209 130268 -88093 345705 425635
34640 425635 86865 -62143 -111955 -586116 -1172764 -1048644 -333482 13546 -235075 -278426
34630 -278426 284831 850959 946553 934900 1128104 1120855 611610 123922 234428 679257
34620 679257 891170 905999 1054316 1211059 1063525 722371 351663 -341282 -1358333 -1628006
34610a628006J409739K040405M38804j663207j777751j45336Q36155K61864l40525
34601e67858J19082O70921L34233j42299J40133M61741j45072r21740n28275O04460
34591B5326R01458K37321L8481P63685J076877L1435j390094j701342q71689q4079
34581i72621j54375p81201j012793k16001J091213J515955M93816o43564l38960
34572a018531P78871O79041q60582j702554o10688Q40167P86444j73345l55627
34563a636804K25733L67871L1107J05959L77843j14592q75413l42934J280625
34554e80605J818230M27676r73967p02315K01457L9509o05721q8459J162124J095568
34544A793497n88605j783141j112504J97803M35981j87214m03352Q546L20127
$$ plain form
34610 -1628006 -218267 1822138 2260942 597735 -1180016 -1325352 -489197 -227333 -567858
34601 -567858 -448776 222145 556378 414079 554212 1015953 870881 -50859 -579134 25326
34591 25326 926784 1164105 1202586 1966271 3043148 3074583 1684489 -16853 -888542 -972621
34581 -972621 -1126996 -1908197 -2920990 -3136991 -2045778 -529823 -36007 -679571 -1018531
34572 -1018531 -239660 439381 -421201 -2123755 -2734443 -1894276 -1107832 -1281177 -1636804
34563 -1636804 -1411071 -1043200 -1012093 -906134 -528291 -642883 -1518296 -1861230 -580605
34554 -580605 1237625 1665301 691334 -10981 190476 229985 -375736 -464195 697929 1793497
34544 1793497 1204892 -578249 -1690753 -1492950 -1056969 -1244183 -1647535 -1638989 -1318862
34535a318862L17452L38876K97651o1593k30831M16535J195970P74981o17449
34526A112730j181999k04314Q19338N20253l48191m33078Q861l3753k92084J33010
34516A00773P56256L46570p20632q36767Q4032L81250m35513p61742K75796J193683
34506C83706O29252m37010n23907r1403k97552o75332j53372O16900K46963o88967
34496i90722l34991J233845J862683O62831p25807q67468m80596o41765q05711
34487a087701j2233J155805J319519L78509m19318k21639N20835P87858Q3950
34478B505585j075560j535629o81945O48940R94156J05481p88246p63381l13193
34469i03792k30804l43550j12672K56897J88763k53984n15844l70282M4111O34750
$$ plain form
34535 -1318862 -1001410 -662534 -364883 -426476 -657307 -240772 955198 1730179 1112730
34526 1112730 -69269 -273583 545755 1066008 717817 284739 293600 259847 -32237 100773
34516 100773 857029 1203599 482967 -353800 -269768 111482 -324031 -1085773 -809977 383706
34506 383706 1012958 575948 52041 -39362 -336914 -1012246 -1165618 -548718 -301755 -990722
34496 -990722 -1325713 -91868 1770815 2433646 1707839 840371 359775 -281990 -1087701
34487 -1087701 -1099934 55871 1375390 1753899 1334581 1112942 1633777 2421635 2505585
34478 2505585 1430025 -105604 -787549 -138609 855547 961028 172782 -590599 -903792
34469 -903792 -1134596 -1478146 -1590818 -1333921 -1145158 -1399142 -1914986 -2285268 -2241157 -1606407
34459a606407J179532J143678L67361l98713l65104J59296K46572k43397n61803
34450g8985l37968r6005k87748n44546l46013P0412Q5267k15449l1602Q72343
34440i10294J512192R13235l90438r80018n71815k54079m61984j83349R50022
34431c76528J326334k46556k012482j374078J108773K348670J239295j63293l32639
34422A517496k65502p88103p48487M21963R55273k63741j254497p5337J588863
34413A087928R98995j023138j439926J1729P58229m9102n35384J19357M32691
34404C61379j35238n9359R90174R73503q64306k136596j072167N54596N31402
34395h56612j90059L02152J134150K71512j481267j474066L82663J437376N63501
$$ plain form
34459 -1606407 -426875 716803 1084164 685451 320347 479643 726215 482818 -78985
34450 -78985 -416953 -512958 -800706 -1345252 -1691265 -1620853 -1535586 -1751035 -1782637 -910294
34440 -910294 601898 1515133 1124695 144677 -427138 -681217 -1143201 -1326550 -376528
34431 -376528 949806 703250 -1309232 -2683310 -1574537 774133 2013428 1850135 1517496
34422 1517496 1251994 463891 -284596 137367 1092640 828899 -425598 -500935 1087928
34413 1087928 2086923 1063785 -376141 -364412 393817 344715 -190669 -71312 361379
34404 361379 226141 166782 1156956 2130459 1266153 -870443 -1942610 -1388014 -856612
34395 -856612 -1046671 -744519 389631 661143 -820124 -2294190 -1911527 -474151 89350
34386H9350l66474J65216J109161R92488J78432k29199j79553j90705k31412j18617
34376A218687j18389l12982k24907K02660J82954n43313q70304P6342J279856
34367H90604J057402m67463j461526r32081P9816K11523l69555n17438J69824
34358a338894J017945J378447J252811Q21450J10474o07722p27522j19051M26336
34349B214274J62839n11774o43202k21441j89228q34356j147604l24669Q48315
34340f46846R42106j33958r51836m04192R34463J577959R07523k20608o61465
34331A343146m22911m95601j275069j822259j162207K43296J107934J037226O75183
34322g71262L75162r2736n03120j73776O73359Q47254J9900o21827k35198M06842
$$ plain form
34386 89350 -277124 -111908 997253 1989741 2168173 1938974 1759421 1568716 1337304 1218687
34376 1218687 1100298 787316 562409 765069 948023 404710 -465594 -389252 890604
34367 890604 1948006 1480543 19017 -913064 -833248 -621725 -991280 -1508718 -1338894
34358 -1338894 -320949 1057498 2310309 3131759 3242233 2634511 1906989 1787938 2214274
34349 2214274 2377113 1865339 1222137 1000696 811468 -22888 -1170492 -1495161 -646846
34340 -646846 295260 161302 -790534 -1194726 -260263 1317696 2225219 2004611 1343146
34331 1343146 920235 424634 -850435 -2672694 -3834901 -3591605 -2483671 -1446445 -771262
34322 -771262 -396100 -488836 -991956 -1165732 -492373 354881 374781 -247046 -482244 -75402
34312g5402L54610k1789j4797Q2373j79910k76561K45669N65841r1820q32609
34302b44395m31043M82799M06076m61780o13582J41204N18076J46732L4537M60131
34292D38755M38801k96605p05764l83315k43669o04165m34064N99004J101770
34283h9252J24839j144326j111994K0382R77319J248660J052399M35016m41342
34274A071701r04347o40762k15058N655M48378J115131J026005j02032q94842
34265I09829k89480P27067P37787J00476n9588R811n77966j289281q94718K06700
34255d19363M48286k77689m72653L62421R09978K78214o29653o62849m324M80094
34245A2462M27476m6921o62067q48857j93319O87323O53872k64440p23332k5818
$$ plain form
34312 -75402 279208 257419 242622 324995 145085 -131476 114193 680034 588214 -244395
34302 -244395 -675438 -192639 213437 -248343 -861925 -720721 -202645 -55913 -21376 438755
34292 438755 877556 580951 -124813 -508128 -751797 -1355962 -1790026 -1191022 -89252
34283 -89252 35587 -1108739 -2220733 -2200351 -1223032 25628 1078027 1513043 1071701
34274 1071701 167354 -473408 -688466 -682811 -234433 880698 1906703 1804671 909829
34265 909829 620349 1347416 2085203 2185679 2126091 2135902 1557936 268655 -626063 -419363
34255 -419363 28923 -248766 -721419 -358998 550980 829194 199541 -463308 -467632 12462
34245 12462 439938 393017 -269050 -1117907 -1311226 -623903 29969 -234471 -957803 -983621
34235i83621Q44233P82216J69530M9579M20019L68493l90487j050184q72119j69698
34225h32039J96456K7119L2219P01659J335084Q49045n29274j301621p46410R8323
34215a69439J76662N5511O75702J389998Q49471o34647j360881p98401j78325
34206E651l10785m56941R7784P96032Q52902L85339j81852p93601j208423q05739
34196a619633L28156J069030P65652K15857L61181Q33323O75959j45577q33580
34187A650368q86758m06823L05539Q38083P51074R8029n19956p51972q02200p03389
34177d28005j40013N92623M85110o10046j291467m70760R20513J224895M02263
34168F85113j89808M6121L36286K5231m98825n86615j99516K47305L79816J09793
$$ plain form
34235 -983621 -139388 642828 812358 861937 1281956 1650449 1259962 209778 -662341 -832039
34225 -832039 -635583 -608464 -576245 125414 1460498 2309543 1780269 478648 -267762 -169439
34215 -169439 7223 62734 738436 2128434 2977905 2343258 982377 183976 5651
34206 5651 -305134 -762075 -664291 131741 984643 1369982 1188130 394529 -813894 -1619633
34196 -1619633 -1291477 -222447 543205 759062 1120243 1953566 2629525 2483948 1650368
34187 1650368 763610 356787 662326 1500409 2251483 2349512 1829556 1077584 275384 -428005
34177 -428005 -568018 24605 509715 -100331 -1391798 -1862558 -942045 282850 685113
34168 685113 495305 541426 877712 902943 404118 -182497 -382013 -134708 245108 354901
34158C54901k38822j60585L17740M57140j94789j006914j052625l14473N44345
34149a294082J179136J542550J298409K85930o60736m91226M40968O48862l68360
34140B581451j339977j028508R7900O94292L89373k3654N3621K99403J88208j86396
34130A725713l56784k46605k44286n14129o67337l70495P3058J97282J71427M85804
34120B53648R34333P09918l02217j106031q67330L2715O59345O66376L15366q8547
34110A207576k65888K7716N48099N91861n4676p15340q06132n67087l25592J43081
34100b16382Q03449P96217k79688j249220p59895O77942J320733N80364m66028
34091A207492q14623n53086j19775L05788M98636K24940k38471l72079k12145
$$ plain form
34158 354901 116079 -44506 273234 730374 535585 -471329 -1523954 -1838427 -1294082
34149 -1294082 -114946 1427604 2726013 3011943 2351207 1859981 2300949 2949811 2581451
34140 2581451 1241474 212966 310866 1005158 1394531 1370877 1424498 1723901 1912109 1725713
34130 1725713 1368929 1122324 878038 363909 -303428 -673923 -600865 -403583 -232156 253648
34120 253648 1187981 1897899 1595682 489651 -377679 -344964 314381 980757 1296123 1207576
34110 1207576 941688 969404 1517503 2109364 2054688 1339348 533216 -33871 -359463 -216382
34100 -216382 587067 1383284 1103596 -145624 -905519 -227577 1093156 1673520 1207492
34091 1207492 392869 -160217 -279992 25796 524432 749372 510901 138822 -73323
34082g3323j59622j50378J41454M69268L28128p9385j77932r1487k92934m58002
34072e44213M4315P29923N46733k28564k70368N05291O89409k01135q50400l63485
34062E7506L51599L20354L1445J63010K44047j93031m43655M4054L52353m34802
34052D92880j435114j197598K4943P68437N42667M2285l33170o59683n45234M47412
34042a852175J559545J470205K24345p43824n95978Q4236N34222O71845M80070
34033A832491l04431j413681j844924r87356N58758J630033J614412Q11206L1324
34024A927832j53461j1230k74566r38330j027353p8529Q93583P65047p6211n60584
34014D66198o89024j066763j264082l80202R82264J192744J83567l22489L95206
$$ plain form
34082 -73323 -232945 -383323 -241869 227399 555527 476142 298210 206723 -86211 -544213
34072 -544213 -499898 230025 776758 548194 277826 783117 1472526 1271391 420991 57506
34062 57506 409105 729459 760904 923914 1167961 974930 531275 575329 927682 492880
34052 492880 -942234 -2139832 -2114889 -1346452 -803785 -761500 -1094670 -1754353 -2299587 -1852175
34042 -1852175 -292630 1177575 1401920 658096 62118 146354 680576 1352421 1832491
34033 1832491 1528060 114379 -1730545 -2717901 -2159143 -529110 1085302 1896508 1927832
34024 1927832 1774371 1763141 1488575 550245 -477108 -555637 337946 1102993 1026782 466198
34014 466198 -222826 -1289589 -2553671 -2933873 -1951609 -758865 -575298 -897787 -502581
34005e02581R36092K37549o55252m42021L47615N23454K58054L98797O78479K44252
33995B024438n79590o35099J79841P36817L62221m35564r25709q62067k52244
33986c86956O66660J235387R88025L81186Q3970k34082j303339k529383k258110
33977c356642j87875J743723J715462L55603l03339L63849J003524M68747n80353
33968A222699q10005j96576O3952n08868q69261r3394R61913P23491o58273j273597
33958a437919j80253J150123R87479j38024m10475M18446P60058k60891j515582
33949f27038j600776o60230K30426O18464P74939P83120M02533k73299o62949
33940a014810l48188L64294O59568O8203q37897q62780L74615J699817J660615
$$ plain form
34005 -502581 433511 671060 15808 -426213 -78598 444856 702910 1101707 1780186 2024438
33995 2024438 1444848 809749 989590 1726407 2088628 1653064 727355 -134712 -386956
33986 -386956 279704 1515091 2503116 2884302 2968272 2734190 1430851 -1098532 -3356642
33977 -3356642 -3544517 -1800794 -85332 270271 -33068 330781 1334305 1803052 1222699
33968 1222699 412694 216118 280070 -228798 -1098059 -1191453 -229540 493951 -164322 -1437919
33958 -1437919 -1618172 -468049 519430 381406 -29069 389377 1149435 888544 -627038
33949 -627038 -2227814 -2888044 -2657618 -2039154 -1264215 -481095 -78562 -351861 -1014810
33940 -1014810 -1362998 -998704 -339136 -270933 -1108830 -1971610 -1596995 102822 1763437
33931A763437L76831o34667m83901R4113L477p59714j366816j250670m66729N61120
33921b163519J237805J153694N90319K79568M28069M79509O0543m71057p24231
33912H70700q27632q98407o92423k64354k03214o07377o18871K58643J136890
33903a846045R61202Q9789l87693l41301m11857n30043Q108J014152J254640J68991
33893b0057j200132j430201l17757J014422J278414K69198q23349o32502O22440
33884a239524J252986M56853m16715P4226J137058R72810l74968j207361q73911
33875b18546l68115k39939R7446O59197M47127o40893j240926o66111K2062l0046
33865b178744o2252O65844J345975J018889K49980Q8307L92870M28648J64817
$$ plain form
33931 1763437 2140268 1505601 1021700 1115813 1119290 359576 -1007240 -2257910 -2724639 -2163519
33921 -2163519 -925714 227980 818299 1097867 1525936 2005445 2065988 1594931 870700
33912 870700 43068 -855339 -1547762 -1812116 -2015330 -2622707 -3241578 -2982935 -1846045
33903 -1846045 -884843 -795054 -1182747 -1524048 -1935905 -2465948 -2457840 -1443688 -189048 -20057
33893 -20057 -1220189 -2650390 -2968147 -1953725 -675311 -406113 -1229462 -1861964 -1239524
33884 -1239524 13462 470315 53600 127826 1264884 2237694 1862726 655365 -218546
33875 -218546 -586661 -826600 -729154 -69957 377170 -263723 -1504649 -2170760 -2148698 -2178744
33865 -2178744 -2240996 -1575152 -229177 789712 1039692 1127999 1520869 1949517 2114334
33856B114334j60786p52417j406913j107495K67137J061224J70260r76407n47167
33847a338230P09178P45315l68484p30934O4863L91867m76310j212355p63928
33838b979018J52440N94027P00680O80866O4624j093776j594088p05935N94533
33829c585647R59241M45759R3036L59569P95768Q47917L55147m45397r84238p43593
33819a902438J22444Q53727R46495O28143L84997L64867L20558p9033p89350j137529
33809b87119m94756N83556P12557l22568j004415m10980J82408n08253j268724
33800b818294k32290J654941J700950k34215j371506l38957R66278P82484M7954
33791A57345Q1626J21947q25365j586272n61682J370449J948404Q14377l08710
$$ plain form
33856 2114334 1953548 1201131 -205782 -1313277 -1046140 15084 185344 -791063 -1338230
33847 -1338230 -629052 116263 -252221 -983155 -918292 -526425 -1002735 -2215090 -2979018
33838 -2979018 -2826578 -2232551 -1531871 -851005 -786381 -1880157 -3474245 -4180180 -3585647
33829 -3585647 -2626406 -2180647 -2087611 -1728042 -932274 -84357 270790 -174607 -1158845 -1902438
33819 -1902438 -1779994 -926267 20228 648371 1033368 1398235 1718793 1639760 850410 -287119
33809 -287119 -781875 -198319 514238 191670 -812745 -1223725 -1041317 -1549570 -2818294
33800 -2818294 -3050584 -1395643 305307 71092 -1300414 -1639371 -673093 109391 157345
33791 157345 238971 360918 -464447 -2050719 -2612401 -1241952 706452 1520829 1212119
33782A212119l45761K9539n3145m94786p63729n92163n5868M24842L58139j00892
33772c81705j97688K30179L80238j49730n90301l42316l5007k74801m12643K12493
33762a561281P79991K12945q35893q16127L23602J107793P34713o7442l71734
33753d93433q3927L95111O22242K76424l94222n42531J56674Q19842O01233K4712
33743A382125N7684M63987K99613m31199r26037j020757j121422j010645k08683
33734b515334O23654K65840r17761j036346N76100K091616J577057l62049j437603
33725a134826p06365L76701J01007j123586j319808K29390J728392J213541o10108
33716a245662j291974j39044R92669P32118P9782L19594Q51992N48340j90372
$$ plain form
33782 1212119 866358 895897 842752 347966 -415763 -1007926 -1063794 -638952 -280813 -381705
33772 -381705 -579393 -349214 31024 -118706 -709007 -1051323 -1086330 -1361131 -1773774 -1561281
33762 -1561281 -781290 -568345 -1404238 -2220365 -1896763 -788970 -54257 -121699 -493433
33753 -493433 -577360 -182249 439993 716417 322195 -220336 -63662 756180 1357413 1382125
33743 1382125 1439809 1903796 2203409 1772210 846173 -174584 -1296006 -2306651 -2515334
33734 -2515334 -1891680 -1625840 -2543601 -3579947 -3003847 -912231 664826 302777 -1134826
33725 -1134826 -1841191 -1464490 -1363483 -2487069 -3806877 -3577487 -1849095 -635554 -1245662
33716 -1245662 -2537636 -2676680 -1684011 -951893 -872111 -552517 299475 847815 657443
33707F57443l68254k27294m76472o91272j79245M51257K95468j22682J41834N85613
33697F6396K19872m50397l48144J07160j02452m82680l2842N24838K3233m99153
33687i74169O66640K347601J788113o78252j803618o11912K36638q18564j744527
33678a592050p38986O89495N42268m18595m67838J54593K72216J0960N8841J74705
33668a314391R8977M41745J175580R48218n45459j353290k00023J212363Q35149
33659A298869n55562j019162o33544n77069m91234N31943J451456O43071r37057
33650b88289q58475P97549J414967k7203j489534j168461O5586N11947J04442
33641i37471j32877J30210L94436L14699K4376k20230l19572l90502n71317o76426
$$ plain form
33707 657443 289189 61895 -414577 -1105849 -1285094 -833837 -538369 -661051 -519217 66396
33697 66396 286268 -164129 -512273 -405113 -507565 -990245 -1023087 -498249 -475016 -974169
33687 -974169 -307529 2040072 3828185 3149933 1346315 734403 971041 152477 -1592050
33678 -1592050 -2331036 -1641541 -1099273 -1517868 -1985706 -1831113 -1558897 -1547937 -1489096 -1314391
33668 -1314391 -1215414 -773669 401911 1350129 804670 -548620 -748643 463720 1298869
33659 1298869 743307 -275855 -909399 -1486468 -1977702 -1445759 5697 648768 -288289
33650 -288289 -1146764 -349215 1065752 1038549 -450985 -1619446 -1553860 -1041913 -937471
33641 -937471 -1070348 -940138 -545702 -231003 -206627 -426857 -746429 -1136931 -1708248 -2384674
33631b384674l62930K00992M01521J55488N8580K58450J85470j73651o169O74926
33621i91997O01000n50436j136195j09404R99307M64369p05190m09125J059468
33612g78203J590093O51823l12104n49341o90547q51095l27433O08383O86479
33603B8055k36994q45878m66491J65619M48776N42345K84107p36108j756032j329920
33593c902521L21100J216674M36823o54749o64635j3960L03336L43890O05738
33584b008304R15782Q55156M95785O6733l92608o51492l53867K48057M41738J06100
33574b76920k26525l67087n48221n76029m5875O32476O24981L8169l15908l22379
33564a383318l77366j60196P25117J254945K14664j282438r53197Q70904J371075
$$ plain form
33631 -2384674 -2747604 -2546612 -2145091 -1989603 -1931023 -1672573 -1487103 -1660754 -1666923 -991997
33621 -991997 -390997 -941433 -2077628 -2187032 -1187725 -723356 -1428546 -1837671 -778203
33612 -778203 811890 1463713 1151609 602268 -88279 -939374 -1266807 -658424 28055
33603 28055 -208939 -1054817 -1521308 -1355689 -906913 -364568 -80461 -816569 -2572601 -3902521
33593 -3902521 -3581421 -2364747 -1927924 -2582673 -3247308 -3261268 -2957932 -2614042 -2008304
33584 -2008304 -1092522 -237366 258419 325152 -67456 -718948 -1072815 -824758 -383020 -276920
33574 -276920 -503445 -870532 -1418753 -1994782 -2040657 -1408181 -783200 -745031 -1060939 -1383318
33564 -1383318 -1760684 -1920880 -1195763 59182 273846 -1008592 -1961789 -1090885 280190
33555B80190k80042j501773n22619Q77285N95944m28820l27632L96028K15959
33546f95480m12831o6826P74706M99792o94273j089418l07528L50437K59579J26277
33536a255565K86358J86926k72876m37178j06420K23054L68159N52604O11895
33527A56957K50942j39418j02596j73530r56274j578143p47875Q66149J222872
33518a200916R796q04447m4055R50203O32906l69342n47367M7187K23823j88830
33508a291042k25908L58017O13150O3172l90830Q3768P89236M81278n97862q46672
33498i63693L72560J642096J390786M0241p70780n62173l16669n61329n97173
33489c26134Q219M98729K31977j62653J43350P24875N40237m32568j145211r04271
$$ plain form
33555 280190 148 -1501625 -2024244 -1146959 -551015 -979835 -1307467 -911439 -695480
33546 -695480 -1108311 -1175137 -400431 99361 -594912 -1684330 -1991858 -1641421 -1381842 -1255565
33536 -1255565 -969207 -782281 -1055157 -1492335 -1598755 -1375701 -1007542 -454938 156957
33527 156957 407899 268481 165885 -7645 -963919 -2542062 -3289937 -2423788 -1200916
33518 -1200916 -1191120 -1995567 -2039622 -1089419 -456513 -825855 -1373222 -1326035 -1102212 -1291042
33508 -1291042 -1516950 -1158933 -545783 -482611 -873441 -789673 -437 480841 -117021 -963693
33498 -963693 -591133 1050963 2441749 2481990 1711210 1149037 832368 271039 -326134
33489 -326134 -317915 180814 412791 250138 393488 1118363 1658600 1226032 80821 -823450
33479h23450j37039K59083o7209n58390l57506N47709J066099M36678n08961n30015
33469f73001J756j97298q20404k63622J289409J544704j37683j197708J77614
33460b76233J931801J360685n44741r53448M8835k6859j477328j884497l49940
33451b171725J053625Q21888J10914K05312M43974K883m32651k15747q8227n44032
33441h13786n52637N53013J455572P91217n68848q99101k48484P3359j49330k0608
33431c79633N42408N89774j78089q95394q50884l04404J34530J85020o8394k56229
33421a481295Q255N04190M61312k56583o72811j40688M58119N656r72107j029792
33411c115744o4847N87291K88742j34553m9191k5894n45008q83298k44078Q17341
$$ plain form
33479 -823450 -960489 -701406 -768615 -1327005 -1684511 -1136802 -70703 365975 -142986 -673001
33469 -673001 -671245 -868543 -1688947 -1952569 -663160 881544 743861 -453847 -276233
33460 -276233 1655568 3016253 2471512 1518064 1566899 1540040 62712 -1821785 -2171725
33451 -2171725 -1118100 -296212 -185298 20014 463988 466871 34220 -181527 -269754 -813786
33441 -813786 -1366423 -813410 642162 1433379 864531 -34570 -283054 -209695 -359025 -379633
33431 -379633 162775 752549 574460 -320934 -1171818 -1476222 -1341692 -1156672 -1225066 -1481295
33421 -1481295 -1473040 -968850 -507538 -764121 -1436932 -1577620 -1119501 -1113845 -2085952 -3115744
33411 -3115744 -3180591 -2593300 -2304558 -2439111 -2488302 -2514196 -3059204 -3942502 -4186580 -3369239
33401c369239J134926O08210J21749P1261M6917j1122N16368J634805K070085
33392B823960P97123j266625k139258j266621j12414k0633n07020l34416N17655
33383a508249R55897M73425k66429n16954k71296J10962M02553M73052K97572
33374A50533R4275J7973j61434n36557n37151K13457Q26944J75947j078082j025264
33364a859359N70997J564931N19472j061863r77029M42512J100265L75766l44844
33355C30848j79873R4980k62820p06671n14001l534J11613j96091m75269m96216
33345b297034k49966K28124O37864N52680J28256P0791M99115N16412m83830j669780
33335b067368j704445m88164P94195J194081Q49189L76400J30113J89063M88743
$$ plain form
33401 -3369239 -2234313 -1626103 -1504354 -1433093 -1386176 -1397298 -880930 753875 2823960
33392 2823960 3621083 2354458 215200 -1051421 -1163835 -1184468 -1691488 -2025904 -1508249
33383 -1508249 -552352 -78927 -345356 -862310 -1133606 -1022644 -620091 -147039 150533
33374 150533 244808 262781 101347 -435210 -972361 -758904 68040 243987 -834095 -1859359
33364 -1859359 -1288362 276569 796041 -265822 -1242851 -800339 299926 675692 330848
33355 330848 150975 245955 -16865 -723536 -1237537 -1241071 -1129458 -1325549 -1800818 -2297034
33345 -2297034 -2547000 -2318876 -1681012 -1128332 -1000076 -929285 -430170 86242 -397588 -2067368
33335 -2067368 -3771813 -4259977 -3465782 -2271701 -1422512 -1046112 -915999 -726936 -238193
33326b38193P30451N76158J38403p9164R6563K26306o3580m95856n92438m21781
33316a23131m37066o96162p28709k39703M45562P88536O14871J51072k63978l51386
33306h40094j9634M66789O13394J95182m75074q96084q30105l17599M54895J077064
33296e71266J029448K54263n94357q37324n12837q4715K70245N60675N09079m4165
33286b0954m70975n2320O68536L65843r54234j565920m59680R83554Q73927m85268
33276a117491j161375l83411P17475J053646P95985M24294o0297m82677k64673
33267d78524M95612P73310J70247l19150K8061L06877m72704j400641q64330P48012
33257a013230J377383L64341o28181k61298N91758N24363k53089o77503o61314
$$ plain form
33326 -238193 492258 1068416 1206819 1127655 1224218 1450524 1386944 891088 298650 -123131
33316 -123131 -560197 -1256359 -1985068 -2224771 -1779209 -990673 -375802 -224730 -488708 -840094
33306 -840094 -859728 -392939 220455 415637 -59437 -955521 -1785626 -2103225 -1648330 -571266
33296 -571266 458182 712445 118088 -719236 -1232073 -1316788 -1046543 -485868 23211 -20954
33286 -20954 -491929 -544249 124287 490130 -464104 -2030024 -2489704 -1506150 -632223 -1117491
33276 -1117491 -2278866 -2662277 -1944802 -891156 -95171 329123 268826 -213851 -478524
33267 -478524 17088 790398 960645 641495 669556 976433 503729 -896912 -1761242 -1013230
33257 -1013230 364153 728494 100313 -160985 430773 955136 702047 24544 -636770
33248f36770p14336m96106O27463J902860J724011j940j475388j403203n11281
33239i84690o7210n9201K37244P38027P37425K36446J0088L39108N36850K0342
33229A744429p25133p19011J48409P83819J92975j089528j447902k76345J056129
33220c32158J011088M9664j74833M93880M36555r85272k077829j263309M62498
33211b379716R70834r8q89273q19834l70934j8455M93882J016057P85130j41329
33201a353736n66624J03235R35316R57068M99666K68398O8541n45598j122893
33192g56627r22741j82325K69748L26858N00389P12583K82472p96072j507261
33183b072976j057588J65722J145766J271264O59641r1156l20516R8678M67522
$$ plain form
33248 -636770 -1351106 -1847212 -1219749 683111 2407122 2405182 929794 -473409 -984690
33239 -984690 -1051900 -1111101 -873857 -135830 601595 838041 848129 1187237 1724087 1744429
33229 1744429 1019296 300285 448694 1232513 1425488 335960 -1111942 -1388287 -332158
33220 -332158 678930 728594 553761 1047641 1484196 498924 -1578905 -2842214 -2379716
33211 -2379716 -1408882 -1408980 -2298253 -3118087 -3489021 -3507476 -3013594 -1997537 -1212407 -1353736
33201 -1353736 -1920360 -1817125 -881809 75259 574925 843323 911864 366266 -756627
33192 -756627 -1679368 -1861693 -1591945 -1265087 -764698 -52115 230357 -565715 -2072976
33183 -2072976 -3130564 -2964842 -1819076 -547812 111829 20673 -299843 -201165 266357
33174B66357J2494r78613j330699n11529N96897Q54170K83263k01369j13480K00734
33164i21775K98258J36546j44061l73252k73132K21125N59007J51424n80304n63253
33154a489417K42128M94332n39133j592825j076496N59649J488084J151730O98836
33145f3112P86462O29236k83640j078543r54851m63207l33642j79574M63182Q33595
33135f44094Q9724r91563r64343R4320P99272N62901N1877k63825n40756n78419
33125b384906R6401R94375R35364j30843q85305n83317L8454K22658K62924N18411
33115i15784N67038J02770l22250k12865O2778O0141K1516J83856J41145l79138
33105f90793q17243n62468J57492P16602Q10729L48240n89428j282869q23228
$$ plain form
33174 266357 278851 -699762 -2030461 -2541990 -1945093 -1090923 -807660 -1009029 -1122509 -921775
33164 -921775 -623517 -486971 -631032 -1004284 -1277416 -1056291 -497284 -345860 -926164 -1489417
33154 -1489417 -1247289 -752957 -1292090 -2884915 -3961411 -3401762 -1913678 -761948 -63112
33145 -63112 723350 1352586 1068946 -9597 -964448 -1427655 -1761297 -1940871 -1477689 -644094
33135 -644094 -554370 -1545933 -2510276 -2415956 -1616684 -1053783 -1001906 -1265731 -1806487 -2384906
33125 -2384906 -2288505 -1294130 -358766 -489609 -1374914 -1958231 -1919777 -1697119 -1434195 -915784
33115 -915784 -348746 -245976 -568226 -781091 -718313 -658172 -636656 -452800 -311655 -690793
33105 -690793 -1508036 -2070504 -1913012 -1196410 -385681 -37441 -626869 -1909738 -2732966
33096b732966M71686J108898M59210l63225l12414J50963K78528L42853O05137
33087H670L21725p88885j323362j60347J366237J206095k30021p39672K06070
33078a33490Q44817L5475j213059j519689p85527L59937J339508J484286M50180
33069H62438q66457j070942j77865M80342L69088K81413N30955L26391n08860
33060B26503q90787l54519J4838m75265p69060J03141J164608R50164j65434o37698
33050h33509q2912N29806N74836K85418j58398p80999j153861p18633K13789P14292
33040a410171M87160O5959j70515l50051m87582l15655J61479N69603O81245N28277
33030b40251Q5499n91378j010594o49621K89349J045547J169426P76891J32368
$$ plain form
33096 -2732966 -2261280 -1152382 -693172 -1056397 -1368811 -1217848 -939320 -596467 8670
33087 8670 330395 -458490 -1781852 -1942199 -575962 630133 400112 -339560 -133490
33078 -133490 711327 746802 -466257 -1985946 -2771473 -2411536 -1072028 412258 862438
33069 862438 -4019 -1074961 -1252826 -772484 -403396 -121983 408972 735363 226503
33060 226503 -664284 -1018803 -1003965 -1479230 -2248290 -2145149 -980541 -30377 -195811 -833509
33050 -833509 -916421 -386615 188221 473639 315241 -465758 -1619619 -2338252 -2124463 -1410171
33040 -1410171 -923011 -857052 -1027567 -1377618 -1865200 -2180855 -2019376 -1449773 -768528 -240251
33030 -240251 -154752 -746130 -1756724 -2406345 -2116996 -1071449 97977 874868 1007236
$$ [...]
##END NTUPLES=NMR SPECTRUM
##END=
