##TITLE=31Pdec_SR116_4
 , 24 sc
 1.4.2022
##JCAMPDX= 6.0         $$ Bruker NMR JCAMP-DX V2.0
##DATA TYPE= NMR SPECTRUM
##DATA CLASS= NTUPLES
##ORIGIN= UXNMR, Bruker Analytische Messtechnik GmbH
##OWNER= root
$$ XWIN-NMR		Version 3.5
$$ Fri Apr  1 12:05:33 2022 Russian Standard Time (UT+4h)  she@DPX200
##.OBSERVE FREQUENCY= 81.013821
##.OBSERVE NUCLEUS= ^31P
##.ACQUISITION MODE= SIMULTANEOUS
##.ACQUISITION SCHEME= undefined
##.AVERAGES= 24
##.DIGITISER RES= 16
##SPECTROMETER/DATA SYSTEM= spect
##.PULSE SEQUENCE= zgpg30
##.SOLVENT NAME= D2O
##.SHIFT REFERENCE= (INTERNAL, D2O, 0, 248.564)
##AUDIT TRAIL= $$ (NUMBER, WHEN, WHO, WHERE, WHAT)
$$ ##TITLE= Audit trail, XWIN-NMR		Version 3.5
$$ ##JCAMPDX= 5.01
$$ ##ORIGIN= Bruker BioSpin GmbH
$$ ##OWNER= she
$$ F:/spectra/data/she/nmr/P31/1/pdata/1/auditp.txt
$$ ##AUDIT TRAIL=  $$ (NUMBER, WHEN, WHO, WHERE, WHAT)
(   1,<2022-04-01 12:04:31.62 +0400>,<she>,<DPX200>,
      <created by zg, POWCHK disabled, PULCHK disabled
       configuration hash MD5:
       00 E9 B6 7A A2 85 ED C7 34 08 36 98 17 FE 4E 26
       data hash MD5: 32K
       93 C8 D9 89 5A AD 37 28 8C 9A 0B A3 1F E5 60 C7>)
(   2,<2022-04-01 12:04:46.35 +0400>,<she>,<DPX200>,
      <Start of raw data processing
       efp BC_mod = 2 LB = 1 FT_mod = 6 PKNL = 1 PHC0 = -9379.654 PHC1 = 136.8756 SI = 64K 
       data hash MD5: 64K
       9F 65 C2 00 F8 0F 7E 20 26 F8 64 E4 27 A1 6C C5>)
(   3,<2022-04-01 12:05:04.37 +0400>,<she>,<DPX200>,
      <pk PHC0 = -2.715983 PHC1 = 16.6 
       data hash MD5: 64K
       EF B5 21 B1 98 13 B2 EB 96 92 78 00 63 1E 1B DA>)
(   4,<2022-04-01 12:05:07.51 +0400>,<she>,<DPX200>,
      <abs ABSG = 5 
       data hash MD5: 64K
       EE 55 77 77 5D 78 C5 47 51 E9 8C 16 1C 04 20 B4>)
$$ ##END=
$$ 
$$ hash MD5
$$ 0C F3 9C A9 4A 13 11 B7 E6 34 58 AD 94 35 BB 77
##$RELAX= 
##$RELAX= 
##$RELAX= 
##$RELAX= 
##$RELAX= 
##$RELAX= 
##$RELAX= 
##$RELAX= 
$$ Bruker specific parameters
$$ --------------------------
##$DU= <F:/spectra>
##$EXPNO= 1
##$NAME= <P31>
##$PROCNO= 1
##$TYPE= <nmr>
##$USER= <she>
##$AMP= (0..31)
100 100 100 100 100 100 100 100 100 100 100 100 100 100 100 100 100 100 
100 100 100 100 100 100 100 100 100 100 100 100 100 100 
##$AQSEQ= 0
##$AQ_mod= 1
##$AUNM= <au_zg>
##$AUTOPOS= <>
##$BF1= 81.014009
##$BF2= 200.13
##$BF3= 200.13
##$BF4= 200.13
##$BF5= 200.13
##$BF6= 200.13
##$BF7= 200.13
##$BF8= 200.13
##$BYTORDA= 1
##$CFDGTYP= 0
##$CFRGTYP= 5
##$CHEMSTR= <none>
##$CNST= (0..31)
1 1 145 1 1 1 1 1 1 1 1 1 1 1 1 1 1 1 1 1 1 1 1 1 1 1 1 1 1 1 1 1 
##$CPDPRG= <waltz16>
##$CPDPRG1= <>
##$CPDPRG2= <waltz16>
##$CPDPRG3= <>
##$CPDPRG4= <mlev>
##$CPDPRG5= <mlev>
##$CPDPRG6= <mlev>
##$CPDPRG7= <mlev>
##$CPDPRG8= <mlev>
##$CPDPRGB= <>
##$CPDPRGT= <>
##$D= (0..31)
0 1 0 0 0 0 0 0 0 0 0 0.03 2e-05 3e-06 0 0 0 0 0 0 0 0 0 0 0 0 0 0 0 0 
0 0 
##$DATE= 1648800271
##$DBL= (0..7)
120 120 120 11 120 120 24 19 
##$DBP= (0..7)
150 150 150 150 150 150 150 150 
##$DBP07= 0
##$DBPNAM0= <>
##$DBPNAM1= <>
##$DBPNAM2= <>
##$DBPNAM3= <>
$$ [...]
##$SUBNAM3= <"">
##$SUBNAM4= <"">
##$SUBNAM5= <"">
##$SUBNAM6= <"">
##$SUBNAM7= <"">
##$SUBNAM8= <"">
##$SUBNAM9= <"">
##$SW= 501.771253377433
##$SWIBOX= (0..15)
0 1 3 0 0 0 0 0 0 0 0 0 0 0 0 0 
##$SW_h= 40650.406504065
##$TD= 32768
##$TD0= 1
##$TE= 0
##$TE2= 300
##$TE3= 300
##$TEG= 300
##$TL= (0..7)
0 120 53 12 22 120 120 120 
##$TP= (0..7)
150 150 150 150 150 150 150 150 
##$TP07= 0
##$TPNAME0= <>
##$TPNAME1= <>
##$TPNAME2= <>
##$TPNAME3= <>
##$TPNAME4= <>
##$TPNAME5= <>
##$TPNAME6= <>
##$TPNAME7= <>
##$TPOAL= (0..7)
0.5 0.5 0.5 0.5 0.5 0.5 0.5 0.5 
##$TPOFFS= (0..7)
0 0 0 0 0 0 0 0 
##$TUNHIN= 0
##$TUNHOUT= 0
##$TUNXOUT= 0
##$USERA1= <user>
##$USERA2= <user>
##$USERA3= <user>
##$USERA4= <user>
##$USERA5= <user>
##$V9= 5
##$VALIST= <valist>
##$VCLIST= <CCCCCCCCCCCCCCC>
##$VD= 0
##$VDLIST= <DDDDDDDDDDDDDDD>
##$VPLIST= <PPPPPPPPPPPPPPP>
##$VTLIST= <TTTTTTTTTTTTTTT>
##$WBST= 1024
##$WBSW= 4
##$XGAIN= (0..3)
0 0 0 0 
##$XL= 0
##$YL= 0
##$YMAX_a= 13183
##$YMIN_a= -5662
##$ZGOPTNS= <>
##$ZL1= 120
##$ZL2= 120
##$ZL3= 120
##$ZL4= 120
##$ABSF1= 248.5645
##$ABSF2= -253.2056
##$ABSG= 5
##$ABSL= 3
##$ALPHA= 0
##$AQORDER= 0
##$ASSFAC= 0
##$ASSFACI= 0
##$ASSFACX= 0
##$ASSWID= 0
##$AUNMP= <proc_1d>
##$AZFE= 0.1
##$AZFW= 0.5
##$BCFW= 0
##$BC_mod= 2
##$BYTORDP= 0
##$COROFFS= 0
##$CY= -3
##$DATMOD= 1
##$DC= 0
##$DFILT= <>
##$DTYPP= 0
##$F1P= 0
##$F2P= 0
##$FCOR= 1
##$FTSIZE= 65536
##$FT_mod= 6
##$GAMMA= 0
##$GB= 0
##$INTBC= 1
##$INTSCL= 5.30512e-09
##$ISEN= 30
##$LB= 1
##$LEV0= 0
##$LPBIN= 0
##$MAXI= 10000
##$MC2= 0
##$MEAN= 0
##$ME_mod= 0
##$MI= 50
##$NCOEF= 0
##$NC_proc= -8
##$NLEV= 6
##$NOISF1= 182.463
##$NOISF2= 159.3651
##$NSP= 0
##$NTH_PI= 0
##$NZP= 0
##$OFFSET= 248.5645
##$PC= 4
##$PHC0= -9382.37
##$PHC1= 153.4756
##$PH_mod= 1
##$PKNL= yes
##$PPARMOD= 0
##$PSCAL= 0
##$PSIGN= 0
##$REVERSE= no
##$SF= 81.014009
##$SI= 65536
##$SIGF1= 159.3651
##$SIGF2= -187.1042
##$SINO= 113.3802
##$SIOLD= 16384
##$SREGLST= <1H.CDCl3>
##$SSB= 0
##$STSI= 65536
##$STSR= 0
##$SW_p= 40650.406504065
##$SYMM= 0
##$S_DEV= 0
##$TDeff= 32768
##$TDoff= 0
##$TI= <>
##$TILT= no
##$TM1= 0
##$TM2= 0
##$TOPLEV= 0
##$USERP1= <user>
##$USERP2= <user>
##$USERP3= <user>
##$USERP4= <user>
##$USERP5= <user>
##$WDW= 1
##$XDIM= 65536
##$YMAX_p= 447177647
##$YMIN_p= -53193364
$$ End of Bruker specific parameters
$$ ---------------------------------
##NTUPLES= NMR SPECTRUM
##VAR_NAME=  FREQUENCY,     SPECTRUM/REAL,   SPECTRUM/IMAG
##SYMBOL=    X,             R,               I
##VAR_TYPE=  INDEPENDENT,   DEPENDENT,       DEPENDENT
##VAR_FORM=  AFFN,          ASDF,            ASDF
##VAR_DIM=   65536,         65536,           65536
##UNITS=     HZ,            ARBITRARY UNITS, ARBITRARY UNITS
##FACTOR=    0.620285442955139, 1,           1
##FIRST=     20137.2065510759, 0,            0
##LAST=      -20513.1999529892, 0,           0
##MIN=       -20513.1999529892, -53193364,   0
##MAX=       20137.2065510759, 447177647,    0
$$ Real data points
##PAGE= N=1
##DATA TABLE= (X++(R..R)), XYDATA
$$ [...]
39635B2620959J744225K188985K123611K293722K228811J073020o32408j536522
39627C2104403j485249j362255j186684j30967J558964K487581K222056J698288
39619C5906137J145468m16140k837153m014139k744772q00451n72594j858924
39611B3807432k616313j989681r20387l28439k73122o17061j155466j260629n33204
39602A4113130M12034Q13074J031582J837298K804019K738164J584760O10352
39594B5944413N65802P88974L78222o67729j760669k432377k461722j833766p91774
39585A7729374L29619J248700J558727Q95978l18591r41453n12700P2570k0620
39576B0041604l53731l60189o65017j817488k609765j574652L40853P60298n18843
$$ plain form
39635 22620959 24365184 26554169 28677780 30971502 33200313 34273333 33640925 32104403
39627 32104403 30619154 29256899 28070215 27939248 29498212 31985793 34207849 35906137
39619 35906137 37051605 36635465 33798312 29784173 27039401 26238950 25666356 23807432
39611 23807432 21191119 19201438 18281051 17952612 17679490 17062429 15906963 14646334 14113130
39602 14113130 14525164 15338238 16369820 18207118 21011137 23749301 25334061 25944413
39594 25944413 26510215 27299189 27677411 27009682 25249013 22816636 20354914 18521148 17729374
39585 17729374 18058993 19307693 20866420 21762398 21443807 20502354 19989654 20062224 20041604
39576 20041604 19687873 19327684 18662667 16845179 14235414 12660762 13001615 13761913 13243070
39567A3243070j169287O384J321695J057472K2435j48677L91442N15271L78704
39558A5618509R61119J929078J809795K94135j151528j317274p63884p72276j514586
39549A5093088j919241j130907L74519J289590R80977K33594K70507J225058K021001
39540A8438186J718776M72783q96021j734350j830810j403481j030244j134565
39532A2600274j388250j102914k91907K84654K75300J93885M26052N56681J84729
39523A1738504k73485k37324P7668J4773n25152j018342j036839n81346Q4438
39514H242895N49114M49829q2580m12340j43169M02440P29420Q30099R36036R86872
39504A2488616Q25380O56671Q11495J198636J455082J592570K098058L323248
$$ plain form
39567 13243070 12073783 12080167 13401862 14459334 14481769 14333092 14724534 15239805 15618509
39558 15618509 16579628 18508706 20318501 20612636 19461108 18143834 17379950 16607674 15093088
39549 15093088 13173847 12042940 12417459 13707049 14688026 14921620 15192127 16417185 18438186
39540 18438186 20156962 20629745 19733724 17999374 16168564 14765083 13734839 12600274
39532 12600274 11212024 10109110 9817203 10101857 10377157 10571042 10997094 11553775 11738504
39523 11738504 11465019 11227695 11305363 11320136 10794984 9776642 8739803 8158457 8242895
39514 8242895 8792009 9241838 9159258 8746918 8603749 9006189 9735609 10565708 11501744 12488616
39504 12488616 13313996 13970667 14782162 15980798 17435880 19028450 21126508 24449756
39496B4449756M991484O367533O855683O481226N808866N297120M750609L517503
39488F8519780J147699k230291n888668q584955r105457p378557m880905l294094
39480B8304552k838391k504116j681040p21512j2600N15638Q33251O73951J72683
39471B2742416j44135j53101j67887j88186j548P5056l17345m78210N16792J887102
39461B3770954J860386N98722K92975J573118K122016K70513k215951k915440
39453B5357293k392113k589401l120761k144720r1709O65169k37506n63006P39224
39444A5622470J996245J923097J643844K305020K981186K619579K130897K571668
39436C3794006K750333R11834k043746l302476j891900K92784J372952J574930
$$ plain form
39496 24449756 29441240 35808773 42664456 49145682 54954548 60251668 65002277 68519780
39488 68519780 69667479 67437188 61548520 52963565 43858108 36479551 31598646 28304552
39480 28304552 25466161 22962045 21281005 20559493 20546893 21062531 21895782 22569733 22742416
39471 22742416 22598281 22445180 22277293 22089107 22087559 22162615 21845270 21367060 21883852 23770954
39461 23770954 25631340 26230062 26523037 28096155 30218171 30488684 28272733 25357293
39453 25357293 22965180 20375779 17255018 15110298 15018589 15683758 15446252 14883246 15622470
39444 15622470 17618715 19541812 21185656 23490676 26471862 29091441 31222338 33794006
39436 33794006 36544339 37456173 35412427 32109951 30218051 30510835 31883787 33458717
39428C3458717J842443J952964J236915L27652P60793K780544M630830M611808
39420E1602666L187790K114783J666615L3552l839469p909445q966781o586052
39412C1303659l642263k697727l315129l545137k714074j629231r32859n52939
39404A2274300l85001l79781j19538P22152J585841J584425Q21497K70048K87269
39395A6661212J68065n84199j403310j517471r95140m36456j36836n7985j80488
39386A1517392l17824O7995J212897K385412K525546J569704O13268O62365J617563
39377B1854318K513766K350460P20702j794298l732766l879048k579291j404786
39369A4049057j239458j379671r62592m29511o50625j227389r43809K47537R84328
$$ plain form
39428 33458717 35301160 37254124 38491039 38818691 39579484 42360028 46990858 51602666
39420 51602666 54790456 56905239 58571854 58605406 54765937 46856492 37889711 31303659
39412 31303659 27661396 24963669 21648540 18103403 15389329 13760098 12827239 12274300
39404 12274300 11889299 11509518 11389980 12112132 13697973 15282398 16103895 16373943 16661212
39395 16661212 16829277 16245078 14841768 13324297 12329157 11892701 11755865 11697880 11517392
39386 11517392 11199568 11267563 12480460 14865872 17391418 18961122 19574390 20236755 21854318
39377 21854318 24368084 26718544 27439246 25644948 21912182 18033134 15453843 14049057
39369 14049057 12809599 11429928 10467336 10037825 9387200 8159811 7216002 7463539 8447867
39360H447867M63708m94318q07400n55641m07915m38642k89536M3833L23566N69080
39350F854602Q05307O91150M5459n91607n98943k20871j88576n67618o89500k14660
39340E324743L77473M94947J68395j03387J4552L56103M95743L35334L30832Q24888
39330H619623J261660P06041p09793j631037j205901k33904M7147l47353n16746
39321E989737k28467r5738m12476p64690q14351o89386n11690j66045L61755Q61129
39311C529778J101235Q57957J4028r77314j203933m86611O6859m48247j191023
39302A262729o69032R15864J775012J062248n1325k27191L34201O94449O76574
39293E773529O81228O51397J46754p82885j492128j478671q45665r9879K74881
$$ plain form
39360 8447867 8911575 8417257 7609857 7054216 6646301 6207659 5918123 5961956 6285522 6854602
39350 6854602 7659909 8351059 8396518 7804911 7205968 6985097 6796521 6228903 5539403 5324743
39340 5324743 5702216 6197163 6365558 6262171 6276723 6632826 7128569 7463903 7794735 8619623
39330 8619623 9881283 10587324 9877531 8246494 7040593 6806689 6853836 6506483 5989737
39321 5989737 5761270 5665532 5253056 4488366 3674015 2984629 2472939 2306894 2668649 3529778
39311 3529778 4631013 5488970 5502998 4525684 3321751 2835140 2901999 2453752 1262729
39302 1262729 593697 1509561 3284573 4346821 4295496 4068305 4402506 5096955 5773529
39293 5773529 6454757 7106154 7252908 6470023 4977895 3499224 2653559 2553680 2828561
39284B828561J70632m8286N8577M40580O08446L26545k2470Q9912O95386J281632
39274F429515J280679N86008l16939p88757o92788m77495n25135o92916o71450
39265D130722m62745k36362l5359R5189M1097m0971K52452Q87235J225316R13461
39255F770035M01553J97365K54160N15527J238706K200095K537526K162308K276106
39246A8553381L456805M341862L553813J846310O64941l92114k523481m834598
39238B4666919n058251l138595j584242j759514k131577j074158O25637J254851
39230A1801070O11625k54635o22044m45918l0747m043p22229j365378p69221O04243
39220H802723R82987p8154j038464q78665m40550m61965j95036Q16800J358797
$$ plain form
39284 2828561 2999193 2950907 3009484 3450064 4058510 4385055 4362585 4452497 5147883 6429515
39274 6429515 7710194 8296202 7979263 7190506 6497718 6020223 5495088 4802172 4130722
39265 4130722 3667977 3431615 3396256 3491445 3532542 3491571 3744023 4631258 5856574 6770035
39255 6770035 7171588 7368953 7623113 8138640 9377346 11577441 14114967 16277275 18553381
39246 18553381 22010186 26352048 29905861 31752171 32417112 32024998 29501517 24666919
39238 24666919 19608668 16470073 14885831 13126317 10994740 9920582 10546219 11801070
39230 11801070 12412695 12158060 11536016 11090098 11059351 11055308 10333079 8967701 8198480 8802723
39220 8802723 9785710 9707556 8669092 7790427 7349877 6887912 6692876 7509676 8868473
39211H868473M53202p96547q35066O4659O46110O89608O86211N07908o2513l47947
39201I874098J96654P82053N31922J07214O02976J590229J811839J212800P49709
39192A7459494O70559M40747R01k14587j85904j64540r5301o6117n18538j071185
39182A6255529l33914J813902L162555K196487Q56612J952761M778485N988190
39174C6670607M399731K095482O37438r48699l558656n810566n890818m081729
39166B3512790k176298j314366j300221j372335j019289m63286m84342j314043
39158A4068610k009906j672530p85041l46221l11636j70393l13668j151490j574786
39149E732939l94068J168742Q60932q75727j264806M05517J595451O20918q23007
$$ plain form
39211 8868473 9321675 8525128 7690062 7754721 8400831 9090439 9776650 10284558 10222045 9874098
39201 9874098 10070752 10852805 11384727 11491941 12094917 13685146 15496985 16709785 17459494
39192 17459494 18130053 18570800 18571701 18357114 18171210 18006670 17911369 17845252 17326714 16255529
39182 16255529 15921615 17735517 20898072 23094559 23951171 25903932 30682417 36670607
39174 36670607 41070338 43165820 43803258 42854559 39295903 33485337 27594519 23512790
39166 23512790 21336492 20022126 18721905 17349570 16330281 15866995 15382653 14068610
39158 14068610 12058704 10386174 9601133 9254912 8943276 8772883 8459215 7307725 5732939
39149 5732939 5338871 6507613 7368545 6492818 5228012 5633529 7228980 7849898 7026891
39140G026891p13903J81211J52847m83563m42943k1359l34979r63527n38207P83896
39130D646364J368220N15525p38986j272745j057471n87394j38582J99370L94899
39121C329200M93843M64751J94888j66701k71354j59188k15067l76553j51377
39112C142442L68763M55887Q758k14024k2220j96271q75677r60691k0551O42595
39102B329011O0925o38477r7784Q45605M99594p74013j132758l23397O5450m95706
39092C38450n58294O35488J530840N77687j184261j414930K58610J739839J265343
39083C188772m47607j370285p74216J67039K69655j13350k325M41471J63965q96664
39073F26455j433829o92095L56953N05085N2425Q6256O98855J052875Q39730N33384
$$ plain form
39140 7026891 6312988 6494199 6647046 6163483 5720540 5699181 5364202 4400675 3862468 4646364
39130 4646364 6014584 6530109 5791123 4518378 3460907 2873513 2734931 2934301 3329200
39121 3329200 3823043 4287794 4482682 4315981 4044627 3885439 3670372 3293819 3142442
39112 3142442 3511205 3967092 3975850 3761826 3739606 3543335 2667658 1706967 1686416 2329011
39102 2329011 2389936 1751459 1653675 2499280 2998874 2224861 1092103 768706 834156 338450
39092 338450 -219844 415644 1946484 2524171 1339910 -75020 183590 1923429 3188772
39083 3188772 2741165 1370880 596664 763703 1033358 920008 917683 1359154 1523119 626455
39073 626455 -807374 -1499469 -1142516 -637431 -585006 -498750 200105 1252980 2092710 2626094
39063B626094L11324k09735j044491j533105j228530m65968J71730M71538N16273
39054c84870M14154K62295J05106j14679l48202k98533J98557P64339Q09460K34975
39044A642602m81005q20181o03467K0193O70852R31675P11060L34828J20186K5520
39034B552263j29175l26768m14976k88516R7038O22583Q86169N92213Q5153m7030
39024C628954O8805k16388p74779n90362N60650J341419O45424o54449q66456
39015C142818J19465Q17521L71091l96305l58138M27649J037825R19211L63800
39006F444937j9901j1019Q2049m9353k10658l4355K91179J97949k74439l80841
38996F035548J53243O09960L93334p8925j95353j29377k49368k44314K29103N86387
$$ plain form
39063 2626094 2937418 2727683 1683192 150087 -1078443 -1544411 -1372681 -901143 -384870
39054 -384870 29284 291579 396685 282006 -66196 -364729 -166172 598167 1407627 1642602
39044 1642602 1161597 341416 -262051 -241858 428994 1360669 2071729 2406557 2526743 2552263
39034 2552263 2423088 2096320 1681344 1392828 1489866 2112449 2998618 3590831 3675984 3628954
39024 3628954 3697759 3481371 2706592 2116230 2676880 4018299 4663723 4009274 3142818
39015 3142818 3262283 4079804 4450895 4054590 3696452 4124101 5161926 6081137 6444937
39006 6444937 6425036 6414017 6496066 6446713 6236055 6201700 6492879 6690828 6416389 6035548
38996 6035548 6188791 6798751 7192085 7113160 6917807 6788430 6539062 6294748 6523851 7110238
38986G110238P8144q24523r13121r546P60207N29775l14771q47827o37447P4865
38976E005994P08778P66175K79204k03390l26687l40318m85507m60259k9773L25696
38966E239913P4379m53008n46497j63851K31454M91330O47326L62647n44055j331976
38956D007662j091331r2311N60170M66257J79565O4178o9077k08888m5615K65113
38946D035723J49718m23864q23950o97380l06727J03105N20764P23510L84913
38937C665812k79053o27432m15621K1859L00514K16873k28539n14967J14335J341547
38927C595328J559387M1486j544670j278030J35770M93687m43277q55262j02441
38918A601978L78131j88088o46061j88963K73190O4536L3039O57159P93243k22747
$$ plain form
38986 7110238 7188382 6363859 5450738 5441192 6201399 6731174 6416403 5568576 4931129 5005994
38976 5005994 5714772 6480947 6760151 6556761 6230074 5889756 5404249 4943990 4914217 5239913
38966 5239913 5314292 4861284 4314787 4150936 4382390 4873720 5521046 5883693 5339638 4007662
38956 4007662 2916331 2824020 3384190 3850447 4030012 4094190 4025113 3816225 3770610 4035723
38946 4035723 4185441 3761577 2937627 2240247 1933520 2036625 2557389 3280899 3665812
38937 3665812 3386759 2759327 2343706 2365565 2666079 2882952 2654413 2139446 2253781 3595328
38927 3595328 5154715 5196201 3651531 2373501 2509271 3002958 2559681 1704419 1601978
38918 1601978 1980109 1792021 1145960 956997 1230187 1294723 1327762 1984921 2778164 2555417
38908B555417j012249l78488N25874J58284p14955m43776N06209L83632o77924
38899I02024p99375M57945J367914Q17226j96622m15500L602L52799N32474O12898
38889C635385L57366j21897j69157L41511O15920K18024j42305J83278N91869
38880E509994J66664p41769q94628N9232J124699J384714J106382J086587J473209
38871A0275084J789253J842154J939000K133831J897015R10443k77198r32074
38863A9577508j139077j459118j821860j621249r00997m82505o57069o85569n2905
38854A0757159O73104Q73244R23251J331539J516598N68898j095833k001525j559503
38845A1986932p59583o83546j175543j432236j278538j201398j350971j175818
$$ plain form
38908 2555417 1543168 1164680 1690554 1848838 1133883 690107 1196316 1579948 902024
38899 902024 102649 560594 1928508 2745734 2549112 2133612 2137214 2490013 3022487 3635385
38889 3635385 3992751 3870854 3701697 4043208 4659128 4877152 4734847 4918125 5509994
38880 5509994 5676658 4934889 4040261 4099493 5224192 6608906 7715288 8801875 10275084
38871 10275084 12064337 13906491 15845491 17979322 19876337 20786780 20509582 19577508
38863 19577508 18438431 16979313 15157453 13536204 12635207 12152702 11495633 10810064 10757159
38854 10757159 11430263 12303507 13226758 14558297 16074895 16643793 15547960 13546435 11986932
38845 11986932 11227349 10543803 9368260 7936024 6657486 5456088 4105117 2929299
38837B929299k74414P80131R50712P2535q04108o71451K40795R26858Q76935L55127
38827E382419k23948n19950k00133N70295R04582L51434j42038M52754J457076
38818H032491J534778J112155J719961L005253K889333J215086N08398J884148
38810B1901603K913325J512225n21997m57921R14273Q80157n60126j083017l61491
38801B5137031m45779j784558k266235r56650K07679l58502j478008j438434o11843
38792A6004701l22171o01571n42731Q9694P06806O86742k25584j556106k046342
38783A2193438j065978M4277m08348j665010j422026L44178J017219m99381j965785
38774F572584j458291k46517j88445o03186n8620O56231Q998j197775r74760M69932
$$ plain form
38837 2929299 2654885 3435016 4385728 4458263 3654155 2982704 3223499 4150357 5027292 5382419
38827 5382419 5158471 4638521 4438388 5008683 5913265 6264699 6122661 6575415 8032491
38818 8032491 9567269 10679424 12399385 15404638 18293971 19509057 20017455 21901603
38810 21901603 24814928 26327153 25805156 25347235 26261508 27141665 26581539 25498522 25137031
38801 25137031 24691252 22906694 20640459 19683809 19891488 19532986 18054978 16616544 16004701
38792 16004701 15682530 15080959 14538228 14627922 15334728 16021470 15795886 14239780 12193438
38783 12193438 11127460 11171737 10763389 9098379 7676353 8020531 9037750 8538369 6572584
38774 6572584 5114293 4867776 4679331 4076145 4017525 4673756 4682754 3484979 2510219 2980151
38764B980151J130262N15990O8074M25251O35135K60929J74083Q21512J426026
38755H437413J405362J215737J349231J557625J341448M17142j188700k706329
38747A1828929k760621j036914P37393P89717k69989n31124K50351O02538j0716
38738I599564m70355o3581N36938O50366L83125j62162r71078j328614n62008
38729G612195L76275j29371j671446k082881p32905N48821M67158L6747M00629
38720D825222R02584O18415Q5562J12150K88928J7933k40210K3076L03548J53542
38710G090750Q6964L83274L60606r9266J10632J199088J444725q9581j557678
38701H929514j061448K18538J7571j217949j283620r0325L75630l51133o01716
$$ plain form
38764 2980151 4110413 4626403 4694477 5119728 5754863 6015792 6189875 7011387 8437413
38755 8437413 9842775 11058512 12407743 13965368 15306816 15723958 14535258 11828929
38747 11828929 9068308 8031394 8768787 9558504 9288515 8757391 9007742 9610280 9599564
38738 9599564 9129209 9065628 9602566 10252932 10636057 10473895 9502817 8174203 7612195
38729 7612195 7988470 7859099 6187653 4104772 3371867 3920688 4387846 4424593 4825222
38720 4825222 5727806 6346221 6431783 6543933 6832861 6850794 6610584 6633660 6937208 7090750
38710 7090750 7177714 7560988 7921594 7822328 7932960 9132048 10576773 10487192 8929514
38701 8929514 7868066 8086604 8104175 6886226 5602606 5512281 5887911 5536778 4935062
38692D935062K42984P21648P4592m30240J00394O11353R6927o10157l38549N05609
38682E909623P80363L57182n6381o8048K85328Q90226J343848J055897J13386
38673A0611424o20782o88176n65155o58042o44803k62940J18965K12204K69855
38664G772550L81989J76309k84264k16727O53054J416021J220600M57890J7308
38655A1594730P756p0785l94403p05975p76365n35629j19721j6823o03696j341650
38645G037439j174947j2830R89466R75599L80178p23l9997O5892K65356K86283
38635H771716k71806r84645p55605N19505J544702J535676J312483J636476J784979
38626A5093481R75357j0237r5088J97114k43855r84259p30895L09344O09455k07186
$$ plain form
38692 4935062 5178046 5899694 5974286 5544046 5644440 6255793 6352720 5742563 5404014 5909623
38682 5909623 6689986 7047168 6990787 6922739 7208067 8098293 9442141 10498038 10611424
38673 10611424 9990642 9302466 8737311 8079269 7434466 7171526 7290491 7502695 7772550
38664 7772550 8154539 8330848 8046584 7829857 8482911 9898932 11119532 11577422 11594730
38655 11594730 11602486 11531701 11137298 10431323 9654958 9119329 8999608 8982785 8379089 7037439
38645 7037439 5862492 5849662 6839128 7814727 8194905 8194182 8154185 8220077 8485433 8771716
38635 8771716 8499910 7515265 6759660 7279165 8823867 10359543 11672026 13308502 15093481
38626 15093481 16068838 16058601 15963513 16160627 15916772 14932513 14201618 14510962 15120417 14913231
38616A4913231p92755k10013Q02081J093990N11689l48545r27790r65162o21127
38607A3455599m13953n10347l48644L71425Q41738K69912o71936p74882k50407
38598A1968505k79704q41918o78245M61423J213500O76793l82440r46471j026491
38589A0164952r22011m66509K68609O17419L85262K92802P17520R96885O56702
38580A2711631L11610N63001R43877P99323L71097J61103j369m08795p28330o54303
38570A4068845o11624r68089j241667r63122o21973q00131j041812o47191o18
38561G172618M2810l64841l98690n9397j17770o85921r93891o31128k6479L69462
38551D306773N03333L00561k98241q28146o72436m2456J96735k28349o87608o70678
$$ plain form
38616 14913231 14120476 13910463 14712544 15806534 16318223 15969678 15041888 14076726 13455599
38607 13455599 13041646 12531299 12182655 12554080 13395818 13665730 12993794 12218912 11968505
38598 11968505 11688801 10846883 10168638 10630061 11843561 12520354 12137914 11191443 10164952
38589 10164952 9242941 8776432 9045041 9662460 10047722 10340524 11058044 12054929 12711631
38580 12711631 13023241 13586242 14530119 15329442 15700539 15861642 15860273 15451478 14723148 14068845
38570 14068845 13457221 12489132 11247465 10284343 9662370 8862239 7820427 7173236 7172618
38561 7172618 7215428 6850587 6451897 6392500 6274730 5588809 4594918 3963790 3937311 4306773
38551 4306773 4810106 5110667 4812426 3984280 3311844 3269388 3466123 3237774 2550166 1879488
38541A879488l61827p2762J52994K18540k7637l11559j46506L24199M10940k6646
38531B039224l13761k5437M18579N20162L64080J83468o3668l25933l05764l3100
38521B457850M0519j44003n5394M20735N75836K4103n52495n02034k55244m12019
38511A597854n41089k6990M92627m9644j157248j154554K68288J402755R77037
38502A809036p5095k13517M04954M39948m34402j158829r82125l63971O587J58720
38492d08694M06279O46442N99782L56087K17592K02205P0538k44355m94217l77078
38482I74581J61664Q02675J016759N85755O950M0295P10797J182765R21281M98919
38472F902441O85246J122141P62939m39330j253317q91476j35892j32189p50140
$$ plain form
38541 1879488 1517661 1444899 1597893 1816433 1788796 1477237 1330731 1654930 2065870 2039224
38531 2039224 1725463 1700026 2118605 2638767 3002847 3186315 3122647 2796714 2490950 2457850
38521 2457850 2498369 2354366 2298972 2719707 3295543 3319646 2767151 2265117 2009873 1597854
38511 1597854 1056765 1029775 1522402 1472758 315510 -839044 -570756 831999 1809036
38502 1809036 1733941 1520424 1925378 2365326 1930924 772095 -210030 -574001 -567414 -408694
38492 -408694 -2415 644027 1243809 1599896 1817488 2019693 2090231 1845876 1351659 974581
38482 974581 1136245 1938920 2955679 3541434 3548384 3588679 4299476 5482241 6403522 6902441
38472 6902441 7587687 8709828 9472767 9033437 7780120 6888644 6752752 6620563 5870423
38463E870423r83076n40817p5625K0695M8886J36843r8449o91504r70399n42651
38453B174326O1289K56138K37493L33397K22619l59080p40653k11113O09691N02938
38443C087045m25248q50698l15249J66714q1143l57796p395L78374R5195l81087
38433A308712k74461J82223L86186M99251P71912N34187p18154j862557j410207
38424e82908J28474Q56614L32147l6357M23681O20143j46860q33066m59509K48321
38414E50680K33095j18875J03537O01706M50605k11224m05682J17113O64342P27986
38404B713283L91187j65564p26791q33868k78389M00063N55064L03552J69283
38395B527820K13047J27207j48176m42664o10961l97969L32617Q93944K72461
$$ plain form
38463 5870423 4887347 4346530 4270905 4291600 4340486 4477329 4378880 3687376 2716977 2174326
38453 2174326 2235615 2491753 2729246 3062643 3285262 2926182 2185529 1974416 2584107 3087045
38443 3087045 2661797 1811099 1495850 1662564 1581421 1223625 1216230 1594604 1689799 1308712
38433 1308712 1034251 1216474 1602660 2101911 2873823 3408010 2689856 827299 -582908
38424 -582908 -454434 402180 734327 697970 1121651 1741794 1594934 761868 302359 550680
38414 550680 783775 664900 768437 1370143 1820748 1609524 1203842 1320955 1985297 2713283
38404 2713283 3104470 2938906 2212115 1378247 1099858 1499921 2054985 2358537 2527820
38395 2527820 2740867 2868074 2719898 2277234 1666273 1268304 1600921 2494865 2767326
38386B767326j116796j402686J01260J560233J218136m775k33596K83285L8685
38377C211072o91085l03222R59660J070316k85056r49643K10358J512396J280067
38368F014863K88918J1359K84120K86374K91043P67317R56423L4046j191241j306129
38358F437093l52243N12759P78873P02861K87077m99320r57945m55126L63407
38349F817436L94630j86052k50112M29942Q93101N27582k26801p92094j081154
38340F526478j068844n85848K41806R56941J284324J219192P14700j54342q38599
38331H295808p55581p3079M59216M27072Q1001j41978l5933K85201M01902m1945
38321H901684o97850o82608K18573J059116R80422L94986K41198N84376P80924
$$ plain form
38386 2767326 1650530 247844 349104 1909337 3127473 3122698 2889102 3172387 3211072
38377 3211072 2519987 2216765 3176425 4246741 3961685 3012042 3222400 4734796 6014863
38368 6014863 6303781 6315140 6599260 6885634 7176677 7943994 8900417 8934463 7743222 6437093
38358 6437093 6084850 6597609 7376482 8079343 8366420 7867100 6909155 6454029 6817436
38349 6817436 7212066 7026014 6775902 7205844 8098945 8626527 8399726 7607632 6526478
38340 6526478 5457634 4871786 5113592 6070533 7354857 8574049 9288749 9134407 8295808
38331 8295808 7540227 7467148 7926364 8353436 8434437 8292459 8256526 8541727 8943629 8901684
38321 8901684 8203834 7521226 7739799 8798915 9779337 10174323 10415521 10999897 11780821
38312A1780821O22437M31779L01104Q6481o3115J7948l7934n41990q71699j98160
38302A1527672J022226J381655M72981n32859n90583j32070j66946p33341r79078
38293A1269657n01351Q3458M2292m14799l98911L32772Q44476K87181p19266q49074
38283I976435p0453K85557l27606p90820k31592N19938M53374J56074O32655J293991
38273A1897553Q67421k45756m17334N30016R71479R8683q23313m68044O69414
38264A3080119J238969Q75723K31440j42741j91213l3115K21171N41902J038036
38255A6860291J652385J875116J287493L18469j70775r502K14153Q1667l85820
38246B1723477j185436k155454k521471j712687n62293m67736j296013j486156
$$ plain form
38312 11780821 12403258 12835037 13136141 13222622 13159507 13177455 13139521 12597531 11725832 11527672
38302 11527672 12549898 13931553 14404534 13871675 13281092 13149022 12982076 12248735 11269657
38293 11269657 10768306 10851764 10894056 10479257 10080346 10413118 11257594 11544775 10825509 9976435
38283 9976435 9905982 10191539 9863933 9073113 8841521 9361459 9814833 9970907 10603562 11897553
38273 11897553 12764974 12519218 12101884 12631900 13603379 13702062 12878749 12410705 13080119
38264 13080119 14319088 15194811 15426251 15283510 15092297 15059182 15280353 15822255 16860291
38255 16860291 18512676 20387792 21675285 21993754 21822979 21813477 22027630 22109297 21723477
38246 21723477 20538041 18382587 15861116 14148429 13586136 13118400 11822387 10336231
38238A0336231m79427M36941K35432l97255n27519m73156p17423n96838M88962
38229H305948J520502J170485J06772K24799J698541K537579J465084k80064q12797
38220A5936849j31052L03986j60950p49184p83882p01329j136626j790692j885125
38211H901995j343421p91873n25988k24729K26858L80985L452m42366n18509m41092
38201E225312m73070k57996N49655J420426J502376Q04090J10146j17433q9783
38192H673723q7767j38081j84537o3177M87232J292808J561023Q08442m05715
38183A1943951j255580j637202j723725j275122l47256R6310m64793q84990n912
38174D445681J159831Q07766n61469p06636P27325J633494R52768J98076M71386
$$ plain form
38238 10336231 9856804 10293745 10529177 10131922 9604403 9131247 8413824 7816986 8305948
38229 8305948 9826450 10996935 11103707 11328506 13027047 15564626 17029710 16749646 15936849
38220 15936849 15805797 16109783 15948833 15199649 14415767 13714438 12577812 10787120 8901995
38211 8901995 7558574 6766701 6240713 6015984 6242842 6623827 6627279 6184913 5666404 5225312
38201 5225312 4752242 4494246 5043901 6464327 7966703 8770793 8880939 8763506 8673723
38192 8673723 8585956 8447875 8263338 8200161 8687393 9980201 11541224 12349666 11943951
38183 11943951 10688371 9051169 7327444 6052322 5705066 5801376 5336583 4451593 4445681
38174 4445681 5605512 6413278 5851809 5145173 5872498 7505992 8458760 8656836 9128222
38165I128222M76036q49042j905621q62605J067736J271723k30294q95893M13333
38156G613595J919424J716325K21065r05217r89619o34801n43204q60200j384165
38147F153203j840279j925972j405011l99849M26668L55736m20595p32897P5023
38138B86027J028461Q22206j55751m30523J21440J59817n95032p15579L16295
38129H37361Q88722n0127r82780k93893Q75632M80069r24850j092177J37402O79135
38119E54494j94699p59764O6418R49366N73814j40504K25562J084552Q12208n65034
38109B606413j340948o05501O30764R87593L71830l30052n34054l76370j60993
38100A248682L6365J70807P7735k17044l17854M2630M98449M83426O2793j88672
$$ plain form
38165 9128222 9604258 8755216 6849595 5986990 7054726 8326449 8096155 7200262 7613595
38156 7613595 9533019 11249344 11470409 10565192 9575573 8940772 8397568 7537368 6153203
38147 6153203 4312924 2386952 981941 582092 1008760 1364496 943901 211004 286027
38138 286027 1314488 2136694 1980943 1550420 1671860 1831677 1236645 521066 837361
38129 837361 1726083 1675956 693176 399283 1274915 1754984 830134 -262043 -124641 554494
38119 554494 359795 -399969 -333551 615815 1189629 1049125 1274687 2359239 3171447 2606413
38109 2606413 1265465 659964 1290728 2278321 2650151 2320099 1786045 1409675 1248682
38100 1248682 1285047 1455854 1533589 1316545 998691 1041321 1539770 2023196 2085989 1897317
38090A897317q8615k189o2591L7301L14524L31974L4413o2033J18489j07744r47415
38079A463431j447826p99132M09116J051000R69568P73222O62201L74150m1260
38070C414470k33672j59791p4042j13725k84025m96244l72969L58826J041008
38061C079836N81910q10917j526212q07461J35860J31693k07867P5535M63471
38052A115848J03080m15705j55496L17663K7588m15878N0312O79514R8700r13906
38042D91720m37645J125329J399039k3394q58299K3365Q24256L2744j104678q70697
38032F01740K27879P80031Q32925J136196J297304N15250o65177r74002l13801
38023C438345K77979K26900m3903R7551Q68883J874450K138850J045451l84938
$$ plain form
38090 1897317 1808702 1806513 1743922 1781223 2095747 2427721 2462134 2400101 2518590 2410846 1463431
38079 1463431 15605 -783527 -374411 676589 1646157 2419379 3081580 3455730 3414470
38070 3414470 3180798 3021007 2946965 2833240 2549215 2052971 1680002 2038828 3079836
38061 3079836 3661746 2850829 1324617 517156 653016 784709 576842 652377 1115848
38052 1115848 1218928 803223 647727 965390 992978 577100 627412 1306926 1405626 491720
38042 491720 54075 1179404 2578443 2555049 1696750 1720115 2544371 2577115 1472437 601740
38032 601740 829619 1609650 2442575 3578771 4876075 5391325 4726148 3752146 3438345
38023 3438345 3716324 3943224 3899321 3996872 4865755 6740205 8879055 9924506 9539568
38014I539568j85198J972086M004802M103815L084038K919036L854473M369574
38006C3662194L512981J941277P44941K84738K67084K48856r6801q80339k056254
37997C7628677l473003m615174m644118l402347k059649j744219j840006j012730
37989A4837431L48450O14374r1410K91568K277753L617851K839715J615765J744087
37980B8095584J971709K99305k265779l144190k305908j983877k767626k927774
37972A4971444j706513n59975n88001j031598j044649r92937j195773j062632
37964F789366l15326L05740K59600n1240k34210m18450m78778l2322N10568L07586
37954F642534k38439J96070J451979J689646L47743o62702Q3712J235670R70370
$$ plain form
38014 9539568 9354370 11326456 15331258 19435073 22519111 25438147 29292620 33662194
38006 33662194 37175175 39116452 39861393 40146131 40413215 40662071 40565270 39684931 37628677
37997 37628677 34155674 29540500 24896382 21494035 19434386 17690167 15850161 14837431
37989 14837431 15185881 15800255 15708845 16000413 18278166 21896017 24735732 26351497 28095584
37980 28095584 30067293 30366598 28100819 24956629 22650721 20666844 17899218 14971444
37972 14971444 13264931 12704956 12116955 11085357 10040708 9047771 7851998 6789366
37964 6789366 6474040 6779780 7039380 6988140 6753930 6335480 5856702 5824380 6334948 6642534
37954 6642534 6404095 6600165 8052144 9741790 10089533 9426831 9510543 10746213 11716583
37945A1716583J141K30956J516479K099260J781989K300326M277573N868586N271647
37936C5064540L130195J397690P64653L40323n56371j428020j617473j533764
37928C5561773k206301l712516m695683l898747j849341l48941l32820r91638
37920A7525786j187827q81953o18609l44728L89100J420438K059300K107343K024052
37911B2492902J991535J510215K28776j317699k246823k409068k481355k898113
37903A4870370l082158k197909n89732K25965n64514j793302j725552m19725M09402
37894E132845j11702r05635p85032j99858k35382p64070p81840j22609L52698
37885A579415J66276k15851l22594l01740l73217l42341J6019N02910O80375L20299
$$ plain form
37945 11716583 11717724 11948680 13465159 15564419 17346408 19646734 23924307 29792893 35064540
37936 35064540 38194735 39592425 40357078 40697401 40141030 38713010 37095537 35561773
37928 35561773 33355472 29642956 24947273 21048526 19199185 18850244 18517424 17525786
37920 17525786 16337959 15456006 14837397 14492669 14881769 16302207 18361507 20468850 22492902
37911 22492902 24484437 25994652 26223428 24905729 22658906 20249838 17768483 14870370
37903 14870370 11788212 9590303 9000571 9226536 8662022 6868720 5143168 4723443 5132845
37894 5132845 5021143 4115508 3330476 3130618 2895236 2131166 1349326 1226717 1579415
37885 1579415 1745691 1529840 1207246 905506 532289 189948 205967 708877 1389252 1709551
37875A709551l68187q26397o35182q9904P0951k26323j40187O90752J201170L25795
37865A712039j121900j289376Q9464J240780P88107n53394j207645o55328M60976
37856e36277J302280J296991L64900p34222r14409j23408M97225K60783j30049
37847A283814P9699L90203r49p63883j035166p93523n19202j00428O70232J074614
37837B85411M07768m62435j25584R56688R09357n16575j334686l97712Q20628
37828E42860O37191l04018m20158J66490J70616m54293n36850J65679N87603K16722
37818G71842j82238j4774K89451L09542L46958N37959L08586n39100j071883m67998
37808B88345N96586Q00329Q4351l19772K40251R20419O92852j73385n79200j49487
$$ plain form
37875 1709551 1341364 514967 -120215 -210119 -139168 -365491 -505678 185074 1386244 1712039
37865 1712039 590139 -699237 -609773 631007 1419114 865720 -341925 -997253 -536277
37856 -536277 766003 2062994 2427894 1693672 779263 655855 1153080 1413863 1283814
37847 1283814 1363513 1753716 1752767 988884 -46282 -839805 -1359007 -1459435 -789203 285411
37837 285411 693179 230744 105160 1061848 1971205 1454630 119944 -277768 542860
37828 542860 1180051 876033 455875 622365 792981 338688 -198162 -32483 555120 771842
37818 771842 589604 574830 864281 1173823 1520781 2058740 2367326 1828226 756343 288345
37808 288345 884931 1685260 1769611 1449839 1690090 2610509 3303361 3129976 2550776 2401289
37798B401289M20648N32365M55663O26571Q04246N80812L59934R25573K012911
37789I120012K266343J062298m14897o36050K60165P60885K4326j231534j872343
37780I339205j602590r06339l49334k05643l81562n15865m07397l30025n91624
37771D048826r05314p15971r4656L02976J98454n1956k49869o26624j055694q26502
37761B3670K46232J177650R94838O2961n48628o28344q10317j166739r00659K64578
37751a284758J307219J157170J70506l76744j554N49406N83081L94061N43824
37742C042211Q19989N80254j53701o98048p83790q72099j192523j229893o26888
37733a114488Q1481L01566L78359Q83857J326716P04713p18643j395432n82632
$$ plain form
37798 2401289 2821937 3354302 3809965 4436536 5240782 5821594 6181528 7107101 9120012
37789 9120012 11386355 12448653 12033756 11397706 11657871 12418756 12443082 11211548 9339205
37780 9339205 7736615 6830276 6480942 6275299 5893737 5377872 4970475 4640450 4048826
37771 4048826 3143512 2427541 2332885 2635861 2834315 2782359 2532490 1905866 850172 23670
37761 23670 269902 1447552 2442390 2505351 1956723 1328379 518062 -648677 -1549336 -1284758
37751 -1284758 22461 1179631 1350137 973393 971839 1521245 2104326 2498387 3042211
37742 3042211 3862200 4442454 4288753 3590705 2806915 1934816 742293 -487600 -1114488
37733 -1114488 -1033007 -731441 -353082 530775 1857491 2562204 1843561 448129 -134503
37724a34503O03954P89764R5370m53513n16828m81070l83398J33379Q94108J169260
37714A716523P04366L3712l66460n43260n31930j30192M37522L76393n51451j320505
37704a75282q34869M94142J196451O74044j62520l13776P6755K92393J64799N1628
37694A463765J17167K04874J90412L4488k71154m91757k92346N7581k36891j128009
37684c51870j253110J45869J597713J203350m14973q57243L98737J245289L87824
37675B101586o99622m46937K57406n1248o94381k24154P25433M56092o48030o28973
37665A47172N85783R08037l65466j290821m68028P58482O29829l11708m55051
37656A38229K22060M31565k25569q72304q42251l40946K36091P15700R39490Q21471
$$ plain form
37724 -134503 469451 1259215 1354585 901072 384244 -96826 -480224 -346845 547263 1716523
37714 1716523 2420889 2454601 2088141 1544881 1012951 882759 1320281 1696674 1145223 -175282
37704 -175282 -1010151 -516009 680442 1354486 1191966 878190 954945 1247338 1412137 1463765
37694 1463765 1580932 1785806 1976218 2010706 1739552 1247795 955449 1013030 776139 -351870
37684 -351870 -1604980 -1459111 138602 1341952 926979 69736 468473 1713762 2101586
37675 2101586 1401964 955027 1212433 1161185 466804 242650 968083 1424175 776145 147172
37665 147172 732955 1640992 1275526 -15295 -483323 275159 904988 593280 138229
37656 138229 360289 791854 566285 -306019 -1148270 -1489216 -1253125 -537425 402065 1223536
37646A223536N60746L67346J50280j95286m63124m02434m7940L99503P09052N88930
37636B890609k0925o14673o42981l29398k75915l66457K108O40003O74192P3642
37626B030205k04275J10223J44713m10515o02621K2140L97822k86914j102783
37617I7995r04931k04323j21477m13274p8051P17891Q64469J37909n35608m86892
37607i26292R6104P54601J017738M31138p37197j260009m28405P03941O67301
37598C18920k92349p11454k24102O3785m50631q92581l31309Q17374J369019Q28424
37588D95096j38719n11811n1599M31006J57492m70025m87313O961K261n13262
37578a079913l17630P97510J244766J67068r28964n43173L65268J30925p63896
$$ plain form
37646 1223536 1784282 2151628 2301908 2106622 1643498 1241064 1193124 1592627 2301679 2890609
37636 2890609 2869684 2255011 1612030 1282632 1006717 640260 642368 1282371 1956563 2030205
37626 2030205 1825930 1936153 2080866 1670351 1067730 1089870 1487692 1200778 97995
37617 97995 -806936 -1011259 -1132736 -1546010 -1624061 -906170 -41701 96208 -439400 -926292
37607 -926292 -830188 -75587 942151 1373289 636092 -623917 -1052322 -348381 318920
37598 318920 26571 -684883 -908985 -845200 -1295831 -2188412 -2519721 -1702347 -333328 495096
37588 495096 356377 -155434 -207033 223973 381465 -88560 -575873 -568912 -566651 -1079913
37578 -1079913 -1397543 -600033 644733 811801 -117163 -660336 -295068 -164143 -928039
37569i28039p29883R7472L89168J99131N68868J087690M04266j026854j255203
37560a193384K3949J058401R75369P26170P54718J80029j056489j547549p55327
37551h34113R0212K07038L07342O47253K31003j006505j376679q3578J237673
37542e80354R82815j79147q44023r21371p89120j32400Q97933J028004q6781p58748
37532a383192J73433J302719R32578j94275m24297J5068p1894m06073j5952N54893
37522D83008J79222n35957k33572N85029L91539m65974k89441P99218R00156l42247
37512A470981j084806m00039M17853L41121Q6208K23592Q928p74631q45613L23099
37502b33307J093917J39372j182824p97592Q27345J392845K01913j037157q24391
$$ plain form
37569 -928039 -1657922 -1560450 -1171282 -972151 -403283 684407 1088673 61819 -1193384
37560 -1193384 -1169435 -111034 864335 1590505 2345223 2525252 1468763 -78786 -834113
37551 -834113 -743901 -536863 -229521 417732 648735 -357770 -1734449 -1818027 -580354
37542 -580354 402461 223314 -620709 -1542080 -2331200 -2463600 -1565667 -537663 -624444 -1383192
37532 -1383192 -1209759 92960 1025538 831263 406966 422034 350140 -55933 -71885 483008
37522 483008 662230 126273 -107299 477730 869269 403295 113854 913072 1813228 1470981
37512 1470981 386175 -13864 403989 745110 831318 1054910 1063838 289207 -556406 -233307
37502 -233307 860610 999982 -182842 -980434 -153089 1239756 1441669 404512 -419879
37493d19879L26934J029771P57899l1298o66625o88954p8710N57232M54859l23477
37483I17752p51007o1875J150679J517782N21594q75695j332369n29656O91403
37474A248608J275387P73068m53850j431400j250159p6303P48273K65121p02104
37465C96641o24579M35375R08383K84984J9399J052082J925191Q27495j469774
37456C755197k446484j195178O66877J374803Q34193q2464p02759o37836J80272
37447A746621J053184R61319j10842r95342q20622l728N32581M73192J12378j72055
37437B776686j20728K55028N00770J55943n22680p98484m81591r4601O6412K87858
37427B024613O41646O11676p6964q78291j101627o79434M8107P60344J047908
$$ plain form
37493 -419879 -92945 936826 1694725 1663427 996802 307848 229138 786370 1241229 917752
37483 917752 166745 104870 1255549 2773331 3294925 2419230 1086861 557205 1248608
37474 1248608 2523995 3297063 2843213 1411813 161654 85351 833624 1098745 396641
37465 396641 -227938 207437 1115820 1400804 1420203 2472285 4397476 5224971 3755197
37456 3755197 1308713 113535 780412 2155215 2989408 2906944 2204185 1566349 1746621
37447 1746621 2799805 3761124 3650282 2654940 1834318 1830590 2363171 2836363 2948741 2776686
37437 2776686 2655958 2910986 3411756 3567699 3045019 2246535 1764944 1670343 1736755 2024613
37427 2024613 2666259 3277935 3200971 2322680 1221053 541619 589726 1350070 2397978
37418B397978N19714n04594r82492m02092M22791M28409k30764n04484J7124O73188
37408A834778Q04634N00558Q9521m32266j027629j154684l30993R43587J460368
37399B687874P01103n02894j036412q18823n57974n09229k34239M23780R22234
37390A075420Q36324M35808J14396j47364l79411l23356j0370R590l92589m13875
37380H04573M76105J400782J125699j15845q82661m80224L26396N81952K21673
37371C458450k91601o54093p62666n80505j99993K19571N74457O88827L41368
37362B793815k81845n84488m14768l72145p36688q07456q1736O73400N66013O5538
37352H19640Q3514K70658k04561p50016j34392J070144R69387n35940j299900
$$ plain form
37418 2397978 2917692 2413098 1430606 1028514 1451305 1879714 1648950 1144466 1161590 1834778
37408 1834778 2639412 3139970 3229491 2797225 1769596 614912 283919 1227506 2687874
37399 2687874 3388977 2886083 1849671 1030848 472874 -36355 -270594 153186 1075420
37390 1075420 1911744 2347552 2461948 2314584 1935173 1611817 1601447 1611037 1218448 804573
37380 804573 1280678 2681460 3807159 3691314 2808653 2328429 2654825 3236777 3458450
37371 3458450 3166849 2512756 1750090 1169585 969592 1189163 1763620 2452447 2793815
37362 2793815 2511970 1927482 1512714 1140569 403881 -403575 -485311 188089 754102 819640
37352 819640 903154 1173812 969251 219235 84843 1154987 2124374 1588434 288534
37343B88534k30580J038456P86680l42358q16764n56176l28773j10235L91655
37334A20439N93711o590n28730P4848J113071J042573j22439q28293k97350N58652
37324A719892O37561o8777q58169j120513o51505J59748M96468N0150m45561k46765
37314c27471K44550J91447k36952k17766J89599J01902n57940p26850J50910J174388
37304a4183J204967K66886p83390j353952j340689p61760J92859R67312J040127
37295e81823N24060M2366j9149J15954Q1637k6982J66485N56505M47068m44939
37285H61182j280674j043931Q211O59728M87915L24960P16664R87274M68584k67855
37275A922058l04417J57187K05877l17026p19139n92299j87065K27025O13593
$$ plain form
37343 288534 57954 1096410 1883090 1540732 723968 167792 -160981 -271216 120439
37334 120439 714150 707560 178830 253678 1366749 2409322 2286883 1458590 1161240 1719892
37324 1719892 2357453 2288676 1430507 309994 -341511 -181763 314705 364855 -80706 -327471
37314 -327471 -82921 108526 -128426 -346192 -156593 -54691 -612631 -1339481 -1188571 -14183
37304 -14183 1190784 1457670 674280 -679672 -2020361 -2782121 -2589262 -1621950 -581823
37295 -581823 -57763 -15397 -34546 81408 163045 136063 302548 859053 1306121 861182
37285 861182 -419492 -1463423 -1455212 -795484 -307569 17391 734055 1721329 2189913 1922058
37275 1922058 1617641 1774828 1980705 1663679 944540 352241 165176 392201 1005794
37266A005794Q31863O95554L54460J20456K117j64505l08351k73009j51320p7298
37256B035761L6218J99691J69001r0271k59454l25890o83647j131074p02811P37262
37246a5214J711774J040109k89728m75282M96953J048232M15979o09409j181584
37237B141830j231304q43034q6181N16740M91526K86844N47872Q22815L05044
37228B952152m99005m38134K08399J53681m79409k15990J068080J656426P87526
37219E193726j58632j02493J50946j65111k74090L79065P37206J06475k07336
37210E659756R05975K080833J553426K78630N31911K171291K880230J943087J244284
37201A9249423K073332L128929K641845Q86540n48868j014313j257195k055812
$$ plain form
37266 1005794 1837657 2533211 2887671 3008127 3010244 2845739 2537388 2264379 2113059 2035761
37256 2035761 2071979 2271670 2440671 2350400 2090946 1765056 1081409 -49665 -752476 -15214
37246 -15214 1696560 2736669 2446941 1971659 2468612 3516844 3932823 3323414 2141830
37237 2141830 910526 67492 -18689 498051 989577 1276421 1824293 2647108 2952152
37228 2952152 2453147 2015013 2223412 2377093 1897684 1681694 2749774 4406200 5193726
37219 5193726 5035094 4932601 5083547 4918436 4644346 5023411 5760617 5867092 5659756
37210 5659756 6565731 8646564 10199990 10478620 11010531 13181822 16062052 18005139 19249423
37201 19249423 21322755 24451684 27093529 27980069 27431201 26416888 25159693 23103881
37193B3103881l173793l690292l087501j868884r49504n78050m02126m85295j188533
37184G679903j837146j022841R58270J626602k64440k365518j832898M41873J285155
37175D668960J58335m44626M94381R11642m68037j693961q25600Q09439Q71344
37166D481877k26809l56274N83783O28867q02593j891035j296112p6870J54792
37157A199626m21508m71619L16135Q54826K93807q37949j349862p89329K16750
37148i89123Q37690Q55345N50693K11867O2868L02605P25738O21784l01066j150399
37138A728002q39822K89705Q29769L16186k49645j38563R7306p0167o5685O15904
37128B512990J169406O02629n87359j088286o70393k00625o3280J69493N46370
$$ plain form
37193 23103881 19930088 16239796 13152295 11283411 10333907 9755857 9353731 8868436 7679903
37184 7679903 5842757 4819916 5778186 7404788 7140348 4774830 2941932 3383805 4668960
37175 4668960 4827295 4382669 4877050 5788692 5320655 3626694 2801094 3610533 4481877
37166 4481877 4255068 3898794 4482577 5111444 4308851 2417816 1121704 1044834 1199626
37157 1199626 778118 306499 622634 1477460 1771267 933318 -416544 -1205873 -989123
37148 -989123 -151433 703912 1254605 1466472 1529340 1831945 2557683 3179467 2878401 1728002
37138 1728002 888180 1177885 2007654 2323840 2074195 1935632 2032938 1962771 1897086 2512990
37128 2512990 3682396 4285025 3697666 2609380 1938987 1738362 1675082 1844575 2390945
37119B390945M49705k64070q43306p17877k24389Q1901J82522L16619M89417O08714
37109B470181P03054P16050M22846j93722p41973q07260l96513P1692J07926m20304
37099A931977j001384q07968L45787J529579J600478N19269o17213q07410o5439
37090B627676Q00371R78180L14538n02247n69150J57397P29553M89439j6100J0713
37080E020370K90725K364p09978q55885j62224N34705N54294Q3773m60401q27764
37070C469979o30421K78752J009172M40737r20225j261986j00415R04914N26658
37061C717165j95290J28759R12052P56947j44690n48503l42929l76761o18019
37052C288731l45277J57201K3796k65788N18657J799981J562420k51955j162998
$$ plain form
37119 2390945 2840650 2576580 1733274 1015397 791008 872909 1055431 1372050 1861467 2470181
37109 2470181 3173235 3889285 4312131 4118409 3376436 2569176 2172663 2244355 2352281 1931977
37099 1931977 930593 122625 468412 1997991 3598469 4117738 3500525 2693115 2627676
37090 2627676 3428047 4406227 4720765 4218518 3649368 3806765 4536318 5025757 5009657 5020370
37080 5020370 5311095 5313459 4603481 3747596 3585372 4120077 4674371 4758144 4297743 3469979
37070 3469979 2839558 3118310 4127482 4568219 3647994 2386008 2285593 3190507 3717165
37061 3717165 3521875 3650634 4562686 5319633 5174943 4626440 4283511 3906750 3288731
37052 3288731 2943454 3100655 3124451 2858663 3377320 5177301 6739721 6487766 5324768
37043E324768J0234J123162J42547j514760j295647M21127J165429L73993j60890
37034E589963M06519Q35574L12440j98166J21850N56211L24626j14998k05413
37025G628606l62877q68499r04339J24273J269738J258045L04673m14615m98100
37016G536905m06605l15683k3359K75351J46853k76389m48174k09636J87336N56896
37006G023495P05653L47926k87337l71939K90744P09456K58626j23365N13932
36997I067191J320753R71817K2231K3388P98719P67029j98377n63737M1239K21056
36987A2471309m07834l03872J124757K068938J144067l99142q70563o34218o50352
36978A3543090l74423Q02509J639364R18863j04694L57986J383479Q05848q73363
$$ plain form
37043 5324768 5335002 6458164 6600711 5085951 3790304 4211431 5376860 5750853 5589963
37034 5589963 5996482 6832056 7144496 6946330 7068180 7624391 7949017 7834019 7628606
37025 7628606 7265729 6397230 5492891 5617164 6886902 8144947 8449620 8035005 7536905
37016 7536905 7130300 6814617 6791258 7066609 7213462 6937073 6488899 6279263 6466599 7023495
37006 7023495 7729148 8077074 7789737 7417798 7708542 8417998 8676624 8553259 9067191
36997 9067191 10387944 11359761 11381992 11405380 12204099 12971128 12772751 12209014 12250253 12471309
36987 12471309 12063475 11759603 12884360 14953298 16097365 15698223 14827660 14193442 13543090
36978 13543090 13168667 13971176 15610540 16529403 16424709 16782695 18166174 18972022 18098659
36969A8098659j101475M75779J495781Q54444J60352M96306O41548k10634n33757
36960B0377003J006748L081393L596701K656147J924422K121436K710739L262484
36952D0737073L741822M029650M207027M718369N505641N836919N670857O004326
36944H0451684O984946P084879N442795L683325L747501N026123N568260N293708
36936A23283221N790822P250875P881354O670216M804448L713954L262590K672612
36928A65330092K034446K009347K829709M368101O680091R869365J3735610J7966103
36920B24822864K2476999K7360281L2551047L7263774L9309657L5398755K3341002
36913D42524379M653268j5309899l0383166l7288368l7094794l3598538l0067005
$$ plain form
36969 18098659 16997184 17472963 18968744 19823188 19983540 20479846 21121394 20910760 20377003
36960 20377003 21383751 24465144 28061845 30717992 32642414 34763850 37474589 40737073
36952 40737073 44478895 48508545 52715572 57433941 62939582 68776501 74447358 80451684
36944 80451684 87436630 94521509 99964304 103647629 107395130 112421253 117989513 123283221
36936 123283221 129074043 136324918 144206272 150876488 155680936 159394890 162657480 165330092
36928 165330092 167364538 169373885 172203594 176571695 183251786 193121151 206856761 224822864
36920 224822864 247299863 274660144 307211191 344474965 383784622 419183377 442524379
36913 442524379 447177647 431867748 401484582 364196214 327101420 293502882 263435877
36906B63435877k7115753k3687302j9744417j6914148j6094707j5791830j4092216
36899A29995504j1377976r507727q865634q057309o449291n119381m851904m841632
36891G0924650m125822k973418k044594j298714n72677k51003m92808o62421l97967
36882E8105226m29773j397299k581336k842018k238504j656015j289852o52498
36874D5017931J57341L68872k08604q02453p37846j49096N30945J129475J579344
36865D6885909J778477J856843K167986K822636L569957M250154N003059N921771
36857G4256792O879459P860159R122526J0832536J2783443J4637957J6198311
36850A52571183J7267612J7492072J6573256J4484341J1309635P098493K181860
$$ plain form
36906 263435877 236320124 212632822 192888405 175974257 159879550 144087720 129995504
36899 129995504 118617528 109109801 100244167 92186858 85737567 80618186 75766282 70924650
36891 70924650 66798828 63825410 61780816 60482102 59909425 59658422 59165614 58503193 58105226
36882 58105226 57675453 56278154 53696818 50854800 48616296 46960281 45670429 45017931
36874 45017931 45175272 45544144 45335540 44533087 43795241 43646145 44177090 45306565 46885909
36865 46885909 48664386 50521229 52689215 55511851 59081808 63331962 68335021 74256792
36857 74256792 81136251 88996410 98118936 108951472 121734915 136372872 152571183
36850 152571183 169838795 187330867 203904123 218388464 229698099 236796592 238978452
36843B38978452k509187n867031p472892p796662p460284o632092n377491m248383
36835A91614430l957124m446564m769060m086244k459134m99233J336504K796386
36827A75529961L589421L590762L101885K479425J681847N88208n25661j439490
36819A88596358k668995m821888p253092q356378p586034o280676n803210n651785
36811A40174300m430927k202249n60301l27775m80760P4131P67631M42800n51873
36802A32904977p12364K96056J055081N37832m17096o21089n16679j418064l378429
36793A27730225n219710o457622p700695r000594r345920q370486p208877o820154
36785F7606167o627519n800857m806081m462908m358252l593180k449569j845749
$$ plain form
36843 238978452 236469265 230602234 223129342 215332680 207872396 201240304 195862813 191614430
36835 191614430 187657306 183210742 178441682 174355438 171896304 171397071 172733575 175529961
36827 175529961 179119382 182710144 185812029 188291454 189973301 190561509 190035848 188596358
36819 188596358 185927363 181105475 173852383 165496005 157909971 151629295 145826085 140174300
36811 140174300 135743373 133541124 132980823 132653048 132172288 132246419 133014050 133456850 132904977
36802 132904977 132192613 132488669 133543750 134081582 133664486 133043397 132526718 131108654 127730225
36793 127730225 122510515 116052893 108352198 99351604 90005684 81635198 74426321 67606167
36785 67606167 60978648 55177791 50371710 45908802 41550550 37957370 35507801 33662052
36777C3662052j640376j067982n23180j121386k475810k772897j495703l49915
36769B2214803p14114j668655j590219n27473J85721q4696p46521r78775m76150
36760A5613921L97739P01934k39513j662348j886498n93279M51674j64155j377951
36751A1241524j228142K55020J274348R66902K72958J21649K60206K10767J02542
36742A3477774L6636l21972r22885r86845j51950P58898Q40127L94303L21067
36733A3445153O34951N26570j95637o58904k04201O06977Q07391M29114M04024
36724A5795438J119797J782287J564522R00174J009779K248065L551334L749657
36716C1721053K989145K461321K908666L813927M151526L654558L025553K872462
$$ plain form
36777 33662052 32021676 30953694 30430514 29309128 26833318 24060421 22564718 22214803
36769 22214803 21500689 19832034 18241815 17714342 17900063 17815367 17068846 16090071 15613921
36760 15613921 16011660 16713594 16474081 14811733 12925235 12331956 12783630 12619475 11241524
36751 11241524 10013382 10268402 11542750 12509652 12782610 12904259 13164465 13375232 13477774
36742 13477774 13514410 13192438 12269553 11282708 11130758 11889656 12729783 13124086 13445153
36733 13445153 14080104 14606674 14411037 13752133 13547932 14154909 14962300 15391414 15795438
36724 15795438 16915235 18697522 20262044 21162218 22171997 24420062 27971396 31721053
36716 31721053 34710198 37171519 40080185 43894112 48045638 51700196 54725749 57598211
36708E7598211K812166K062340P76856Q1768N15037J142051Q39979j11235n77875
36699F5139298l11705q5688k52816l53135k96405p42079j855099k719965k597524
36690E5924882j908269j359504r19003l27212J63308L08727L81703L71903m91980
36681E2144555k403549l937160l667864k356140k077306l339522m516217m265309
36673B5581488l111299k203360j754619j409817j193932j261923j332218j121429
36665A2192891q92123r15389q16307j76831N18601L57906o30299j355691j096816
36656G185942m01343j83320m31265m10659P1486L09797k37675j100330j395744
36647C406889r19749j89737L42686N93426N07853L7090m98379n69088j00845M49098
$$ plain form
36708 57598211 60410377 62472717 63249573 63331341 63846378 64988429 65828408 65717173 65139298
36699 65139298 64827593 64741905 64489089 64135954 63839549 63097470 61242371 58522406 55924882
36690 55924882 54016613 52657109 51738106 51410894 51574202 51882929 52264632 52636535 52144555
36681 52144555 49741006 45803846 42135982 39779842 37702536 34363014 29846797 25581488
36673 25581488 22470189 20266829 18512210 17102393 15908461 14646538 13314320 12192891
36665 12192891 11300768 10385379 9569072 9392241 9910842 10268748 9638449 8282758 7185942
36656 7185942 6784599 6601279 6170014 5759355 5830841 6140638 5902963 4802633 3406889
36647 3406889 2487140 2297403 2640089 3233515 3741368 3778458 3280079 2710991 2610146 3059244
36637C059244P26077P03137K97113n41414j243278r59948J64609Q71959M46321
36628C523820k90990l07778Q8790m8461o45964p72653k01029L15514L26904K17502
36618B205655K67759J34374l32861n43312l0322O49820N61231k80025q75274o21350
36608A135695j33822k83531p96920n75095N39926J224896M92176p23880q09451
36599F9994K05330Q61017N83767K54500L43905J77331m05461l97626M35943O67437
36589B796137m37415j293898m49314P98762L99744r76196j030956K62791P19462
36580G89117j68551l96244Q60983J611092M35470j004377p15870L84820K25359
36571B021799q62624q38895M86198J074690r0017j480730j335266O1314J174599
$$ plain form
36637 3059244 3785321 4488458 4785571 4244157 3000879 2040931 2205540 3077499 3523820
36628 3523820 3232830 2925052 3013842 2965381 2319417 1546764 1345735 1661249 1988153 2205655
36618 2205655 2473414 2607788 2274927 1731615 1701293 2351113 2912344 2632319 1757045 1135695
36608 1135695 1001873 718342 -78578 -653673 -113747 1111149 1603325 879445 69994
36599 69994 275324 1136341 1720108 1974608 2318513 2495844 2090383 1692757 2128700 2796137
36589 2796137 2358722 1064824 615510 1414272 1814016 837820 -193136 69655 789117
36580 789117 620566 224322 1085305 2696397 3131867 2127490 1411620 1796440 2021799
36571 2021799 1159175 320280 806478 1881168 1791151 310421 -1024845 -963531 211068
36562B11068J233970O49837Q3274j63492j05784P4326J86384J94768J39741l4036
36552B470056l17410m18319j06758K65746Q9385n72039r00622m37010K15620K57882
36542E46531j04356m499O28498P76093j57494j230266j086373J60104J038020
36533E66258O74679k58761p59437p26745m85844O5037R95014J598215J099321
36524B767737j04451p81624m24038K57297M25092O8284k44556q9901M25637P36207
36514C035684L78694l20754n04766k4664K16099k79553n85734K34894J384374
36505C534274J306069J1461j022687j130567j073898j267626j022507p1941O14292
36496a23130L40937j50421J02871Q16262J042848N19682k88622q87583r26370
$$ plain form
36562 211068 1445038 2094875 2178149 2014657 1908873 1983199 2169583 2364351 2504092 2470056
36552 2470056 2152646 1734327 1627569 1893315 1982700 1410661 510039 73029 288649 546531
36542 546531 442175 437676 1066174 1842267 1684773 454507 -631866 -471762 566258
36533 566258 1240937 982176 222739 -504006 -989850 -924813 70201 1668416 2767737
36524 2767737 2663286 1881662 1457624 1714921 2140013 2208297 1963741 1873840 2299477 3035684
36514 3035684 3414378 3093624 2588858 2564194 2780293 2500740 1915006 2149900 3534274
36505 3534274 4840343 4851804 3829117 2698550 1624652 357026 -665481 -737422 -123130
36496 -123130 217807 67386 170257 986519 2029367 2549049 2260427 1372844 446474
36487D46474k94108M77751N70816L5859j80157K62680N28834O4799m24439j95005
36477A293504L25895M16501K36810J82782n2440o81153q83533N9956J263791J192751
36467C354864j72717j341742j332412n89475M2021K45569R9312j48169j17424
36458C9827K64594M90169J96546j71255r9918N6408k36537n47671j49051N18872
36448C61984L77536m04694n01175L94062R21393J64588q61472p23598L47274R21002
36438I96900L89476m81824q32016o51460l54988q9837J95335L53684J40631l03942
36428f38041m18148R9978P52426P55001P0770n06154m04953O7739L53692L99552
36418E31862M07750L24660Q5881l1597J50816K80536M0293k31670j18959O7633
$$ plain form
36487 446474 152366 630117 1200933 1236792 1056635 1319315 1848149 1912948 1488509 1293504
36477 1293504 1619399 2035900 2272710 2455492 2403052 1721899 838366 898322 2162113 3354864
36467 3354864 3182147 1840405 507993 -81482 -39461 206108 305420 157251 39827
36458 39827 304421 794590 991136 819881 719963 776371 539834 -7837 -156888 361984
36448 361984 739520 334826 -166349 227713 1149106 1313694 452222 -271376 75898 996900
36438 996900 1386376 904552 72536 -578924 -933912 -1023749 -828414 -474730 -334099 -638041
36428 -638041 -1056189 -956211 -203785 551216 621986 115832 -289121 -221382 132310 531862
36418 531862 939612 1264272 1350153 1318556 1469372 1749908 1790201 1558531 1439572 1507205
36408A507205j80611n82945m98361q4715j2238j45272L11312J202540J216720
36399B733635j47312j471828j173709L18182J145943M85246n57194n98834K69046
36390A003175Q21621L70236m67042o72132p4476N91999O76144K66251j32163j87731
36380B195882R7154M62230M78152p3379p42472p62593q2134M50905K52207k00685
36370B075267j82608K29010N17170O17585P11519N65697n9306o35316m18471L53094
36360C773641O87771K41219l07828k89750K68409R52447J264127P51473l80461
36351F961048r89833k83051Q12929P44612k81887m61103Q32786K031721J805903
36342A1173125R44589P01351O46671k57632j392881j174197L02989J148957M57792
$$ plain form
36408 1507205 1326594 743649 245288 160573 148335 3063 314375 1516915 2733635
36399 2733635 2586323 1114495 -59214 258968 1404911 1890157 1332963 734129 1003175
36390 1003175 1824796 2195032 1727990 1055858 981382 1573381 2249525 2515776 2383613 2195882
36380 2195882 2293036 2755266 3233418 3160039 2417567 1654974 1572840 2023745 2275952 2075267
36370 2075267 1892659 2121669 2638839 3256424 3967943 4533640 4474334 3839018 3420547 3773641
36360 3773641 4461412 4702631 4394803 4105053 4373462 5325909 6590036 7341509 6961048
36351 6961048 5971215 5688164 6501093 7245705 6963818 6502715 7335501 9367222 11173125
36342 11173125 12117714 12819065 13465736 13208104 11815223 10641026 10944015 12092972 12550764
36333A2550764m13101j8698J015423J084305Q7081m33911M65497J806980K006669
36324A8151009Q94751j87021j26296P12345J157312P08735q2092n29630n81707
36315B0117406n62272n88586n53729m55392m05391l72595j84370J71992M22371
36306A7589434K94951r9674k96615Q620N31749P13199N15498N83365J348780K273482
36296B3462789K448889J832172J352882J710734K547466L049685L038764L144079
36288D2587460L989560N408876O540238O770674O547498O910952Q034409Q716249
36280I5505916P843533N916584M282805L123338J323258j570046m492839o447152
36272A05485397p762573q959045r420213q436571o854668o207057o460524o117817
$$ plain form
36333 12550764 12137663 12118965 13134388 14218693 14305774 13871863 14337360 16144340 18151009
36324 18151009 19045760 18858739 18732443 19444788 20602100 21310835 21228743 20699113 20117406
36315 20117406 19555134 18966548 18412819 17957427 17552036 17179441 16995071 17167063 17589434
36306 17589434 17884385 17784711 17488096 17496716 18028465 18741664 19257162 19840527 21189307 23462789
36296 23462789 25911678 27743850 29096732 30807466 33354932 36404617 39443381 42587460
36288 42587460 46577020 51985896 58526134 65296808 71844306 78755258 86789667 95505916
36280 95505916 103349449 109266033 113548838 116672176 117995434 116425388 111932549 105485397
36272 105485397 97722824 88763779 79343566 70906995 64052327 57845270 51384746 45266929
36264D5266929m640408l289433l101227l392948l096071k448750k274832k389649
36256B0633611j971581j075587n41536n80826o32312n92905r84662j705793j802528
36247A0745881r32011j6365J22312j60726k47684l06091o16286p22635k44041
36238G622354J85008j44351p43252p27063l19796k97036m50861q1277L66480j53505
36228E256701j238017j340916k74324M36412N0799m30124l57298m56435q78100
36219G68698l47022J379224K220483P83864j060552q08863Q34162J207748j40387
36210D837355j178474q59273k52821j77003j35562K5278l64083j066573p94875
36201C3969M90807J074822J45221q40480m84399M98863P55795L85572K35285K79557
$$ plain form
36264 45266929 40626521 37337088 34235861 30842913 27746842 25298092 23023260 20633611
36256 20633611 18662030 17586443 17044907 16464081 15831769 15238864 14254202 12548409 10745881
36247 10745881 9813870 9797505 9919817 9759091 9511407 9205316 8589030 7866395 7622354
36238 7622354 7807362 7663011 6919759 6192696 5872900 5575864 5125003 5043726 5410206 5256701
36228 5256701 4018684 2677768 2403444 2839856 2890655 2460531 2103233 1646798 768698
36219 768698 421676 1800900 4021383 4805247 3744695 2935832 3769994 4977742 4837355
36210 4837355 3658881 2799608 2546787 2369784 2234222 2259500 1895417 828844 33969
36201 33969 524776 1599598 1744819 904339 419940 918803 1674598 2060170 2295455 2575012
36191B575012O2168j64142k4310K9107m28244p04072j8908R64500R55309L831
36181C250251o22676l72331k8716l35223r79716j165309n33501O07404J492800
36172A312983J379143L06231o87454o10975K68607P41061J60561q20758j105429
36163I43970l89010O04750R70956N71703Q0339R5322M55334O43289N35508K76806
36153D788967k66859j179736j792677j264287M0767P35699K73319l12638K3936
36144A046491R04719J253841P48758p8791o38586o51484k20275P5924k86619q67203
36134A286775o24214M91721J230325Q18646M8959r4966J03053r1128m86091m81460
36124B201620k54018l13659m30112j07010L26617J98846k73132k83087K83322
$$ plain form
36191 2575012 2637180 2473038 2448728 2477835 2049591 1345519 1326611 2291111 3246420 3250251
36181 3250251 2627575 2255244 2226528 1891305 911589 -253720 -787221 -179817 1312983
36172 1312983 2692126 2998357 2310903 1699928 1968535 2709596 2870157 2049399 943970
36163 943970 554960 1159710 2130666 2702369 2782708 2878030 3333364 3976653 4512161 4788967
36153 4788967 4522108 3342372 1549695 285408 326175 1061874 1335193 1022555 1046491
36144 1046491 1951210 3205051 3953809 3875018 3236432 2584948 2364673 2440597 2153978 1286775
36134 1286775 662561 1154282 2384607 3203253 3252212 3157246 3260299 3169171 2683080 2201620
36124 2201620 1947602 1633943 1203831 1096821 1423438 1622284 1349152 1066065 1349387
36115A349387Q00145Q58815M24651n46160j689399j904711o03719J050748J390193
36106A129950N10767K392N02018R36401M28133l88104m98890O5371N75514O59721
36096C923273M44901J16866k14532m70164o12290n14916M3390Q86651J202217
36087D805396M04029r21172j585488j227567n40393j80213j20123n5852J56375
36078G34992M68866O17107L00137k51395l40984R1594J55193m69191o04344O38448
36068A340423K010647J685301Q5410p31294k45986M2712n75510r18973k08203
36059B484527N63009M84595J87166L52095L64264l06962q04858l31150L30588
36050C323274J64379k91085k5005N13782K31235n38249m96871M22386R56957N28391
$$ plain form
36115 1349387 2149532 3008347 3432998 2886838 1197439 -707272 -1310991 -260243 1129950
36106 1129950 1640717 1643109 2145127 3081528 3509661 3121557 2622667 2688038 3263552 3923273
36096 3923273 4368174 4485040 4270508 3800344 3188054 2673138 2716528 3603179 4805396
36087 4805396 5209425 4288253 2702765 1475198 934805 754592 634469 578617 734992
36078 734992 1203858 1820965 2121102 1869707 1528723 1620317 1775510 1306319 701975 1340423
36068 1340423 3351070 5036371 5121781 4390487 4144501 4187213 3611703 2692730 2484527
36059 2484527 3047536 3532131 3719297 4071392 4435656 4128694 3323836 2992686 3323274
36050 3323274 3487653 3196568 3171563 3685345 3916580 3378331 2881460 3303846 4260803 4789194
36040D789194r0286j86379P4093L75681O90672Q08697M04368k22980l16126K41319
36030F568253P03572M90909j43677n28103j72356R08315J979513K026771J028729
36021A2861926L19570Q54149J690655J392399M51394P00738K386678L628164L257127
36012B7542800K499475K893661L913442L905807K481504P02919n55005j250141
36004D2134462j481459j228248p51357m68742m19901l83769l58065l76063j07487
35995C6559371O91068J529791J724493J470013J586030K177155K402229J852362
35987D9992512J397215K125367L909016N611296O534436P146664Q353498J0462123
35979I5532127J3098427J5959757J9315175K3672959K9200541L5561964M1689278
$$ plain form
36040 4789194 4698908 4512529 4586622 4962303 5652975 6461672 6866040 6643060 6326934 6568253
36030 6568253 7271825 7762734 7619057 7090954 6918598 7826913 9806426 11833197 12861926
36021 12861926 13181496 14035645 15726300 17118699 17570093 18270831 20657509 24285673 27542800
36012 27542800 30042275 32935936 36849378 40755185 43236689 43939608 43384603 42134462
36004 42134462 40653003 39424755 38673398 38204656 37784755 37400986 37042921 36666858 36559371
35995 36559371 37250439 38780230 40504723 41974736 43560766 45737921 48140150 49992512
35987 49992512 51389727 53515094 57424110 63035406 69569842 76716506 85070004 95532127
35979 95532127 108630554 124590311 143905486 167578445 196778986 232340950 274030228
35972B74030228M4893647M0707413K5660537J703391k2971001l9360327m4365331
35965B80298557m1547645l5961692l0012398k4240649j9429194j6092321j3308211
35958I9706447j0061812p091104n660656n087491l512024r50269O40115P18230
35950F8701436J358421M059321P247800Q431108P379749N537531L496978J034003
35942A07246347j131661j815629j503433k084264m260528o848113q783997j0065258
35934G0753464j0389425q868584n977994l983405m131780m840970m097661k397740
35926B6065905j633430k037991k167843j426705o77799m30372k07068R3681j52611
35917A7425767q86377j081222m13023J13583j70957n56533l03199J43154J64418
$$ plain form
35972 274030228 318923875 359631288 385291825 386995216 364024215 324663888 280298557
35965 280298557 238750912 202789220 172776822 148536173 129106979 113014658 99706447
35958 99706447 89644635 82553531 76892875 71805384 68293360 67343091 67983206 68701436
35950 68701436 70059857 74119178 81366978 89798086 97177835 102715366 106212344 107246347
35942 107246347 106114686 104299057 102795624 100711360 96450832 89602719 80818722 70753464
35934 70753464 60364039 51495455 45517461 41534056 37402276 32561306 28463645 26065905
35926 26065905 24432475 22394484 20226641 18799936 18122137 17691765 17484697 17578378 17425767
35917 17425767 16539390 15458168 15045145 15158728 14987771 14431238 14128039 14271193 14435611
35908A4435611J27062M94682P08607J27034o24090m58215N13885J299743J567697
35899A8192016J677089J558172R36650N04102J367187L143475M028077L258937
35891C4665705K300907K868482M737718O368511P040342P484579Q656541J0529782
35883H4652567J2102337J2386468J1506324J0745177J1157360J2337691J3146666
35876A68034590J3282460J3044179J1737824P950716J917485l910161p577060
35869B04480033r640073j1458654j2829968j2834783j1975705j1587868j1619409
35862A22533573j0853787r214469q069446q026368q016345p048048n572367m537786
35854F1194957m125251l959422l749540l303533k618480k191272k487157k998668
$$ plain form
35908 14435611 14562673 15057355 15765962 15892996 15268906 14810691 15324576 16624319 18192016
35899 18192016 19869105 21427277 22363927 22868029 24235216 27378691 31406768 34665705
35891 34665705 36966612 39835094 44572812 50941323 57981665 65466244 74122785 84652567
35883 84652567 96754904 109141372 120647696 131392873 142550233 154887924 168034590
35876 168034590 181317050 194361229 206099053 214049769 215967254 212057093 204480033
35869 204480033 194839960 183381306 170551338 157716555 145740850 134152982 122533573
35862 122533573 111679786 102465317 94395871 86369503 78353158 71305110 65732743 61194957
35854 61194957 57069706 53110284 49360744 46057211 43438731 41247459 38760302 35761634
35846C5761634k740777j791836j295582j719847k228211k112106j711522j468755
35838B0692998j191996q04045p33821r52840o97935J60614N47172k13364j205764
35829A5601019j233403m63116J06036L7470m70556j099951j267128l90818R34794
35820A1754347J133364p7793q62293Q5252J389634J121091j02368j88700J019104
35811A5271638J695961J167811Q36647J714225L040807L941601M744081N827513
35803C8240284O460713N648809L341633L45686k192932l065258j846898J54812
35795D7086849P74836p56343l176131m944903n688323n711138n164397m160121
35787A8260329k951384j715478p57358p39645j733677k356990j302525M08242
$$ plain form
35846 35761634 33020857 31229021 29933439 28213592 25985381 23873275 22161753 20692998
35838 20692998 19501002 18696957 17963136 17010296 16312361 16472975 17020147 16806783 15601019
35829 15601019 14367616 13904500 14010536 14048006 13577450 12477499 11210371 10819553 11754347
35820 11754347 12887711 12809918 11947625 12032877 13422511 14543602 14441234 14252534 15271638
35811 15271638 16967599 18135410 18972057 20686282 23727089 27668690 32412771 38240284
35803 38240284 44700997 50349806 53691439 54037125 51844193 48778935 46932037 47086849
35795 47086849 47861685 47105342 43929211 38984308 33295985 27584847 22420450 18260329
35787 18260329 15308945 13593467 12836109 12096464 10362787 8005797 6703272 7111514
35779G111514M94143j098408j862829n44805R07891M77722q57659j015378j58929
35770C453262M9201m99561m38017L78780N73310k44359p42215j49545N06707K53671
35760C141234k17004J16213P27623L15350j044904j798115j024822L43643Q53494
35751A412712L97194N6778L74536O71006K94200l09464m18309k44495l43294l07991
35741A582873N99712J652019J136297r18807k145605r72994J046743J451763K91533
35732C723534m46032j24364m6227p47214q56064N11476J903193J422919n07557
35723D833664j712477j172843k5149L68807J13460N2065K84844K77397L553J9167
35713C042488L95331M53821j16676o15736l46128K90602M03713p7138m75007m88429
$$ plain form
35779 7111514 7605657 6507249 4644420 4099615 5007506 5485228 4627569 3612191 3453262
35770 3453262 3502463 3002902 2564885 2943665 3516975 3272616 2530401 2380856 2887563 3141234
35760 3141234 2924230 3040443 3768066 4083416 3038512 1240397 215575 559218 1412712
35751 1412712 1809906 1866684 2241220 2912226 3206426 2896962 2478653 2234158 1890864 1582873
35741 1582873 2182585 3834604 4970901 4052094 1906489 933495 1980238 3432001 3723534
35732 3723534 3277502 3153138 3106911 2359697 1503633 2015109 3918302 5341221 4833664
35723 4833664 3121187 1948344 1923195 2292002 2405462 2457527 2742371 3019768 3023321 3042488
35713 3042488 3437819 3891640 3774964 3159228 2813100 3103702 3507415 3430277 2955270 2466841
35703B466841l98071k76722J06968N61910N45935J23434L81L77051O07872K99711
35693D415310q9186j13919K0705J18860M54316J027596J142752L81228o31753
35684F725909j055429q69474n36701k27202N8273J78830K19139N69309J135115
35675F197769J173766M83058l3221L35756J062401J414429J674181K379604L186610
35666A7874353L615605M192337N597818P351716Q730588J0335342J2928661J4943485
35658H5569905J3265151P227517L80973k761954j166162J998778K468536j559561
35650A05423183q205373j3617478j5157930j3247687j0200671p711605n952539
35643C1329900m575545l518642k761472k147555j705616j613009j739252j693821
$$ plain form
35703 2466841 2068770 1792048 1899016 2460926 3006861 3130295 3130676 3507727 4115599 4415310
35693 4415310 4326124 4212205 4232910 4351770 4806086 5833682 6976434 7357662 6725909
35684 6725909 5670480 4801006 4264305 4037103 4095376 4274206 4493345 5062654 6197769
35675 6197769 7371535 7854593 7821372 8157128 9219529 10633958 12308139 14687743 17874353
35666 17874353 21489958 25682295 31280113 38631829 47362417 57697759 70626420 85569905
35658 85569905 98835056 106062573 106443546 103681592 102515430 104514208 106982744 105423183
35650 105423183 97217810 83600332 68442402 55194715 44994044 37282439 31329900
35643 31329900 26754355 23235713 20474241 18326686 16621070 15008061 13268809 11574988
35635A1574988j351878r44150p13053p88627j111309j160378l25282R55243J201256
35626G336810j39219j533919j314615n3238M35204j10052l31377K36665M78727
35617E004986k27343r67417q68959k94889J22060L71000M23565p6552q64861r40651
35607A680939p0413O32550L07130m29805n25792R4002P71720J008576O27144j98913
35597C897138p61761n26940j55498o58445j442181q35077J016536J737488K06171
35588B477431j482809j070789N36419R53121K3521m43786J01862L96510j05819
35579A385661l56047K74315R14163P23190R6803k71277m04793n38891n16620k41607
35569A064897k7981p2750j60104j50427j72729j65571J15644M73551L62777j79812
$$ plain form
35635 11574988 10223110 9278960 8565907 7777280 6665971 5505593 5180311 6135554 7336810
35626 7336810 7197591 5663672 4349057 4295819 4731023 4620971 4289594 4526259 5004986
35617 5004986 4777643 3810226 2941267 2646378 2768438 3139438 3563003 3486451 2621590 1680939
35607 1680939 1610526 2243076 2550206 2120401 1594609 1688611 2460331 3468907 4096051 3897138
35597 3897138 3135377 2608437 2452939 1794494 352313 -482764 533772 2271260 2477431
35588 2477431 994622 -76167 460252 1413373 1436894 993108 1094970 1491480 1385661
35579 1385661 1029614 1303929 2218092 2941282 3038085 2766808 2362015 1823124 1306504 1064897
35569 1064897 1036916 964166 804062 653635 480906 315335 430979 904530 1267307 1087495
35559A087495m28551p7653K74442J42021n3133K25458N98605K65153p16613j331904
35549a4680q43788L43555J198008J134996M17049k93711n26250k33316K61375
35540A443238M84370K49829l7135J28049M26392q8466j408539j964961o30436
35531a397659J246406J318440l78454j325373k34181J059952N40828q75665r34241
35522i79947M28746J243336O77561m2069P7760M61161L48330l1094k76372n49535
35512A357877q36058n44314M37168J155876Q05271j52627p26935o60240l24702
35503E11316O5467M13479L54175k86294q58213n10244N23107R69336J48653r83992
35493C46790r85310J25638Q21040J76336p75056n48695N28341Q09797o2460n97709
$$ plain form
35559 1087495 658944 581291 855733 997754 944621 1170079 1768684 2033837 1317224 -14680
35549 -14680 -858468 -514913 683095 1818091 2235140 1941429 1415179 1181863 1443238
35540 1443238 1927608 2177437 2140302 2268351 2694743 2606277 1197738 -767223 -1397659
35531 -1397659 -151253 1167187 788733 -536640 -770821 289131 829959 -45706 -979947
35522 -979947 -551201 692135 1369696 1327627 1405387 1866548 2214878 2183784 1907412 1357877
35512 1357877 521819 -22495 414673 1570549 2375820 2223193 1496258 836018 511316
35503 511316 576783 990262 1344437 1058143 199930 -310314 212793 1182129 1330782 346790
35493 346790 -638520 -512882 308158 484494 -290562 -839257 -310916 498881 436421 -161288
35483a61288O3448P27984K29289n51304k78896M05712K5517r15665n53052J059695
35473E1440J672129L10310j158827q96726L19598O68201R186m27793j38603K86431
35463F95346L60772J25209k81279o15045m48318K19577O91602M86156k057k67380
35453I64583m29344o12510l98773L28909P80213L94139j42280J0342M28658K17080
35443A541017m02609n40316k28157k47508o22403n91985j1008M40674M65058M29550
35433B32313M04122L6518n10498n99286k49197j47822l57083j54404N43626P90966
35423a0745J42192n36194m37733j2624k4685k71455j38579K29011K59770K4402
35413g76640N4765L31580K90589k13874o35203m94403M7603M45366L36355j08571
$$ plain form
35483 -161288 -97840 630144 859433 308129 29233 434945 460462 -455203 -1008255 51440
35473 51440 1723569 2033879 875052 -21674 297924 966125 975311 547518 408915 695346
35463 695346 1056118 1181327 900048 285003 -163315 56262 747864 1234020 1231963 964583
35453 964583 535239 -77271 -476044 -147135 633078 1027217 884937 895279 1323937 1541017
35443 1541017 1138408 598092 369935 122427 -499976 -1091961 -1102969 -662295 -197237 232313
35433 232313 636435 672953 162455 -436831 -686028 -833850 -1190933 -1345337 -801711 -10745
35423 -10745 131447 -404747 -842480 -855104 -879789 -1151244 -1289823 -1060812 -801042 -776640
35413 -776640 -721875 -390295 -99706 -313580 -948783 -1443186 -1395583 -950217 -613862 -722433
35403g22433k75384K29010Q98578P62113k48974r46340m16131O37233Q51844J49647
35393I19163k52729K71791Q77953N83896l33699q68442o82716l06450j86017j91850
35383a69100q1696Q4855J65290J86604J60695n9796m73842p02198l95654K42537
35373a042305O74355P00772N62677M07787J01811l49610o53015o76874o02297
35364h76699m27187J29384Q83677R70648j1531j123080j118091o6270Q38229Q81120
35354H0200M24752L3556j19179K2401L97343M97558j05967q54284p71781m3542
35344d38943J06066o00322q84416Q9792J299144J360065M72145j97654l02873
35335I03004l37268m22598k53878O6516J94574K90024O26407P53297J08044p54079
$$ plain form
35403 -722433 -997817 -768807 129771 891884 642910 -303430 -719561 -82328 769516 919163
35393 919163 666434 938225 1816178 2400074 2066375 1197933 515217 208767 22750 -169100
35383 -169100 -250796 -165941 -651 185953 346648 286852 -186990 -889188 -1284842 -1042305
35373 -1042305 -367950 332822 895499 1303286 1405097 1055487 402472 -274402 -876699
35364 -876699 -1303886 -1174502 -290825 679823 668292 -454788 -1572879 -1639149 -800920 80200
35354 80200 504952 538508 419329 441730 839073 1336631 1230664 376380 -395401 -438943
35344 -438943 -332877 -933199 -1817615 -1727823 -428679 931386 1403531 1205877 903004
35335 903004 565736 143138 -110740 -44224 150350 440374 1066781 1820078 1928122 1174043
35325A174043p00812K21559P10988Q3622p80269p30351J65333Q29011M44792o75153
35315G42763j284447m62011J054268J392712M4j275758o54999Q57174Q91627o62614
35305E98759j563327p79411J41785o2626l71700L61843J150496N49588p34984
35296g09577q74689K17205R33561N28734r7157j27876J52109K46773J38721j50679
35286B57125o96101j129721q22781J48167R13298Q90475L80988l5359j69875j79133
35276d42917k71697n13437o50456k84085M88025R48841O93452K63954L29325O91431
35266A252436P36150L92964p1719o89470j363823j361833k89159Q79906R25376
35257D10828J62620j88078o7160m43395j212583j023526L97166J426213Q38871
$$ plain form
35325 1174043 473231 694790 1405778 1489400 709131 -21220 144113 973124 1417916 742763
35315 742763 -541684 -1003695 50573 1443285 1443329 167571 -487428 369746 1261373 598759
35305 598759 -964568 -1743979 -1602194 -1664820 -2036520 -1674677 -524181 25407 -709577
35296 -709577 -1584266 -1367061 -433500 95234 -1923 -129799 22310 269083 407804 257125
35286 257125 -438976 -1568697 -2391478 -2243311 -1330013 -439538 -58550 -93909 -263784 -442917
35276 -442917 -714614 -1228051 -1878507 -2162592 -1674567 -725726 -32274 231680 561005 1252436
35266 1252436 1988586 2381550 2309831 1620361 256538 -1105295 -1394454 -514548 410828
35257 410828 573448 385370 318210 -125185 -1337768 -2361294 -1964128 -537915 300956
35248C00956m40285q30255k57259K08604J09766l8156K41068P75479R96172M84913
35238A551003m68185q87470k68678M64069J11942q36832p59166M82906J133152
35229E22741K83759p04198m75192K66066K72687j38902q1585M1533n30382j080245
35219a623718m51781P34052Q91114Q6699j81058L53652L95853m03626p00781K02480
35209f97114J126131R58867K61129m4046k09420p62237j154690n63985O28040
35200d57325J249309Q31998j15342r21841j144975n87596L69664Q15732L32074
35191C71698l65347l92261O9565J61754l22686p20276n16893J8352K72922j4650
35181a437822n32042o70596j21325O92433J013789O85285L06251L05432L81093
$$ plain form
35248 300956 -139329 -969584 -1226843 -1018239 -908473 -946629 -705561 69918 1066090 1551003
35238 1551003 1082818 195348 -73330 390739 502681 -334151 -1093317 -610411 522741
35229 522741 806500 102302 -372890 -106824 165863 26961 -54624 -13091 -543473 -1623718
35219 -1623718 -2075499 -1341447 -450333 -363634 -544692 -191040 204813 -198813 -899594 -697114
35209 -697114 429017 1387884 1649013 1604967 1395547 633310 -521380 -1085365 -457325
35200 -457325 791984 1623982 1508640 586799 -558176 -1145772 -776108 39624 371698
35191 371698 6351 -385910 -316345 -154591 -477277 -1197553 -1714446 -1696094 -1423172 -1437822
35181 -1437822 -1969864 -2640460 -2761785 -2069352 -1055563 -370278 -64027 241405 622498
35172F22498J90694K4908K30939M18055k4916q34898j064189m04468L40039L39267
35162a62071j82541l30661K10178P31467M44726l81170o42101J41859J067992
35153H97678J006074J34888m14026k60647j48678m94266o55679j60300L47101
35144B52145J93951j14709J89006O44081K21116q31844j123310j80251Q11264
35135F1449O83413k49949q80361p02861n870P55175J220311J128104N35697j34384
35125B410724n09614n48046l62172j17343j20545n12013q19338m40648L20143
35116f98852M77395j23503m38626J08467N67141m6320j024976r52094J09739P74549
35106a247080M92943J52068L86496O45173L61331j45914m98524q88174j218693
$$ plain form
35172 622498 813192 838100 1069039 1487094 1462178 627280 -436909 -841377 -501338 -162071
35162 -162071 -344612 -675273 -465095 266372 711098 329928 -312173 -170314 897678
35153 897678 1903752 2038640 1624614 1363967 1215289 721023 65344 -94956 252145
35144 252145 446096 331387 520393 1164474 1385590 553746 -569564 -749815 61449
35135 61449 744862 494913 -385448 -1088309 -1094179 -339004 881307 2009411 2545108 2410724
35125 2410724 1901110 1353064 990892 873549 753004 240991 -578347 -1018995 -698852
35116 -698852 -221457 -344960 -783586 -675119 -107978 -154298 -1179274 -2131368 -2021629 -1247080
35106 -1247080 -754137 -602069 -215573 429600 790931 645017 146493 -741681 -1960374
35097a960374p18088P07330J721574J248262R3481l14395o9061k52861q14133
35088c58265o49110L54210J031959Q49406N05373L50136j70728r90871j016613
35079i4503n1464M82412j86378p35095N9420J123227Q18391k91634m41428L48270
35069A031218M66291m62607j121385q47175l55659L0315P80880J450086P70200
35060A742164q66532j243080K87077J381459J94339j657007j562721J77660J170290
35051c76351O12661j87681m37270o73566j022161p51900J47178P12965O72111
35042a304014P47986R89301M55505q83791j534413n93166Q29799J188735M17786
35033C13728n46675j105920r97894M396J366622J667537L51292j106966r88633
$$ plain form
35097 -1960374 -2678462 -1971132 -249558 998704 1092185 777790 708729 455868 -358265
35088 -358265 -1007375 -653165 378794 1228200 1733573 2083709 1912981 922110 -94503
35079 -94503 -145967 336445 150067 -585028 -525608 597619 1416010 1124376 682948 1031218
35069 1031218 1497509 1034902 -86483 -933658 -1289317 -1259002 -478122 971964 1742164
35060 1742164 875632 -367448 -80371 1301088 1495427 -161580 -1724301 -1546641 -376351
35051 -376351 236310 48629 -388641 -1062207 -2084368 -2836268 -2689090 -1976125 -1304014
35042 -1304014 -556028 433273 888778 4987 -1529426 -2122592 -1292793 -104058 313728
35033 313728 -232947 -1338867 -2336761 -2332365 -965743 701794 1053086 -53880 -1042513
35024a042513K87232Q74694K20992l73596M5440P09088M49544n81393j224287
35015f34799q44217N1020N59768L72391k2828j9853L11593L43596j29230m69912
35005d82471j40080L66617J94365n07027p07538l7124O30032M65559j36572k43585
34995e97824K04577L81417j15532o06997k65516O71653J075770L03564r77221
34986G3891j563629j073097j62238M64577P25764P67626N33650J14276J310M06124
34976B88254O84187J34972q26754j072184l15586N10579N94194K07699J6140J01619
34966C23120J53815R8876q314l16102q28863j035280m92867L96098P88913N03003
34956d17601J51847K01280M47169N00487K68139j78797p16150r63838m84808N00842
$$ plain form
35024 -1042513 -755281 119413 340405 -33191 12249 721337 1170881 589488 -634799
35015 -634799 -1479016 -1427996 -868228 -495837 -518665 -538518 -226925 116671 -12559 -482471
35005 -482471 -622551 -255934 -61569 -568596 -1276134 -1313258 -683226 -217667 -354239 -597824
34995 -597824 -393247 -11830 -127362 -734359 -999875 -328222 747548 1051112 73891
34986 73891 -1489738 -2562835 -2725073 -2260496 -1534732 -767106 -233456 -119180 -117870 288254
34976 288254 972441 1107413 280659 -791525 -1107111 -596532 -2338 205361 221501 323120
34966 323120 476935 575811 567497 251395 -577468 -1612748 -2105615 -1709517 -920604 -417601
34956 -417601 -265754 -64474 382695 883182 1151321 972524 256374 -707464 -1192272 -691430
34946f91430J042972N26885m92894r68086o47108k05477j94593l89039k77998
34937b296768K16731P37350R56529Q27264M91746J26547j33205k06361o3230K10908
34927H67511L41906M3474n79589r79336p63082k10021J08719R6469J13676K69619
34917f90654K67104M9446L1158L88580O11947K02868n24565q14431m25010K22004
34907f81553O70080P60116M65029j33664p17434r59745q79503o74155l16907K96727
34897b171009Q95325R75985M30120l09104p16544n01206L04004J148662J130419
34888A186652J0197j099095q58400M84838J282264O44259n01707q66963m10461
34879a28416Q5705K59385K25690l6384n35005q36894n09302K06223O96022O95595
$$ plain form
34946 -691430 351542 878427 385533 -582553 -1229661 -1435138 -1629731 -2018770 -2296768
34937 -2296768 -2080037 -1342687 -386158 441106 932852 1059399 926194 719833 656603 867511
34927 867511 1209417 1252891 673302 -306034 -1069116 -1279137 -1170418 -1073949 -960273 -690654
34917 -690654 -423550 -374104 -342946 45634 657581 860449 335884 -478547 -903557 -681553
34907 -681553 -11473 748643 1213672 1080008 362574 -597171 -1476674 -2150829 -2467736 -2171009
34897 -2171009 -1275684 -299699 130421 -178683 -895227 -1396433 -1092429 56233 1186652
34888 1186652 1196849 97754 -760646 -275808 1006456 1650715 1149008 282045 -128416
34879 -128416 -42711 216674 442364 405980 -129025 -965919 -1475221 -1268998 -572976 122619
34869A22619K75515m60440j119732r77636P1656R60189O97469j79063l63088K78413
34859f94098O40263K16135j91846J09738O32792N82079J8145m37595n07561l32532
34849C5520m0097K89006M73517L87095R5907k91234o68086q04196n43538j56523
34839a222629n8607j53351L2250N10730P32994M56685Q4797p9169k68941o27809
34829e93050p61304l64157J89554L53665J57302L5388J93165M86305P00136O68907
34819A065911L14632k27129o60915p74677n21489m1124J86167l40036j171458
34810b170118r12666Q56968K309627J491222o77688j435018k20197N97600l56380
34801e16650j302516m97036P31825L24843r14640p33322O99155J199708L35796
$$ plain form
34869 122619 398134 -62306 -1182038 -2159674 -2088018 -1127829 -430360 -609423 -972511 -694098
34859 -694098 -53835 162300 -29546 80192 712984 1295063 1313208 875613 368052 35520
34849 35520 -4577 284429 757946 1145041 1240948 949714 281628 -522568 -1066106 -1222629
34839 -1222629 -1281236 -1434587 -1402337 -891607 -158613 298072 382869 303700 34759 -593050
34829 -593050 -1354354 -1718511 -1528957 -1175292 -1017990 -982602 -789437 -303132 397004 1065911
34819 1065911 1380543 1153414 492499 -282178 -803667 -844791 -658624 -998660 -2170118
34810 -2170118 -3082784 -2225816 83811 1575033 897345 -537673 -757870 -160270 -516650
34801 -516650 -1819166 -2316202 -1584377 -1259534 -2174174 -2907496 -2208341 -1008633 -672837
34792f72837j29299M13226N00175l74519n42892Q36360J912580R23659r74460
34783A891993j523225o97506k44507o73376p25245K80774J306631J189641J95133
34774A000313n72098o00614k81873j21005j10778M7958L29958L08985j77244o30642
34764h07040n32940p8659K39867M40911P33438P29401k2597q89852p42154K55314
34754f74311P27911K32164p8240N31900J100341N90494m18440p55695m11052j29151
34744G15921n2449P7727M0617l81760o18660j59317L46564L4938o09526m35218
34734a041163M81823R83472O84698L16506K40170k2190n99784q72998n80831k44075
34724f54372j49381Q6393N88333Q24430N46874K59782L20484L73687R4509k70465
$$ plain form
34792 -672837 -802136 -388910 111265 -263254 -806146 30214 1942794 2866453 1891993
34783 1891993 368768 -328738 -573245 -1246621 -1971866 -1691092 -384461 805180 1000313
34774 1000313 428215 -172399 -454272 -575277 -686055 -638097 -308139 846 -176398 -807040
34764 -807040 -1339980 -1418639 -1178772 -737861 -4423 724978 702381 -187471 -929625 -674311
34754 -674311 53600 285764 207524 739424 1839765 2430259 2011819 1256124 845072 715921
34744 715921 663472 741199 781816 400056 -218604 -377921 -31357 3581 -605945 -1041163
34734 -1041163 -559340 424132 1108830 1425336 1665506 1643316 1043532 170534 -410297 -654372
34724 -654372 -803753 -717360 -129027 695403 1242277 1502059 1822543 2196230 2290739 2020274
34714B020274m96426p32463q64677l87705N65942R40846K04006o99510o67269
34705a16982n6834o340o02235q25352j98754N37272N68319M7014k93603m6972
34695i94467N86174J051478Q35485m7319q78135r19807l48116l7394k82049l34253
34685a368403L66224J077935O80618n22664r41006J15289J339570J201847O0554
34676B009964n36072k13048q7616o89176j025201l34650N22341M65303l3005R5165
34666A74005N11727N0916j008894j043340L09892J349101Q19141k52648k91669
34657F18231M25785M68056l83291r27931m90321K29442L63492p2570n55687p03044
34647a027838l48356L55609P56187K89957n80850p15986J80902J092254J069000
$$ plain form
34714 2020274 1523848 791385 -73292 -460997 104945 1045791 1249797 550287 -116982
34705 -116982 -173816 -180156 -782391 -1607743 -1806497 -1269225 -700906 -653892 -947495 -994467
34695 -994467 -408293 643185 1478670 1431351 553216 -366591 -714707 -752101 -1034150 -1368403
34685 -1368403 -1002179 75756 756374 233710 -707296 -592007 747563 1949410 2009964
34676 2009964 1473892 1260844 1173228 484052 -541149 -875799 -353458 111845 78840 174005
34666 174005 685732 736648 -272246 -1315586 -1005694 343407 1162548 909900 618231
34657 618231 1044016 1512072 1128781 200850 -289471 -60029 303463 230893 -324794 -1027838
34647 -1027838 -1376194 -1020585 -264398 25559 -555291 -1271277 -1090375 1879 1070879
34638A070879L75625j93782m29341m93827k34656M29003Q42357K98261p77363
34629H87156j240025p84952j74048J27275M93159J035969J044373J61200p37205
34620H12902o51477J42852N96100L17421k46614o41706o58733j77834M50129L25603
34610B68643p80795j597253q56078P37752J350890O31722p640K30693M79999l3072
34600D24861o91823o80339k23074J41538M36021O64060M29402j54362k87668R4752
34590A53368K1669o21133m80355Q43542J517875L05850j011357l09359J184015
34581A604115P17762j303070j759218R3572J392498L74443r04915k35262J101078
34572A081003P07249q79319j254822j47155M55427j46128l61574O69700J379493
$$ plain form
34638 1070879 1446504 1252722 823381 329554 94898 523901 1366258 1664519 887156
34629 887156 -352869 -1137821 -1311869 -1184594 -691435 344534 1388907 1550107 812902
34620 812902 161425 304277 900377 1217798 971184 329478 -329255 -507089 -56960 268643
34610 268643 -512152 -2109405 -2965483 -2227731 -876841 -245119 -252759 -22066 457933 424861
34600 424861 -266962 -947301 -1170375 -1028837 -592816 71244 500646 346284 58616 153368
34590 153368 175037 -446096 -926451 -82909 1434966 1740816 729459 420100 1604115
34581 1604115 2321877 1018807 -740411 -646839 745659 1120102 215187 -20075 1081003
34572 1081003 1788252 908933 -345889 -493044 -37617 -183745 -545319 124381 1503874
34563A503874K98945j348917j257800N26681J547732L94308j338208j350488K02822
34554h21051J195758O73447j23660n8503K58426m2980m31745j18846K89640j19491
34544G00995p10556l55701L24305j06287j092820o56900J092846J617990j06493
34535G07379j790576j298435K80192P80024L27541M13302R32216N36262o94326
34526A93579j182107l75219N17195M85644o9801l44415j58888K64600O40239O06130
34516E76957J25217j73714J82384N63533K4319j126880j554882o98821N78405
34507a503482J216593J007531L42608k92109m26911Q5318O88891N90953k62931
34498A446461j084942j126645l43026O62767J031263L13132q35547j054816Q9596
$$ plain form
34563 1503874 1802819 453902 -803898 -277217 1270515 1664823 326615 -1023873 -821051
34554 -821051 374707 1048154 924494 865991 1124417 1081437 649692 530846 820486 700995
34544 700995 -9561 -365262 -40957 -147244 -1240064 -1896964 -804118 813872 707379
34535 707379 -1083197 -2381632 -2101440 -1321416 -993875 -580573 351643 887905 193579
34526 193579 -988528 -1363747 -846552 -360908 -430709 -775124 -934012 -669412 -29173 576957
34516 576957 702174 528460 710844 1274377 1298696 171816 -1383066 -2081887 -1503482
34507 -1503482 -286889 720642 1063250 771141 344230 429548 1118439 1709392 1446461
34498 1446461 361519 -765126 -1108152 -445385 585878 899010 63463 -991353 -901757
34489i01757J361345J369529K90242o84748j019740r73751o08827J25072O28868
34480d13767K53785m62300m07591K95774M12194l59305q31206k26685O24717O40139
34470d74245L0950k55024P2344N21566O23459K94240k77447p05683o26844q3480
34460h80164N26932R08836R68883O01518j21748o77012o04994k06441j01760k68930
34450A45120k57383j42943l29581n33709o8630Q28027J116723N74005R1422Q6914
34440A509965r3411p18867r52869l32337K53312J542m64092k76076J10757j94618
34430a156694p96074n83126L75199Q97769N30626M3810K4000J41368N8402K2443
34420d42277J59057O6629l78225n45752J4119P27501P67534K97389J91669O50192
$$ plain form
34489 -901757 459588 1829117 2119359 1434611 414871 -558880 -1167707 -1042635 -413767
34480 -413767 -159982 -622282 -1029873 -734099 -321905 -681210 -1512416 -1739101 -1114384 -474245
34470 -474245 -443295 -698319 -625975 -104409 519050 813290 535843 -169840 -796684 -880164
34460 -880164 -353232 555604 1524487 2126005 2004257 1327245 722251 515810 414050 145120
34450 145120 -112263 -255206 -584787 -1118496 -1187126 -359099 757624 1331629 1423051 1509965
34440 1509965 1416554 697687 -255182 -587519 -334207 -332665 -796757 -1072833 -962076 -1156694
34430 -1156694 -1952768 -2535894 -2160695 -1262926 -732300 -688490 -664490 -523122 -464720 -442277
34420 -442277 -283220 -216591 -594816 -1140568 -1126449 -398948 368586 665975 857644 1507836
34410A507836Q68969K71201n93906q15419l49776P0208L4191j50603j42830m4829
34400F55042n3200j42186k67214m04334k81826K99567P56276K27624q64498q90338
34390i65087N90684J697900P79703r14167q98231P84797J589633L03584j313338
34381A655478j390957m97175j48733l29434k5698P41781J002308N10230j3812
34372A503988j78051l49654p30826q68974l31069O13467J193257Q86348j9262
34363A719224o50475n37008j98068k95775m97778l6529P64145P23280k70738q91665
34353a71387m10188K38586J58279o6434L31283P69684M06713j98311J6069P20166
34343A794460O92668j91825q72307p59041k41854K37679M77609J59921o49073
$$ plain form
34410 1507836 2376805 2648006 2054100 1238681 888905 959113 993304 842701 699871 655042
34400 655042 601842 459656 192442 -211892 -493718 -194151 562125 789749 -74749 -965087
34390 -965087 -374403 1323497 2103200 1189033 290802 1075599 2665232 2968816 1655478
34381 1655478 264521 -232654 -381387 -710821 -736519 5262 1007570 1517800 1503988
34372 1503988 1325937 976283 245457 -623517 -954586 -341119 852138 1738486 1719224
34363 1719224 1068749 531741 333673 37898 -459880 -496409 267736 991016 720278 -171387
34353 -171387 -581575 -342989 -184710 -251144 80139 849823 1256536 1058225 1074294 1794460
34343 1794460 2487128 2295303 1422996 663955 422101 659780 1137389 1297310 648237
34334F48237r83023j76961Q16179O87832p1230M9149R14773Q65391l61597r68974
34324A419776l4262R17998M17873o16833n53931K90129M19353k49003m04060L24528
34314A931568P52476Q8998q35679q36823j3293N02211K9759r05744j227836m85281
34304i99644O69756J183927P33754j5897k95969j01933k8803m37026r68420q76706
34294a136961J15302J245241J306173J11517j026615q58173J35577M84797j15476
34285B61382n40858j51751L44618L36028K85577N47908M53566l77881q83484n5615
34275B19490J173045J048871m09138j448521j096047j67131L58663N57272P36860
34266I73364O17928n902o47809p77973m73542k1150M58709O44334O7678r63759
$$ plain form
34334 648237 -334786 -511747 304432 992264 921034 970183 1884956 2750347 2388750 1419776
34324 1419776 1385514 2303512 2721385 2104552 1550621 1840750 2260103 2011100 1607040 1931568
34314 1931568 2684044 2773042 1937363 1100540 1087247 1589458 1619217 713473 -514363 -999644
34304 -999644 -329888 854039 1587793 1571896 1275927 1173994 1145191 708165 -260255 -1136961
34294 -1136961 -1021659 223582 1529755 1641272 614657 -243516 -107939 376858 261382
34285 261382 -279476 -431227 -86609 249419 534996 1082904 1536470 1158589 275105 219490
34275 219490 1392535 2441406 2032268 583747 -512300 -679431 -320768 236504 973364
34266 973364 1591292 1585390 937581 159608 -313934 -335084 123625 767959 835637 -128122
34256a28122j267444k59354J089647J438470O88349k47508p60107q64033o17826
34247i27928p3489L92165M20526K05045R3319p3439n45870q98581n29517K43755
34237a694014M99511Q3073k51949r8906J79620M03149Q61920J326938R08221m66591
34227A750972j451286j021340J6449K55077k55175l69504J61702M06213p4958
34218e81850n28521k94565K36755M23935L20991K90075L01106J85197J09489K43666
34208G06278L23818Q9968j53857P59K73178J8695o99800j037958n47216J54855
34198h71280K66356o7360m1319N61722J015131O74370j33139n84446m12182m5653
$$ plain form
34256 -128122 -1395566 -1654920 -565273 873197 1561546 1314038 553931 -310102 -927928
34247 -927928 -1001417 -609252 -188726 16319 109638 36199 -509671 -1408252 -1937769 -1694014
34237 -1694014 -1194503 -1111430 -1363379 -1462285 -1282665 -879516 -17596 1309342 2217563 1750972
34227 1750972 299686 -721654 -705205 -450128 -705303 -1074807 -913105 -506892 -581850
34218 -581850 -1110371 -1404936 -1168181 -744246 -423255 -133180 167926 353123 462612 706278
34208 706278 1030096 1120064 966207 966966 1240144 1258839 559039 -478919 -1026135 -871280
34198 -871280 -604924 -672284 -713603 -151881 863250 1537620 1404481 820035 407853 362200
$$ [...]
##END NTUPLES=NMR SPECTRUM
##END=
