##TITLE=31Pdec_SR116_1
 , 24 sc
 30.3.2022
##JCAMPDX= 6.0         $$ Bruker NMR JCAMP-DX V2.0
##DATA TYPE= NMR SPECTRUM
##DATA CLASS= NTUPLES
##ORIGIN= UXNMR, Bruker Analytische Messtechnik GmbH
##OWNER= root
$$ XWIN-NMR		Version 3.5
$$ Wed Mar 30 11:55:09 2022 Russian Standard Time (UT+4h)  she@DPX200
##.OBSERVE FREQUENCY= 81.013821
##.OBSERVE NUCLEUS= ^31P
##.ACQUISITION MODE= SIMULTANEOUS
##.ACQUISITION SCHEME= undefined
##.AVERAGES= 24
##.DIGITISER RES= 16
##SPECTROMETER/DATA SYSTEM= spect
##.PULSE SEQUENCE= zgpg30
##.SOLVENT NAME= D2O
##.SHIFT REFERENCE= (INTERNAL, D2O, 0, 248.564)
##AUDIT TRAIL= $$ (NUMBER, WHEN, WHO, WHERE, WHAT)
$$ ##TITLE= Audit trail, XWIN-NMR		Version 3.5
$$ ##JCAMPDX= 5.01
$$ ##ORIGIN= Bruker BioSpin GmbH
$$ ##OWNER= she
$$ F:/spectra/data/she/nmr/P31/1/pdata/1/auditp.txt
$$ ##AUDIT TRAIL=  $$ (NUMBER, WHEN, WHO, WHERE, WHAT)
(   1,<2022-03-30 11:52:56.96 +0400>,<she>,<DPX200>,
      <created by zg, POWCHK disabled, PULCHK disabled
       configuration hash MD5:
       00 E9 B6 7A A2 85 ED C7 34 08 36 98 17 FE 4E 26
       data hash MD5: 32K
       46 B9 86 08 C8 BB 5A 04 4D 84 E0 A1 81 4F FF 08>)
(   2,<2022-03-30 11:53:25.42 +0400>,<she>,<DPX200>,
      <Start of raw data processing
       efp BC_mod = 2 LB = 1 FT_mod = 6 PKNL = 1 PHC0 = -9178.461 PHC1 = 42.2756 SI = 64K 
       data hash MD5: 64K
       13 FC B7 AA 1C 10 F7 80 55 6D 24 5E F6 AB 5D 0E>)
(   3,<2022-03-30 11:53:45.12 +0400>,<she>,<DPX200>,
      <pk PHC0 = -29.32347 PHC1 = 94.60001 
       data hash MD5: 64K
       79 63 45 CA 05 1A 84 96 39 DF FC A6 AA F8 7D F0>)
(   4,<2022-03-30 11:53:49.51 +0400>,<she>,<DPX200>,
      <abs ABSG = 5 
       data hash MD5: 64K
       E5 7B 72 A5 FA 94 95 3D 55 75 2A 3B AA 1E 9C B0>)
$$ ##END=
$$ 
$$ hash MD5
$$ 78 52 7A 63 5E 23 5D 1D 23 1E 0D 78 66 72 DA 33
##$RELAX= 
##$RELAX= 
##$RELAX= 
##$RELAX= 
##$RELAX= 
##$RELAX= 
##$RELAX= 
##$RELAX= 
$$ Bruker specific parameters
$$ --------------------------
##$DU= <F:/spectra>
##$EXPNO= 1
##$NAME= <P31>
##$PROCNO= 1
##$TYPE= <nmr>
##$USER= <she>
##$AMP= (0..31)
100 100 100 100 100 100 100 100 100 100 100 100 100 100 100 100 100 100 
100 100 100 100 100 100 100 100 100 100 100 100 100 100 
##$AQSEQ= 0
##$AQ_mod= 1
##$AUNM= <au_zg>
##$AUTOPOS= <>
##$BF1= 81.014009
##$BF2= 200.13
##$BF3= 200.13
##$BF4= 200.13
##$BF5= 200.13
##$BF6= 200.13
##$BF7= 200.13
##$BF8= 200.13
##$BYTORDA= 1
##$CFDGTYP= 0
##$CFRGTYP= 5
##$CHEMSTR= <none>
##$CNST= (0..31)
1 1 145 1 1 1 1 1 1 1 1 1 1 1 1 1 1 1 1 1 1 1 1 1 1 1 1 1 1 1 1 1 
##$CPDPRG= <waltz16>
##$CPDPRG1= <>
##$CPDPRG2= <waltz16>
##$CPDPRG3= <>
##$CPDPRG4= <mlev>
##$CPDPRG5= <mlev>
##$CPDPRG6= <mlev>
##$CPDPRG7= <mlev>
##$CPDPRG8= <mlev>
##$CPDPRGB= <>
##$CPDPRGT= <>
##$D= (0..31)
0 1 0 0 0 0 0 0 0 0 0 0.03 2e-05 3e-06 0 0 0 0 0 0 0 0 0 0 0 0 0 0 0 0 
0 0 
##$DATE= 1648626776
##$DBL= (0..7)
120 120 120 11 120 120 24 19 
##$DBP= (0..7)
150 150 150 150 150 150 150 150 
##$DBP07= 0
##$DBPNAM0= <>
##$DBPNAM1= <>
##$DBPNAM2= <>
$$ [...]
##$SUBNAM3= <"">
##$SUBNAM4= <"">
##$SUBNAM5= <"">
##$SUBNAM6= <"">
##$SUBNAM7= <"">
##$SUBNAM8= <"">
##$SUBNAM9= <"">
##$SW= 501.771253377433
##$SWIBOX= (0..15)
0 1 3 0 0 0 0 0 0 0 0 0 0 0 0 0 
##$SW_h= 40650.406504065
##$TD= 32768
##$TD0= 1
##$TE= 0
##$TE2= 300
##$TE3= 300
##$TEG= 300
##$TL= (0..7)
0 120 53 12 22 120 120 120 
##$TP= (0..7)
150 150 150 150 150 150 150 150 
##$TP07= 0
##$TPNAME0= <>
##$TPNAME1= <>
##$TPNAME2= <>
##$TPNAME3= <>
##$TPNAME4= <>
##$TPNAME5= <>
##$TPNAME6= <>
##$TPNAME7= <>
##$TPOAL= (0..7)
0.5 0.5 0.5 0.5 0.5 0.5 0.5 0.5 
##$TPOFFS= (0..7)
0 0 0 0 0 0 0 0 
##$TUNHIN= 0
##$TUNHOUT= 0
##$TUNXOUT= 0
##$USERA1= <user>
##$USERA2= <user>
##$USERA3= <user>
##$USERA4= <user>
##$USERA5= <user>
##$V9= 5
##$VALIST= <valist>
##$VCLIST= <CCCCCCCCCCCCCCC>
##$VD= 0
##$VDLIST= <DDDDDDDDDDDDDDD>
##$VPLIST= <PPPPPPPPPPPPPPP>
##$VTLIST= <TTTTTTTTTTTTTTT>
##$WBST= 1024
##$WBSW= 4
##$XGAIN= (0..3)
0 0 0 0 
##$XL= 0
##$YL= 0
##$YMAX_a= 24079
##$YMIN_a= -43577
##$ZGOPTNS= <>
##$ZL1= 120
##$ZL2= 120
##$ZL3= 120
##$ZL4= 120
##$ABSF1= 248.5645
##$ABSF2= -253.2056
##$ABSG= 5
##$ABSL= 3
##$ALPHA= 0
##$AQORDER= 0
##$ASSFAC= 0
##$ASSFACI= 0
##$ASSFACX= 0
##$ASSWID= 0
##$AUNMP= <proc_1d>
##$AZFE= 0.1
##$AZFW= 0.5
##$BCFW= 0
##$BC_mod= 2
##$BYTORDP= 0
##$COROFFS= 0
##$CY= -3
##$DATMOD= 1
##$DC= 0
##$DFILT= <>
##$DTYPP= 0
##$F1P= 0
##$F2P= 0
##$FCOR= 1
##$FTSIZE= 65536
##$FT_mod= 6
##$GAMMA= 0
##$GB= 0
##$INTBC= 1
##$INTSCL= 5.30512e-09
##$ISEN= 30
##$LB= 1
##$LEV0= 0
##$LPBIN= 0
##$MAXI= 10000
##$MC2= 0
##$MEAN= 0
##$ME_mod= 0
##$MI= 50
##$NCOEF= 0
##$NC_proc= -4
##$NLEV= 6
##$NOISF1= 182.463
##$NOISF2= 159.3651
##$NSP= 0
##$NTH_PI= 0
##$NZP= 0
##$OFFSET= 248.5645
##$PC= 4
##$PHC0= -9207.784
##$PHC1= 136.8756
##$PH_mod= 1
##$PKNL= yes
##$PPARMOD= 0
##$PSCAL= 0
##$PSIGN= 0
##$REVERSE= no
##$SF= 81.014009
##$SI= 65536
##$SIGF1= 159.3651
##$SIGF2= -187.1042
##$SINO= 113.3802
##$SIOLD= 16384
##$SREGLST= <1H.CDCl3>
##$SSB= 0
##$STSI= 65536
##$STSR= 0
##$SW_p= 40650.406504065
##$SYMM= 0
##$S_DEV= 0
##$TDeff= 32768
##$TDoff= 0
##$TI= <>
##$TILT= no
##$TM1= 0
##$TM2= 0
##$TOPLEV= 0
##$USERP1= <user>
##$USERP2= <user>
##$USERP3= <user>
##$USERP4= <user>
##$USERP5= <user>
##$WDW= 1
##$XDIM= 65536
##$YMAX_p= 488522899
##$YMIN_p= -13516338
$$ End of Bruker specific parameters
$$ ---------------------------------
##NTUPLES= NMR SPECTRUM
##VAR_NAME=  FREQUENCY,     SPECTRUM/REAL,   SPECTRUM/IMAG
##SYMBOL=    X,             R,               I
##VAR_TYPE=  INDEPENDENT,   DEPENDENT,       DEPENDENT
##VAR_FORM=  AFFN,          ASDF,            ASDF
##VAR_DIM=   65536,         65536,           65536
##UNITS=     HZ,            ARBITRARY UNITS, ARBITRARY UNITS
##FACTOR=    0.620285442955139, 1,           1
##FIRST=     20137.2065510759, 0,            0
##LAST=      -20513.1999529892, 0,           0
##MIN=       -20513.1999529892, -13516338,   0
##MAX=       20137.2065510759, 488522899,    0
$$ Real data points
##PAGE= N=1
##DATA TABLE= (X++(R..R)), XYDATA
$$ [...]
$$ plain form
39092 67052 -83879 -50205 84656 263757 415377 410393 228656 44997 -17298 -83965 -274851
39081 -274851 -393517 -166691 277035 509439 404265 292920 421835 597145 567930 466304
39071 466304 572808 832934 925941 730774 438990 236683 128766 74207 54206 -18360
39061 -18360 -228705 -446857 -398944 -34547 365265 541356 538605 522547 498812 388646 249816
39050 249816 217948 289254 340840 333867 332072 336153 269559 152937 143022 331372 593831 701625
39038 701625 548265 257456 96970 248466 596442 786914 583232 129792 -221122 -283680
39028 -283680 -128960 111527 345449 459622 373516 177346 41551 -19830 -107285 -168743
39018 -168743 -30929 259862 412159 309284 176615 185438 177823 -8160 -215437 -240132
$$ packed form
39092F7052j50931L3674J34861J79101J51620m984j81737j83659o2295o6667j90886
39081b74851j18666K26826M43726K32404j05174j11345J28915J75310k9215j01626
39071D66304J06504K60126R3007j95167k91784k02307j07917n4559k0001p2566
39061a8360k10345k18152M7913L64397L99812J76091k751j6058k3735j10166j38830
39050B49816l1868P1306N1586o973j795M081o6594j16622r915J88350K62459J07794
39038G01625j53360k90809j60486J51496L47976J90472k03682m53440l50914o2558
39028b83680J54720K40487K33922J14173q6106j96170j35795o1381q7455o1458
39018a68743J37814K90791J52297j02875j32669Q823p615j85983k07277k4695
$$ plain form
39008 -240132 -188429 -243458 -269295 -14520 404629 598905 444877 195614 70391 53249
38998 53249 102734 242063 393215 403225 292162 228443 230311 158577 37667 86298 347129
38987 347129 565701 549384 397383 259363 110221 -91777 -235797 -209403 -66877 76910
38977 76910 187833 263144 284067 287147 338667 393937 345612 238705 236238 330023 309667 90916
38965 90916 -139869 -191449 -81646 79105 215752 247124 134357 21800 102336 303365
38955 303365 357194 211363 77408 42170 -20547 -88954 54088 375674 510477 315939
38945 315939 114407 157781 255556 210860 214912 446365 641056 482650 142223 5332
38935 5332 86682 128284 84801 94473 117015 5184 -163685 -184752 -68793 10268 -2861
$$ packed form
39008b40132N1703n5029k5837K54775M19149J94276j54028k49263j25223j7142
38998E3249M9485J39329J51152J0010j11063o3719J868p1734j20910M8631K60831
38987C47129K18572j6317j52001j38020j49142k01998j44020K6394J42526J43787
38977G6910J10923P5311K0923L080N1520N5270m8325j06907k467R3785k0356k18751
38965I0916k30785n1580J09803J60751J36647L1372j12767j12557Q0536K01029
38955C03365N3829j45831j33955l5238o2717o8407J43042L21586J34803j94538
38945C15939k01532M3374R7775m4696M052K31453J94691j58406l40427j36891
38935E332Q1350M1602m3483R672K2542j11831j68869k1067J15959P9061j3129
$$ plain form
38924 -2861 -77248 -234233 -378187 -219143 302821 754469 745532 484927 386980 390170 184230
38913 184230 -105884 -68845 267782 463355 381475 303236 327346 248407 86401 144447 415560
38902 415560 493893 247397 49940 142184 272840 222684 198352 393797 580363 483901
38892 483901 246652 184711 337722 531114 651117 629980 404554 101109 2678 133251
38882 133251 164625 -50818 -192586 -3208 231576 121649 -171174 -168010 181296 441846
38872 441846 349227 110189 -574 10969 31806 84890 223720 355267 347705 242568 215317
38861 215317 334399 467359 462409 347717 270525 273643 249918 136875 23552 -1788 23277
38850 23277 53774 126523 197204 66146 -318064 -628423 -508385 -67295 253646 257809 143163
$$ packed form
38924b861p4387j56985j43954J59044N21964M51648q937k60605r7947L190k05940
38913A84230k90114L7039L36627J95573q1880p8239K4110p8939j62006N8046K71113
38902D15560P8333k46496j97457R2244J30656n0156k4332J95445J86566r6462
38892D83901k37249o1941J53011J93392J20003k1137k25426l03445r8431J30573
38882A33251L1374k15443j41768J89378K34784j09927k92823L164L49306K60550
38872D41846r2619k39038j10763J1543K0837N3084J38830J31547p562j05137k7251
38861B15317J19082J32960m950j14692p7192L118k3725j13043j13323k5340K5065
38850B3277L0497P2749P0681j31058l84210l10359J20038M41090L20941M163j14646
$$ plain form
38839 143163 99454 70517 -31945 -150050 -202909 -196383 -162184 -139563 -195827 -300235 -261726
38828 -261726 -9619 183680 53088 -201015 -165593 157043 383390 363452 303076 264508
38818 264508 46871 -329082 -496104 -279021 48270 213453 268333 306238 256175 133547
38808 133547 111095 178011 125836 8257 137581 444030 387728 -199612 -729186 -689128
38798 -689128 -349548 -194848 -161875 6598 103036 -181417 -546245 -436183 60230 330934
38788 330934 179910 13662 88024 168794 43754 -137582 -188117 -146477 -79478 49076
38778 49076 209625 297872 354874 503919 631760 462857 30009 -254513 -130459 180164
38768 180164 320817 244908 144340 114123 85038 16851 -2693 119470 317399 392576 260193
$$ packed form
38839A43163m3709k8937j02462j18105n2859O526L4199K2621n6264j04408L8509
38828b61726K52107J93299j30592k54103L5422L22636K26347j9938o0376l8568
38818B64508k17637l75953j67022K17083L27291J65183N4880L7905n0063j22628
38808A33547k2452O6916n2175j17579J29324L06449n6302n87340n29574M0058
38798f89128L39580J54700L2973J68473R6438k84453l64828J10062M96413K70704
38788C30934j51024j66248P4362Q0770j25040j81336n0535M1640O6999J28554
38778D9076J60549Q8247N7002J49045J27841j68903m32848k84522J24054L10623
38768A80164J40653p5909j00568l0217k9085o8187j9544J22163J97929P5177j32383
$$ plain form
38757 260193 111229 175313 342660 269443 -79841 -303477 -148086 86741 1998 -316446
38747 -316446 -515237 -552762 -648697 -798053 -781983 -618308 -570884 -675451 -640590 -309796
38737 -309796 94790 292192 253429 118135 30371 114609 393947 675906 717560 541069
38727 541069 398074 412712 464623 429860 319094 165400 -3263 -64596 98360 371400
38717 371400 500492 433233 353555 362609 368033 329859 363963 516481 651915 657260 572389
38706 572389 445655 252515 41557 -27443 98169 256478 282197 198093 108764 28582
38696 28582 -79098 -175254 -156701 33026 343939 647160 821044 838301 751458 591741
38686 591741 365165 162195 117287 183448 126700 -120047 -283814 -126866 172450 258668
$$ packed form
38757B60193j48964O4084J67347p3217l49284k23636J55391K34827q4743l18444
38747c16446j98791l7525r5935j49356J6070J63675M7424j04567L4861L30794
38737c09796M04586J97402l8763j35294q7764Q4238K79338K81959M1654j76491
38727E41069j42995J4638N1911l4763j10766j53694j68663o1333J62956K73040
38717C71400J29092o7259p9678R054N424l8174L4104J52518J35434N345q4871
38706E72389j26734j93140k10958o9000J25612J58309K5719q4104q9329q0182
38696B8582j07680r6156J8553J89727L10913L03221J73884J7257q6843j59717
38686E91741k26576k02970m4908O6161n6748k46747j63767J56948K99316Q6218
$$ plain form
38676 258668 92747 -57961 -35045 75172 167884 221683 194545 41166 -182151 -401005
38666 -401005 -636078 -856120 -854485 -519230 -103765 49148 -50566 -147532 -155014 -142672 -52332
38655 -52332 189228 375651 253338 -20062 -77180 59040 46244 -140960 -171049 20713
38645 20713 129062 98448 256282 624299 681001 143984 -501406 -644727 -332165 -24072
38635 -24072 85214 107350 104988 99235 220129 490342 641027 460558 143232 4630 65600
38624 65600 207216 469148 827808 940578 569847 81575 32551 367604 527553 308450
38614 308450 79309 89147 99689 -89767 -222000 -12053 332160 396648 187012 98346
38604 98346 314548 566918 546968 302045 87677 3759 -31338 -26967 128813 418675 593401
$$ packed form
38676B58668j65921j50708K2916J10217R2712N3799k7138j53379k23317k18854
38666d01005k35073k20042J635L35255M15465J52913r9714r6966p482J2342R0340
38655e2332K41560J86423j22313k73400n7118J36220j2796j87204l0089J91762
38645B0713J08349l0614J57834L68017N6702n37017o45390j43321L12562L08093
38635b4072J09286K2136k362n753J20894K70213J50685j80469l17326j38602O0970
38624F5600J41616K61932L58660J12770l70731m88272m9024L35053J59949k19103
38614C08450k29141R838J0542j89456j32233K09947L44213O4488k09636q8666
38604I8346K16202K52370j9950k44923k14368q3918l5097M371J55780K89862J74726
$$ plain form
38593 593401 462779 172827 29216 118135 276627 376838 419439 362403 114661 -234405
38583 -234405 -410046 -289491 -63624 41286 22236 -32875 -140168 -313247 -411725 -285642
38573 -285642 10773 290046 436394 430638 280793 60965 -74195 -48567 30591 29189 -33721
38562 -33721 -51288 24550 186276 401188 548338 466291 176932 -79242 -147145 -135564 -163720
38551 -163720 -136723 17932 83641 -179263 -604395 -767713 -548200 -265565 -231605 -405185
38541 -405185 -552491 -544901 -411009 -246581 -162748 -221910 -359088 -434120 -384982 -261673 -119189
38530 -119189 23878 123955 124767 52863 2600 1536 -18664 -91142 -143376 -98486 25714
38519 25714 162564 279634 363632 368888 250320 44057 -138263 -217710 -218653 -201687 -160443
$$ packed form
38593E93401j30622k89952j43611Q8919J58492J00211M2601n7036k47742l49066
38583b34405j75641J20555K25867J04910j9050n5111j07293j73079r8478J26083
38573b85642K96415K79273J46348n756j49845k19828j35160K5628P9158j402o2910
38562c3721j7567P5838J61726K14912J47150q2047k89359k56174o7903J1581k8156
38551a63720K6997J54655O5709k62904m25132j63318K19513K82635L3960j73580
38541d05185j47306P590J33892J64428Q3833n9162j37178p5032M9138J23309J42484
38530a19189J43067J00077Q12p1904n0263j064k0200p2478n2234M4890J24200
38519B5714J36850J17070Q3998N256j18568k06263j82320p9447r43J6966M1244
$$ plain form
38508 -160443 -53076 72946 90532 -28789 -145508 -136798 -53738 7954 89288 267373 453221
38497 453221 475885 330206 161273 36418 -76193 -137548 -70681 48171 67674 28019
38487 28019 87557 175402 33447 -326368 -543586 -427342 -231008 -217453 -256825 -113923
38477 -113923 122910 204510 130434 92856 132805 136718 102854 156861 326745 487488 508770
38466 508770 351085 94780 -46807 111875 464095 694171 716047 766477 926311 896129
38456 896129 512609 146704 203523 493488 542970 328892 217905 300544 301177 123324 -4745
38445 -4745 32878 98910 155504 332462 564372 580515 374751 285735 460629 613416 485933
38434 485933 197423 -46957 -256219 -460448 -541402 -480232 -478425 -604538 -611134 -347543 -64147
$$ packed form
38508a60443J07367J26022J7586j19321j16719Q710Q3060O1692Q1334J78085J85848
38497D53221K2664j45679j68933j24855j12611o1355O6867J18852J9503l9655
38487B8019N9538Q7845j41955l59815k17218J16244J96334J3555l9372J42902
38477a13923K36833Q1600p4076l7578L9949L913l3864N4007J69884J60743K1282
38466E08770j57685k56305j41587J58682L52220K30076K1876N0430J59834l0182
38456H96129l83520l65905N6819K89965M9482k14078j10987Q2639O33j77853j28069
38445d745L7623O6032N6594J76958K31910J6143k05764q9016J74894J52787j27483
38434D85933k88510k44380k09262k04229q0954O1170J807j26113o596K63591K83396
$$ plain form
38423 -64147 -24263 -87126 -990 130717 47123 -182582 -256881 -126168 -13057 -1344 49727
38412 49727 187343 271473 225293 124539 24044 -75316 -100857 8078 111811 30042 -127864
38401 -127864 -90172 117351 182105 31132 -31110 149218 293631 173418 13132 74851
38391 74851 145678 -112707 -499127 -482881 -37770 270831 142688 -21988 196565 552549
38381 552549 527301 123861 -189163 -199739 -161784 -277188 -385967 -296803 -101483 15659
38371 15659 47260 72289 89651 112031 256091 556796 832490 922021 933356 1057973 1250481
38360 1250481 1325693 1295571 1338259 1442612 1368640 1042064 739739 728220 896793 942557
38350 942557 811899 737361 850519 970270 863207 568886 320968 214702 131750 10056
$$ packed form
38423f4147L9884o2863Q6136J31707q3594k29705p4299J30713J13111J1713N1071
38412D9727J37616Q4130m6180j00754j00495r9360k5541J08935J03733q1769j57906
38401a27864L7692K07523O4754j50973o2242J80328J44413j20213j60286O1719
38391G4851P0827k58385l86420J6246M45111L08601j28143j64676K18553L55984
38381E52549k5248m03440l13024j0576L7955j15404j08779Q9164J95320J17142
38371A5659L1601K5029J7362K2380J44060L00705K75694Q9531J1335J24617J92508
38360A250481P5212l0122M2688J04353p3972l26576l02325j1519J68573M5764
38350I42557j30658p4538J13158J19751j07063k94321k47918j06266q2952j21694
$$ plain form
38340 10056 -5613 193258 430809 444845 271637 201687 336568 428349 256918 -40354
38330 -40354 -172033 -75361 79419 164902 198633 228139 274707 363577 483727 547388 494355
38319 494355 393034 343113 344036 362305 440636 606608 754233 766482 688010 634890 624116
38308 624116 655907 842975 1219530 1515886 1427137 1086745 955007 1197962 1507217 1641906
38298 1641906 1805395 2261149 2854802 3234875 3400975 3717439 4431267 5456013 6645239
38289 6645239 8034493 9759614 11956211 14810067 18414591 22293037 25196383 25791555
38281 25791555 23771052 20156181 16373495 13160646 10496301 8312312 6787787 5905968
38273 5905968 5214533 4340418 3464006 2954406 2745699 2455772 1992697 1617609 1436549
$$ packed form
38340A0056j5669J98871K37551J4036j73208o9950J34881R1781j71431k97272
38330d0354j31679R6672J54780Q5483L3731K9506M6568Q8870J20150O3661n3033
38319D94355j01321m9921R23J8269P8331J65972J47625J2249p8472n3120j0774
38308F24116L1791J87068L76555K96356q8749l40392j31738K42955L09255J34689
38298A641906J63489M55754N93653L80073J66100L16464P13828J024746J189226
38289F645239J389254J725121K196597K853856L604524L878446K903346N95172
38281B5791555k020503l614871l782686l212849k664345k183989j524525q81819
38273E905968o91435q74115q76412n09600k08707k89927m63075l75088j81060
$$ plain form
38264 1436549 1267448 1077880 1120711 1453263 1695466 1531365 1175741 1062267 1278869 1592604
38254 1592604 1858029 2095948 2285534 2385276 2494276 2702320 2826040 2606754 2180860 2033972
38244 2033972 2396581 2965460 3366033 3644569 4102396 4834127 5691135 6625588 7834361
38235 7834361 9564671 11940226 14920946 18160261 20829293 21872940 20750299 17940037
38227 17940037 14588247 11659846 9481619 7949710 6887568 6138312 5541770 4999023
38219 4999023 4484559 3923345 3195194 2371079 1781800 1656115 1793484 1808859 1623778 1464303
38209 1464303 1417033 1304957 1068243 948877 1110873 1320796 1257991 988884 855074 957700
38199 957700 1036082 883367 628813 498096 482017 409628 252074 171324 266667 415283
$$ packed form
38264A436549j69101j89568M2831L32552K42203j64101l55624j13474K16602L13735
38254A592604K65425K37919J89586R9742J09000K08044J23720k19286m25894j46888
38244B033972L62609N68879M00573K78536M57827P31731Q57008R34453J208773
38235G834361J730310K375555K980720L239315K669032J043647j122641k810262
38227A7940037l351790k928401k178227j531909j062142p49256n96542n42747
38219D999023n14464n61214p28151q24115n89279j25685J37369J5375j85081j59475
38209A464303m7270j12076k36714j19366J61996K09923o2805k69107j33810J02626
38199I57700P8382j52715k54554j30717j6079p2389j57554q0750R5343J48616
$$ plain form
38189 415283 426119 269839 79830 -27758 -43512 10055 131243 276403 340786 283391
38179 283391 207306 223664 285236 265477 171918 147295 245062 326209 225334 -65471 -410110
38168 -410110 -644289 -655407 -440861 -126453 144066 347838 526620 622930 543625 401478
38158 401478 465406 768845 999542 955645 883039 1081814 1359168 1263813 810560 532615
38148 532615 708918 950443 798907 406446 264725 456606 581358 374199 21761 -201828
38138 -201828 -292401 -365348 -387207 -255566 -29190 87400 -40199 -338940 -561165 -458720
38128 -458720 -38304 359599 396309 156911 29662 138967 185584 -34755 -277024 -244747
38118 -244747 -54307 18797 24254 177830 380011 334730 82464 -28052 98744 207674
$$ packed form
38189D15283J0836j56280j90009j07588j5754N3567J21188J45160O4383n7395
38179B83391p6085J6358O1572j9759r3559k4623R7767Q1147j00875k90805l44639
38168d10110k34179j1118K14546L14408K70519K03772J78782R6310p9305j42147
38158D01478O3928L03439K30697m3897p2606J98775K77354r5355m53253k77945
38148E32615J76303K41525j51536l92461j41721J91881J24752k07159l52438k23589
38138b01828r0573p2947k1859J31641K26376J16590j27599k98741k22225J02445
38128d58720M20416L97903L6710k39398j27249J09305M6617k20339k42269L2277
38118b44747J90440P3104N457J53576K02181m5281k52266j10516J26796J08930
$$ plain form
38108 207674 199800 285916 522630 643329 532943 447045 525626 500628 188553 -105730 -49068
38097 -49068 174564 198247 101039 238656 595838 773373 578520 228503 -29073 -145412
38087 -145412 -112010 91874 342918 440965 383245 346260 380761 354921 216005 85121 65829
38076 65829 148529 307179 513090 679957 777522 939993 1247556 1472349 1305167 800441
38066 800441 329680 104566 4070 -130102 -285030 -377686 -339545 -109861 245661 471087
38056 471087 418343 313409 425472 586701 435311 57573 -93103 74363 166684 26388
38046 26388 30211 414161 783750 672464 248142 67799 341122 785750 1074471 1124985
38036 1124985 1022241 882369 767775 645739 517544 580883 1022952 1613122 1827121 1501930
$$ packed form
38108B07674p874Q6116K36714J20699j10386q5898P8581k4998l12075k94283N6662
38097d9068K23632K3683r7208J37617L57182J77535j94853l50017k57576j16339
38087a45412L3402K03884K51044R8047n7720l6985L4501k5840j38916j30884j9292
38076F5829Q2700J58650K05911J66867R7565J62471L07563K24793j67182n04726
38066H00441m70761k25114j00496j34172j54928r2656L8141K29684L55522K25426
38056D71087n2744j04934J12063J61229j51390l77738j50676J67466R2321j40296
38046B6388L823L83950L69589j11286m24322j80343K73323M44628K88721N0514
38036A124985j02744j39872j14594j22036j28195O3339M42069N90170K13999l25191
$$ plain form
38026 1501930 1032716 757538 533497 185389 -27103 188826 570985 602878 277003 101300
38016 101300 358125 751310 864172 673484 490548 559733 807787 935423 757800 464912
38006 464912 439583 789409 1238195 1546595 1796484 2112841 2358966 2339567 2113392 1866757
37996 1866757 1635681 1370698 1112967 893865 639413 385909 369006 644102 863259 750742
37986 750742 559542 655848 858507 691706 200504 -26931 287987 719088 758528 456794
37976 456794 218250 219218 268836 133119 -169101 -379818 -285248 294 125434 -48390
37966 -48390 -246815 -185802 13450 55177 -58629 -102613 -49780 -60609 -117364 -41974 128728
37955 128728 141332 -70163 -294441 -374405 -315017 -63516 451665 1018178 1255278 1139441
$$ packed form
38026A501930m69214k75178k24041l48108k12492K15929L82159L1893l25875j75703
38016A01300K56825L93185J12862j90688j82936O9185K48054J27636j77623k92888
38006D64912k5329L49826M48786L08400K49889L16357K46125j9399k26175k46635
37996A866757k31076k64983k57731k19102k54452k53504j6903K75096K19157j12517
37986G50742j91200R6306K02659j66801m91202k27435L14918M31101L9440l01734
37976D56794k38544R68M9618j35717l02220k10717R4570K85542J25140j73824
37966d8390j98425O1013J99252M1727j13806m3984N2833j0829n6755P5390J70702
37955A28728J2604k11495k24278p9964N9388K51501N15181N66513K37100j15837
$$ plain form
37945 1139441 1079691 1355069 1789796 2088062 2161910 2014577 1651071 1257649 1122157 1193940
37935 1193940 1065027 589938 161856 115832 227080 147757 5741 119419 353642 282566
37925 282566 -80042 -214953 165910 718342 942352 752542 403091 88155 -155805 -275774
37915 -275774 -167721 154727 478554 551404 317768 -25634 -221585 -195942 -101360 -137940
37905 -137940 -363498 -664240 -859596 -834846 -618456 -342506 -119312 12247 25243 -93783
37895 -93783 -223377 -140661 175928 406056 248840 -171559 -482843 -552470 -525965 -453362
37885 -453362 -227248 92690 252767 193064 137063 183667 139925 -87474 -262963 -193401
37875 -193401 -39692 -30090 -125961 -206452 -320247 -490910 -531679 -353141 -211177 -319653
$$ packed form
37945A139441n9750K75378M34727K98266P3848j47333l63506l93422j35492P1783
37935A193940j28913m75089m28082m6024J11248p9323j42016J13678K34223p1076
37925B82566l62608j34911L80863N52432K24010j89810l49451l14936k43960j19969
37915b75774J08053L22448L23827P2850k33636l43402j95951K5643R4582l6580
37905a37940k25558l00742j95356K4750K16390K75950K23194J31559J2996j19026
37895i3783j29594Q2716L16589K30128j57216m20399l11284o9627K6505P2603
37885d53362K26114L19938J60077n9703n6001M6604m3742k27399j75489O9562
37875a93401J53709R602r5871q0491j13795j70663m0769J78538J41964j08476
$$ plain form
37865 -319653 -456226 -336094 -153060 -280681 -590033 -602211 -279480 -105137 -291133 -448149
37855 -448149 -257273 8330 -40031 -269456 -258263 47881 301828 290341 164941 135639
37845 135639 209017 298262 392318 500554 538277 399453 144865 28134 247942 674638
37835 674638 928423 800327 498582 363400 449782 591088 785800 1208335 1795128 2146131
37825 2146131 2009366 1615241 1318758 1117579 781852 305766 -70820 -221393 -231414 -165026
37815 -165026 -5726 160364 172485 64633 63889 240508 392067 377052 326909 379919 431692
37804 431692 358427 305715 497951 861846 1089420 1032137 817790 610809 473360 454690
37794 454690 598347 819515 945197 914023 802582 660895 485378 345672 344931 437645
$$ packed form
37865c19653j36573J20132J83034j27621l09352j2178L22731J74343j85996j57016
37855d48149J90876K65603m8361k29425J1193L06144K53947j1487j25400k9302
37845A35639P3378Q9245R4056J08236L7723j38824k54588j16731K19808M26696
37835F74638K53785j28096l01745j35182Q6382J41306J94712M22535N86793L51003
37825B146131j36765l94125k96483k01179l35727m76086l76586j50573j0021O6388
37815a65026J59300J66090J2121j07852p44J76619J51559j5015n0143N3010N1773
37804D31692p3265n2712J92236L63895K27574n7283k14347k06981j37449j8670
37794D54690J43657K21168J25682l1174j11441j41687j75517j39706p41R2714
$$ plain form
37784 437645 478070 466591 545267 737329 931089 1148382 1537482 2017692 2249726 2121313
37774 2121313 1973700 2154763 2630737 3260072 4140296 5375454 6783498 8213000 9889976
37765 9889976 11946478 13732743 14167228 12875141 10591273 8354145 6655066 5440813
37757 5440813 4520242 3726270 2947822 2244172 1799092 1649536 1609133 1521833 1402107 1266967
37747 1266967 1051441 780611 616445 631056 712345 767411 826290 878091 816985 633836
37737 633836 461511 364229 292883 291956 486010 787854 909889 775658 628183 605401 533234
37726 533234 319629 218080 436824 765005 879998 803318 763398 804995 832829 876004
37716 876004 1006057 1115850 1060998 926945 917142 1079353 1353197 1745002 2218332 2560700
$$ packed form
37784D37645M0425j1479P8676J92062J93760K17293L89100M80210K32034j28413
37774B121313j47613J81063M75974O29335Q80224J235158J408044J429502J676976
37765I889976K056502J786265M34485j292087k283868k237128j699079j214253
37757E440813r20571p93972p78448p03650m45080j49556m0403q7300j19726j35140
37747A266967k15526k70830j64166J4611Q1289N5066N8879N1801o1106j83149
37737F33836j72325r7282p1346r27J94054L01844J22035j34231j47475k2782p2167
37726E33234k13605j01549K18744L28181J14993p6680l9920M1597K7834M3175
37716H76004J30053J09793n4852j34053r803J62211K73844L91805M73330L42368
$$ plain form
37706 2560700 2634088 2653210 2960018 3611764 4419948 5298736 6359853 7751718 9540296
37697 9540296 11544666 13122209 13436977 12280961 10399185 8673792 7254197 5868768
37689 5868768 4637077 3954228 3751345 3543634 3196045 3027137 3127335 3206243 3223159 3520281
37679 3520281 4089269 4294074 3681008 2621166 1793374 1388923 1163596 953510 773586
37670 773586 622457 499942 468645 500678 450878 324257 314487 434351 425701 219627 129182
37659 129182 335579 544559 471887 330068 444730 671192 626593 299692 -2129 -167605
37649 -167605 -321622 -448226 -382017 -143674 57358 128905 126312 61533 -26150 69108 438020
37638 438020 739485 563265 56378 -224710 -81165 126540 82920 -100889 -217239 -275687
$$ packed form
37706B560700P3388J9122L06808O51746Q08184Q78788J061117J391865J788578
37697I540296K004370J577543L14768j156016j881776j725393j419595j385429
37689E868768j231691o82849k02883k07711l47589j68908J00198P8908J6916K97122
37679C520281N68988K04805o13066j059842q27792m04451k25327k10086j79924
37670G73586j51129j22515l1297L2033m9800j26621r770J19864q650k06074r0445
37659A29182K06397K08980p2672j41819J14662K26462m4599l26901l01821j65476
37649a67605j54017j26604O6209K38343K01032P1547k593o4779q7683R5258L68912
37638D38020L01465j76220n06887k81088J43545K07705m3620j83809j16350n8448
$$ plain form
37628 -275687 -316623 -249845 -75893 12505 -53748 -49408 200231 518765 630075 536624 445394
37617 445394 450990 478359 444351 324827 137886 -33209 -87816 -53636 -71224 -173866 -236921
37606 -236921 -217678 -249440 -375223 -397494 -187920 22610 -91084 -484946 -784861 -752447
37596 -752447 -500300 -252936 -95862 4490 100008 239985 428221 547926 436618 101633
37586 101633 -216997 -268814 -39287 266586 443292 441342 342732 253247 241393 347640 600251
37575 600251 986544 1419421 1793235 2127098 2622888 3474288 4553188 5358445 5411020 4722844
37565 4722844 3771138 2982215 2380856 1816126 1322415 1029729 852164 581214 261867
37556 261867 148329 252645 291512 173489 137993 227449 75384 -431097 -705841 -215028
$$ packed form
37628b75687m0936O6778J73952Q8398o6253M340K49639L18534J11310r3451r1230
37617D45394N596K7369l4008j19524j86941j71095n4607L4180j7588j02642o3055
37606b36921J9243l1762j25783k2271K09574K10530j13694l93862k99915L2414
37596g52447K52147K47364J57074J00352R5518J39977J88236J19705j11308l34985
37586A01633l18630n1817K29527L05873J76706j950r8610q9485j1854J06247K52611
37575F00251L86293M32877L73814L33863M95790Q51400J078900Q05257N2575o88176
37565D722844r51706p88923o01359n64730m93711k92686j77565k70950l19347
37556B61867j13538J04316L8867j18023l5496Q9456j52065n06481k74744M90813
$$ plain form
37546 -215028 610274 844009 330267 -170161 -114208 197093 290167 202407 179702 180866 70635
37535 70635 -38731 -4998 46054 -39135 -132812 -49620 132858 245786 307970 380593 375726
37524 375726 267916 241279 346160 298824 -33967 -248678 59236 609538 775637 447892
37514 447892 61923 -115425 -198753 -238401 -115276 76880 58272 -135302 -151248 74885
37504 74885 192796 61921 13932 264089 512198 432819 193616 158535 364801 603551
37494 603551 770964 846224 750092 520923 431934 644478 917792 936907 764806 698248
37484 698248 827250 1006184 1124197 1153499 1081319 1045606 1354151 2072070 2780541 3100441
37474 3100441 3271036 3754019 4374770 4411931 3611707 2595186 2050251 1949862 1861518 1675753
$$ packed form
37546b15028Q25302K33735n13742n00428N5953L11301R3074q7760k2705J164j10231
37535G0635j09366L3733N1052q5189r3677Q3192J82478J12928O2184P2623m867
37524C75726j07810k6637J04881m7336l32791k14711L07914N50302J66099l27745
37514D47892l85969j77348q3328l9648J23125J92156j8608j93574j5946K26133
37504G4885J17911j30875m7989K50157K48109p9379k39203l5081K06266K38750
37494F03551J67413P5260r6132k29169q8989K12544K73314J9115j72101o6558
37484F98248J29002J78934J18013K9302p2180l5713L08545P17919P08471L19900
37474C100441J70595M82983O20751L7161q00224j016521n44935j00389q8344j85765
$$ plain form
37464 1675753 1626358 1767384 1834804 1628459 1250299 915388 723228 671611 738480 861891
37454 861891 930123 875410 741540 614162 524669 472304 500305 660370 887168 994536
37444 994536 863250 586993 360491 258041 205989 143195 99305 118914 213599 378021
37434 378021 530395 464450 54034 -469341 -670046 -435135 -131333 -97758 -204919 -130358
37424 -130358 121266 266032 206769 142917 221193 345814 390193 388816 439690 552318 648040
37413 648040 629093 460058 271034 308262 630564 927864 847137 458988 168117 166027
37403 166027 230306 121012 -76552 -128344 16898 209312 291318 216071 78259 78936 329074
37392 329074 644996 703843 471982 301732 491174 902488 1151321 1055536 765341 545748
$$ packed form
37464A675753m9395J41026O7420k06345l78160l34911j92160n1617O6869J23411
37454H61891O8232n4713j33870j27378q9493n2365K8001J60065K26798J07368
37444I94536j31286k76257k26502j02450n2052o2794m3890J9609R4685J64422
37434C78021J52374o5945m10416n23375k00705K34911L03802L3575j07161P4561
37424a30358K51624J44766n9263o3852P8276J24621M4379j377N0874J12628R5722
37413F48040j8947j69035j89024L7228L22302K97300q0727l88149k90871k090
37403A66027O4279j09294j97564n1792J45242J92414Q2006p5247j37812O77K50138
37392C29074L15922N8847k31861j70250J89442M11314K48833r5785k90195k19593
$$ plain form
37382 545748 554622 759626 964890 978045 824122 717324 767051 831330 744583 559282 439158
37371 439158 422269 433938 459756 559624 741214 929676 1046811 1060051 998040 958628 1022642
37360 1022642 1121007 1099463 960533 886863 948365 981385 898217 903439 1165851 1442670 1346725
37349 1346725 923738 637710 754855 1041432 1169859 1160923 1250636 1498635 1737799 1843216
37339 1843216 1874103 1936649 2017571 2014639 1910372 1852921 1993251 2246681 2336909 2150533 1926503
37328 1926503 1957660 2205603 2395868 2421633 2421351 2479356 2512658 2500296 2562508 2701098 2695542
37317 2695542 2415951 2050404 1849763 1814361 1823424 1914160 2184208 2512360 2643638 2541638
37307 2541638 2435919 2502938 2684208 2838722 2900443 2854252 2720515 2610962 2659503 2851909
$$ packed form
37382E45748Q874K05004K05264J3155j53923j06798M9727O4279q6747j85301j20124
37371D39158j6889J1669K5818R9868J81590J88462J17135J3240o2011l9412O4014
37360A022642R8365k1544j38930p3670O1502L3020q3168N222K62412K76819r5945
37349A346725m22987k86028J17145K86577J28427q936Q9713K47999K39164J05417
37339A843216L0887O2546Q0922k932j04267n7451J40330K53430R0228j86376k24030
37328A926503L1157K47943J90265K5765k82N8005L3302j2362O2212J38590n556
37317B695542k79591l65547k00641l5402R063R0736K70048L28152J31278j02000
37307B541638j05719O7019J81270J54514O1721m6191j33737j09553M8541J92406
$$ plain form
37297 2851909 3044642 3173066 3299528 3432124 3466147 3368997 3266059 3259309 3298395 3315383
37287 3315383 3350268 3446622 3548220 3594603 3599253 3553831 3404852 3217193 3177301 3303644 3357624
37276 3357624 3222477 3152407 3390414 3741209 3856393 3782812 3820316 3930898 3773862 3349143
37266 3349143 3092597 3183789 3258044 3068238 2957559 3272632 3695975 3685698 3339727 3250938
37256 3250938 3593402 3927534 3960517 3947917 4148786 4361516 4317478 4183831 4293629 4587897
37246 4587897 4716141 4605742 4569932 4825146 5192536 5370253 5290499 5089358 4873236 4654852
37236 4654852 4445482 4282550 4172340 4075375 3948460 3766857 3527711 3275709 3103572 3066453
37226 3066453 3094805 3051665 2895018 2727369 2650687 2628548 2550736 2390952 2220678 2089060
$$ packed form
37297B851909J92733J28424J26462J32596L4023r7150j02938o750L9086J6988
37287C315383L4885R6354J01598M6383M650m5422j48979j87659l9892J26343N3980
37276C357624j35147p0070K38007L50795J15184p3581L7504J10582j57036m24719
37266C349143k56546R1192P4255j89806j10679L15073M23343j0277l45971q8789
37256C250938L42464L34132L2983j2600K00869K12730m4038j33647J09798K94268
37246D587897J28244j10399l5810K55214L67390J77717p9754k01141k16122k18384
37236D654852k09370j62932j10210r6965j26915j81603k39146k52002j72137l7119
37226C066453K8352m3140j56647j67649p6682k2139p7812j59784j70274j31618
$$ plain form
37216 2089060 1981402 1898208 1876193 1899281 1877131 1764228 1633031 1576219 1594712 1634902 1678893
37205 1678893 1733215 1770027 1747435 1673507 1605692 1589603 1604393 1551255 1329182 991290 788199
37194 788199 926156 1277894 1483662 1375302 1137035 986799 898623 774434 701062 819526
37184 819526 1045570 1145161 1052562 929489 922610 1012857 1091727 1062056 891700 679705 615636
37173 615636 753801 902946 879723 779064 813941 975101 1073627 1065703 1083412 1150652 1123742
37162 1123742 958029 808742 802118 896171 1020425 1163171 1266632 1235392 1123165 1117907
37152 1117907 1250004 1297824 1091282 746528 486634 378895 366809 419204 509693 559315
37142 559315 538868 553925 711914 959691 1141264 1167757 1073446 967979 974971 1131970 1304386
$$ packed form
37216B089060j07658q3194k2015K3088k2150j12903j31197n6812J8493M0190M3991
37205A678893N4322L6812k2592p3928o7815j6089J4790n3138k22073l37892k03091
37194G88199J37957L51738K05768j08360k38267j50236q8176j24189p3372J18464
37184H19526K26044R9591r2599j23073o879R0247P8870k9671j70356k11995o4069
37173F15636J38165J49145k3223j00659L4877J61160R8526p924J7709O7240k6910
37162A123742j65713j49287o624R4053J24254J42746J03461l1240j12227n258
37152A117907J32097M7820k06542l44754k59894j07739j2086N2395R0489M9622
37142E59315k0447J5057J57989K47777J81573K6493r4311j05467O992J56999J72416
$$ plain form
37131 1304386 1291118 1065645 818829 717939 731187 746634 747039 778743 832146 840440 753097
37120 753097 574604 388288 343258 515408 770091 887058 845964 846442 1002509 1177535
37110 1177535 1209191 1150384 1152647 1200774 1109782 780443 374925 203546 419764 821525
37100 821525 1025296 897076 718275 818418 1155722 1425418 1466480 1330649 1051780 657234
37090 657234 368163 433227 720237 819001 634211 521347 700559 906922 845090 658146
37080 658146 650246 798980 862527 792424 731286 720078 685190 635558 639799 678357 706572 769014
37068 769014 875794 890406 734617 575784 602326 742461 830802 923378 1183642 1548229
37058 1548229 1779011 1795434 1700211 1521404 1207221 882948 836785 1155494 1556793 1688793
$$ packed form
37131A304386j3268k25473k46816j00890J3248J5447M05L1704N3403Q294q7343
37120G53097j78493j86316m5030J72150K54683J16967m1094M78J56067J75026
37110A177535L1656n8807K263M8127r0992l29339m05518j71379K16218M01761
37100H21525K03771j28220j78801J00143L37304K69696M1062j35831k78869l94546
37090F57234k89071O5064K87010R8764j84790j12864J79212K06363o1832j86944
37080F58146p900J48734O3547p0103o1138j1208l4888m9632M241L8558K8215O2442
37068G69014J06780J4612j55789j58833K6542J40135Q8341R2576K60264L64587
37058A548229K30782J6423r5223j78807l14183l24273m6163L18709M01299J32000
$$ plain form
37048 1688793 1501443 1256453 1219142 1379708 1495004 1430970 1385852 1613150 1970827 2029234
37038 2029234 1689543 1371145 1418453 1643962 1710332 1655159 1695647 1778491 1740707 1722872 1956837
37027 1956837 2256491 2211813 1862978 1687879 1863466 2023021 1892274 1710711 1767560 1888387
37017 1888387 1721561 1317084 1086309 1261806 1646186 1890461 1860205 1704281 1646829 1750882
37007 1750882 1894292 1961898 1968542 1943840 1839813 1686276 1681312 1908150 2095602 1950781
36997 1950781 1642354 1607654 1909137 2172027 2202650 2234804 2404083 2413785 2034512 1596238
36987 1596238 1573001 1875551 1992357 1762778 1573589 1723126 1993484 2072523 2106651 2486571
36977 2486571 3173707 3597072 3335297 2659038 2186262 2137070 2203733 2131890 2100448 2364396
$$ packed form
37048A688793j87350k44990l7311J60566J15296o4034m5118K27298L57677N8407
37038B029234l39691l18398M7308K25509O6370n5173M0488Q2844l7784j7835K33965
37027A956837K99654m4678l48835j75099J75587J59555j30747j81563N6849J20827
37017A888387j66826m04477k30775J75497L84380K44275l0256j55924n7452J04053
37007A750882J43410O7606O644k4702j04027j53537m964K26838J87452j44821
36997A950781l08427l4700L01483K62890L0623L2154J69279R702l79273m38274
36987A596238k3237L02550J16806k29579j89189J49537K70358P9039L4128L79920
36977B486571O87136M23365k61775o76259m72776m9192O6663p1843l1442K63948
$$ plain form
36967 2364396 2766556 2880479 2549224 2032958 1644241 1465686 1450539 1572254 1759681 1832561
36957 1832561 1651858 1299268 1018742 980537 1141522 1336917 1478217 1621240 1823303 1999480
36947 1999480 2020936 1932161 1931781 2110785 2344983 2487581 2522199 2475102 2347931 2214852 2197979
36936 2197979 2239144 2095723 1703832 1343004 1269287 1386962 1475217 1513392 1532709 1380675
36926 1380675 977208 636612 740898 1170141 1437439 1357439 1200104 1165999 1101157 842665
36916 842665 518149 337072 313192 336494 347821 334178 294366 286412 384766 547301 643173
36905 643173 624998 551382 452762 310802 149337 16087 -82433 -113052 8262 220369
36895 220369 254638 -7237 -279802 -266990 -139691 -245122 -475117 -399923 -5397 213862
$$ packed form
36967B364396M02160J13923l31255n16266l88717j78555j5147J21715J87427P2880
36957A832561j80703l52590k80526l8205J60985J95395J41300J43023K02063J76177
36947A999480K1456q8775l80J79004K34198J42598L4618m7097j27171j33079j6873
36936B197979M1165j43421l91891l60828p3717J17675Q8255L8175J9317j52034
36926A380675m03467l40596J04286M29243K67298q0000j57335l4105o4842k58492
36916H42665l24516j81077k3880K3302J1327j3643l9812p954R8354J62535R5872
36905F43173j8175p3616r8620j41960j61465j33250r8520l0619J21314K12107
36895B20369L4269k61875k72565J2812J27299j05431k29995P5194L94526K19259
$$ plain form
36885 213862 -4144 -327135 -387152 -280871 -273388 -356611 -378559 -338100 -280883 -125299 144890
36874 144890 295992 112255 -273989 -539870 -562174 -463414 -361494 -264231 -169932 -116946
36864 -116946 -127988 -177117 -200866 -127206 54499 251389 358787 370535 325081 212066 54907
36853 54907 1549 156335 379267 435315 287867 67043 -154513 -327217 -281858 76417
36843 76417 501267 654797 576921 565225 635069 511792 182558 10864 177762 411148
36833 411148 445330 392343 451432 565772 602662 620738 720896 819063 773957 604458 428719
36822 428719 306543 244568 240404 254723 241665 214745 185466 121561 109138 376071 895067
36811 895067 1176847 854440 304229 200394 566313 822898 721111 597800 666661 716507
$$ packed form
36885B13862k18006l22991o0017J06281P483q3223k1948M0459N7217J55584K70189
36874A44890J51102j83737l86244k65881k2304R8760J01920R7263R4299N2986
36864a16946j1042m9129k3749P3660J81705J96890J07398J1748m5454j13015j57159
36853E4907n3358J54786K22932N6048j47448k20824k21556j72704M5359L58275
36843G6417M24850J53530p7876j1696O9844j23277l29234j71694J66898K33386
36833D11148L4182n2987N9089J14340L6890J8076J00158R8167m5106j69499j75739
36822D28719j22176o1975m164J4319j3058k6920k9279o3905j2423K66933N18996
36811H95067K81780l22407n50211j03835L65919K56585j01787j23311O8861M9846
$$ plain form
36801 716507 658411 732051 961212 1023075 897770 1016858 1472962 1724842 1460890 1133275
36791 1133275 1195868 1409088 1401943 1346588 1483945 1494826 1018006 397711 229228 456932
36781 456932 581572 514508 561437 736286 750262 597329 557421 661037 679134 608831 677750
36770 677750 889660 1016713 1017994 1044875 1062558 875843 518814 253594 198094 265849 407519
36759 407519 603085 710956 638542 553158 625472 716856 636097 516017 577878 715159 695228
36748 695228 582753 566766 577468 503562 564991 982900 1478012 1609725 1431607 1287809
36738 1287809 1173924 906326 726716 1021983 1542654 1660798 1403647 1450445 2011257 2515166
36728 2515166 2638269 2858623 3616162 4611702 5421859 6238232 7425971 8748429 9618327
$$ packed form
36801G16507n8096P3640K29161O1863j25305J19088M56104K51880k63952l27615
36791A133275O2593K13220p145n5355J37357J0881m76820o20295j68483K27704
36781D56932J24640o7064M6929J74849J3976j52933l9908J03616J8097p0303O8919
36770F77750K11910J27053J281K6881J7683j86715l57029k65220n5500O7755J41670
36759D07519J95566J07871p2414q5384P2314R1384q0759j20080O1861J37281j9931
36748F95228j12475j5987J0702p3906O1429M17909M95112J31713j78118j43798
36738A287809j13885k67598j79610K95267N20671J18144k57151M6798N60812N03909
36728B515166J23103K20354P57539R95540Q10157Q16373J187739J322458Q69898
$$ plain form
36719 9618327 9914631 10071072 10491856 11305469 12616874 14562044 16963823 19123686 20125144
36710 20125144 19446851 17394059 14925588 12922775 11591726 10621284 9764519 9030288 8435940
36701 8435940 7947351 7682424 7834510 8325353 8836118 9260799 9845349 10808060 12125016
36692 12125016 13779027 15870537 18265601 20382944 21604471 21842349 21571595 21326294
36684 21326294 21170827 20604746 19049441 16536066 13807013 11596099 9981391 8662435
36676 8662435 7616271 7044073 6789646 6326241 5398469 4292571 3395808 2828356 2555721
36667 2555721 2497206 2439374 2181895 1852700 1759867 1883292 1874554 1622975 1417129 1423766 1418304
36656 1418304 1226421 1057718 1145722 1354076 1410772 1315649 1263054 1308451 1324676 1206355
$$ packed form
36719I618327K96304J56441M20784Q13613J311405J945170K401779K159863J001458
36710B0125144o78293k052792k468471k002813j331049r70442q56765p34231n94348
36701H435940m88589k64927J52086M90843N10765M24681N84550R62711J316956
36692A2125016J654011K091510K395064K117343J221527K37878k70754k45301
36684B1326294j55467n66081j555305k513375k729053k210914j614708j318956
36676H662435j046164n72198k54427m63405r27772j105898q96763n67452k72635
36667B555721n8515n7832k57479l29195r2833J23425q738k51579k05846O637n462
36656A418304j91883j68703Q8004K08354N6696r5123n2595M5397J6225j18321
$$ plain form
36646 1206355 983857 790572 761512 893277 1030246 1081543 1144153 1261858 1245024 990633
36636 990633 790440 960955 1324584 1478070 1439476 1540697 1780405 1846549 1749986 1831639
36626 1831639 2097557 2167440 1988137 1968559 2253666 2520174 2710983 3290618 4457675 5770404
36616 5770404 6936135 8301426 10092802 11867846 13341290 15069399 17433466 19437140
36608 19437140 19621907 18126867 16854968 17337631 19116120 20505359 20379813 18851763
36600 18851763 16663083 14466188 12626637 11300161 10465542 9921200 9401009 8820899 8383455
36591 8383455 8299739 8433574 8439054 8271625 8282586 8711869 9401560 10204407 11376583 13257174
36581 13257174 15708273 18114971 19840445 20564468 20407478 19919542 19705573 19792300 19531125
$$ packed form
36646A206355k22498j93285k9060J31765J36969N1297O2610J17705j6834k54391
36636I90633k00193J70515L63629J53486l8594J01221K39708O6144r6563Q1653
36626A831639K65918O9883j79303j9578K85107K66508J90809N79635J167057J312729
36616E770404J165731J365291J791376J775044J473444J728109K364067K003674
36608A9437140J84767j495040j271899M82663J778489J389239j25546j528050
36600A8851763k188680k196895j839551j326476q34619n44342n20191n80110m37444
36591H383455q3716J33835N480j67429J0961M29283O89691Q02847J172176J880591
36581A3257174K451099K406698J725474P24023j56990m87936k13969Q6727k61175
$$ plain form
36572 19531125 18344663 16376979 14203713 12176821 10365456 8881370 7827703 7032251
36564 7032251 6218399 5399541 4791405 4399402 4018031 3596915 3282454 3104760 2929192
36555 2929192 2729163 2610419 2526499 2257958 1764128 1319702 1187497 1323749 1500488 1574921
36545 1574921 1540278 1422640 1247309 1083661 1050592 1235785 1583947 1889038 1972597 1870027
36535 1870027 1748907 1657116 1506150 1320978 1295626 1495679 1688432 1618970 1329893 1078462
36525 1078462 1050774 1265579 1626818 1946592 2036832 1897469 1712009 1592683 1491299 1422428
36515 1422428 1527329 1771674 1841229 1575178 1295752 1428832 1941601 2433249 2668522 2733641
36505 2733641 2745087 2713768 2690894 2776328 2951635 3126107 3362593 3821066 4430164 4858840
$$ packed form
36572A9531125j186462j967684k173266k026892j811365j484086j053667p95452
36564G032251q13852q18858o08136l92003l81371m21116l14461j77694j75568
36555B929192k00029j18744q3920k68541m93830m44426j32205J36252J76739P4433
36545A574921l4643j17638j75331j63648l3069J85193L48162L05091Q3559j02570
36535A870027j21120r1791j50966j85172k5352K00053J92753o9462k89077k51431
36525A078462k7688K14805L61239L19774R0240j39363j85460j19326j01384o8871
36515A422428J04901K44345O9555k66051k79426J33080N12769M91648K35273O5119
36505B733641J1446l1319k2874Q5434J75307J74472K36486M58473O09098M28676
$$ plain form
36495 4858840 4941483 4950396 5280094 5967750 6706179 7300284 7929102 8894484 10252284 11831850
36485 11831850 13544804 15480159 17692019 20131077 22899402 26348719 30720619 35862565
36477 35862565 41535873 47795568 54638173 61278749 66190556 68055333 66545652 62250247
36469 62250247 56202232 49547747 43239566 37694962 32817558 28446627 24636105 21456388
36461 21456388 18787846 16463740 14435992 12685335 11152390 9862521 8925680 8300983
36453 8300983 7749106 7129173 6560252 6179446 5918976 5637177 5313698 5014737 4791361
36444 4791361 4655967 4522621 4191785 3596143 3020564 2804150 2848433 2751065 2428510 2213759
36434 2213759 2272703 2353895 2273397 2237503 2452789 2757105 2879820 2779712 2512764 2058365
$$ packed form
36495D858840Q2643Q913L29698O87656P38429N94105O28818R65382J357800J579566
36485A1831850J712954J935355K211860K439058K768325L449317M371900N141946
36477C5862565N673308O259695O842605O640576M911807J864777j509681m295405
36469F2250247o048015o654485o308181n544604m877404m370931l810522l179717
36461B1456388k668542k324106k027748j750657j532945j289869r36841o24697
36453H300983n51877o19933n68921l80806k60470k81799l23479k98961k23376
36444D791361j35394j33346l30836n95642n75579k16414M4283r7368l22555k14751
36434B213759N8944Q1192q0498l5894K15286L04316J22715j00108k66948m54399
$$ plain form
36424 2058365 1497394 1083111 916268 814749 696499 784819 1199278 1635553 1715886 1421835
36414 1421835 970344 530136 266075 349455 664968 805859 635817 558593 927678 1483517
36404 1483517 1728586 1605559 1418253 1280113 1054959 747307 574508 644227 807431 847464
36394 847464 694894 503300 550342 919924 1283631 1253544 957954 899096 1183599 1368576
36384 1368576 1236476 1183871 1519036 1889793 1872177 1701588 1865019 2268643 2398178 2137068
36374 2137068 1866716 1820477 1834178 1736015 1556575 1313589 946660 533240 296958 338532
36364 338532 543231 760561 915907 971550 931032 867096 851516 900760 1024341 1210726
36354 1210726 1342590 1297644 1159832 1121864 1161709 1078392 871227 760784 778945 706956
$$ packed form
36424B058365n60971m14283j66843j01519j18250Q8320M14459M36275Q0333k94051
36414A421835m51491m40208k64061Q3380L15513J40891j70042p7224L69085N55839
36404A483517K45069j23027j87306j38140k25154l07652j72799O9719J63204M0033
36394H47464j52570j91594M7042L69582L63707l0087k95590n8858K84503J84977
36384A368576j32100n2605L35165L70757j7616j70589J63431M03624J29535k61110
36374B137068k70352m6239J3701r8163j79440k42986l66929m13420k36282M1574
36364C38532K04699K17330J55346N5643m0518o3936j5580M9244J23581J86385
36354A210726J31864m4946j37812l7968L9845q3317k07165j10443J8161p1989
$$ plain form
36344 706956 524504 528754 845109 1194711 1336337 1378891 1455415 1446628 1260085 1062711 1009482
36333 1009482 1027883 1061149 1233830 1596777 1985615 2291045 2618363 3068390 3594033 4128537
36323 4128537 4669583 5314828 6381473 8198966 10577880 13126129 16528565 22346062
36315 22346062 30166271 35888840 35095574 28223764 20357834 15488748 13038938 10699025
36307 10699025 8225814 6745229 6177173 5544336 4834039 4627416 4565477 3903082 3020349
36298 3020349 2769151 2830183 2315353 1542010 1549041 2160940 2205970 1526731 1159597 1501112
36288 1501112 1817107 1697817 1591535 1699433 1627022 1341400 1291319 1406459 1125171 559561
36278 559561 475268 951659 1222093 1038489 1023283 1404642 1565424 1219628 962730 1213229
$$ packed form
36344G06956j82452M250L16355L49602J41626M2554P6524q787j86543j97374n3229
36333A009482J8401L3266J72681L62947L88838L05430L27318M50027N25643N34504
36323D128537N41046O45245J066645J817493K378914K548249L402436N817497
36315B2346062P820209N722569p93266o871810p865930m869086k449810k339913
36307A0699025k473211j480585n68056o32837p10297k06623o1939o62395q82733
36298C020349k51198O1032n14830p73343P031O11899M5030o79239l67134L41515
36288A501112L15995j19290j06282J07898p2411k85622n0081J15140k81288n65610
36278E59561q4293M76391K70434j83604j5206L81359J60782l45796k56898K50499
$$ plain form
36268 1213229 1550371 1539361 1381980 1354042 1351516 1335923 1532829 1905236 2076683 1977907
36258 1977907 1941759 2047953 2033590 1910672 1982477 2220605 2314408 2289669 2351318 2250377
36248 2250377 1648677 958914 874683 1191880 1120938 667489 582146 967259 1123193 861470
36238 861470 779244 1061838 1177593 980729 979199 1259541 1270330 948051 940050 1397786 1644364
36227 1644364 1376662 1127201 1188169 1142167 837329 797396 1268618 1816928 2193282 2626917
36217 2626917 2994045 2747753 1980341 1499012 1538740 1472506 1086836 989598 1391468 1652607
36207 1652607 1465495 1348152 1525387 1470408 1034064 885576 1305958 1637174 1451209 1201910
36197 1201910 1225909 1183215 982367 1142683 1699053 1854075 1298536 819104 1010406 1394457
$$ packed form
36268A213229L37142j1010j57381k7938k526j5593J96906L72407J71447r8776
36258A977907l6148J06194j4363j22918P1805K38128R3803k4739O1649j00941
36248B250377o01700o89763q4231L17197p0942m53449q5343L85113J55934k61723
36238H61470q2226K82594J15755j96864j530K80342J0789l22279q001M57736K46578
36227A644364k67702k49461O0968m6002l04838l9933M71222N48310L76354M33635
36217B626917L67128k46292p67412m81329L9728o6234l85670r7238M01870K61139
36207A652607j87112j17343J77235n4979m36344j48488M20382L31216j85965k49299
36197A201910K3999m2694k00848J60316N56370J55022n55539m79432J91302L84051
$$ plain form
36187 1394457 1386115 1171527 1102586 1124028 1226861 1579111 1919347 1774017 1435958 1643985
36177 1643985 2217522 2271815 1848922 1883271 2420639 2470600 1873002 1643053 2113693 2414881
36167 2414881 2193728 2164407 2555234 2728937 2701227 3231385 4085500 4150680 3594361 3834297
36157 3834297 5048890 5953298 6347619 7430575 9270252 10690558 12039758 15077958
36149 15077958 19796586 24885530 31690738 42960954 56037684 62327702 56829491 44406195
36141 44406195 33382609 26511866 21719504 18012685 15961150 14691107 12879464 11374298
36133 11374298 11432660 11991736 11696898 11603038 12878014 14154926 14205936 14628538 16757231
36124 16757231 18914398 20039513 22567431 28042239 33861158 38480039 45214516 56173827
$$ packed form
36187A394457q342k14588o8941K1442J02833L52250L40236j45330l38059K08027
36177A643985N73537N4293m22893L4349N37368M9961n97598k29949M70640L01188
36167B414881k21153k9321L90827J73703k7710N30158Q54115O5180n56319K39936
36157C834297J214593R04408L94321J082956J839677J420306J349200L038200
36149A5077958M718628N088944O805208J1270216J3076730O290018n498211j2423296
36141D4406195j1023586o870743m792362l706819k051535j270043j811643j505166
36133A1374298N8362N59076k94838r3860J274976J276912N1010M22602K128693
36124A6757231K157167J125115K527918N474808N818919M618881O734477J0959311
$$ plain form
36116 56173827 68073899 79948917 98241234 126684059 159929959 198895319 261838200
36109 261838200 358323334 454226439 488522899 435998934 336368795 249760704 198431461
36102 198431461 165637098 135674612 111572852 97950571 89180457 79911768 73129605
36095 73129605 71920967 72957023 72973180 73959314 77487448 80127230 78515958 73983091
36087 73983091 68813389 62392885 54135350 46256876 40635034 36107682 31332703 27333699
36079 27333699 25017377 23017333 20149332 17487849 16082101 14968144 13228147 11787579
36071 11787579 11450552 11208801 10121723 8981441 8620188 8358333 7530909 6849387 6914436
36062 6914436 6965636 6334290 5629310 5384673 5040491 4299308 3970703 4440926 4788133 4409777
$$ packed form
36116E6173827J1900072J1875018J8292317K8442825L3245900L8965360O2942881
36109B61838200R6485134R5903105L4296460n2523965r9630139q6608091n1329243
36102A98431461l2794363k9962486k4101760j3622281q770114r268689o782163
36095G3129605j208638J036056J6157R86134L528134K639782j611272m532867
36087G3983091n169702o420504q257535p878474n621842m527352m774979l999004
36079B7333699k316322k000044k868001k661483j405748j113957j739997j440568
36071A1787579l37027k41751j087078j140282l61253k61855q27424o81522O5049
36062F914436N1200o31346p04980k44637l44182p41183l28605M70223L47207l78356
$$ plain form
36052 4409777 4053869 4263208 4297642 3632420 3063489 3236894 3462489 3094140 2769503 3133472
36042 3133472 3552006 3267986 2751625 2761976 3027853 2929186 2616184 2476016 2314852 1956724
36032 1956724 1834431 2156598 2307149 1857539 1353272 1346559 1491489 1345695 1217477 1444213
36022 1444213 1643353 1450251 1238787 1384906 1557745 1417648 1264459 1353977 1355998 1115189
36012 1115189 1120200 1571729 1842410 1542754 1252800 1477623 1762446 1622297 1465553 1738640
36002 1738640 2005803 1815429 1697204 2292864 3168344 3503314 3371723 3322170 3217456 2562738
35992 2562738 1610838 1101743 1119110 1106292 847600 631280 581808 546325 525127 614139
35982 614139 675121 580921 563203 826043 1094756 1040540 841323 824593 888952 789983 656537
$$ packed form
36052D409777l55908K09339L4434o65222n68931J73405K25595l68349l24637L63969
36042C133472M18534k84020n16361J0351K65877r8667l13002j40168j61164l58128
36032A956724j22293L22167J50551m49610n04267o713J44930j45794j28218K26736
36022A444213J99140j93102k11464J46119J72839j40097j53189Q9518K021k40809
36012A115189N011M51529K70681k99656k89954K24823K84823j40149j56744K73087
36002A738640K67163j90374j18225N95660Q75480L34970j31591m9553j04714o54718
35992B562738r51900n09095J7367j2818k58692k16320m9472l5483k1198Q9012
35982F14139O0982r4200j7718K62840K68713n4216j99217j6730O4359r8969j33446
$$ plain form
35971 656537 702787 768026 656536 582656 763221 937654 822643 659221 751645 853614
35961 853614 611742 251202 195879 344573 356183 328582 539352 812930 819759 731054 886320
35950 886320 1067270 840249 418887 406441 785045 936482 657332 411067 497666 663283
35940 663283 683070 709581 826531 787226 468902 191754 314302 760464 1138644 1164470
35930 1164470 874001 556818 497157 669655 767803 655177 599211 836935 1131522 1094561
35920 1094561 777915 553908 513577 407593 165957 59723 260306 565822 686606 567721
35910 567721 327521 69670 -133158 -192015 -40508 299128 692555 931825 875099 599092
35900 599092 347888 302704 466171 726993 892665 730000 224555 -229270 -207197 157225
$$ packed form
35971F56537M6250O5239j11490p3880J80565J74433j15011j63422R2424J01969
35961H53614k41872l60540n5323J48694J1610k7601K10770K73578O829q8705J55266
35950H86320J80950k27021m21362j2446L78604J51437k79150k46265Q6599J65617
35940F63283J9787K6511J16950l9305l18324k77148J22548M46162L78180K5826
35930A164470k90469l17183n9661J72498R8148j12626n5966K37724K94587l6961
35920A094561l16646k24007m0331j05984k41636j06234K00583L05516J20784j18885
35910E67721k40200k57851k02828n8857J51507L39636L93427K39270n6726k76007
35900E99092k51204m5184J63467K60822J65672j62665n05445m53825K2073L64422
$$ plain form
35890 157225 307522 40449 -238930 -147390 201256 522211 748686 867865 767642 522178
35880 522178 460686 660567 737497 453161 150859 211747 442934 451066 313101 377856 626790
35869 626790 742009 672166 649784 718415 679031 485719 326836 314269 380683 454838 500282
35858 500282 457400 361805 387858 561513 629689 470364 380203 611755 877063 750456
35848 750456 370757 238422 421515 500986 302616 145755 244474 343382 184341 -24071
35838 -24071 99173 535003 849191 702296 221517 -150019 -125045 144138 299653 248951
35828 248951 227623 368038 468064 343413 157122 150453 247842 227044 136130 214489 472029
35817 472029 656601 619787 452590 273815 128501 88318 217211 419791 523326 531542
$$ packed form
35890A57225J50297k67073k79379R1540L48646L20955K26475J19179j00223k45464
35880E22178o1492J99881P6930k84336l02302O0888K31187Q132j37965O4755K48934
35869F26790J15219o9843k2382O8631l9384j93312j58883j2567O6414P4155M5444
35858E00282m2882r5595K6053J73655O8176j59325r0161K31552K65308j26607
35848G50456l79699j32335J83093P9471j98370j56861R8719R8908j59041k08412
35838b4071J23244M35830L14188j46895m80779l71536K4974K69183J55515n0702
35828B48951k1328J40415J00026j24651j86291o669R7389k0798r0914P8359K57540
35817D72029J84572l6814j67197j78775j45314m0183J28893K02580J03535Q216
$$ plain form
35807 531542 630236 921134 1277408 1468894 1354130 1001272 689909 696401 1004605 1362558
35797 1362558 1679074 2131414 2765484 3298424 3559469 3835547 4455654 5309056 6199803
35788 6199803 7432571 9441020 11844973 13463423 13467795 12141603 10349041 8650952 7171922
35779 7171922 5953982 5034949 4316435 3678706 3185723 2949971 2845919 2596635 2150319
35770 2150319 1748733 1562676 1462218 1270088 1073061 1090297 1335599 1638184 1948641 2359338
35760 2359338 2830539 3240404 3787365 4898116 6435981 7402301 6934338 5397046 3964187
35751 3964187 3242316 2873402 2431013 2013471 1784245 1565876 1230419 1016443 1100119 1230155
35741 1230155 1127627 916012 832218 826703 772906 766427 876652 886307 629016 330912 277228
$$ packed form
35807E31542R8694K90898L56274J91486j14764l52858l11363O492L08204L57953
35797A362558L16516M52340O34070N32940K61045K76078O20107Q53402Q90747
35788F199803J232768K008449K403953J618450M372j326192j792562j698089j479030
35779G171922j217940r19033p18514o37729m92983k35752j04052k49284m46316
35770B150319m01586j86057j00458j92130j97027J7236K45302L02585L10457M10697
35760B359338M71201M09865N46961J110751J537865R66320m67963j537292j432859
35751C964187p21871l68914m42389m17542k29226k18369l35457k13976Q3676J30036
35741A230155j02528k11615q3794n515n3797o479J10225R655k57291k98104n3684
$$ plain form
35730 277228 390792 477540 615516 911634 1117652 917401 427664 26300 -158512 -226742
35720 -226742 -164596 74943 302497 298710 164293 107691 54504 -137960 -261860 -22460
35710 -22460 401329 546298 357105 218430 310924 393566 269535 58889 -66164 -79401
35700 -79401 17275 213587 374494 373433 314472 359360 423985 352880 271127 389718 574425
35689 574425 527949 307338 206800 214440 104213 13100 319217 888523 1076834 668394
35679 668394 220301 199247 326795 154351 -183243 -245914 11460 270903 363775 345712
35669 345712 230435 37689 -13672 257840 621265 650566 323053 74766 191190 438010
35659 438010 451483 268026 223688 429567 631869 643039 637823 809346 931693 628854
$$ packed form
35730B77228J13564Q6748J37976K96118K06018k00251m89737m01364j84812o8230
35720b26742O2146K39539K27554l787j34417n6602n3187j92464j23900K39400
35710b2460M23789J44969j89193j38675R2494Q2642j24031k10646j25053j3237
35700g9401R6676J96312J60907j061n8961M4888O4625p1105q1753J18591J84707
35689E74425m6476k20611j00538P640j10227r1113L06117N69306J88311m08440
35679F68394m48093k1054J27548j72444l37594o2671K57374K59443R2872j8063
35669C45712j15277j92746n1361K71512L63425K9301l27513k48287J16424K46820
35659D38010J3473j83457m4338K05879K02302J1170n216J71523J22347l02839
$$ plain form
35649 628854 38531 -225547 82485 444483 313501 -105057 -216173 71328 308064 250889
35639 250889 137694 185129 259138 168626 -52042 -275149 -422648 -395727 -126681 220119
35629 220119 345816 184943 -45219 -184775 -265556 -288880 -162428 83536 287892 414112
35619 414112 544139 600211 401184 48127 -102422 50395 220440 235596 292538 525734
35609 525734 691510 546213 241494 66007 45148 70343 183616 422169 575087 430873
35599 430873 144983 47594 170824 268693 250254 275735 405580 451479 280545 48968
35589 48968 -11510 94049 173176 137936 93294 130183 178494 155469 150219 295967 506402
35578 506402 558400 462546 491319 724435 846216 614910 275213 193823 301909 291781
$$ packed form
35649F28854n90323k64078L08032L61998j30982m18558j11116K87501K36736n7175
35639B50889j13195M7435P4009r0512k20668k23107j47499K6921K69046L46800
35629B20119J25697j60873k30162j39556q0781k3324J26452K45964K04356J26220
35619D14112J30027N6072j99027l53057j50549J52817J70045J5156N6942K33196
35609E25734J65776j45297l04719j75487k0859K5195J13273K38553J52918j44214
35599D30873k85890r7389J23230R7869j8439K5481J29845M5899j70934k31577
35589D8968o0478J05559P9127l5240m4642L6889M8311k3025n250J45748K10435
35578E06402N1998r5854K8773K33116J21781k31306l39697q1390J08086j0128
$$ plain form
35568 291781 208338 365952 722392 845465 585300 309300 310242 412755 386869 355257 493296
35557 493296 637477 524127 210013 -41098 -135191 -156029 -139646 -87066 -89319 -213527 -348825
35546 -348825 -351912 -255328 -163166 -45990 176627 432812 554648 485408 301363 102266
35536 102266 -1022 106356 394108 616633 540757 204659 -152133 -350238 -356727 -191955
35526 -191955 101681 412275 590871 562948 387794 214966 162625 191616 137421 -59180
35516 -59180 -220962 -155238 73906 266560 393381 541808 627901 485190 240291 229769
35506 229769 453136 489359 143811 -176840 -16867 475339 773798 674809 439733 337279
35496 337279 361284 398484 420197 442297 440219 368145 222453 85974 96532 291439 496237
$$ packed form
35568B91781q3443J57614L56440J23073k60165k76000R42J02513k5886l1612J38039
35557D93296J44181j13350l14114k51111r4093k0838J6383N2580k253j24208j35298
35546c48825l087R6584R2162J17176K22617K56185J21836o9240j84045j99097
35536A02266j03288J07378K87752K22525p5876l36098l56792j98105o489J64772
35526a91955K93636L10594J78596k7923j75154j72828n2341K8991n4195j96601
35516e9180j61782O5724K29144J92654J26821J48427Q6093j42711k44899j0522
35506B29769K23367L6223l45548l20651J59973M92206K98459r8989k35076j02454
35496C37279K4005L7200K1713K2100k078p2074j45692j36479J0558J94907K04798
$$ plain form
35485 496237 502083 349457 256451 258838 161147 -94146 -275893 -211801 -45228 16687 -493
35474 -493 37589 146846 285121 450751 564712 460544 163628 -35056 20813 94971 -77840
35463 -77840 -377313 -496610 -380101 -211018 -117964 -133958 -289681 -505081 -549884 -357188
35453 -357188 -197863 -279747 -379910 -201131 102073 152233 -30138 -70906 142334 319110
35443 319110 261921 109623 20966 -30120 -53933 37838 202225 229196 47528 -169000 -281268
35432 -281268 -331847 -343703 -230327 840 206024 366866 638314 1010758 1185108 962424
35422 962424 542714 247263 131888 75980 78867 211943 370837 334681 77308 -165044
35412 -165044 -170218 45031 300088 454294 495538 478006 420901 288588 75303 -130884
$$ packed form
35485D96237N846j52626r3006K387r7691k55293j81747O4092J66573O1915j7180
35474d93L8082J09257J38275J65630J13961j04168k96916j98684N5869P4158j72811
35463g7840k99473j19297J16509J69083R3054j5994j55723k15400m4803J92696
35453c57188J59325q1884j00163J78779L03204N0160j82371m0768K13240J76776
35443C19110n7189j52298q8657n1086k3813R1771J64387K6971j81668k16528j12268
35432b81268n0579j1856J13376K31167K05184J60842K71448L72444J74350k22684
35422I62424m19710k95451j15375n5908K887J33076J58894l6156k57373k42352
35412a65044n174K15249K55057J54206M1244j7532n7105j32313k13285k06187
$$ plain form
35402 -130884 -225910 -209845 -155633 -75426 80585 282810 391320 317998 146499 42286
35392 42286 88916 234746 353163 345654 231773 128896 97113 54025 -68635 -153280 -42437
35381 -42437 172387 213945 11802 -174584 -122980 51393 110913 47755 19748 43987 -4492
35370 -4492 -116365 -108910 88580 308006 385910 367929 363704 356327 311796 343873 549421 747962
35358 747962 647801 292360 73646 196628 385209 310732 86195 42948 161866 98874
35348 98874 -234010 -492953 -426729 -250234 -282264 -460285 -489508 -318741 -169467 -151628
35338 -151628 -139565 -58433 -41642 -191967 -357303 -299966 -28001 170635 39811 -362989
35328 -362989 -731564 -834351 -722799 -601422 -558950 -516375 -410713 -297996 -233609 -163188
$$ packed form
35402a30884r5026J6065N4212Q0207J56011K02225J08510p3322j71499j04213
35392D2286M6630J45830J18417p509j13881j02877l1783m3088j22660q4645J10843
35381d2437K14824M1558k02143j86386N1604J74373N9520o3158k8007K4239m8479
35370d492j11873P455J97490K19426P7904j7981m225p377m4531L2077K05548J98541
35358G47962j00161l55441k18714J22982J88581p4477k24537m3247J18918o2992
35348I8874l32884k58943O6224J76495l2030j78021k9223J70767J49274J7839
35338a51628J2063Q1132J6791j50325j65336N7337K71965J98636j30824m02800
35328c62989l68575j02787J11552J21377M2472M2575J05662J12717O4387P0421
$$ plain form
35318 -163188 -14042 171295 271414 226841 100922 22270 70436 176073 160892 -40729
35308 -40729 -241348 -220000 -53311 -28094 -203344 -299753 -123560 136181 199266 79413
35298 79413 -31726 -99753 -220515 -367819 -422341 -395178 -387339 -362671 -193579 77382 248363
35287 248363 248286 207986 213129 192286 103549 34644 35750 27247 -31922 -49147 9178 -16807 -252026
35274 -252026 -521323 -513500 -198557 100517 109026 -69538 -134299 -658 131989 107650 13637
35263 13637 -27821 -83781 -247057 -380617 -282520 -57638 -29995 -250418 -403581 -318762 -245048
35252 -245048 -395601 -524337 -307927 58969 86721 -255686 -459099 -223937 112374 94467
35242 94467 -216533 -400539 -275675 -42241 87832 124448 143202 125264 48634 -9254 16895
$$ packed form
35318a63188J49146J85337J00119m4573j25919p8652M8166J05637j5181k01621
35308d0729k00619K1348J66689K5217j75250r6409J76193K59741O3085j19853
35298G9413j11139o8027j20762j47304n4522K7163P839K4668J69092K70961J70981
35287B48363p7m0300N143k0843q8737o8905J106q503n9169j7225N8325k5985k35219
35274b52026k69297P823L14943K99074Q509j78564o4761J33641J32647k4339r4013
35263A3637m1458n5960j63276j33560R8097K24882K7643k20423j53163Q4819P3714
35252b45048j50553j28736K16410L66896K7752l42407k03413K35162L36311j7907
35242I4467l11000j84006J24864K33434J30073L6616J8754j7938p6630n7888K6149
$$ plain form
35231 16895 45490 -49100 -226384 -295836 -161424 62488 231816 359239 518975 653443
35221 653443 628492 455516 299518 240671 169125 -20134 -233597 -265114 -39167 270701
35211 270701 366845 120236 -226436 -264732 57155 264511 -74668 -730905 -1065653 -835904
35201 -835904 -379448 -4329 349232 698967 740270 291851 -307419 -594477 -547359 -446765
35191 -446765 -397038 -325205 -274339 -333058 -384269 -254049 -22828 107757 154181 254817 345251
35180 345251 260515 76613 10806 44006 -14894 -138581 -118777 18365 1522 -243224 -473341
35169 -473341 -510691 -437754 -354363 -228568 -64251 37028 44859 13112 -81842 -272798 -394151
35158 -394151 -237276 88112 260058 219867 206743 298169 294107 135228 49416 138978 171489
$$ packed form
35231A6895K8595r4590j77284o9452J34412K23912J69328J27423J59736J34468
35221F53443k4951j72976j55998n8847p1546j89259k13463l1517K25947L09868
35211B70701R6144k46609l46672l8296L21887K07356l39179o56237l34748K29749
35201h35904M56456L75119L53561L49735M1303m48419n99270k87058M7118J00594
35191d46765M9727P1833N0866n8719n1211J30220K31221J30585M6424J00636R0434
35180C45251q4736j83902o5807L3200n8900j23687J9804J37142j6843k44746k30117
35169d73341l7350P2937Q3391J25795J64317J01279P831l1747r4954j90956j21353
35158c94151J56875L25388J71946m0191j3124R1426m062j58879q5812Q9562L2511
$$ plain form
35147 171489 -41064 -352341 -541491 -597937 -597586 -549675 -496275 -510121 -494485 -271076 49531
35136 49531 131793 -37619 -63518 218552 433272 255670 -83460 -208101 -164664 -207811
35126 -207811 -309538 -278892 -151752 -84663 -44133 51539 71418 -95960 -243133 -145414 31703
35115 31703 28767 3224 268130 650355 641069 174304 -248029 -271252 -71498 73074 154677
35104 154677 219422 171814 11278 -46631 95587 210395 73894 -208700 -387982 -391245
35094 -391245 -292371 -145037 -15001 -8115 -92715 -47575 240272 567408 673183 561038
35084 561038 375721 120817 -242657 -525248 -457401 -116587 92839 -21116 -180072 -79705
35074 -79705 129886 71193 -266964 -481735 -337592 -99477 -123887 -343672 -413753 -243090
$$ packed form
35147A71489k12553l11277j89150n6446L51M7911N3400j3846J5636K23409L20607
35136D9531Q2262j69412k5899K82070K14720j77602l39130j24641M3437m3147
35126b07811j01727L0646J27140O7089M0530R5672J9879j67378j47173R7719J77117
35115C1703k936k5543K64906L82225r286m66765m22333k3223J99754J44572Q1603
35104A54677O4745m7608j60536n7909J42218J14808j36501k82594j79282l263
35094c91245R8874J47334J30036O886q4600M5140K87847L27136J05775j12145
35084E61038j85317k54904l63474k82591O7847L40814K09426j13955j58956J00367
35074g9705K09591n8693l38157k14771J44143K38115k4410k19785p0081J70663
$$ plain form
35064 -243090 -81619 -98214 -172889 -172454 -148386 -130956 3866 260744 356230 97603 -245962
35053 -245962 -274503 -48244 23255 -142396 -150658 220542 600050 517960 69654 -237407
35043 -237407 -177391 -15947 -33274 -148261 -137921 -7459 55338 -10280 -76110 -60109 -48877
35032 -48877 -132363 -243840 -245004 -86061 183450 462956 578656 349541 -162129 -572707
35022 -572707 -568026 -311540 -209315 -305588 -250892 66807 252730 -6828 -421043 -501734
35012 -501734 -265998 -135059 -260348 -380006 -330017 -273702 -329062 -339671 -183129 -5598
35002 -5598 46695 74538 184766 223885 17644 -275844 -334931 -123204 83144 79573 -86360
34991 -86360 -293897 -462437 -469472 -211701 164501 316635 124668 -120839 -100706 121748
$$ packed form
35064b43090J61471j6595p4675M35K4068J7430J34822K56878R5486k58627l43565
35053b45962k8541K26259P1499j65651q262L71200L79508q2090m48306l07061
35043b37407O0016J61444j7327j14987J0340J30462O2797o5618o5830J6001J1232
35032d8877q3486j11477j164J58943K69511K79506J15700k29115n11670m10578
35022e72707M681K56486J02225r6273N4696L17699J85923k59558m14215q0691
35012e01734K35736J30939j25289j19658M9989N6315n5360j0609J56542J77531
35002e598N2293K7843J10228L9119k06241k93488n9087K11727K06348l571j65933
34991h6360k07537j68540p035K57771L76202J52134j91967k45507K0133K22454
$$ plain form
34981 121748 260103 239726 223173 267983 251071 168809 222904 464972 590807 317027 -168414
34970 -168414 -377785 -111279 332993 545461 427361 190438 79320 157210 280709 245642
34960 245642 7265 -257739 -369228 -360691 -364444 -357040 -207322 54933 242192 297832 348648
34949 348648 416659 332881 53349 -185630 -202736 -144511 -200481 -230665 30829 488538 705135
34938 705135 437475 -67005 -373481 -314448 -86117 12088 -114154 -272891 -219939 25676
34928 25676 196770 147456 54232 132030 303405 338880 221436 154795 257939 449990 608765
34917 608765 660069 542979 281086 68823 89843 255396 313754 207952 115727 134535
34907 134535 156962 87644 -48432 -257571 -585135 -893301 -901944 -599554 -367394 -488127
$$ packed form
34981A21748J38355k0377j6553M4810j6912q2262N4095K42068J25835k73780m85441
34970a68414k09371K66506M44272K12468j18100k36923j11118P7890J23499l5067
34960B45642k38377k65004j11489Q537l753P404J49718K62255J87259N5640N0816
34949C48648O8011q3778k79532k38979j7106N8225n5970l0184K61494M57709K16597
34938G05135k67660n04480l06476N9033K28331R8205j26242j58737N2952K45615
34928B5676J71094m9314r3224P7798J71375L5475j17444o6641J03144J92051J58775
34917F08765N1304j17090k61893k12263K1020J65553N8358j05802r2225J8808
34907A34535K2427o9318j36076k09139l27564l08166q643L02390K32160j20733
$$ plain form
34897 -488127 -730253 -670904 -293520 15913 12040 -148690 -220513 -200979 -238220 -361230 -449426
34886 -449426 -413782 -287695 -142062 -7865 80608 48798 -115782 -255186 -166494 125175
34876 125175 344256 298550 115928 26232 31944 -14297 -99754 -78482 9668 -70335 -369959
34865 -369959 -624923 -622511 -477504 -391118 -340403 -201795 -19352 71534 76348 82955 59663
34854 59663 -67755 -202086 -173636 -29652 9392 -105338 -183076 -123237 -83236 -202542 -353941
34843 -353941 -339422 -205609 -169249 -281541 -359789 -277887 -163929 -212700 -389939 -450726 -249049
34832 -249049 80782 305896 375850 418812 494256 492512 324116 85500 -62037 -100452 -128190
34821 -128190 -169519 -134979 25773 231459 350417 308109 114294 -139115 -301965 -275400
$$ packed form
34897d88127k42126N9349L77384L09433l873j60730p1823J9534l7241j23010q8196
34886d49426L5644J26087J45633J34197Q8473l1810j64580j39404Q8692K91669
34876A25175K19081m5706j82622q9696N712m6241q5457K1272Q8150q0003k99624
34865c69959k54964K412J45007Q6386N0715J38608J82443R0886M814O607k3292
34854E9663j27418j34331K8450J43984L9044j14730p7738N9839M0001j19306j51399
34843c53941J4519J33813L6360j12292p8248Q1902J13958m8771j77239o0787K01677
34832b49049L29831K25114O9954M2962P5444j744j68396k38616j47537l8415k7738
34821a28190m1329L4540J60752K05686J18958m2308j93815k53409j62850K6565
$$ plain form
34811 -275400 -129027 -42251 -96862 -183185 -141070 55843 282720 385120 298508 95236
34801 95236 -66113 -83907 -22088 -26906 -129345 -204798 -153705 -34956 36177 43628 43051 40630
34789 40630 4963 -24120 51771 246107 433754 478403 372158 223048 135006 121185 113494
34778 113494 37666 -112964 -266415 -330097 -259781 -92789 53648 37260 -179190 -434959
34768 -434959 -498510 -341551 -195526 -250698 -397393 -408648 -305014 -328594 -546770 -705586
34758 -705586 -582192 -311196 -199278 -307666 -383924 -190715 214583 535933 514391 165750
34748 165750 -216570 -337886 -211337 -111691 -185536 -253647 -121936 60442 -17156 -342756
34738 -342756 -543759 -393795 -136796 -162240 -487949 -732593 -571746 -98373 294023 323455
$$ packed form
34811b75400J46373Q6776n4611q6323M2115J96913K26877J02400q6612k03272
34801I5236j61349j7794O1819m818j02439p5453N1093J18749P1133P451n77k421
34789D0630l5667k9083P5891J94336J87647M4649j06245j49110q8042j3821p691
34778A13494p5828j50630j53451o3682P0316J66992J46437j6388k16450k55769
34768d34959o3551J56959J46025n5172j46695j1255J03634k3580k18176j58816
34758g05586J23394K70996J11918j08388p6258J93209M05298L21350k1542l48641
34748A65750l82320j21316J26549R9646p3845o8111J31711J82378p7598l25600
34738c42756k01003J49964K56999k5444l25709k44644J60847M73373L92396K9432
$$ plain form
34728 323455 70512 -173910 -253589 -259772 -308323 -349499 -295915 -211738 -202577 -196311 -50063
34717 -50063 145341 110490 -214104 -520913 -507409 -227268 45922 151448 98864 -74012
34707 -74012 -322216 -528950 -566078 -413573 -156392 88443 201095 116245 -77431 -195846
34697 -195846 -184938 -161926 -160897 -25428 293310 520293 380744 21241 -161462 -46293
34687 -46293 136297 220321 275467 315879 171991 -180612 -426080 -274848 133253 416454
34677 416454 434640 363072 351250 352405 306453 275905 317569 367053 341706 250380 116000
34666 116000 -105660 -410705 -621998 -529498 -160061 201208 280903 41258 -343034 -617967
34656 -617967 -568119 -167632 316916 518350 368019 180260 225955 372319 329478 119646
$$ packed form
34728C23455k52943k44422p9679o183m8551m1176N3584Q4177R161O266J46248
34717e0063J95404l4851l24594l06809J3504K80141K73190J05526n2584j72876
34707g4012k48204k06734l7128J52505K57181K44835J12652q4850j93676j18415
34697a95846J0908K3012J029J35469L18738K26983j39549l59503j82703J15169
34687d6293J82590Q4024N5146M0412j43888l52603k45468J51232M08101K83201
34677D16454J8186p1568j1822J155m5952l0548M1664M9484k5347r1326j34380
34666A16000k21660l05045k11293R2500L69437L61269P9695k39645l84292k74933
34656f17967M9848M00487M84548K01434j50331j87759M5695J46364m2841k09832
$$ plain form
34646 119646 32473 168165 324105 363199 395629 491863 495096 295435 66348 15757 71790
34635 71790 41756 -47467 -9993 179960 367000 468625 522207 497426 298974 -9373 -198866
34624 -198866 -172522 -95135 -131964 -204370 -131043 86947 263624 272285 165159 41175 -93219
34613 -93219 -264495 -399824 -367241 -165272 24653 44182 -48996 -78868 17640 169487 328425
34602 328425 489108 566606 440170 168504 -1888 75150 272060 371316 308430 171091
34592 171091 66601 42388 39990 -80957 -343935 -509683 -333957 42517 229995 136342
34582 136342 51706 116458 99374 -112923 -210749 56440 439166 581087 547614 568490 540057
34571 540057 261914 -42424 24374 363850 482746 237935 -11456 -18831 55955 44937
$$ packed form
34646A19646q7173J35692J55940L9094L2430R6234L233j99661k29087n0591N6033
34635G1790l0034q9223L7474J89953J87040J01625N3582k4781j98452l08347j89493
34624a98866K6344P7387l6829p2406P3327K17990J76677Q661j07126j23984j34394
34613i3219j71276j35329L2583K01969J89925J9529r3178k9872R6508J51847J58938
34602C28425J60683P7498j26436k71666j70392P7038J96910R9256o2886j37339
34592A71091j04490k4213k398j20947k62978j65748J75726L76474J87478r3653
34582A36342q4636O4752j7084k12297r7826K67189L82726J41921l3473K0876k8433
34571E40057k78143l04338O6798L39476J18896k44811k49391p375P4786j1018
$$ plain form
34561 44937 34993 115740 218647 299281 370501 335753 138532 52235 370442 791336 649104
34550 649104 -105604 -699342 -552757 -6249 284328 219371 120400 89690 -26199 -234216
34540 -234216 -360931 -318023 -127111 180477 455000 406462 -44718 -554027 -728907 -560753
34530 -560753 -283784 -30220 124865 22559 -344065 -635930 -552428 -275357 -201836 -358449
34520 -358449 -429686 -288620 -142661 -160662 -262589 -307600 -254377 -118201 47897 149575
34510 149575 177353 253571 399848 409338 168330 -66153 -3726 204712 172615 -131293 -360607
34499 -360607 -317163 -132059 68035 285849 397566 171355 -317749 -629746 -500889 -179745
34489 -179745 -52347 -175715 -366717 -525942 -648250 -677308 -577575 -448380 -378815 -283353
$$ packed form
34561D4937r944Q0747J02907Q0634P1220l4748j97221q6297L18207M20894j42232
34550F49104p54708n93738J46585N46508K90577o4957r8971l0710j15889k08017
34540b34216j26715M2908J90912L07588K74523m8538m51180n09309j74880J68154
34530e60753K76969K53564J55085j02306l66624k91865Q3502K77071P3521j56613
34520c58449p1237J41066J45959j8001j01927m5011N3223J36176J66098J01678
34510A49575K7778P6218J46277R490k41008k34483O2427K08438l2097l03908k29314
34499c60607M3444J85104K00094K17814J11717k26211m89104l11997J28857L21144
34489a79745J27398j23368j91002j59225j22308k9058R9733J29195O9565R5462
$$ plain form
34479 -283353 -60823 174521 222356 98796 -7621 -70460 -276864 -665292 -926834 -759044
34469 -759044 -316609 -86763 -300477 -657263 -719692 -426957 -79380 72136 36809 -59433
34459 -59433 -127716 -120106 -51974 -42009 -174515 -312811 -228291 63209 292523 306245 230697
34448 230697 201597 163951 55967 -25669 10096 100496 171920 243607 271620 114060 -195851
34437 -195851 -377198 -292813 -186860 -310591 -524808 -527944 -300313 -64728 42130 23425
34427 23425 -89733 -173542 -18693 353806 585780 455517 232856 255527 395771 327280
34417 327280 98884 -5133 -6634 -148141 -372170 -387253 -210968 -157596 -285658 -331929
34407 -331929 -219346 -162449 -218815 -195682 -68650 -38406 -99932 -26689 131302 43338 -270728
$$ packed form
34479b83353K22530K35344M7835j23560j06417o2839k06404l88428k61542J67790
34469g59044M42435K29846k13714l56786o2429K92735L47577J51516l5327r6242
34459e9433o8283P610O8132R965j32506j38296Q4520K91500K29314J3722p5548
34448B30697k9100l7646j07984q1636L5765R0400P1424P1687K8013j57560l09911
34437a95851j81347Q4385J05953j23731k14217l136K27631K35585J06858j8705
34427B3425j13158q3809J54849L72499K31974j30263k22661K2671J40244o8491
34417C27280k28396j04017j501j41507k24029j5083J76285N3372j28062m6271
34407c31929J12583N6897n6366K3133J27032L0244o1526P3243J57991q7964l14066
$$ plain form
34396 -270728 -334947 37899 396460 322374 -4296 -215143 -295781 -368507 -323874 -65186
34386 -65186 188114 221956 187382 285248 357465 169212 -134099 -237530 -130955 -4393
34376 -4393 138807 369567 497466 279800 -114485 -257603 -56338 168839 192954 128502
34366 128502 123142 131770 76323 -10618 -92035 -194480 -301350 -325727 -245092 -147688 -104701
34355 -104701 -86808 -41420 4950 -43969 -232233 -434271 -438038 -231799 -88267 -173621 -214501
34344 -214501 107911 526884 448996 -101503 -374918 20782 492704 335889 -250506 -559805
34334 -559805 -416658 -203571 -106592 5659 83286 -61187 -235173 -29478 442734 578773
34324 578773 187405 -216040 -201034 38671 180809 278373 429055 413557 96143 -170018
$$ packed form
34396b70728o4219L72846L58561p4086l26670k10847q0638p2726M4633K58688
34386f5186K53300L3842l4574R7866P2217j88253l03311j03431J06575J26562
34376d393J43200K30760J27899k17666l94285j43118K01265K25177K4115o4452
34366A28502n360Q628n5447q6941q1417j02445j06870k4377Q0635R7404M2987
34355a04701J7893M5388M6370m8919j88264k02038l767K06239J43532q5354m0880
34344b14501L22412M18973p7888n50499k73415L95700M71922j56815n86395l09299
34334e59805J43147K13087R6979J12251P7627j44473j73986K05695M72212J36039
34324E78773l91368m03445J5006K39705J42138R7564J50682j5498l17414k66161
$$ plain form
34314 -170018 810 419573 624677 588382 626625 722700 503041 -44711 -355913 -50525
34304 -50525 466004 521543 81203 -268802 -180975 31284 -39371 -267240 -239534 79386
34294 79386 314811 262168 114521 52248 -9663 -102852 -7324 345553 578683 350763 -73903
34283 -73903 -145515 197756 493235 450601 268947 213409 258234 269280 233245 168950 52847
34272 52847 -54456 -25005 100566 106681 -79187 -267544 -291551 -213630 -166733 -178732 -227759
34261 -227759 -287152 -254112 -22499 316615 526807 509308 356318 151820 -39850 -44995
34251 -44995 218569 434433 205004 -276971 -358928 127240 569923 479370 154989 66502
34241 66502 75221 -170226 -440582 -207362 448943 869538 744313 426665 256916 113883
$$ packed form
34314a70018J70828M18763K05104l6295L8243R6075k19659n47752l11202L05388
34304e0525N16529N5539m40340l50005Q7827K12259p0655k27869K7706L18920
34294G9386K35425n2643j47647o2273o1911r3189R5528L52877K33130k27920m24666
34283g3903p1612L43271K95479m2634j81654n5538M4825J1046l6035o4295j16103
34272E2847j07303K9451J25571O115j85868j88357k4007P7921M6897j1999m9027
34261b27759n9393L3040K31613L39114K10192j7499j52990k04498j91670n145
34251d4995K63564K15864k29429m81975q1957M86168M42683r0553l24381q8487
34241F6502Q719k45447k70356K33220O56305M20595j25225l17648j69749j43033
$$ plain form
34231 113883 -190175 -519968 -656952 -605591 -459120 -234194 -21773 -40559 -326023 -567965
34221 -567965 -469026 -119229 165557 245512 216384 171472 98638 -12678 -107328 -127443 -76854
34210 -76854 -16637 -5276 -17091 57093 260360 451935 449929 283170 171698 237557 360827
34199 360827 358646 191405 -52461 -268912 -379497 -344058 -190580 1379 147465 158281
34189 158281 -31810 -331799 -471254 -277547 67732 229138 137890 9973 -16911 -2053
34179 -2053 46351 225343 451986 430570 75900 -283870 -324354 -127816 35961 119752 240400
34168 240400 378579 409635 330126 216341 59584 -126896 -157012 97486 408689 413094
34158 413094 92370 -227638 -313281 -190282 65758 383674 559679 415388 126643 48400
$$ packed form
34231A13883l04058l29793j36984N1361J46471K24926K12421j8786k85464k41942
34221e67965R8939L49797K84786P9955k9128m4912p2834j11316r4650k0115N0589
34210g6854O0217J1361j1815P4184K03267J91575k006j66759j11472O5859J23270
34199C60827k181j67241k43866k16451j10585L5439J53478J91959J46086J0816
34189A58281j90091k99989j39455J93707L45279J61406r1248j27917k6884J4858
34179b053M8404J78992K26643k1416l54670l59770m0484J96538J63777Q3791J20648
34168B40400J38179L1056p9509j13785j56757j86480l0116K54498L11203M405
34158D13094l20724l20008q5643J22999K56040L17916J76005j44291k88745p8243
$$ plain form
34148 48400 163071 94440 -224471 -344239 4209 425453 435622 194544 216242 557841
34138 557841 784757 671962 467592 406052 366802 160496 -154905 -417058 -593579 -702370
34128 -702370 -662999 -403922 -34485 224250 254201 128974 19363 22939 50910 -79821
34118 -79821 -380505 -602321 -542406 -343948 -291912 -378832 -339258 -107737 65248 34151 -5579
34107 -5579 141796 361077 467536 535372 717747 894096 798230 439351 121352 45083
34097 45083 134375 286674 549884 932713 1225843 1211544 1009283 1037132 1547901 2277735
34087 2277735 2676040 2496465 2030104 1673793 1426956 1029659 497067 177708 219949 317287
34077 317287 175232 -44727 -16623 220846 352841 293422 259809 360376 429384 336744
$$ packed form
34148D8400J14671o8631l18911j19768L48448M21244J0169k41078K1698L41599
34138E57841K26916j12795k04370o1540l9250k06306l15401k62153j76521j08791
34128g02370L9371K59077L69437K58735K9951j25227j09611L576K7971j30731
34118g9821l00684k21816N9915J98458N2036q6920L9574K31521J72985l1097l9730
34107e579J47375K19281J06459O7836J82375J76349r5866l58879l17999p6269
34097D5083Q9292J52299K63210L82829K93130j4299k02261K7849N10769P29834
34087B277735L98305j79575m66361l56311k46837l97297n32592l19359M2241R7338
34077C17287j42055k19959K8104K37469J31995n9419l3613J00567O9008r2640
$$ plain form
34067 336744 197621 156846 153953 35343 -208530 -423034 -454787 -285497 -32707 168394
34057 168394 288031 360615 333606 111817 -193828 -284146 -96775 19072 -192093 -431468
34047 -431468 -251816 235565 505708 404469 292494 373929 412668 276991 244976 473615
34037 473615 614065 341266 -87859 -230538 -130137 -132654 -247833 -203679 -27462 -43162
34027 -43162 -277519 -366242 -168039 -31727 -243847 -555825 -524421 -100449 368380 585797
34017 585797 553746 453280 435860 494061 465653 233885 -50165 -86277 169874 383678
34007 383678 242194 -156493 -451543 -446541 -239902 -18505 108618 111494 32941 -16607 31043
33996 31043 103789 91152 11841 -30953 -30756 -76254 -170808 -205992 -158251 -169093 -338911 -542592
$$ packed form
34067C36744j39123m0775k893j18610k43873k14504l1753J69290K52790K01101
34057A68394J19637P2584k7009k21789l05645r0318J87371J15847k11165k39375
34047d31468J79652M87381K70143j01239j11975Q1435L8739j35677l2015K28639
34037D73615J40450k72799m29125j42679J00401k517j15179M4154J76217j5700
34027d3162k34357q8723J98203J36312k12120l11978L1404M23972M68829K17417
34017E85797l2051j00466j7420N8201k8408k31768k84050l6112K56151K13804
34007C83678j41484l98687k95050N002K06639K21397J27123K876p8553m9548M7650
33996C1043P2746j2637p9311m2794J97m5498r4554l5184M7741j0842j69818k03681
$$ plain form
33984 -542592 -560750 -341948 -41671 160554 196682 102162 -20724 -39311 104789 304442
33974 304442 381503 296530 188044 178135 226949 228324 164622 92156 39688 10878 42107 159892
33962 159892 299196 354456 314364 277771 333708 475578 617948 647716 495893 232120
33952 232120 50729 71379 182667 182209 37166 -117049 -205289 -277805 -342555 -310986 -162981
33941 -162981 -3811 113034 260488 446584 514916 371403 173628 134733 240127 318713
33931 318713 305164 253203 158145 -28081 -222227 -247492 -72973 148263 312710 473997
33921 473997 655936 719603 543859 249141 101812 202177 360783 317025 38867 -242645
33911 -242645 -307765 -208695 -183402 -322710 -448724 -386724 -228101 -182801 -257152 -267323 -151312
$$ packed form
33984e42592j8158K18802L00277K02225L6128r4520j22886j8587J44100J99653
33974C04442P7061q4973j08486r909M8814J375o3702p2466n2468k8810L1229J17785
33962A59892J39304N5260m0092l6593N5937J41870J42370K9768j51823k63773
33952B32120j81391K0650J11288m58j45043j54215q8240p2516o4750L1569J48005
33941a62981J59170J16845J47454J86096O8332j43513j97775l8895J05394P8586
33931C18713j3549n1961r5058j86226j94146k5265J74519K21236J64447J61287
33921D73997J81939O3667j75744k94718j47329J00365J58606m3758k78158k81512
33911b42645o5120R9070K5293j39308j26014O2000J58623M5300p4351j0171J16011
$$ plain form
33900 -151312 -66105 -131374 -258713 -321903 -337296 -352995 -296914 -106454 75518 36816 -179941
33889 -179941 -281553 -108908 144630 203266 68771 -40629 -32062 -21671 -69857 -35937 195651
33878 195651 484937 582171 429553 176153 -46802 -200382 -227892 -79500 124818 166911
33868 166911 55804 93190 469151 938730 1084088 813015 413057 155777 37250 -75995
33858 -75995 -212152 -282206 -219524 -68463 43243 11098 -146538 -308323 -378641 -352964 -254573
33847 -254573 -104868 10540 -20111 -147833 -154890 40253 210664 124122 -115748 -254600
33837 -254600 -297989 -443470 -652942 -635928 -318231 -8828 31627 -85604 -149340 -184833
33827 -184833 -288758 -333707 -123226 259697 520548 528128 408363 304596 256872 293646
$$ packed form
33900a51312Q5207o5269j27339o3190j5393j5699N6081J90460J81972l8702k16757
33889a79941j01612J72645K53538N8636j34495j09400Q567J0391m8186L3920K31588
33878A95651K89286R7234j52618k53400k22955j53580k7510J48392K04318M2093
33868A66911j11107L7386L75961M69579J45358k71073l99958k57280j18527j13245
33858g5995j36157p0054O2682J51061J11706l2145j57636j61785p0318K5677R8391
33847b54573J49705J15408l0651j27722p057J95143J70411q6542k39870j38852
33837b54600m3389j45481k09472J7014L17697L09403M0455j17231o3736l5493
33827a84833j03925m4949K10481L82923K60851P580j19765j03767m7724L6774
$$ plain form
33817 293646 417812 486909 322709 -10538 -226646 -174856 1183 119918 175382 195547
33807 195547 97995 -147776 -384918 -488243 -567660 -728781 -778844 -481733 -27077 128247
33797 128247 -83093 -222758 -12665 261636 243488 52418 3323 63414 15549 -36238
33787 -36238 167422 446982 310108 -249724 -609575 -379582 50269 115646 -159124 -355933
33777 -355933 -309631 -166568 -21911 100749 61176 -221438 -515134 -562011 -511667 -680410
33767 -680410 -964159 -934813 -520185 -138571 -70602 -116351 -29928 87463 53298 -42860 -14755
33756 -14755 98222 129610 69482 36715 54306 28040 -84384 -187625 -123262 170530 514971
33745 514971 573097 225565 -205658 -326949 -206667 -248236 -549702 -753642 -612227 -329377
$$ packed form
33817B93646J24166O9097j64200l33247k16108N1790J76039J18735N5464K0165
33807A95547r7552k45771k37142j03325p9417j61121n0063K97111M54656J55324
33797A28247k11340j39665K10093K74301j8148j91070m9095O0091m7865n1787
33787c6238K03660K79560j36874n59832l59851K29993M29851O5377k74770j96809
33777c55933M6302J43063J44657J22660l9573k82614k93696m6877N0344j68743
33767f80410k83749K9346M14628L81614O7969m5749Q6423J17391l4165r6158K8105
33756a4755J12977L1388o0128l2767J7591k6266j12424j03241O4363K93792L44441
33745E14971N8126l47532m31223j21291J20282m1569l01466k03940J41415K82850
$$ plain form
33735 -329377 -175931 -103868 33482 168154 178489 130955 119546 69280 -77917 -191478
33725 -191478 -187121 -211607 -360502 -451295 -342588 -227587 -291767 -323720 -56081 303883 332053
33714 332053 64620 -40753 201990 478472 474685 235010 -35464 -192888 -121336 207256
33704 207256 568106 656267 477441 308002 260658 198983 94595 102274 208330 180852 -5719
33693 -5719 -69762 79437 107988 -233291 -680632 -827965 -676888 -515113 -445500 -354846 -221914
33682 -221914 -149993 -153586 -162641 -193725 -303128 -413262 -382986 -221016 -64176 17292 44683
33671 44683 20234 -51468 -88238 -37415 -10334 -152782 -424149 -654047 -763701 -769475 -631872
33660 -631872 -314033 21999 102286 -112013 -331413 -276576 1562 214130 166883 -65146
$$ packed form
33735c29377J53446P2063J37350J34672J0335m7534j1409n0266j47197j13561
33725a91478M357k4486j48895r0793J08707J15001o4180l1953K67639L59964K8170
33714C32053k67433j05373K42743K76482l787k39675k70474j57424P1552L28592
33704B07256L60850Q8161j78826j69439m7344o1675j04388P679J06056k7478j86571
33693e719o4043J49199K8551l41279m47341j47333J51077J61775O9613R0654J32932
33682b21914P1921l593r055l1084j09403j10134L0276J61970J56840Q1468K7391
33671D4683k4449p1702l6770N0823K7081j42448k71367k29898j09654n774J37603
33660f31872L17839L36032Q0287k14299k19400N4837K78138K12568m7247k32029
$$ plain form
33650 -65146 -248444 -227136 -59917 67281 52687 -47399 -155309 -265965 -339140 -236564
33640 -236564 79443 372122 346684 21484 -286385 -345677 -217535 -66178 58242 184571
33630 184571 311415 415782 479132 456754 315793 134857 49807 62403 36467 -61379 -75448
33619 -75448 81765 237088 178220 -37561 -172532 -141467 -70660 -52619 -35712 19029 50376
33608 50376 30304 36082 103798 135211 55739 -33772 14893 179916 298398 277861 176290
33597 176290 98418 104523 188894 252117 139857 -165187 -428934 -407066 -194311 -141724 -382082
33586 -382082 -637746 -600775 -317976 -51686 77628 119740 97939 12032 -43441 -4717 -37822
33575 -37822 -353046 -818629 -1030281 -827195 -484898 -301358 -251861 -202925 -205039 -330203
$$ packed form
33650f5146j83298K1308J67219J27198j4594j00086j07910j10656p3175J02576
33640b36564L16007K92679k5438l25200l07869n9292J28142J51357J24420J26329
33630A84571J26844J04367O3350k2378j40961j80936q5050J2596k5936r7846j4069
33619g5448J57213J55323n8868k15781j34971L1065P0807J8041J6907N4741L1347
33608E0376k0072N778O7716L1413p9472q9511M8665J65023J18482k0537j01571
33597A76290p7872O105Q4371O3223j12260l05044k63747K1868K12755N2587k40358
33586c82082k55664L6971K82799K66290J29314M2112k1801q5907n5473L8724l3105
33575c7822l15224m65583k11652K03086L42297J83540M9497M8936k114j25164
$$ plain form
33565 -330203 -421121 -307677 -155423 -262974 -542676 -555933 -148532 270466 269296 -36492
33555 -36492 -212831 -143149 -110229 -269714 -381555 -206687 80726 125000 -87223 -211893
33545 -211893 -55265 165312 161475 -47746 -254333 -370864 -404159 -269421 70637 341727
33535 341727 179576 -323158 -616719 -388536 31959 173861 62267 49910 209819 288783
33525 288783 203950 181176 325777 402066 201174 -131812 -326283 -344924 -320169 -293270 -235277
33514 -235277 -218448 -332309 -471858 -427391 -194287 -8941 -39736 -196709 -298079 -286345
33504 -286345 -205229 -76715 99722 287778 433992 508018 475112 290899 -2878 -224162
33494 -224162 -188715 86198 366730 406408 159559 -180271 -336446 -188606 105364 262317
$$ packed form
33565c30203r0918J13444J52254j07551k79702j3257M07401M18998j170l05788
33555c6492j76339O9682L2920j59485j11841J74868K87413M4274k12223j24670
33545b11893J56628K20577l837k09221k06587j16531l3295J34738L40058K71090
33535C41727j62151n02734k93561K28183M20495J41902j11594j2357J59909P8964
33525B88783q4833k2774J44601P6289k00892l32986j94471j8641K4755K6899N7993
33514b35277J6829j13861j39549M4467K33104J85346l0795j56973j01370J1734
33504b86345Q1116J28514J76437J88056J46214P4026l2906j84213k93777k21284
33494b24162L5447K74913K80532L9678k46849l39830j56175J47840K93970J56953
$$ plain form
33484 262317 175932 7121 -60505 -51546 -89265 -157446 -137884 -36065 25917 42602 142369
33473 142369 324347 399054 297410 220124 308032 365413 162384 -130654 -127162 195650 420091
33462 420091 247655 -140036 -386261 -386327 -265950 -138311 -68989 -134520 -312627 -401230 -236063
33451 -236063 53978 165781 -29765 -378837 -637091 -651304 -418632 -119903 -37769 -262971
33441 -262971 -522570 -505897 -333281 -426091 -852910 -1112706 -769082 -69299 349167 241759
33431 241759 -54010 -162312 -80334 3666 784 -108280 -341111 -562187 -478732 -32356
33421 -32356 371843 317856 -54393 -262590 -185110 -143088 -262541 -237735 71177 262327
33411 262327 -14809 -431366 -413854 1072 260253 152359 27142 107357 119829 -176610
$$ packed form
33484B62317q6385j68811o7626Q959l7719o8181J9562J01819O1982J6685R9767
33473A42369J81978P4707j01644p7286Q7908N7381k03029k93038L492L22812K24441
33462D20091j72436l87691k46225o6J20377J27639O9322o5531j78107q8603J65167
33451b36063K90041J11803j95546l49072k58254j4213K32672K98729Q2134k25202
33441b62971k59599J6673J72616r2810m26819k59796L43624O99783M18466j07408
33431B41759k95769j08302Q1978Q4000k882j09064k32831k21076Q3455M46376
33421c2356M04199n3987l72249k08197P7480M2022j19453K4806L08912J91150
33411B62327k77136m16557J7512M14926K59181j07894j25217Q0215J2472k96439
$$ plain form
33401 -176610 -537226 -612531 -472477 -425912 -523231 -545732 -370981 -101937 87629 69016
33391 69016 -164440 -397578 -336225 -2746 212645 75877 -160198 -193358 -168522 -379365
33381 -379365 -699509 -763184 -583423 -497070 -534323 -367359 45974 295719 185921 84778
33371 84778 314561 596250 483008 59035 -204641 -117325 96926 223807 240046 116793
33361 116793 -183571 -476652 -458783 -146836 62391 -84564 -350848 -373689 -187807 -129692
33351 -129692 -301547 -411466 -207251 149102 293217 124430 -125973 -255066 -309575 -385054
33341 -385054 -390149 -174134 200414 485113 524050 370670 155103 -15298 -38250 123277
33331 123277 330250 378392 269228 213045 300315 347007 182498 -63599 -127712 24144
$$ packed form
33401a76610l60616p5305J40054M6565r7319k2501J74751K69044J89566j8613
33391F9016k33456k33138O1353L33479K15391j36768k36075l3160K4836k10843
33381c79365l20144o3675J79761Q6353l7253J66964M13333K49745j09798j01143
33371H4778K29783K81689j13242m23973k63676Q7316K14251J26881J6239j23253
33361A16793l00364k93081J7869L11947K09227j46955k66284k2841J85882N8115
33351a29692j71855j09919K04215L56353J44115j68787k50403j29093n4509p5479
33341c85054n095K16015L74548K84699L8937j53380k15567j70401k2952J61527
33331A23277K06973M8142j09164n6183Q7270M6692j64509k46097o4113J51856
$$ plain form
33321 24144 165054 112895 -56787 -109257 95506 431110 578126 348116 -54369 -230082
33311 -230082 -91704 10773 -210616 -549552 -582978 -245768 130178 284336 256274 141554
33301 141554 -97115 -469803 -821102 -991725 -987795 -882935 -678267 -379379 -106444 11145
33291 11145 -6425 -43304 -41169 7321 143579 365975 500693 339273 -45111 -284586 -132835
33280 -132835 219484 387224 270747 110607 82322 61662 -112119 -332618 -375518 -248562
33270 -248562 -175793 -254445 -333201 -264679 -96893 48926 126319 109564 -43685 -259313 -323095
33259 -323095 -141128 85419 103684 -62175 -191380 -194101 -159656 -124025 -19616 118038
33249 118038 111590 -96239 -301879 -279977 -61513 133634 167464 82489 -21367 -99022 -149679
$$ packed form
33321B4144J40910n2159j69682n2470K04763L35604J47016k30010m02485j75713
33311b30082J38378J02477k21389l38936l3426L37210L75946J54158k8062j14720
33301A41554k38669l72688l51299j70623L930J04860K04668K98888K72935J17589
33291A1145j7570l6879K135M8490J36258K22396J34718j61420l84384k39475J51751
33280a32835L52319J67740j16477j60140k8285k0660j73781k20499m2900J26956
33270b48562P2769p8652p8756O8522J67786J45819P7393j6755j53249k15628o3782
33259c23095J81967K26547J8265j65859j29205k721L4445L5631J04409J37654
33249A18038o448k07829k05640K1902K18464J95147L3830q4975j03856p7655n0657
$$ plain form
33238 -149679 -173824 -172812 -165150 -181308 -234965 -291720 -274618 -127858 110250 305844 318067
33227 318067 117400 -158299 -290099 -182755 12570 50763 -115161 -279208 -253414 -89015
33217 -89015 43728 88919 102455 99140 52377 13839 86309 263771 405063 383661 193124
33206 193124 -79495 -303634 -355585 -217439 -15065 122223 209619 331031 467981 518093
33196 518093 446059 305028 154205 66154 135041 323940 393057 185380 -89402 -106991
33186 -106991 84459 134624 -45314 -141553 34598 222918 125097 -136721 -230794 -92664
33176 -92664 69711 119111 93692 46310 -15345 -75843 -145600 -280355 -457331 -544032 -499814
33165 -499814 -453680 -453211 -338641 -51903 154690 82286 -50678 55008 245898 127158
$$ packed form
33238a49679k4145J012P662j6158n3657n6755J7102J46760K38108J95594J2223
33227C18067k00667k75699j31800J07344J95325L8193j65924j64047K5794J64399
33217h9015J32743M5191J3536l315m6763l8538P2470J77462J41292k1402j90537
33206A93124k72619k24139n1951J38146K02374J37288Q7396J21412J36950N0112
33196E18093p2034j41031j50823q8051O8887J88899O9117k07677k74782j7589
33186a06991J91450N0165j79938r6239J76151J88320r7821k61818r4073J38130
33176i2664J62375M9400k5419m7382o1655o0498o9757j34755j76976q6701M4218
33165d99814M6134M69J14570K86738K06593p2404j32964J05686J90890j18740
$$ plain form
33155 127158 -277934 -528793 -448098 -359652 -527599 -758762 -768776 -625603 -580296 -676042
33145 -676042 -755909 -707349 -518539 -229809 21289 49279 -147411 -349222 -427370 -507551
33135 -507551 -677267 -748065 -536855 -210243 -77050 -150500 -198967 -165094 -228850 -439099
33125 -439099 -570320 -446496 -195549 -53892 -65368 -106343 -111366 -135245 -224342 -336041 -395071
33114 -395071 -362392 -233229 -24864 192189 292281 203190 22242 -62869 -7573 30833
33104 30833 -66075 -201445 -253700 -307278 -474547 -586845 -370347 76160 317581 178954
33094 178954 -31518 -44740 -25513 -192326 -361039 -232085 78817 196689 61050 -41854
33084 -41854 34113 151898 229036 349005 483149 442829 208139 15358 14543 100813 173948
$$ packed form
33155A27158m05092k50859Q0695Q8446j67947k31163j0014J43173M5307r5746
33145f76042p9867M8560J88810K88730K51098K7990j96690k01811p8148q0181
33135e07551j69716p0798K11210L26612J33193p3450m8467L3873o3756k10249
33125d39099j31221J23824K50947J41657j1476m0975n023k3879q9097j11699n9030
33114c95071L2679J29163K08365K17053J00092q9091j80948q5111N5296L8406
33104C0833r6908j35370n2255n3578j67269j12298K16498M46507K41421j38627
33094A78954k10472j3222J9227j66813j68713J28954L10902J17872j35639j02904
33084d1854P5967J17785P7138J19969J34144m0320k34690j92781q15Q6270P3135
$$ plain form
33073 173948 289223 436746 447001 265585 77719 14905 -14177 -52962 55969 340810
33063 340810 496552 295726 -20825 -76542 103657 228515 251657 346540 460572 344255
33053 344255 49719 -43418 169753 295098 34979 -339374 -406194 -209414 -96164 -125593
33043 -125593 -64541 85498 12783 -342253 -546506 -247110 290588 528082 364327 155742
$$ packed form
33073A73948J15275J47523J0255j81416j87866o2814k9082l8785J08931K84841
33063C40810J55742k00826l16551n5717J80199J24858K3142R4883J14032j16317
33053C44255k94536r3137K13171J25345k60119l74353o6820J96780J13250k9429
33043a25593O1052J50039p2715l55036k04253K99396N37698K37494j63755k08585
$$ [...]
##END NTUPLES=NMR SPECTRUM
##END=
