##TITLE=31Pdec_SR115_k3
 CDCl3, 124 sc
 8.7.2022
##JCAMPDX= 6.0         $$ Bruker NMR JCAMP-DX V2.0
##DATA TYPE= NMR SPECTRUM
##DATA CLASS= NTUPLES
##ORIGIN= UXNMR, Bruker Analytische Messtechnik GmbH
##OWNER= root
$$ XWIN-NMR		Version 3.5
$$ Fri Jul  8 15:59:18 2022 Russian Standard Time (UT+4h)  she@DPX200
##.OBSERVE FREQUENCY= 81.013821
##.OBSERVE NUCLEUS= ^31P
##.ACQUISITION MODE= SIMULTANEOUS
##.ACQUISITION SCHEME= undefined
##.AVERAGES= 124
##.DIGITISER RES= 16
##SPECTROMETER/DATA SYSTEM= spect
##.PULSE SEQUENCE= zgpg30
##.SOLVENT NAME= CDCl3
##.SHIFT REFERENCE= (INTERNAL, CDCl3, 0, 248.564)
##AUDIT TRAIL= $$ (NUMBER, WHEN, WHO, WHERE, WHAT)
$$ ##TITLE= Audit trail, XWIN-NMR		Version 3.5
$$ ##JCAMPDX= 5.01
$$ ##ORIGIN= Bruker BioSpin GmbH
$$ ##OWNER= she
$$ F:/spectra/data/she/nmr/P31/1/pdata/1/auditp.txt
$$ ##AUDIT TRAIL=  $$ (NUMBER, WHEN, WHO, WHERE, WHAT)
(   1,<2022-07-08 15:58:12.06 +0400>,<she>,<DPX200>,
      <continue with go, POWCHK disabled, PULCHK disabled
       configuration hash MD5:
       00 E9 B6 7A A2 85 ED C7 34 08 36 98 17 FE 4E 26
       data hash MD5: 32K
       2A BD BA 92 B6 D3 8F B9 D3 98 4F 10 66 EB A3 31>)
(   2,<2022-07-08 15:58:13.87 +0400>,<she>,<DPX200>,
      <Start of raw data processing
       efp BC_mod = 2 LB = 1 FT_mod = 6 PKNL = 1 PHC0 = -9903.883 PHC1 = 26.45667 SI = 64K 
       data hash MD5: 64K
       8A 92 19 0B 87 BE 74 FB 23 9A 17 2D 46 EA 44 30>)
(   3,<2022-07-08 15:58:38.90 +0400>,<she>,<DPX200>,
      <pk PHC0 = -541.8992 PHC1 = 511.0001 
       data hash MD5: 64K
       BF B1 BA 61 EA 88 1F DD 13 71 82 48 F7 97 37 63>)
(   4,<2022-07-08 15:58:43.20 +0400>,<she>,<DPX200>,
      <abs ABSG = 5 
       data hash MD5: 64K
       55 96 D7 A3 04 5A E0 E9 F6 5A 30 C9 C8 EE 24 C2>)
$$ ##END=
$$ 
$$ hash MD5
$$ F7 D7 49 BA 49 4B 49 79 45 26 E8 88 0B 95 8E AA
##$RELAX= 
##$RELAX= 
##$RELAX= 
##$RELAX= 
##$RELAX= 
##$RELAX= 
##$RELAX= 
##$RELAX= 
$$ Bruker specific parameters
$$ --------------------------
##$DU= <F:/spectra>
##$EXPNO= 1
##$NAME= <P31>
##$PROCNO= 1
##$TYPE= <nmr>
##$USER= <she>
##$AMP= (0..31)
100 100 100 100 100 100 100 100 100 100 100 100 100 100 100 100 100 100 
100 100 100 100 100 100 100 100 100 100 100 100 100 100 
##$AQSEQ= 0
##$AQ_mod= 1
##$AUNM= <au_zg>
##$AUTOPOS= <>
##$BF1= 81.014009
##$BF2= 200.13
##$BF3= 200.13
##$BF4= 200.13
##$BF5= 200.13
##$BF6= 200.13
##$BF7= 200.13
##$BF8= 200.13
##$BYTORDA= 1
##$CFDGTYP= 0
##$CFRGTYP= 5
##$CHEMSTR= <none>
##$CNST= (0..31)
1 1 145 1 1 1 1 1 1 1 1 1 1 1 1 1 1 1 1 1 1 1 1 1 1 1 1 1 1 1 1 1 
##$CPDPRG= <waltz16>
##$CPDPRG1= <>
##$CPDPRG2= <waltz16>
##$CPDPRG3= <>
##$CPDPRG4= <mlev>
##$CPDPRG5= <mlev>
##$CPDPRG6= <mlev>
##$CPDPRG7= <mlev>
##$CPDPRG8= <mlev>
##$CPDPRGB= <>
##$CPDPRGT= <>
##$D= (0..31)
0 1 0 0 0 0 0 0 0 0 0 0.03 2e-05 3e-06 0 0 0 0 0 0 0 0 0 0 0 0 0 0 0 0 
0 0 
##$DATE= 1657281329
##$DBL= (0..7)
120 120 120 11 120 120 24 19 
##$DBP= (0..7)
150 150 150 150 150 150 150 150 
##$DBP07= 0
##$DBPNAM0= <>
##$DBPNAM1= <>
$$ [...]
##$SUBNAM3= <"">
##$SUBNAM4= <"">
##$SUBNAM5= <"">
##$SUBNAM6= <"">
##$SUBNAM7= <"">
##$SUBNAM8= <"">
##$SUBNAM9= <"">
##$SW= 501.771253377433
##$SWIBOX= (0..15)
0 1 3 0 0 0 0 0 0 0 0 0 0 0 0 0 
##$SW_h= 40650.406504065
##$TD= 32768
##$TD0= 1
##$TE= 0
##$TE2= 300
##$TE3= 300
##$TEG= 300
##$TL= (0..7)
0 120 53 12 22 120 120 120 
##$TP= (0..7)
150 150 150 150 150 150 150 150 
##$TP07= 0
##$TPNAME0= <>
##$TPNAME1= <>
##$TPNAME2= <>
##$TPNAME3= <>
##$TPNAME4= <>
##$TPNAME5= <>
##$TPNAME6= <>
##$TPNAME7= <>
##$TPOAL= (0..7)
0.5 0.5 0.5 0.5 0.5 0.5 0.5 0.5 
##$TPOFFS= (0..7)
0 0 0 0 0 0 0 0 
##$TUNHIN= 0
##$TUNHOUT= 0
##$TUNXOUT= 0
##$USERA1= <user>
##$USERA2= <user>
##$USERA3= <user>
##$USERA4= <user>
##$USERA5= <user>
##$V9= 5
##$VALIST= <valist>
##$VCLIST= <CCCCCCCCCCCCCCC>
##$VD= 0
##$VDLIST= <DDDDDDDDDDDDDDD>
##$VPLIST= <PPPPPPPPPPPPPPP>
##$VTLIST= <TTTTTTTTTTTTTTT>
##$WBST= 1024
##$WBSW= 4
##$XGAIN= (0..3)
0 0 0 0 
##$XL= 0
##$YL= 0
##$YMAX_a= 4615
##$YMIN_a= -5729
##$ZGOPTNS= <>
##$ZL1= 120
##$ZL2= 120
##$ZL3= 120
##$ZL4= 120
##$ABSF1= 248.5645
##$ABSF2= -253.2056
##$ABSG= 5
##$ABSL= 3
##$ALPHA= 0
##$AQORDER= 0
##$ASSFAC= 0
##$ASSFACI= 0
##$ASSFACX= 0
##$ASSWID= 0
##$AUNMP= <proc_1d>
##$AZFE= 0.1
##$AZFW= 0.5
##$BCFW= 0
##$BC_mod= 2
##$BYTORDP= 0
##$COROFFS= 0
##$CY= -3
##$DATMOD= 1
##$DC= 0
##$DFILT= <>
##$DTYPP= 0
##$F1P= 0
##$F2P= 0
##$FCOR= 1
##$FTSIZE= 65536
##$FT_mod= 6
##$GAMMA= 0
##$GB= 0
##$INTBC= 1
##$INTSCL= 5.30512e-09
##$ISEN= 30
##$LB= 1
##$LEV0= 0
##$LPBIN= 0
##$MAXI= 10000
##$MC2= 0
##$MEAN= 0
##$ME_mod= 0
##$MI= 50
##$NCOEF= 0
##$NC_proc= -8
##$NLEV= 6
##$NOISF1= 182.463
##$NOISF2= 159.3651
##$NSP= 0
##$NTH_PI= 0
##$NZP= 0
##$OFFSET= 248.5645
##$PC= 4
##$PHC0= -10445.78
##$PHC1= 537.4568
##$PH_mod= 1
##$PKNL= yes
##$PPARMOD= 0
##$PSCAL= 0
##$PSIGN= 0
##$REVERSE= no
##$SF= 81.014009
##$SI= 65536
##$SIGF1= 159.3651
##$SIGF2= -187.1042
##$SINO= 113.3802
##$SIOLD= 16384
##$SREGLST= <1H.CDCl3>
##$SSB= 0
##$STSI= 65536
##$STSR= 0
##$SW_p= 40650.406504065
##$SYMM= 0
##$S_DEV= 0
##$TDeff= 32768
##$TDoff= 0
##$TI= <>
##$TILT= no
##$TM1= 0
##$TM2= 0
##$TOPLEV= 0
##$USERP1= <user>
##$USERP2= <user>
##$USERP3= <user>
##$USERP4= <user>
##$USERP5= <user>
##$WDW= 1
##$XDIM= 65536
##$YMAX_p= 567138509
##$YMIN_p= -55413067
$$ End of Bruker specific parameters
$$ ---------------------------------
##NTUPLES= NMR SPECTRUM
##VAR_NAME=  FREQUENCY,     SPECTRUM/REAL,   SPECTRUM/IMAG
##SYMBOL=    X,             R,               I
##VAR_TYPE=  INDEPENDENT,   DEPENDENT,       DEPENDENT
##VAR_FORM=  AFFN,          ASDF,            ASDF
##VAR_DIM=   65536,         65536,           65536
##UNITS=     HZ,            ARBITRARY UNITS, ARBITRARY UNITS
##FACTOR=    0.620285442955139, 1,           1
##FIRST=     20137.2065510759, 0,            0
##LAST=      -20513.1999529892, 0,           0
##MIN=       -20513.1999529892, -55413067,   0
##MAX=       20137.2065510759, 567138509,    0
$$ Real data points
##PAGE= N=1
##DATA TABLE= (X++(R..R)), XYDATA
$$ [...]
45085 4461372 -7319472 -2922138 11169109 12534398 -2698825 -15374464 -13509054 -6550541
45077 -6550541 -5364203 -6173998 -1893486 4926161 8968017 11062299 12454318 9275509
45069 9275509 163727 -8124775 -9482890 -6343570 -2929291 2669756 12914013 22816355
45061 22816355 24729682 17830736 7267396 -2896799 -10797313 -14228486 -12742973 -10309702
45053 -10309702 -10862109 -12595238 -11067257 -6614072 -4040023 -5319074 -6981436 -5566890
45045 -5566890 -2274681 -682930 -2127957 -5060645 -7398516 -7256098 -2009778 10125702
45037 10125702 25785291 35935890 33109821 19202480 3608148 -6220236 -9635588
45030 -9635588 -9022681 -5942370 -2284868 -666368 -1132022 -927134 471544 143678 -2185806
45021 -2185806 -1701635 4123104 9991303 9192035 2334918 -4650718 -8385581 -9690800
45013 -9690800 -9896059 -9543668 -8972992 -7556875 -4759424 -3156001 -5773775 -9149590 -6217817
45004 -6217817 882916 -101896 -13673723 -26879877 -26147345 -15640946 -8135463 -5018167
44996 -5018167 898378 7376278 3622852 -10495985 -20686340 -17612831 -8849156 -6542194
44988 -6542194 -11586273 -15131748 -10257895 1520905 11750777 11904796 2332622 -6435087
44980 -6435087 -5510732 1515936 4880070 2305979 -939562 -2364772 -3705215 -4256369
44972 -4256369 -2098506 -468313 -3526402 -7172827 -3736856 5617158 13138480 17064329
44964 17064329 20634946 20797906 11578971 -1808694 -7080689 -4414715 -6478694 -15980195
44956 -15980195 -19378227 -8781194 5242493 10531077 8983298 6494733 773331 -9661182
44948 -9661182 -15767602 -10035109 -231017 891695 -6167359 -10318381 -6103819 2271870
44940 2271870 9419986 12918132 11734156 7008488 2064284 -2066082 -7015353 -10953958
44932 -10953958 -9244819 -3917134 -3308458 -8244879 -9167085 -2770442 94837 -8549454
44924 -8549454 -19947573 -22017050 -16812404 -13287631 -11354200 -5571171 2186672 6065724
44916 6065724 6619464 6555130 2184548 -8927811 -17614760 -13458164 -1279825 5243502
44908 5243502 2810176 -714806 -940942 26447 1720222 3892081 456691 -11910911
44900 -11910911 -22445836 -17922952 -3195602 4991903 2960887 2203831 6487724 5151440
44892 5151440 -6583618 -17519909 -17719170 -11843529 -7947486 -5604600 -3044517 -4253485
44884 -4253485 -9815530 -10856186 -2025793 7726164 7358165 34020 -2951170 474394
44876 474394 2373739 -1052701 -4342824 -2395074 1887292 1658240 -5766971 -16128094
44868 -16128094 -22022373 -19461764 -11065231 -2058436 5540685 11798026 13577103 6039581
44860 6039581 -9760115 -25853440 -35316071 -36998196 -32203064 -22751114 -13705682 -11318522
44852 -11318522 -15054044 -17079702 -12881684 -7238045 -6275799 -8822307 -9964566 -8781074
44844 -8781074 -7567115 -6368171 -3142280 1995726 6284151 7533655 5988051 3767425
44836 3767425 3079742 3749727 3162822 835792 1130264 7214971 14299805 15068383 10659023
44827 10659023 8448153 8986015 4804411 -5258051 -10840320 -4956893 4626615 6587974
44819 6587974 1764379 -973079 663180 1575851 336325 1330254 5866364 9189295
44811 9189295 7806280 3868807 880304 -300271 -221431 404255 260179 -517604 1983251
44802 1983251 11282819 23772869 31034620 30174720 27247643 28216562 30631752 27486637
44794 27486637 16469571 2080125 -9337021 -13294516 -7838914 4760126 16831354
44787 16831354 20215659 14307848 6351694 2132883 -122691 -3850167 -6390061 -2987987
44779 -2987987 3667782 5557957 1579303 -342375 3589105 5953029 240765 -7141449
44771 -7141449 -6235984 -342237 -2011847 -12803413 -18850523 -10596739 2637877 4900137
44763 4900137 -5367103 -14446232 -11404837 81926 8850605 9722168 6383414 3398378
44755 3398378 442040 -3935633 -7179332 -6443090 -5227246 -8908644 -13298482 -6967610
44747 -6967610 11007394 25326025 24204996 16090937 15827956 21504019 19321162 7214441
44739 7214441 -2855444 -5693588 -8825083 -14499847 -12632141 1238573 15633376 19727792
44731 19727792 17496420 15774537 11097358 758542 -4508083 5531156 21488108 25216618
44723 25216618 15500733 7304095 7521666 7315507 -255276 -9678956 -14320172 -16429516
44715 -16429516 -20042132 -22635158 -19884142 -13051226 -7057960 -5131205 -7802558 -13181181
44707 -13181181 -16775244 -15262571 -11135517 -9127345 -8412395 -4410865 1720213 3070188
44699 3070188 -1696289 -4693746 -347726 5846661 5069742 -2963851 -10985727 -13870073
44691 -13870073 -12557607 -10164711 -8573742 -8629826 -10558166 -13016708 -12440747 -4563188
44683 -4563188 11152763 27507741 33261090 24684552 11381219 5893257 8954961 10575931
44675 10575931 4891896 -2877612 -5335321 -2155458 2331992 5529790 7048174 6381821
44667 6381821 3366972 -788513 -4242671 -4860211 -922192 5401897 7488001 2421087
44659 2421087 -2480958 1410656 10340055 13010964 8730804 8507952 15275642 16713592
44651 16713592 5162812 -7847756 -8147988 -256188 1180131 -5466422 -8955765 -5288704
44643 -5288704 -2816317 -6769166 -11737766 -12261019 -10279050 -9013504 -8471701 -9493270
44635 -9493270 -13416739 -15551172 -8700356 3635807 7891789 -644104 -9379799 -5869331
44627 -5869331 4838598 8667546 1464425 -9684274 -18946308 -25789061 -29296036 -27442385
44619 -27442385 -21161907 -12438220 -277537 14689452 24424197 21019678 9042377 1632788
44611 1632788 4035149 9363014 11389129 12131593 13782477 12153395 3956759 -5523009
44603 -5523009 -8153547 -2864511 4559751 8446649 6547577 -27935 -6582034 -7832477
44595 -7832477 -4336055 -2263063 -3888064 -3442588 3100557 9700628 8529872 2244022
44587 2244022 -474981 832998 -1776780 -10381758 -16351950 -12981697 -5082073 -1065863
44579 -1065863 -1386968 -788564 1721829 1641920 -3116250 -8168378 -7620561 -679442 7424773
44570 7424773 10222241 5993102 -499220 -3054015 -882815 1182967 -719242 -5348212
44562 -5348212 -9373846 -11145067 -9828528 -4381185 3617244 8883888 7799959 3115352
44554 3115352 94615 -77477 610548 2269342 6136439 9000570 4663066 -7211358
44546 -7211358 -18290671 -20223745 -13063613 -3214954 3742990 6003270 4693115 3177760
44538 3177760 4690515 7755570 6566831 -871732 -8031501 -7893895 -3215806 -2679756
44530 -2679756 -7795998 -10803460 -6996989 -2078797 -3282515 -8509137 -9504168 -2695383
44522 -2695383 7848683 15811168 16500586 7894956 -6622942 -17778419 -18256473 -11160081
44514 -11160081 -6187062 -7830703 -12228909 -14980600 -15648597 -13807956 -7732054 299041
44506 299041 3880965 1630179 787756 6930309 15076549 16698727 11579146 6449831
44498 6449831 4746903 4146642 2342401 -1058377 -6996216 -14845712 -18652668 -12315555
44490 -12315555 1075474 11416606 14007282 13687944 15397601 17258466 15834744 12301194
44482 12301194 9283694 5962752 762789 -3850967 -3313400 3334422 11787700 15593579
44474 15593579 10776286 -97680 -8532299 -8404930 -3651696 -3137034 -8098700 -11221033
44466 -11221033 -9091935 -7127676 -8482577 -6997835 1908129 10851292 10182434 2893466
44458 2893466 -215161 3169144 6263140 7181168 11460308 19094975 20832540 12352368
44450 12352368 2689835 1963267 7882946 11628690 11471232 12303552 14944175 14516303 9177436
44441 9177436 3433474 1436257 2016815 1919859 199992 -1944952 -2663941 88336 6306560
44432 6306560 11100493 7963338 -2632319 -11184493 -9464393 -725751 5121960 5648809
44424 5648809 8793381 19182692 27995085 23411224 8227790 -1934336 755619 6434826
44416 6434826 3126074 -5756498 -8176313 -2529732 1579898 562208 2340408 11097226
44408 11097226 17909409 14049795 5009105 1760077 4107153 3697642 181243 2061804
44400 2061804 11069866 17483075 14790163 9177164 8677416 10795845 8158190 919661
44392 919661 -4192050 -3974977 -891083 2719055 6023833 6846506 3855486 714642 1702060
44383 1702060 3718605 -374748 -9807667 -14604895 -8854694 953519 4577784 222404
44375 222404 -5742765 -7339225 -3396347 3403747 8241564 7537489 3554430 2557227 5655064
44366 5655064 5861438 -1471452 -9935773 -10204149 -3606400 183411 -2297117 -4339790
44358 -4339790 -490896 6029353 10154815 12282237 14388522 14373313 9874303 4246039
44350 4246039 2901353 5295022 5934198 3060368 1172565 3448977 5866744 2324970
44342 2324970 -5955565 -9945339 -3078489 9974525 17286485 12233073 -280310 -10539020
44334 -10539020 -13818663 -11548847 -6154384 748432 6306075 7558913 5382739 3676208
44326 3676208 3897648 3773081 2021076 527639 489138 -61318 -3117024 -7971714 -12921744
44317 -12921744 -16703189 -17377458 -13610470 -8278711 -6390290 -7694933 -6396232 -689359
44309 -689359 3240077 731396 -3796953 -4464387 -3412826 -5111617 -6135005 -745797
44301 -745797 5831103 1604562 -13375034 -23896643 -20047634 -10998441 -10900544 -18305799
44293 -18305799 -19191509 -7132074 8903277 16812865 13784757 4922427 -4149514 -9921959
44285 -9921959 -10379971 -6039742 -647348 1708939 140207 -3346733 -6958667 -10641989
44277 -10641989 -14637231 -17661944 -17497559 -13713648 -9203412 -7796223 -10161309 -13439553
44269 -13439553 -15348580 -16524085 -17350082 -15154479 -8156713 -763606 42758 -5700716
44261 -5700716 -9933151 -7562942 -3743780 -5832263 -11831058 -13164539 -7473323 -1558979
44253 -1558979 -650709 -1606374 21737 1939670 -987614 -8666157 -16659047 -22214333
44245 -22214333 -24225603 -19993046 -8836657 1925303 1908679 -9666882 -21753488 -24069135
44237 -24069135 -17405351 -9565486 -6002128 -7378460 -11855679 -15668153 -14443002 -8051985
44229 -8051985 -2432001 -3359052 -9722057 -15283516 -15494359 -10800709 -5550712 -5415134 -12699545
44220 -12699545 -21718977 -22440356 -12236072 -620730 1859909 -3853248 -8835452 -8882255
44212 -8882255 -7165349 -6146865 -4414068 -1977781 -1968672 -5366342 -9456005 -13074340 -18112620
44203 -18112620 -23956152 -25774282 -21163525 -14082210 -9403853 -7620832 -7501518 -9321539
44195 -9321539 -11834346 -10459087 -3297464 4258371 5884729 2729233 251688 -1129360
44187 -1129360 -5819209 -13807699 -18224352 -14272870 -5843660 -289919 194994 -1014154
44179 -1014154 -1122503 -1372408 -4688381 -11546203 -18159997 -18561248 -9883082 3483163
44171 3483163 12390109 11182658 3071336 -3522054 -3399345 1044190 2701470 -3631186
44163 -3631186 -15938499 -25267217 -23374014 -11975997 -2205663 -2004920 -6383401 -4779084
44155 -4779084 3691807 9447843 7742389 6206219 12062092 19209755 16687610 5647191
44147 5647191 -2359597 -2693808 -2473084 -6817618 -11223964 -11960694 -13907842 -20979064 -26957144
44138 -26957144 -24428886 -16562687 -11084429 -8204569 -4593449 -4137502 -12178773 -21986718
44130 -21986718 -21207361 -11956088 -9757170 -19366538 -26505560 -20115323 -8814668 -5467649
44122 -5467649 -7570091 -5568554 -1152746 -2537552 -7572372 -6933540 -1321192 -509094
44114 -509094 -5804804 -7941996 -3645167 -26351 254869 3478738 9379450 6191850
44106 6191850 -9869053 -23372468 -19749051 -6056287 1761214 3594796 10885242 22733479
44098 22733479 24811937 13221561 2667438 5214099 14010615 15642337 8588221 1053490
44090 1053490 -2143172 -2068311 -221818 1534252 -886306 -8642550 -15351466 -13750516
44082 -13750516 -5095077 3262606 7402105 8753158 9011149 9006910 10662167 13888953 13169080
44073 13169080 4118299 -7316200 -9872636 -2079832 5255955 4202771 5406 1359879
44065 1359879 6109750 3921130 -8308029 -20264769 -19640029 -6640911 5986164 7494213
44057 7494213 1085215 -1590290 3148448 5848289 -1762272 -13073057 -14465768 -4077335
44049 -4077335 6094778 6936627 2198845 -508858 41854 2055634 6552975 13073305
44041 13073305 15003579 6718335 -7471185 -17581981 -18752375 -12952832 -3987913 2762400
44033 2762400 -176321 -14117892 -27283404 -25775820 -11830909 -1767242 -4098674 -9566096
44025 -9566096 -7039063 342359 2392207 -1899370 -4876080 -3412577 -2101531 -3789599
44017 -3789599 -5311671 -4147076 -2401943 -1514436 1317085 7842055 14171824 15458708
44009 15458708 12260988 8684126 6871887 7213989 11265044 18937278 23959060 18682917
44001 18682917 5117408 -4230179 -3104 12858726 21217568 18852505 11794515 9355742
43993 9355742 13234650 16706110 13571236 6536252 4649122 11176894 17557374 14822942
43985 14822942 8785331 14348100 32564898 44294357 34300084 12726856 1351790
43978 1351790 4467996 7236812 772126 -6380699 -4574508 2738790 7311456 8019216
43970 8019216 7208123 3499296 -3920561 -9976040 -9997194 -6660478 -4575799 -2808252 1115773
43961 1115773 4537656 3612833 132323 -1674296 -1644999 -1507862 -175918 2995743 4170800
43952 4170800 292380 -5109914 -7002082 -6067379 -5619985 -5773980 -6086670 -8557827 -11821609
43943 -11821609 -8712743 2830548 13247235 14695939 13413654 17240413 18317043 3945096
43935 3945096 -19289762 -29754890 -19537510 -2838692 6556071 10294152 13647269 14344952
43927 14344952 10840493 8870079 11026925 10103342 1281993 -8055547 -9040865 -3808358
43919 -3808358 881618 4909229 10905380 15578172 14274514 9846194 8657646 10955541
43911 10955541 12017904 9585337 4142801 -4317233 -13475996 -16225778 -7785659 6645097
43903 6645097 16382189 15540940 5813622 -7016574 -15686722 -15237168 -8514117 -3753760
43895 -3753760 -3547216 -2028854 3623875 7037835 3876905 868315 5183511 11870937
43887 11870937 11781207 6511690 4646787 6825442 5669335 -1086546 -7681554 -10099732
43879 -10099732 -9669489 -7034656 -1096565 5413251 6793971 1867251 -4921673 -9505181
43871 -9505181 -10317332 -6541141 -53581 3744879 3520807 6428863 16711585 24316975
43863 24316975 15958211 -4998575 -21818766 -26636976 -26555196 -26913113 -22683389 -10954026
43855 -10954026 534059 4058412 1862982 -333252 -1302443 -620058 4115110 10448418
43847 10448418 10031651 1083210 -6161752 -3711453 2130855 1065444 -5982757 -11208411
43839 -11208411 -13405038 -16417102 -17931082 -11014685 3683962 16356552 19281060 12990415
43831 12990415 1832090 -9560687 -15470984 -12066244 -2919791 3533596 3414528 601455
43823 601455 567324 4844284 11057687 14530312 11017567 2376477 -1934381 5417719 19125635
43814 19125635 26235201 21466327 11908457 6894977 9805414 19870509 33826236 43399440
43806 43399440 39346100 23000584 7946547 5116579 10960974 15017666 13848586 11220054
43798 11220054 9072836 6438169 5149708 8172623 11976276 8345650 -3757220 -14156418
43790 -14156418 -12854189 -1628372 8979497 11563123 7844067 4694003 6930144 13350943
43782 13350943 18203141 16771768 9878563 2243417 -2887232 -5656006 -7002016 -7148537
43774 -7148537 -6561994 -5252347 -1251276 6294448 12496653 10575748 1911425 -3583585
43766 -3583585 -407606 4734663 2699179 -5603790 -12562204 -15601517 -18040843 -20325335
43758 -20325335 -18285448 -10392496 -479872 7368696 11621810 11462671 7778860 5433814
43750 5433814 8202927 11649252 8037350 -1416590 -7128067 -5268364 -2683486 -4811831
43742 -4811831 -7543395 -6167020 -4536761 -8458499 -15581935 -18819133 -16097651 -11093980
43734 -11093980 -7743719 -8660231 -14787878 -21877043 -21976185 -13526961 -4999245 -3194592
43726 -3194592 -3953221 -1110165 2072653 -364704 -4575510 -2289297 4762164 7446460
43718 7446460 4344926 2162612 1450095 -5204499 -18518194 -28293432 -28228081 -24182010
43710 -24182010 -22177075 -18053592 -6361513 8284095 16885173 17889808 16099890 13822302
43702 13822302 9971383 5260429 2218976 1479401 2110955 3529809 3846680 -327466
43694 -327466 -8425887 -13636133 -10711562 -3405440 413999 -1389388 -4782844 -6495064
43686 -6495064 -6286157 -4171376 -900191 -358397 -5978660 -14382425 -17459884 -12104057
43678 -12104057 -4165090 -1196005 -4107035 -7574724 -6622453 -1293197 3869162 3956058
43670 3956058 -1510062 -7009480 -5462280 4278353 14754412 16350863 7044523 -5497444
43662 -5497444 -12550151 -13347538 -12926177 -12739582 -9098176 -2117791 819342 -4114167 -8473172
43653 -8473172 -1974518 11019614 15010533 3745061 -12124504 -20254458 -20724486 -20274204
43645 -20274204 -20166675 -17140993 -12234045 -11209265 -16684145 -24063151 -25353612 -16002902
43637 -16002902 -194800 10303780 7108891 -3627004 -6715784 2958383 13522859
43630 13522859 12635905 4035945 731430 6746619 13600842 12369912 2408957 -10159410
43622 -10159410 -17186988 -14219582 -6490157 -5411338 -13489318 -18199316 -9106891 4481893
43614 4481893 4674048 -9281114 -20065251 -17419292 -10073830 -8612202 -9620201 -4623508
43606 -4623508 4902287 10192359 6657202 -4193240 -18505550 -29640248 -30278406 -21791215
43598 -21791215 -15587267 -18240305 -21955146 -18061698 -12434380 -15635128 -23397145 -21848154
43590 -21848154 -10404349 -3501159 -7216542 -9898316 -2410409 6645206 6136573 1343461
43582 1343461 4645220 14799450 19622521 15446709 9827148 6070077 -542101 -9139252
43574 -9139252 -10162679 -1787456 2927818 -5610776 -17587066 -17422724 -6960655 -2113549
43566 -2113549 -8781193 -15473692 -12135222 -4453133 -3016097 -6490533 -4524394 5805782
43558 5805782 14883274 12955927 2119049 -7032682 -8130296 -5049528 -5169499 -9445834
43550 -9445834 -11830777 -8034947 -1468554 1398352 -851171 -4052969 -4719089 -3488397
43542 -3488397 -2389361 -1434541 1291899 7365420 15680666 21916590 22334780 19355862
43534 19355862 19956323 25576680 27697006 18781009 4257962 -3647857 -2044693 1269847
43526 1269847 2039422 4809832 11435209 14866309 10496022 5176613 6998017 12449919
43518 12449919 12550419 7147029 3510186 3182627 273558 -6882845 -11528973 -8623854
43510 -8623854 -2223598 956119 553646 1341911 5930492 12037509 15701917 14817260 9754975
43501 9754975 1960911 -7015305 -14552282 -16461746 -10699496 -1727606 3321295 4576604
43493 4576604 10083824 22704402 32263329 27720783 13012203 2038962 -38222 -672701
43485 -672701 -4864512 -7001835 -2101642 3655360 1024429 -8411396 -13772487 -8886521
43477 -8886521 714590 5047459 642775 -6398530 -7122237 438303 8412591 7705040
43469 7705040 -1101613 -8584190 -8351377 -4012222 -2857938 -6619207 -11152924 -12274789
43461 -12274789 -9006304 -3116881 2117925 4222157 3968117 3571033 2077474 -3508361
43453 -3508361 -11044386 -12325808 -3145937 9921208 17745890 20348934 24359009 30752029
43445 30752029 32345056 24567868 12826379 6256211 7664179 12308825 14247662 11333735
43437 11333735 5320024 -541727 -4000024 -5191070 -5989581 -7873601 -10362051 -11354776
43429 -11354776 -9111906 -4443071 -588656 279358 -107344 998152 2241877 74302
43421 74302 -3544623 -1282204 8013615 13895193 7558236 -3665898 -4795861 4874023
43413 4874023 9507745 -586205 -14740218 -17477600 -9921122 -5647952 -9853349 -13963734
43405 -13963734 -10630428 -3715880 -302566 -609454 -558898 723990 900153 -750458 -2353906
43396 -2353906 -2215374 -581643 371201 -2041442 -7676969 -12255231 -12612514 -11940883 -14412893
43387 -14412893 -15939258 -9048316 2009271 2554171 -10534614 -19986916 -11780906 2576430
43379 2576430 2385701 -10429234 -14539653 -2750672 8080946 5394989 -397739 3787028
43371 3787028 11222912 8414845 -894876 -2080464 6364544 12177593 9973497 6441675
43363 6441675 5102460 1589674 -3142942 227721 13253729 22942196 19099169 8781173
43355 8781173 4627407 6487546 4961272 -1332722 -3067670 5165807 16231018 19581567
43347 19581567 14258869 9068334 11177223 17525982 19019073 12015057 2237605 -3927824
43339 -3927824 -7552157 -12402542 -16201713 -13788395 -7036645 -3329874 -4184893 -3973983
43331 -3973983 -1186548 -1758951 -8046761 -13332503 -12120843 -8391883 -8597016 -13187936
43323 -13187936 -19469663 -25417578 -26276165 -16229846 975766 12831235 15951037 21340994
43315 21340994 32720882 34019947 14187334 -8212250 -7199246 10956354 15380239
43308 15380239 -3069067 -19382690 -13973329 578447 4491344 815220 3293580 10282837
43300 10282837 10336882 3808691 142364 -325623 -4641847 -11051282 -10653699 -3554121 1331769
43291 1331769 1962743 4698089 9866659 9699203 2754306 -2667446 -3140147 -5957304 -14916960
43282 -14916960 -20813488 -13479204 3692294 17761043 19983887 10990550 -2910031 -13981381
43274 -13981381 -17151104 -13662365 -8914990 -6111359 -5105117 -6124255 -8635443 -7317616
43266 -7317616 2964282 17280432 23653302 17600964 6183504 -3128729 -8311129 -6667450
43258 -6667450 4713924 18126973 17807796 1062358 -14450397 -13602626 -3280039 1516255
43250 1516255 291543 1996398 5932633 4107444 -1952897 -3134872 199691 -1512001
43242 -1512001 -9784373 -15861274 -16643612 -17979835 -19860779 -13859358 -90939 8410310
43234 8410310 5530927 2157906 6840644 9636350 -1350604 -17179139 -18184225 -2963489
43226 -2963489 8494621 1995336 -13351357 -19561072 -12651724 -4080424 -3532083 -7501578
43218 -7501578 -6148659 2820151 11484713 12748285 8972848 6185901 4395400 545188
43210 545188 -1978041 3223453 12212884 11846504 -1407412 -13554453 -10896568 1853666
43202 1853666 9218886 4894215 -4319044 -10259061 -10596124 -6814903 -2762177 -3890432
43194 -3890432 -11529163 -18980004 -18476843 -10430678 -1588482 2856855 924185 -7513657
43186 -7513657 -17487694 -19332173 -10202386 -765765 -1532552 -6929689 -3945245 6544282
43178 6544282 10181652 754059 -11627929 -16285882 -13774135 -8311218 -406633 7090949
43170 7090949 6267497 -4707572 -15641523 -17052541 -12363580 -10507804 -12595686 -13231784
43162 -13231784 -9871133 -3889372 2872984 6277601 446996 -12172619 -17246884 -4939181
43154 -4939181 14224682 20652764 10612796 -1247681 -3539409 -149957 1560507 2483610
43146 2483610 5403987 6099671 -439750 -9578923 -11094939 -2574321 7135907 8236541
43138 8236541 215220 -8587190 -9668307 -2614829 4539948 3860348 -3860469 -11073442
43130 -11073442 -13390521 -13255960 -13039961 -10390260 -4258746 -438060 -4767685 -13404233
43122 -13404233 -16664497 -11978611 -6384918 -5266708 -5358136 -2067155 1988170 1045185
43114 1045185 -4340537 -7566425 -5103257 -811260 -582235 -6041081 -14433108 -21851059
43106 -21851059 -25119202 -22838462 -16905744 -12180393 -12637196 -17603106 -22834734 -25378275
43098 -25378275 -26129243 -26998024 -27030432 -23445434 -16226239 -8953243 -4154881 -888269 1013866
43089 1013866 -1737134 -9456769 -13556027 -5063299 10734293 16928475 5692866 -11480517
43081 -11480517 -19425247 -17618843 -15269876 -14712766 -10417301 -1542491 5578774 7476152
43073 7476152 6540046 3432167 -4160682 -13805596 -18611762 -17539539 -16578903 -17205619 -13276928
43064 -13276928 -3078397 5545840 7412395 7801140 11704986 14778901 12829886 11096399
43056 11096399 14321924 15766546 7624057 -3973521 -6815008 -942881 3642034 4402760
43048 4402760 7811280 14530501 16729497 11725452 6230732 4645075 4122849 3605938
43040 3605938 6350084 10125456 6752679 -3179549 -6377140 4710372 18818109 20271881
43032 20271881 9512557 -172844 -1488992 960746 1082871 -1603106 -5447209 -9849237
43024 -9849237 -12893165 -10687149 -2100237 7650506 10761428 5353912 -447663 3993967
43016 3993967 18191810 27929182 21115122 3530359 -8004481 -6498823 -291378 2093422
43008 2093422 1899416 1637931 -2604886 -12999577 -21917742 -20940542 -13412722 -9709162
43000 -9709162 -12505820 -14263883 -8651278 1427912 7603551 4396649 -6076001 -16109328
42992 -16109328 -20183165 -20485148 -21455892 -20560356 -12038276 196245 4470078 45573
42984 45573 1464247 15696051 26818845 16950403 -6050644 -18224618 -12673526 -5670925
42976 -5670925 -9587373 -17057476 -16850302 -10571565 -5772501 -3842074 -3135347 -5017267
42968 -5017267 -8454045 -6657221 1995089 6918223 -700885 -12722978 -14374449 -5993916
42960 -5993916 -1511562 -5760358 -7091953 3223215 16360949 18879057 11693140 5810074
42952 5810074 4162042 -361046 -9280462 -12971487 -5356775 5045735 6406825 70149
42944 70149 -3326341 -1201100 -1868208 -8803560 -12492247 -4102660 9567985 13101740
42936 13101740 1867193 -12957601 -18478469 -12904349 -3319967 3481258 4900565 1292666
42928 1292666 -4821696 -9066500 -7579677 60186 10360109 17867818 18179580 11156140
42920 11156140 1849041 -3742477 -5010108 -6983706 -12746925 -17841236 -15276618 -5047361
42912 -5047361 5065756 8552621 6433778 3190095 327882 -2805617 -4543216 -1651034
42904 -1651034 6015879 14847487 20895917 21448853 15306387 5589482 -49735 2053680
42896 2053680 4661262 -1064359 -10504171 -10382727 -91185 4520338 -5375042 -16745791
42888 -16745791 -13425882 718427 10085192 10534301 9290432 7462549 -48532 -8879216
42880 -8879216 -6992761 5378137 12829682 6025798 -7162516 -15669429 -17704012 -15037740
42872 -15037740 -7744343 -14433 834442 -3461666 -2737702 4226278 6595957 1208058
42864 1208058 -328216 7576536 13189249 8351097 4206770 10981281 17079114 7191240
42856 7191240 -10221657 -14114187 -1935885 10577989 15194080 16647473 15940024 8621315
42848 8621315 -1038121 -3162931 110700 -2046313 -8250267 -6250018 3550232 5942160
42840 5942160 -3765809 -11999003 -10731485 -9796160 -16354646 -19897786 -9800921 6469875
42832 6469875 15421206 16457591 16625705 16189572 11772328 6595913 6161964 8753736 9260887
42823 9260887 7689913 6544351 5003770 2220160 970346 2660238 4823928 7567622
42815 7567622 14157415 21263496 19786787 11270490 10359008 21870869 29269975 19011623
42807 19011623 3545664 2877571 12862070 12122125 -4113125 -17986339 -17193928 -9834416
42799 -9834416 -6612973 -4915511 1374404 8441544 8314659 1070869 -6207932 -8793386
42791 -8793386 -8008031 -8440419 -13807731 -22820346 -28512388 -24822151 -13497445 -1494435
42783 -1494435 6285717 7898056 2334247 -6828664 -9990490 -2565232 5600466 1781099
42775 1781099 -11041221 -18593276 -17044135 -16912252 -23747523 -28909172 -24457286 -14737480
42767 -14737480 -6694330 -22928 5469344 3624739 -7193027 -16007644 -12957200 -4197371
42759 -4197371 -1775869 -4182718 461714 14645298 27424206 30221172 25740792 19536470
42751 19536470 12372555 4202470 -1761168 -2729907 688069 6974925 14348013 18209001
42743 18209001 14063166 4728599 -1306998 -988910 -361369 -4457386 -9585328 -9735657
42735 -9735657 -5353470 -704047 3247132 7637833 10440084 8654872 4693381 4861147
42727 4861147 10901970 17266042 17897094 12841091 7115491 5124508 7236649 10685039
42719 10685039 12684466 12150219 8515336 1183312 -7158666 -8962801 646335 14840133
42711 14840133 20729424 15972618 11654871 14723041 17279627 11256713 4198623 7713634
42703 7713634 16600777 15133353 1899471 -8112790 -7401768 -5134133 -7962357 -8295391
42695 -8295391 67058 9566913 12812444 15476696 22745416 25369529 14749088 1629123
42687 1629123 1623984 9363157 7167325 -4345277 -6435478 5618579 12816494 2504867
42679 2504867 -11007522 -8416819 5810165 11497929 2060777 -8490330 -6131523 6288118
42671 6288118 14760314 11221740 2113397 90079 8274873 16900952 18464131 19335246
42663 19335246 27406733 34316087 24927372 3255544 -8445684 -490523 11282244 11001957
42655 11001957 4712866 4862550 7207893 -563778 -16240198 -25692023 -23238451 -14879133
42647 -14879133 -4889774 6602339 14834658 13173914 4692615 -1050405 -2837906 -7640146
42639 -7640146 -15177260 -15178796 -3354549 10358767 13984978 6374463 -5130396 -12726234
42631 -12726234 -11349515 -1182589 9818971 12099468 6146853 2578097 8393011 18636333
42623 18636333 24012403 21553561 15321388 11101240 12487627 18188924 21747619 17698002
42615 17698002 8650465 2442764 2685651 6908135 13080074 21321777 28682873 29212135
42607 29212135 21550334 11497768 5559538 6073864 12273968 20369819 22902051 15068797
42599 15068797 2620120 -3220010 230012 4620035 2717450 -3950457 -10209929 -12478107
42591 -12478107 -8388551 413097 4563686 -4020843 -17878909 -19695818 -5223482 10927253
42583 10927253 16304455 14855743 14587424 14841211 14563281 19492747 29172522 29434424 12822946
42574 12822946 -4102108 -1491478 13523298 16786482 2893267 -9772682 -9094258 -2958807
42566 -2958807 757511 7223149 19018579 24950412 16337785 1721095 -6183983 -7616302
42558 -7616302 -8646692 -7032611 1640842 11116506 11624805 5558151 3299675 6533567
42550 6533567 8155027 6736810 8071391 12170314 11429662 4235977 -904611 1264420
42542 1264420 5102770 4558645 2622878 4584202 8850580 10429294 8181999 3622977
42534 3622977 -2256236 -6371591 -3729574 4197835 7150880 -1118034 -12837078 -16418178
42526 -16418178 -11929599 -7788974 -6101271 -1878474 4768568 6926310 2620056 -1822429
42518 -1822429 -2736015 -4091473 -7852718 -8472897 -2533980 3936607 4491475 2212405 3204562
42509 3204562 5403359 2487894 -4211025 -6765799 -2957759 632376 -1030823 -4864843
42501 -4864843 -5742024 -3606193 -1243935 1205367 5604534 11218677 14068938 11373178
42493 11373178 5060195 -299946 -2775071 -4550508 -7027771 -6847332 -533060 8122643
42485 8122643 10890183 6241838 1732705 2761866 5148974 3203960 -824853 -1791356
42477 -1791356 -1522396 -5845738 -14186091 -19810416 -19581613 -16638417 -13764406 -10506021
42469 -10506021 -6833645 -3708651 -111553 4814256 7393806 3643589 -2860942 -4805808
42461 -4805808 -2745463 -4472836 -11644110 -16132079 -12847067 -7535530 -6985614 -8944796
42453 -8944796 -7670457 -3586056 -1312131 -2565721 -6329543 -11807194 -16238943 -14421609
42445 -14421609 -5967620 1414503 1953701 661913 4852167 10700751 7671529 -4534645
42437 -4534645 -12860702 -7209323 6791995 14607623 8115994 -8218242 -22712574 -25677942
42429 -25677942 -16590099 -4924404 -1853171 -8767381 -15504740 -11967547 1898 8984665
42421 8984665 7478853 -461820 -6199070 -7414032 -8106754 -9855558 -9430625 -6212983
42413 -6212983 -5192354 -8517669 -10201071 -5508711 -267695 -2343065 -7888786 -6552236
42405 -6552236 1723277 6792071 4896404 2465858 1948707 -2039987 -8505067 -7178156
42397 -7178156 2910159 7008316 -2820888 -13112792 -10269605 -2799518 -5399332 -12690957
42389 -12690957 -9691864 -178959 -822841 -10624464 -11349920 145523 5148985 -5086178
42381 -5086178 -14404750 -9129992 826755 1891801 -697378 3313741 8382427 4530175
42373 4530175 -2333586 -694404 4655779 762006 -9064768 -9121045 2320417 9891418
42365 9891418 5986100 1351585 6381206 16062377 19333493 12812000 542458 -11164789
42357 -11164789 -15675134 -11370801 -6851362 -11742481 -21482076 -22162687 -11834235 -3764454
42349 -3764454 -4598777 -3740550 7329263 18135818 13826148 -1670190 -10078390 -2684407
42341 -2684407 10954311 16768183 10385306 -1694901 -8835414 -4562172 7794790 18699163
42333 18699163 23026024 23129490 20556224 12814222 2305088 -957882 6934456 15502650
42325 15502650 14373596 8644152 9175469 14371475 14548388 9641927 8115210 10469168
42317 10469168 8776145 2758002 1315997 5554087 4915571 -4824945 -13188532 -11489812
42309 -11489812 -5897224 -5810491 -9313154 -9363865 -6099069 -3184408 1468152 11148269 20978238
42300 20978238 22720214 16347961 8792466 3569304 -786890 -4152759 -4562873 -3787569
42292 -3787569 -6128726 -11118848 -12772476 -7124952 2697635 9242187 7318990 -455384
42284 -455384 -4249451 2738990 13852380 15273153 4900392 -3645300 -562841 6317385
42276 6317385 5258330 -1306326 -3789193 -2799152 -5397453 -9006851 -4833550 4210821
42268 4210821 5003521 -4743977 -11829052 -7660200 614500 4121153 4678684 6745621
42260 6745621 8359148 7527040 7832941 10444061 9983076 5595835 5943320 14305217 18906905
42251 18906905 9454073 -5357396 -10129628 -6090524 -7348975 -17143436 -23056645 -16533711
42243 -16533711 -3928677 4636024 6633405 4257130 -464095 -4230284 -3879159 -1964374
42235 -1964374 -3892843 -8120354 -7633007 -2883224 -2991672 -10001480 -12522532 -2137057
42227 -2137057 12850857 18970082 15857978 13001716 13541568 12781149 10392899 12125832
42219 12125832 18203706 20464181 14515126 6447436 3082492 2447254 -619902 -4651457
42211 -4651457 -3737002 3135472 10557675 13476462 11241456 5880879 527585 -797799
42203 -797799 3967817 11374880 14902129 12370949 8803684 10452230 17390888 23562327
42195 23562327 23631560 18395899 12901384 10107793 8252848 5091455 2019860 788082
42187 788082 -1769703 -9842892 -19343305 -20043731 -10392873 -2421537 -5181916 -10325363
42179 -10325363 -4401519 9352337 15055315 9220606 6475899 15678191 24778199 19318384
42171 19318384 5081035 -672986 5651423 11090179 6386467 -3018646 -7299596 -3797075
42163 -3797075 3993889 11350710 13753153 9357490 2206374 -1568185 -1520263 -2214474 -4898400
42154 -4898400 -5635091 -2412412 1578426 2949355 1454451 -2212350 -6735800 -8088882
42146 -8088882 -3097519 4261970 6343370 2533520 27614 2777540 6582660 6882922
42138 6882922 4283440 174731 -5619706 -10067445 -7786088 -517974 2159037 -3638716
42130 -3638716 -9513528 -7204135 -16032 4498793 5724117 6273843 4529462 398947
42122 398947 2265893 16536546 33570938 36134609 21832344 6590424 4091802 10655438
42114 10655438 13493124 6893582 -3682476 -9206626 -5452000 4228728 12891151 16839642
42106 16839642 16788400 12231201 652451 -13915805 -18685223 -6590257 11670554 19370006
42098 19370006 14403187 8326994 7403670 6649529 2787518 266631 984566 -466029
42090 -466029 -5993407 -8544768 -4141984 -843262 -7684733 -20702045 -27731660 -23029961
42082 -23029961 -10605935 3148813 13687639 18104466 16691415 13046461 8980416 2604614
42074 2604614 -5223943 -8113649 -3350376 1624637 -569281 -5166588 -2429517 6303205
42066 6303205 10268559 6143405 2167360 3570474 4755469 886021 -2060317 3709295
42058 3709295 15033869 22049616 21262154 16495424 9511189 -1392450 -13484998 -19271873
42050 -19271873 -17175707 -15340590 -19809737 -24537493 -20031566 -8561034 -2287064 -6161367
42042 -6161367 -11131610 -7792091 474776 4339660 3377635 5195320 11183863 12953797
42034 12953797 5870329 -2269870 -2350022 1852937 -1222872 -13513541 -23326357 -20362377
42026 -20362377 -8347047 742494 776072 -4149069 -6717021 -3549710 3638303 10326837
42018 10326837 12480586 10270271 8696002 11927249 16779850 15142753 4559764 -6745362
42010 -6745362 -8784410 -1883242 4728354 6263966 8427489 16577341 23737370 17152493
42002 17152493 -3069688 -19660189 -17207432 -638021 11631028 10400691 3791908
41995 3791908 2463318 5534066 5962344 3260078 3071752 6832831 9527104 7564127
41987 7564127 2407434 -4128724 -11781090 -17706814 -17099309 -10715734 -5730958 -5700892 -5914724
41978 -5914724 -3109189 -2753943 -9433931 -15858715 -11249994 2281508 12016174 12498604
41970 12498604 10769559 12565628 13740751 9265993 1732421 -4501275 -10224314 -16416383
41962 -16416383 -18698083 -13551519 -5304628 -140189 2866708 7710020 11897332 9097385
41954 9097385 63846 -6888547 -6868067 -3343676 -925652 791716 3688694 6072190
41946 6072190 4806025 497213 -2409573 -981565 1650016 -1637768 -13378930 -25302712
41938 -25302712 -24812157 -10058367 5354127 7026927 -3414220 -11055637 -5866633 6917100
41930 6917100 14547103 10657188 626451 -4371409 1352033 11182039 12486397 1643759
41922 1643759 -10712144 -13035204 -7101262 -2980455 -3842735 -4482174 -3173128 -4708670
41914 -4708670 -10077660 -12686066 -8715872 -3300222 -1743004 -1766376 -132472 -468464 -7128250
41905 -7128250 -15582451 -16738637 -9019147 251090 4309295 2447502 -2283746 -5097820
41897 -5097820 -735481 10616794 19225320 14991475 1653767 -5871384 -884545 6454917
41889 6454917 4955539 -1035106 217162 8404334 11961449 7751365 6990444 16556514
41881 16556514 25628982 20593542 5883672 -2149496 1056011 3842663 -1424561 -6811513
41873 -6811513 -3137748 5017019 7543578 4523530 3285578 4130066 189029 -9440449
41865 -9440449 -17023599 -18328865 -17984676 -18986337 -15423818 -2427844 12267378 15285438
41857 15285438 4854065 -6503712 -8110983 -3645543 -3261765 -7668491 -7421747 1850988
41849 1850988 11282284 10568350 2615874 -922714 3739884 8849054 8123873 4512881
41841 4512881 2329901 301627 -2644242 -2344444 3283704 8290583 7539310 6000682
41833 6000682 10699113 17861838 17825901 10061351 3196277 1123867 -735593 -4662078
41825 -4662078 -5988679 -1916044 3120631 4364135 2956455 2515457 4561101 8950582
41817 8950582 13687583 13445532 4329041 -8675941 -15287301 -12519036 -7447651 -5920703
41809 -5920703 -5556420 -2646319 903208 1576598 -191670 -2409540 -5211737 -8813093
41801 -8813093 -11318427 -11109207 -8583196 -4694273 -1063512 -731474 -3916196 -4637728 1583938
41792 1583938 8419641 6279521 -1757942 -3040504 4601400 9087515 4288784 185334
41784 185334 5607623 13747944 14773237 11543785 10938607 9226862 -76737 -10853934
41776 -10853934 -11786786 -5145806 -3645031 -10117749 -14198909 -9834661 -3199199 -407447
41768 -407447 1593825 7328887 14016671 15206745 8638624 -1725204 -8037323 -3611254
41760 -3611254 9441773 19114205 16261871 6966711 4969526 13125660 20896722 19988619
41752 19988619 13140246 6128922 568590 -2368028 5765 5620707 6913640 1328295
41744 1328295 -3852410 -2255645 1999502 1443656 -2956751 -4098722 -29375 3796673
41736 3796673 2879641 -1066486 -3784707 -3734367 -2669739 -2909829 -4645266 -5319480 -2175675
41727 -2175675 4039557 8840152 8083417 1655613 -6608937 -11300529 -8414690 1397209
41719 1397209 12124527 17082740 14790938 8820731 3003824 -160262 2271720 11422695
41711 11422695 21334122 21794811 10383563 -2263447 -4087741 3855894 9734359 6580474
41703 6580474 -645425 -4755578 -6531259 -10584836 -15615069 -15981511 -11735478 -9202877
41695 -9202877 -10024146 -7810857 -263018 3493373 -3986900 -14293794 -13594184 -3942679
41687 -3942679 -519094 -7432059 -11440363 -4255584 4210704 3834714 1506276 7092481
41679 7092481 13233838 5962192 -10746995 -18686611 -11773184 -2080094 1142818 2486377
41671 2486377 7092656 11096566 11137147 11208584 13775621 14658592 12611292 13299373 17260832
41662 17260832 15081217 3134893 -6269781 -1203904 11774910 17528297 13707822 9476762
41654 9476762 7512815 1386275 -9842254 -17305724 -14846954 -5995225 3833427 13437360
41646 13437360 21642056 24975488 22745269 18149712 12239622 3526345 -4431993 -3298211
41638 -3298211 7831127 17754893 16537947 7888921 2068943 1405328 -904 -5524841
41630 -5524841 -12364337 -16756391 -16087947 -7508524 8066354 21214456 21477081 10873693
41622 10873693 2308636 2298801 3288712 -2823919 -11507425 -12766835 -5623111 2650037 7987021
41613 7987021 11633713 12751136 8055731 -318685 -4329557 299942 9506706 17547401
41605 17547401 22801669 25399240 24642618 21105074 16809650 11862517 5552278 1241421
41597 1241421 3668066 9926431 10565390 2660993 -5450826 -6202233 -2224704 564314
41589 564314 1463941 1081901 -2875523 -8750232 -7912690 2426932 10656611 5569867 -6448454
41580 -6448454 -10896058 -6568303 -3800589 -4808415 -1624163 6128915 7442972 -1910481
41572 -1910481 -11260643 -11201748 -6154949 -3822198 -2581691 2208833 7755031 8819273
41564 8819273 7277004 8142874 10343791 9327069 5784016 4465310 6032248 6337713
41556 6337713 3249913 -329824 -20533 5933302 14743794 19702803 15443203 4446124
41548 4446124 -4665305 -6830475 -4881459 -2898011 -348798 4368006 9319802 11607125
41540 11607125 11112483 9178103 7145177 7669608 12548325 17724975 16647369 10630982
41532 10630982 8475312 12730692 14958602 9514490 2875030 2118414 2953799 -1377100
41524 -1377100 -6832576 -5294113 1137750 4227840 3434351 3272256 769198 -9888915
41516 -9888915 -21581910 -19206300 -2992334 8535283 4714485 -2297865 2389190 13597836
41508 13597836 15678376 6840244 121147 3129395 9239232 9272901 1886321 -9320328
41500 -9320328 -20304814 -25314172 -18977691 -4660255 4801337 608391 -10845312 -15892028
41492 -15892028 -10678398 -4183248 -4464775 -8853952 -10716177 -9973439 -10974610 -13094593
41484 -13094593 -10903552 -4124903 -549146 -5493607 -12852196 -11500467 984727 15061350
41476 15061350 19698039 13426677 4298889 344663 1303757 479709 -5409702 -10705174
41468 -10705174 -7708095 2744925 12044694 14652408 12851432 9964903 5113933 -2393865
41460 -2393865 -9119051 -12014523 -12232633 -10518390 -4200869 6024593 11949781 7827335
41452 7827335 199322 -625250 4281263 5374701 887765 -872363 3398758 5688224
41444 5688224 -155698 -8051556 -8881791 -3539973 219231 -146322 55511 4258939 9536500
41435 9536500 10293960 4676743 -2431308 -2815482 5806969 13998296 9336403 -7372758
41427 -7372758 -20777372 -19480807 -9663048 -4780933 -7529025 -9899356 -7276506 -3173518
41419 -3173518 -986613 116766 228535 -2503351 -6230590 -5645718 -453681 2875974
41411 2875974 949764 -1081840 2275629 8834558 13284340 14470657 13156905 7834364
41403 7834364 -916515 -6471484 -4052368 1001836 1255978 578529 8989070 24383964
41395 24383964 31194203 21278122 6124622 1586874 7897017 12666357 8665669 186799
41387 186799 -5950017 -8018791 -8063974 -8516657 -10682906 -13179805 -12323337 -6675324 351521
41378 351521 4851167 6689794 6719541 3865021 -811503 -1776540 3344926 8232194 7259217
41369 7259217 6035928 12942662 23244930 23694865 13009565 5175081 9202099 17380384
41361 17380384 19062820 15238812 11695909 6992607 -2720796 -12893081 -14841531 -7937625
41353 -7937625 871969 7384373 12098248 13770585 9457352 1214744 -4377584 -4681996
41345 -4681996 -3457634 -3625738 -2656317 2551664 9548734 11706378 5079823 -6544276
41337 -6544276 -13552164 -9326085 1861104 8417308 4567267 -3332966 -5958729 -2372136
41329 -2372136 1796112 3585908 4326827 4430770 3058260 2345469 5724713 11138239 11297929
41320 11297929 2887525 -8103214 -12496133 -7294076 2633700 10701747 14603796 15868815
41312 15868815 14557687 7515610 -5106196 -14162734 -9283161 6450001 16968351 12434218
41304 12434218 1334984 -2413835 2011350 5287089 4796446 7368556 15287094 19901281
41296 19901281 12938417 -2318351 -14974836 -17690164 -11343503 -1733790 6035253 11178628
41288 11178628 15542858 17660060 11624247 -4288337 -20834887 -25771657 -17822451 -7075434
41280 -7075434 -2006647 -2076667 -3100575 -3227129 -2048178 395328 1734869 -524164 -3205338
41271 -3205338 837637 12825769 24659447 28142663 23422859 15739060 8338595 2291041
41263 2291041 -410698 1626442 5890341 7837805 6005444 3271669 3084258 5395481
41255 5395481 6300896 1984107 -6211761 -11662899 -9463892 -3056195 -1273680 -8193333
41247 -8193333 -17849906 -20261263 -12321277 -1874666 486312 -5506962 -7937124 2101566
41239 2101566 16586936 19840489 10662983 3923587 7420040 10548171 3698301 -4456517
41231 -4456517 -1950194 5226456 3694127 -2938588 325044 13010054 18228650 9858933
41223 9858933 1317014 2896647 8301778 10008314 11138819 14044628 12846748 6756424
41215 6756424 6115752 14607976 19283879 10094482 -3485812 -8110285 -6681602 -8770393
41207 -8770393 -12254192 -10417807 -7850697 -12140932 -17199388 -12585366 -3725136 -4492197
41199 -4492197 -13360070 -15540226 -7292770 -15502 -296090 -3532307 -7925931 -16548411
41191 -16548411 -23486228 -16971799 -760264 6361515 -1241707 -7042049 28086 8065725
41183 8065725 4574077 -1688029 2149639 8827940 3712340 -8389080 -10589747 -2849930
41175 -2849930 -2056288 -13708431 -23732737 -22160364 -17024520 -17837267 -20444515 -17744168
41167 -17744168 -13632870 -15260374 -19337785 -17137704 -8553961 -1595523 -622531 -3214302
41159 -3214302 -6454539 -8519087 -5843781 2970201 10939338 8825763 -1461008 -7590314
41151 -7590314 -3088182 4954959 7730560 6085801 4626805 2328718 -2586483 -4207048
41143 -4207048 4127372 17033611 21905073 16262631 9977168 9130679 8678267 4633975
41135 4633975 2392760 6161428 9404318 4528979 -4883958 -10673154 -13064619 -16952538
41127 -16952538 -19818362 -14914857 -4490713 1735313 1454761 2310513 8292343 14332549
41119 14332549 17337010 22041383 30668923 35717439 29863949 16727810 5449458 -343402
41111 -343402 -2520685 -2559198 -1958707 -4317649 -10470266 -14707967 -11938530 -5634136 -2387992
41102 -2387992 -1570420 1982487 6676239 4469469 -6007814 -14428305 -11032353 894010
41094 894010 9383728 8184481 2526842 856762 4248468 6054421 1256939 -6504478
41086 -6504478 -9451263 -6021992 -2793154 -4966795 -9126659 -8777518 -3831922 398925
41078 398925 2230883 5867038 13490950 19870660 18107208 8700993 -156981 -1256439
41070 -1256439 4368843 9318398 8052060 2178460 -2518214 -2779672 -111055 2425466
41062 2425466 2958914 889558 -2219813 -1554231 6686926 18187258 22356320 14628484
41054 14628484 2919582 -2334577 -833812 112443 -2611852 -5655965 -7229370 -9622162
41046 -9622162 -12707646 -11930310 -5691870 312539 -652330 -9074235 -20048500 -27753373
41038 -27753373 -27428823 -17543223 -3236501 6058496 6190670 2972528 4038903 8733938
41030 8733938 10302953 6443598 2633488 4118632 8299399 7837291 718553 -5173070
41022 -5173070 80832 15627738 27939764 24816923 9462750 -3524122 -4884951 1883063
41014 1883063 8949247 12382182 10318418 1434405 -9653097 -12549848 -3713299 6280589
41006 6280589 5802900 -1821692 -4399212 78669 1496892 -4893750 -10264293 -5974297
40998 -5974297 2960182 4759935 -3594640 -13874094 -17235276 -12529564 -5109654 -873450
40990 -873450 -1332710 -3085122 -2752976 -2102206 -5396055 -11484540 -13060385 -6180427 3335703
40981 3335703 6644423 2642986 -1521665 763005 9475033 19744955 26689556 28303949
40973 28303949 25598697 20747728 15098008 9397208 5201570 3814761 3581960 903265
40965 903265 -4857456 -9771794 -10235180 -7589911 -6058127 -7252331 -8455539 -6161177
40957 -6161177 -589042 3674185 2436700 -2606846 -5502711 -4179014 -3068160 -4745643
40949 -4745643 -4080712 3240192 10883674 9397381 902770 -4092916 -3339693 -4122819 -7219354
40940 -7219354 -3999151 5986564 9590853 972903 -6005831 1320056 12851786 10531015
40932 10531015 -3650010 -11631366 -6637268 905218 3330366 4475131 6843746 5930734
40924 5930734 1616808 1740624 9032052 15710407 15897504 13070319 11007098 8148649
40916 8148649 5638063 9668884 19761887 25543772 22158237 18198220 20165144 19941479
40908 19941479 8691896 -5812067 -8995370 -1210458 3512971 -1828216 -9773353 -11793564
40900 -11793564 -8840725 -6287235 -5630812 -4067797 1502169 11234886 21334545 27537883
40892 27537883 30547081 33934307 35342052 27184064 10399606 -1203537 1623802 9285917
40884 9285917 6716230 -4912853 -11574569 -7039157 2855072 13702633 25721440 33634345
40876 33634345 28710152 14319406 5561540 8148942 10519568 3555804 -4653583 -3243516
40868 -3243516 3373782 4166805 416932 2436883 11367661 17599784 16863223 15971915 20246293
40859 20246293 24801564 22409216 13440450 3905943 -2028237 -4113500 -3480753 -828024
40851 -828024 3914264 10713968 17232520 18984086 14378747 7816558 3959591 952882
40843 952882 -5317392 -11905769 -11073415 -2065444 7420672 13470795 20994670 32280149
40835 32280149 39189583 34161499 22376353 14140439 10025154 3468757 -5174250 -8532316
40827 -8532316 -5478775 -3021125 -3341356 -167569 8263604 13450189 9790061 4041060
40819 4041060 4203728 7143317 5912936 2363917 2387031 3756064 -424511 -9089260 -14401895
40810 -14401895 -13807884 -11091063 -7033404 364044 6916970 4932879 -3729541 -8172197
40802 -8172197 -4513678 -661560 -1506043 -704404 6516785 12667393 9210846 1620024
40794 1620024 3602243 19355250 38868484 49121396 45041694 31655446 19430368
40787 19430368 15302852 15990416 13596224 8623657 10514619 22461959 34105939 35046358
40779 35046358 28016357 21565360 16946006 11293824 7858557 12231018 21374521 26571349
40771 26571349 25920275 24812175 24922668 21796139 13721590 4962936 -762017 -3236508
40763 -3236508 -1953282 3657768 9818033 11413009 10487724 14655867 25151041 33234645
40755 33234645 31582510 23703515 18357849 18643834 20329396 18554677 12983228 7190294
40747 7190294 4902819 7007742 11845773 17478722 21802546 21158092 13312096 3297954
40739 3297954 1091184 9883920 21169407 25740243 25083018 26584388 31564954 34534203
40731 34534203 31841045 25314909 19148219 17366114 21361381 26256324 24537614 17450056
40723 17450056 15829701 23618431 29217344 22695597 13189669 16231397 29987352 39065337
40715 39065337 38288465 36701902 38940196 38741004 32797155 26530495 23311340 21011070
40707 21011070 21315114 28621422 37097275 33622318 17924131 5501659 5682199 11307228
40699 11307228 15461815 22153020 32336851 35864370 28879966 24764838 34340353 47516186
40691 47516186 49164482 42758116 42495939 49935840 54721285 53486538 52593330 54679143
40683 54679143 56026832 55905530 57243083 59821795 62709971 70310778 85789531 102213733
40675 102213733 111148849 116251122 126578407 140301919 148653874 153549372 166161074
40668 166161074 187609068 205885118 214840248 222742155 237481716 255500303 271643127
40661 271643127 289735558 315285010 343738504 362790459 363718579 347947767 326200818
40654 326200818 311987178 310386761 311925386 302903426 282297735 262055942 250259361
40647 250259361 242173835 230511286 216611586 206716029 202800167 202171427 203059958 207003421
40639 207003421 217212350 235562068 259256416 281330143 297557059 310898797 324853575
40632 324853575 335739715 338509669 337300312 340832194 348216236 349312890 339614428 324323525
40624 324323525 306247347 281295968 249954219 222040404 203983043 190824455 177072467
40617 177072467 165956876 160242761 152873931 136547103 116046255 101301272 93381231
40610 93381231 86926322 81581891 80137709 78440175 68962432 54397359 47074808 52619283
40602 52619283 62557643 65983341 61745934 56003575 53484720 55089688 60404142 68678687
40594 68678687 78318363 87022088 92379983 93646084 94407107 100801271 113558277 124454239
40586 124454239 125911823 122242238 124681086 135763038 146490117 150789800 154485823 164864092
40578 164864092 178039441 184435966 183419011 183886365 190112070 194705555 188866670 174256062
40570 174256062 160101689 151852244 147986153 146331109 147004397 147821364 143045753 131012854
40562 131012854 118812311 113762623 112672020 106127016 92712602 81550010 79138991
40555 79138991 81131690 81040240 80240516 83176011 88208905 91552404 96964193 111648720
40547 111648720 132575699 146741367 148084493 145534951 149053666 155124612 153983893 146458972
40539 146458972 143765467 150907951 159084354 157433003 145997761 133037734 123944122 117529907
40531 117529907 110695494 101922539 90845323 78287315 66949064 59233713 54288414
40524 54288414 49718292 46078006 46604902 51912588 57868418 59959153 57481360 52369600
40516 52369600 46293110 40282245 34981927 29720467 23237398 16464947 12272924 11513602
40508 11513602 12476168 15276897 21906301 29300999 28682322 17904830 9207741 15610027
40500 15610027 32174677 41256584 36389082 29347206 30025861 31352277 22744768 9433061
40492 9433061 6177343 15561197 24734606 24176827 19113669 18918209 23495767 25749371
40484 25749371 22626626 17937988 15951922 16344268 15496576 11026790 5117453 3305668
40476 3305668 8550850 16828698 20877040 18053988 11790247 5939864 1770781 474608
40468 474608 3321218 7774217 8788939 6525455 7335743 13443419 17307179 11814342
40460 11814342 1490561 -3114924 1124806 9030076 16559560 22796944 24468179 18257331
40452 18257331 8944396 5452593 6987619 3347457 -7375509 -12530095 -3603862 8532530
40444 8532530 7738182 -4185245 -10215312 -1570770 12709462 19796926 16790249 8423199
40436 8423199 -483918 -6608833 -7980580 -5836319 -3297928 -899107 2948475 6975533
40428 6975533 7553763 4779389 2761890 2917120 2519643 1048739 1689483 4438892 4303846
40419 4303846 -281358 -3502148 -1011217 3043582 3311476 2554139 6919825 15260685
40411 15260685 20520124 20409646 19513235 20240706 18338159 10233581 208576 -3926285
40403 -3926285 -487448 4487047 5256518 2740312 1390669 2690369 5445137 10691279
40395 10691279 20130626 28794251 26818424 13068533 50224 -1934135 641924 -4417794
40387 -4417794 -14447327 -15590250 -5532083 2151551 -1001268 -6810083 -5079039 2880678
40379 2880678 11908269 21978389 31232055 31594023 21654702 13803168 16984660 21330027
40371 21330027 12837057 -4214673 -13683375 -10851337 -4775449 -1328142 1108842 1125631
40363 1125631 -5293780 -13504942 -13252289 -4345504 3224799 5645159 8533504 12400034
40355 12400034 9300354 -1933026 -10699925 -10677469 -8706754 -11116391 -12691187 -7371277
40347 -7371277 -98223 1114841 -2433972 -4023651 -1676793 2977658 10159714 18853393
40339 18853393 23385080 20327323 14699373 13008797 14250515 13650254 10914926 8701291
40331 8701291 7097702 5665451 6818890 11068083 13155193 9527685 5501826 7515299
40323 7515299 11788339 9277099 50337 -6218939 -4435426 -594462 -1869147 -6758676
40315 -6758676 -8891283 -6522500 -3991386 -5013706 -7809150 -7826107 -4022142 -576237
40307 -576237 -1659165 -6243127 -9989301 -10642879 -8765087 -4870215 194485 3513898
40299 3513898 3641263 4600532 10614479 18123313 20142296 17436252 16257654 15220282
40291 15220282 6307353 -8212592 -13177656 -2022478 11176540 11451409 4522043 5620749
40283 5620749 14453561 17105101 9949127 5447764 11834678 20617146 19944995 10637065
40275 10637065 2141996 -969205 -1428454 -1471036 712326 6011618 9706625 5001632
40267 5001632 -7814796 -17946384 -13901247 2746289 17825621 20528013 14062453 7928892
40259 7928892 5826096 6298449 9442189 15113389 17872032 12287438 2755465 920308
40251 920308 12290398 29837160 40907401 37527974 22203122 7594927 7369796 21930323
40243 21930323 35822350 34799789 22314261 12756850 12266704 15093039 16512909 18615021
40235 18615021 22454066 24382268 23223574 23311562 27113643 31265647 32776630 33040632
40227 33040632 32820599 29379665 22217214 16203698 14777504 14333842 9718064 2086515
40219 2086515 -2965594 -3127796 -1336662 -582825 160918 3471195 7635190 5727942 -6116479
40210 -6116479 -20082647 -22602862 -12014042 -3322499 -8594375 -18990198 -17024316 -3012196
40202 -3012196 4345586 -5234610 -19974274 -24469211 -19670717 -15589534 -13241861 -5772769
40194 -5772769 6319572 12821959 7907547 -1616296 -5386144 -1849471 2127770 1411820
40186 1411820 -1993075 -4355057 -7220139 -14462903 -22985550 -23047459 -11818968 -758881
40178 -758881 -2023539 -11035542 -12120804 -821820 9976149 8837658 609316 -3364624
40170 -3364624 -1836891 -2355410 -7872069 -12831614 -11595981 -5007563 1469135 2825003
40162 2825003 -1399066 -5645423 -2853282 6966098 15037757 13818150 6326035 1726348
40154 1726348 3442291 6192130 4623101 659987 488593 6240949 12771363 13120654
40146 13120654 6564971 -109610 -102702 6132030 12674861 15291405 14035326 10670207
40138 10670207 7797903 9493368 17495106 26328100 27378401 19221317 9468322 5142932
40130 5142932 5848291 7677589 8424394 6668105 1341073 -4266756 -3214468 5710972
40122 5710972 13276171 9787314 -2404106 -11245148 -8963267 181510 6178493 4684701
40114 4684701 1230415 4074908 12954362 17518596 10187164 -2071143 -5203057 3350384
40106 3350384 11655841 10646411 5531933 5120034 8330901 9348142 9723189 14898553
40098 14898553 21534592 19287421 6252916 -6731756 -10625181 -9479583 -11961997 -17234144
40090 -17234144 -16797933 -8385315 240938 3369707 5710333 12691192 17957246 10758599
40082 10758599 -5223187 -12704207 -4724242 4322755 543293 -7631501 -3664432 8888967
40074 8888967 11186668 178422 -5530046 4571081 16208209 13095002 973982 -3785132
40066 -3785132 1672276 7448502 8101650 6225464 3795729 978671 -244144 -101099
40058 -101099 -3773634 -11810259 -14381986 -5038248 6433062 6444598 -2774106 -8324513
40050 -8324513 -6292794 -2849129 -83638 4232413 5349555 -3693958 -15799003 -14433615
40042 -14433615 2489977 17764218 17922887 8000460 -949488 -5833435 -7229924 -3635172
40034 -3635172 2334317 2092849 -6920611 -15626455 -15907954 -10424040 -4116396 4402291
40026 4402291 15493008 21756941 17986218 10817476 9298203 11754707 11104821 7930511
40018 7930511 8468627 12908709 14767092 10277645 1573821 -7167256 -10939039 -5211892
40010 -5211892 7047477 13789972 7495603 -3057959 -3693525 5102236 9374179 2468822
40002 2468822 -6199366 -5612437 3079093 11872225 17625741 22246321 25538028 24468525
39994 24468525 18830673 12962078 10540669 9829209 5855993 -2951051 -12205345 -17088383
39986 -17088383 -18575893 -20555128 -21715387 -16200179 -3918138 6344849 8336498 6981883
39978 6981883 9488445 12810245 8319349 -3580920 -12467155 -11372148 -3150680 7223260
39970 7223260 18087060 26184274 24784624 12417977 -1961687 -8496121 -7571069 -5951321
39962 -5951321 -4975933 214625 10072635 16651285 13670732 6030320 4246095 10943085
39954 10943085 18100737 18662392 15678579 15825189 17511300 12610472 360902 -7952915
39946 -7952915 -2567376 11447307 20125297 17114403 8542331 3084224 3427989 7513557
39938 7513557 11960080 12569094 6779228 -1643041 -4661820 -3847 4306129 -641803
39930 -641803 -12916007 -21589826 -19379807 -9382324 1009646 8630254 14390366 17453248
39922 17453248 14499155 5982006 -876877 429691 6340252 6247763 -3880152 -15631517
39914 -15631517 -19196418 -16220264 -16072119 -21274215 -23596426 -16075620 -3054085 5594259
39906 5594259 6804068 6285924 9147993 13003753 12350331 7525808 5652351 11242635
39898 11242635 18434612 16709555 4615543 -6745185 -6529269 3317976 12157456 13948817
39890 13948817 11151977 7630824 4308466 1781810 1058665 741285 -1094675 -1658960
39882 -1658960 3535859 11161734 11123481 542812 -10337084 -11065240 -3661496 2903920
39874 2903920 4615541 2283467 -3949509 -10983579 -9078759 6563975 23111440 21930141
39866 21930141 3949642 -9531202 -4942496 7086931 9994491 4502922 2910169 8063470
39858 8063470 10978367 6717024 844182 -711714 963051 2435023 2904239 2791057
39850 2791057 3276273 8039608 18828477 28369191 25749280 11743505 494888 841440
39842 841440 3881706 -2940931 -15476953 -17318033 -2755983 15362329 22627386 19071651
39834 19071651 14066847 12177069 10291755 5211472 -2155579 -9452053 -15132859 -17640908
39826 -17640908 -15543041 -9494358 -2256231 3949435 8966543 13218197 15663627 13939813
39818 13939813 6740185 -3636372 -11510674 -12159569 -6672052 -1148883 -70752 -1917329
39810 -1917329 -2668077 -1572346 -621580 194309 2653842 4834892 776155 -11187951
39802 -11187951 -23089508 -24954231 -16557569 -7038012 -3038572 -2351400 -666593 993535
39794 993535 -383899 -3289438 -4334806 -5115516 -9661648 -15299713 -13576748 -3017755
39786 -3017755 5654299 2256009 -9286707 -16277908 -13785072 -9269443 -10993636 -18066460
39778 -18066460 -23811365 -24172090 -19880819 -13497539 -7470700 -3547844 -1597889 305393
39770 305393 3147265 5129533 3820369 -564422 -5207213 -7669476 -7962465 -7681591 -7645205
39761 -7645205 -7116553 -6110184 -7651751 -14873249 -24709905 -28028936 -19741238 -6519344
39753 -6519344 434614 -768581 -1882460 2222353 6515236 5293704 2438156 5849847
39745 5849847 14752529 19631689 15149476 7404961 5796967 11043373 14636004 9282084
39737 9282084 -2925475 -13435889 -16224403 -11766725 -3369480 6224572 13082200 11673357
39729 11673357 1314251 -9249768 -9831702 -1280425 5743011 4940183 918065 -235594
39721 -235594 71729 -2395087 -6732080 -9072591 -8906000 -8043203 -6363986 -3599500 -2634520
39712 -2634520 -5928690 -10714826 -12418864 -10907109 -9177167 -8401044 -8614657 -11139493
39704 -11139493 -15280638 -16260867 -12469063 -10642363 -15966418 -20892486 -14215371 614730
39696 614730 8329349 3903048 -884231 2978520 7978220 3826302 -4950391 -5954014
39688 -5954014 2142853 8429363 5504028 -2868862 -9746585 -12777194 -12544835 -9445707
39680 -9445707 -4989130 -2307136 -2605061 -3105959 -601179 3861323 5536392 1674072
39672 1674072 -4250255 -5847164 -2064855 450368 -4020789 -11655577 -13717160 -8455565
39664 -8455565 -2486641 -343287 440000 2007462 1074194 -4848123 -11751306 -14288877
39656 -14288877 -12399253 -8841089 -4379812 824557 5574147 10902278 19307711 26587887
39648 26587887 21929422 3324240 -14114391 -15290925 -5771906 -3737894 -13765038 -21407246
39640 -21407246 -14876184 322769 12692899 19910111 25455969 27645449 21124487 6931662
39632 6931662 -6026437 -10219265 -6634820 -1966426 -528673 -325577 2074578 3656934
39624 3656934 -3853718 -21886164 -37952105 -36850901 -18226387 2346596 9750584 2447592
39616 2447592 -9639067 -14857113 -8166099 4176835 8411967 -2275203 -17713890 -22043318
39608 -22043318 -14043674 -6997502 -7978365 -9001135 -3038772 2750408 -1791969 -13789027
39600 -13789027 -22163344 -23050314 -20955273 -18406006 -14249039 -10716143 -12941250 -20389554
39592 -20389554 -25498839 -22464118 -13102324 -3681609 406299 -2529029 -9092263 -12993910
39584 -12993910 -12058425 -11360034 -15399030 -19562813 -15155239 -1939146 10387956 13726949
39576 13726949 9540030 4624182 3591366 6538684 9998017 8929445 1190184 -9073517
39568 -9073517 -15452790 -16576431 -15499876 -12166757 -2592207 11877902 20135501 12011900
39560 12011900 -8073585 -23297409 -21604326 -8012153 1959538 -441268 -9125613 -12462844
39552 -12462844 -7340822 -828206 567050 -1543027 -1780649 1344995 5076478 7029552
39544 7029552 7067199 6033046 5016400 4815432 4744638 3530680 2042657 2392050 3670420
39535 3670420 2649419 79040 1104354 6734711 10590778 8222976 3845098 2370936
39527 2370936 791219 -4886463 -9137317 -3127364 10761216 20073227 17598588 7464787
39519 7464787 -3367232 -11024264 -12312238 -6075843 1123160 -347956 -9713228 -14898388
39511 -14898388 -8869441 418535 1071164 -7684328 -16503851 -17764544 -12030058 -5535543
39503 -5535543 -4130708 -7623694 -9662958 -6449934 -3923019 -9657890 -18595148 -16595409
39495 -16595409 -557473 15096380 17253354 10546817 7979044 12516301 16478621 14366194
39487 14366194 8071118 2266975 1307020 7794399 18082623 22416343 16051547 7246832
39479 7246832 7243615 14776445 18108587 11137324 -323811 -8518882 -12551408 -15091420
39471 -15091420 -16046281 -12955404 -5026577 5275872 13223605 13991511 5931927 -7208856
39463 -7208856 -18072998 -20410215 -13182492 -1732810 5681869 5314596 1986807 2905926
39455 2905926 8023186 10655396 7091157 48748 -7198085 -13112474 -13809104 -5515795
39447 -5515795 6331386 9855637 2986942 -2408033 1858871 8651631 9149458 7853000
39439 7853000 13057832 20454607 18851922 7255824 -5321515 -12872576 -14448746 -8199525
39431 -8199525 4735348 14808882 14895721 12083617 15620415 18733145 8979048 -7528826
39423 -7528826 -12147501 -3309530 1212926 -5403556 -8714865 -286842 6710372 1503820
39415 1503820 -4386119 2120057 10882399 4333267 -12387160 -17714244 -5157313 10240458
39407 10240458 15436424 12736032 8811697 5288529 3723739 8146927 17799875 25259958
39399 25259958 25488541 21082883 16672846 13394844 10184880 5911008 -380226 -7362678
39391 -7362678 -10125296 -5179716 4091695 10869896 12170177 9131892 3341991 -2280776
39383 -2280776 -2795684 2286082 5410780 853730 -5540308 -4558054 2329882 6941764
39375 6941764 8820349 13239290 16506809 8369455 -8384383 -16028916 -6463854 5648174
39367 5648174 4036701 -5922624 -7366634 2467646 10722655 9292115 3019488 -2350470
39359 -2350470 -7902005 -14193403 -16317501 -11383463 -4063778 -13859 894100 793762
39351 793762 -1164092 -4934832 -5535432 625123 8395927 9963309 7091791 9809642
39343 9809642 21565953 32333914 30061286 14734831 -2557361 -11507135 -10068349 -2706969
39335 -2706969 4552680 7957563 7923950 7291324 6890123 4569071 -373562 -4822662 -6011354
39326 -6011354 -4808410 -2272491 2940940 9666322 11109102 2851103 -8860159 -13469967
39318 -13469967 -8936227 -1919364 2432280 3486192 419596 -6113669 -8743423 -323940
39310 -323940 13389479 18875178 14082941 10727498 14657729 17217032 11660605 4708291
39302 4708291 3366841 2747526 -2613860 -6982826 -5304167 -5965298 -16836423 -27694039
39294 -27694039 -23730011 -9999431 -3647144 -5792809 -1732701 11047541 16518997 6522327
39286 6522327 -6177378 -9679028 -10581592 -18626935 -27860302 -26381333 -14930192 -3087294
39278 -3087294 5282365 10653725 8821168 -3294747 -16730748 -18505065 -9531941 -3220112
39270 -3220112 -6250130 -11438176 -11051898 -6917530 -3708958 -975096 2562706 3034611
39262 3034611 -3533146 -13182588 -17124472 -12412908 -5123599 -2485400 -5387432 -9823169
39254 -9823169 -12560113 -12858525 -10654283 -6497867 -2686517 -1021676 482027 4799142
39246 4799142 9633368 9232009 4053949 2150568 6840013 9619288 2260383 -9309683
39238 -9309683 -12178525 -4425117 3668925 4978805 2154146 -1134739 -5148564 -8261581
39230 -8261581 -6056129 267194 3326173 1251976 1398472 7759760 13145302 10049847
39222 10049847 2236944 -1175587 2471847 9580735 16872372 21531447 19783628 11822674
39214 11822674 4047862 587678 -2935579 -11083637 -18828075 -17689574 -8577136 -943327
39206 -943327 -508768 -4126762 -6063927 -4147638 -53272 2662920 1237308 -3437536
39198 -3437536 -7870515 -10238541 -10321852 -6024056 3517057 11581182 10113907 3703738
39190 3703738 5133379 13136691 9804533 -10958517 -28403388 -23241198 -7302809 -5306494
39182 -5306494 -16892078 -20188895 -8792806 -99294 -4891543 -12462802 -12834943 -12326876
39174 -12326876 -16373055 -15376507 -1757207 12788358 12360288 222115 -6778958 -1255696
39166 -1255696 9022831 13932011 9420023 -2785388 -14946357 -16731742 -7043778 1631267
39158 1631267 -1722734 -12160288 -17419515 -15277155 -12053907 -8735480 -1209044 7518398
39150 7518398 8507059 1998244 -270953 7960199 17490464 16272896 5358394 -3896422
39142 -3896422 -4581739 -520268 665685 -3495141 -8570274 -8458209 -1911552 5879873
39134 5879873 8181050 2717458 -6871743 -13544834 -10782669 1911002 15237531 16364361
39126 16364361 3366609 -10241554 -10918364 -1859371 2637764 -2667228 -8438477 -6000313
39118 -6000313 1255245 5506039 5842372 6269046 7830839 8970336 10123089 11936631
39110 11936631 11521218 6428163 415183 -991748 538767 -1557609 -7556073 -9972471
39102 -9972471 -5001646 1893111 5250585 7474732 12185751 16037284 14430972 10502435
39094 10502435 9630816 8478972 161103 -10856562 -11388471 370206 9600932 5791864
39086 5791864 -2085914 -422835 8095735 10376985 4019738 -1012427 -344117 -1819886
39078 -1819886 -11635647 -23701076 -26852741 -16597407 2185244 18622164 21773196 10302158
39070 10302158 -3102589 -4293731 4913775 10142615 5522512 535481 3045015 7415054
39062 7415054 6074278 2476929 3419397 6215043 3584742 -3748926 -8809096 -9069947
39054 -9069947 -6718694 -1458753 7790795 15852086 15104334 6481150 -918107 -1740847
39046 -1740847 744925 2290434 3573668 6525417 9900841 11125779 9706819 7339928
39038 7339928 6358182 8059174 10906017 11306616 7848823 3004758 -1122059 -5860169
39030 -5860169 -12185930 -17305603 -18754807 -18841425 -20816272 -23370230 -23165802 -19974737 -14930310
39021 -14930310 -7051635 3199232 10123870 8730175 2092350 -3233729 -6494866 -10574317
39013 -10574317 -13068107 -8229691 2240486 8709708 5946096 -554884 -3003781 -859450
39005 -859450 836823 -948610 -4057556 -4219302 -147976 4791729 7477535 10551482
38997 10551482 18076924 25650631 23360349 11805354 4632351 7966589 8728486 -4530682
38989 -4530682 -19471198 -15806169 2902897 13228287 6292522 -2567037 -1883798 -1320164
38981 -1320164 -12036298 -26759791 -31423366 -24804590 -15384605 -8092921 -4363250 -6902998
38973 -6902998 -14212700 -17124100 -9850340 1418615 8068003 9896730 9502500 5060282
38965 5060282 -2319394 -3412763 5730983 13455388 8073027 -3458939 -6516424 -2502660
38957 -2502660 -5094502 -15376421 -18386322 -7035561 5985280 6301954 -3636278 -11103524
38949 -11103524 -9918338 -3937294 769235 1355984 -1007269 -1851973 2816218 11273557
38941 11273557 16921954 15644713 10006458 5487453 4813427 6285542 5894832 1475701
38933 1475701 -4120887 -5901720 -3775416 -2684714 -3539385 -13560 10600943 19352192
38925 19352192 16215521 4641147 -3073866 -2367044 328976 -817711 -5115643 -10311867
38917 -10311867 -14732396 -14543923 -7431695 700986 1231902 -4513954 -6942576 -3202898
38909 -3202898 -578296 -2800186 -3563963 1754292 7435217 6743337 2293944 286905
38901 286905 428294 -1365543 -4685203 -5849675 -4394908 -2428060 126347 4220891
38893 4220891 7452713 6373199 2277283 191590 1969830 3957981 2440573 -960533
38885 -960533 -1054910 4044332 9343208 8083555 190805 -7404276 -9766661 -9049239 -8230679
38876 -8230679 -5307971 1158263 5949696 3958085 -1174261 -3651183 -6516829 -15039678
38868 -15039678 -22249584 -15390887 2460286 12390336 5859586 -3382727 -1107347 6961962
38860 6961962 7448176 1504264 1158101 9327709 16588038 15960896 10438091 6129245 5785438
38851 5785438 8631337 10476577 5449539 -6734427 -17393723 -18280035 -11553887 -4738483
38843 -4738483 317152 5990897 9974096 7298078 300062 -2659527 660498 3709289
38835 3709289 2406970 1289295 4858421 9182273 7461668 685824 -2632149 2632617
38827 2632617 11084303 12804010 5731380 -1091209 1055861 8722218 11049208 5091536
38819 5091536 -1042213 -1598882 -1244667 -5521135 -11186678 -12544312 -10969011 -10878475 -11751769
38810 -11751769 -11807393 -14146357 -20357470 -23038711 -15272238 -4026586 -2377227 -9885493
38802 -9885493 -12973067 -5606076 2417295 1038841 -6643128 -11113324 -8166042 651544
38794 651544 11712803 18439869 13520271 -2015791 -16323469 -18372799 -9130133 1857653
38786 1857653 7231868 6192861 2141483 -225594 2220106 8457793 14851152 19059929
38778 19059929 19472631 12490186 -3259351 -20041835 -26221999 -20687319 -14629867 -15629010
38770 -15629010 -17841086 -13385573 -6058110 -5617498 -12892473 -19000912 -17594835 -10688719
38762 -10688719 -2944987 3500337 8077882 10696784 12451533 13891662 12808299 7566850
38754 7566850 2113814 2611279 8114405 9823256 2668430 -6441562 -6697882 2309827
38746 2309827 10067663 9375991 5139806 5475162 9187605 8771378 3282070 -516812 -655820
38737 -655820 -4097615 -13614775 -18935202 -9337345 10010075 23535942 24608695 20383596
38729 20383596 18281788 17004603 12784395 6791532 2795523 2151232 3597583 5020835
38721 5020835 4790927 3947356 5685983 9610191 10196184 6155568 6059390 15838644 25429441
38712 25429441 20367325 4696967 -2218450 6841186 17690514 17354574 10977237 8302503
38704 8302503 6991835 682142 -6740957 -7481432 -3417281 -1461994 -588613 4917636
38696 4917636 12727373 14115192 6970761 -1998543 -7098591 -7876807 -4818102 1458010
38688 1458010 6975812 6824429 1122461 -5475927 -9015979 -7960554 -2920165 1788276
38680 1788276 531567 -5742331 -9001618 -5681510 -2439425 -5267270 -10208351 -11500432
38672 -11500432 -11154911 -12512883 -12545180 -10024907 -12511048 -23387766 -30675182 -23293427
38664 -23293427 -10813576 -9871535 -17013926 -15198608 -4093042 -868944 -9055502 -10556274
38656 -10556274 3523209 16039063 10414679 -3887137 -7827604 -907015 3845710 3103781
38648 3103781 4101785 7648799 6599605 -11557 -4721949 -4207223 -3513934 -6236115 -8678687
38639 -8678687 -5786799 2492857 11553272 15193118 9639918 -1692551 -9661288 -9398093
38631 -9398093 -5539245 -3248433 754747 10869689 20759418 19379272 8371167 2695169
38623 2695169 10542071 21574707 21374175 11223653 4912613 8250784 11563724 5537549
38615 5537549 -3809490 -3951386 4619578 8605113 2489684 -2856932 1764788 8107527
38607 8107527 3918680 -5733131 -5684947 3894319 6139191 -6174094 -18710081 -16448641
38599 -16448641 -3500866 6210503 7407209 3383694 -3665881 -12038500 -16319969 -13190182
38591 -13190182 -7367623 -4761910 -4458468 -3536857 -3575659 -5589906 -5358299 -1318287 258231
38582 258231 -3628180 -4753881 2646860 8719586 2090342 -9626782 -9456899 2523796
38574 2523796 9455624 3906566 -3054098 -1519763 4241712 7330924 8773666 10106808
38566 10106808 7657553 1727259 997928 9555627 18142895 16671880 8320579 2937350
38558 2937350 2483279 1632651 -1550378 -4083384 -4905649 -5996482 -7594935 -7826509 -6714784
38549 -6714784 -6765462 -9949243 -15958346 -21762130 -22036072 -13680401 -1377279 5918435
38541 5918435 6030775 5653420 8672102 9326059 2401765 -6359340 -8351359 -6339047 -10510201
38532 -10510201 -20985090 -24472590 -11985904 7529499 17167180 11878986 2230128 -673766
38524 -673766 2049339 1742197 -4755386 -11833615 -13552029 -9628952 -2075569 7859665
38516 7859665 15909376 14392445 2492213 -7568157 -3567536 9560406 15326349 8083312
38508 8083312 -1097427 -3062323 -3030028 -7958936 -12095618 -5789583 7385988 13934852
38500 13934852 9135144 2321630 2460175 6582055 5729497 -2583478 -11258400 -11242682 -1194937
38491 -1194937 9557407 8919629 -4889851 -19604627 -21274460 -9235571 4549655 9884009
38483 9884009 7535055 3832605 1285687 -1901800 -5506886 -5464604 -134277 4556816
38475 4556816 617864 -10702409 -17493490 -10608831 4362447 13319269 10053443 875215
38467 875215 -5872556 -7713479 -5085205 1118678 6030951 2761136 -7165017 -12199959
38459 -12199959 -5719495 3545647 3287575 -5534143 -12385792 -13585865 -14386515 -15953307
38451 -15953307 -11856111 -425315 9152105 8851767 3398780 3279534 10000271 14961457
38443 14961457 11713816 3297919 -3460153 -6048528 -6153404 -5054990 -3285440 -3344408
38435 -3344408 -7729181 -13375393 -12848530 -3847267 6409059 9826342 6582687 1150774
38427 1150774 -6113397 -15901515 -21758662 -15006338 1777767 15201464 16412559 7964176
38419 7964176 -4926692 -19464955 -29613574 -27409042 -15194670 -5803892 -4775443 -3536332
38411 -3536332 3174651 6303201 -864678 -7953713 -3547038 4551311 1701949 -8677983
38403 -8677983 -10828109 -2630954 2958901 963273 325685 5543644 9653793 8616593
38395 8616593 6848026 4807369 -3246950 -14381051 -15565839 -3905614 6149039 3781347
38387 3781347 -3252012 -3449885 1175038 2931011 2652401 4673852 6013242 1821234
38379 1821234 -4434324 -6018508 -3276683 -1125631 -1482583 -4803370 -12688830 -22263895
38371 -22263895 -25217310 -19570197 -14649042 -16881163 -19448315 -14872388 -8404448 -7844109
38363 -7844109 -8941842 -4039504 2202258 336733 -5966379 -4767543 4468961 10625640
38355 10625640 8472729 2591471 -4408932 -13084499 -17711619 -11300938 -724355 -728089
38347 -728089 -10217028 -11023045 4264704 19283024 17423239 4653191 -2211856 582080
38339 582080 3900738 2806460 919188 419927 -1751233 -6948346 -10488367 -5950491
38331 -5950491 7988128 24391909 32150863 26724980 16235634 11644791 12032685 7608435
38323 7608435 -3095469 -10201162 -9330859 -9214970 -16209389 -22723908 -20223243 -14002228
38315 -14002228 -13926969 -18019406 -17355182 -11897200 -8950546 -9195128 -6590328 -675342 2597969
38306 2597969 1895491 1632026 2099937 -1007407 -6696256 -8737017 -6662181 -6301339 -8087431
38297 -8087431 -5950064 120265 2514802 333283 1969430 7767586 4500575 -13198372
38289 -13198372 -29370253 -28132484 -17371449 -14646791 -18191115 -12216384 2807342 8072321
38281 8072321 -2258485 -9467984 751927 16175631 18140020 9057876 3639841 3349720
38273 3349720 -1769952 -11348668 -13746900 -6311627 278442 -278747 -3246138 -6689080
38265 -6689080 -15863390 -27956768 -28400023 -12207160 4629558 7089152 2537442 5739074
38257 5739074 12768215 8374778 -6209667 -13274611 -6528688 621189 -1017458 -2857705
38249 -2857705 2488313 5431759 -4005531 -16317507 -15526991 -4796742 -1927743 -11624867
38241 -11624867 -18915884 -12714085 -1308092 2239967 -987940 -801994 4664016 6711297
38233 6711297 -151327 -10196068 -13948203 -8995077 -1025478 3503202 3346719 1594417
38225 1594417 837270 861058 883422 1583814 3162045 3504236 1418144 265267 4049510
38216 4049510 10126842 10869606 3923566 -4119070 -6562246 -4105445 -341255 4356953
38208 4356953 8676029 5515824 -9412360 -26128291 -28031477 -13092211 1689855 1301319
38200 1301319 -9398385 -14503756 -7415398 4930817 13858112 16771825 14797603 9997676
38192 9997676 5365302 2614941 290319 -2027100 -197860 7750692 13964466 8489642
38184 8489642 -5471030 -13269443 -7934401 1322052 3726607 1615938 4012690 11906177
38176 11906177 17887439 17299058 12648544 8074846 4954435 2806148 792995 -1535228
38168 -1535228 -3057971 -2022734 658496 1886145 1377661 2119399 4175298 3469852 -402682
38159 -402682 -1482574 2786314 5357122 -468485 -10221953 -14714914 -12906094 -10558795
38151 -10558795 -9863217 -8806370 -7932271 -8984969 -8895524 -3710997 3254826 5620101 4015419
38142 4015419 2867627 229800 -7487665 -12799978 -3892005 14506265 22519851 12647252
38134 12647252 1240526 4205461 14674684 16664129 10208437 7934193 12451128 12903709
38126 12903709 3732750 -6604784 -9088816 -6302891 -5730763 -7264541 -3862668 7234707
38118 7234707 19064714 22269067 15880391 8273497 7072529 11072213 14436212 15544107
38110 15544107 16719739 17436776 14678381 9768249 7545237 7806727 5119975 -1158016
38102 -1158016 -4945398 -4389678 -5806005 -11952763 -15393988 -10500027 -4038069 -5045027
38094 -5045027 -10452393 -10629469 -4996601 -2016463 -5734765 -11648363 -15329000 -17039646
38086 -17039646 -17687010 -17076649 -16412639 -16748823 -15327782 -8987979 -490076 4130214 3843709
38077 3843709 2973406 4220748 6542685 8604527 8971381 4880958 -2847183 -5897438
38069 -5897438 2567555 15975657 20202456 12147559 3704841 4853216 11298080 13341874
38061 13341874 9844465 6994236 7476485 7471526 3329922 -3578371 -9197754 -11223627 -10161136
38052 -10161136 -7091278 -2026231 4287259 7962270 4835917 -3044396 -7428179 -3070691
38044 -3070691 5952040 11807793 11554560 7405965 2512657 261348 3134502 7498402
38036 7498402 4801892 -5712318 -11173729 -774587 17127105 24102500 15385691 3614736
38028 3614736 127695 4010009 9816976 14051547 12061156 536088 -13406812 -17049389
38020 -17049389 -10091546 -6144402 -11150391 -13439711 -3892703 6514803 2130575 -13133745
38012 -13133745 -21408859 -15997845 -6598705 -967643 4532543 13548485 20721887 19827316
38004 19827316 13448733 8551737 6747692 4360961 99397 -2340649 -166290 3032676
37996 3032676 674905 -7744820 -14203238 -11805097 -4560210 -2366937 -7275289 -11751725
37988 -11751725 -11588535 -12127749 -17592816 -22422936 -20217598 -14823751 -13795079 -15405706
37980 -15405706 -12128746 -4701566 -2053971 -6622484 -9630605 -4095075 5384413 10019093
37972 10019093 7963180 3518752 -234039 -3198995 -5351887 -6255113 -6386248 -6565250
37964 -6565250 -7305425 -9964285 -15991365 -22965585 -23995555 -14447702 1472544 13421760
37956 13421760 14423444 6838121 -346657 640172 9776080 18846105 18401379 6727195
37948 6727195 -8279844 -16872707 -16191011 -10378366 -3842958 2479510 7957536 8961661
37940 8961661 2206736 -8952104 -15006276 -9651476 2213007 8518706 2812848 -9024358
37932 -9024358 -16246031 -15341655 -11645230 -9872216 -8039990 -3411887 -389225 -6367765
37924 -6367765 -19816657 -28766143 -24593205 -12834294 -5146037 -3677936 -810711 6011113
37916 6011113 8245923 -455406 -11868179 -11975252 520582 12299361 12419520 4506018
37908 4506018 -503149 1354757 4178888 1200939 -7367088 -15541719 -18278193 -16066697
37900 -16066697 -13613055 -14795969 -19161865 -22853464 -22215280 -16855030 -10229869 -6645655
37892 -6645655 -6221992 -4221952 1765131 6056526 2096527 -5311837 -3687208 8376160
37884 8376160 15584201 5946393 -11541798 -18763308 -12176968 -3489987 -634727 -1019414
37876 -1019414 -2579991 -7471414 -11987455 -6030951 10939034 23575233 18116041 -389300
37868 -389300 -14927317 -15308091 -4648359 7534219 12712787 7836598 -2194416 -9053717
37860 -9053717 -10696792 -12489578 -16994854 -19507301 -17287793 -15474745 -17997379 -19668329
37852 -19668329 -14518641 -5938382 -449854 3395257 10677768 18283053 17364217 6702579
37844 6702579 -4963990 -10169174 -9124676 -4686290 2066019 9640172 14969545 16622923
37836 16622923 16200957 15792519 16006714 15699239 11951119 2871873 -7160211 -8901900
37828 -8901900 1097168 14883574 22665736 23931364 23610596 21958652 16246088 9359036
37820 9359036 7494326 10156555 11147584 9531827 10650306 14705741 13444335 2402322
37812 2402322 -10661806 -15163480 -10991567 -6703458 -6729055 -6074768 1356652 13044782
37804 13044782 19873920 17458264 11324198 7772501 3609544 -7615010 -20563746 -20224715
37796 -20224715 -2929724 15308996 19187270 13895668 14447394 22824670 28512869 26879512
37788 26879512 22803387 18049165 9701877 1764375 3670677 13872031 18416219 11148440
37780 11148440 2975802 4236126 9418040 8667909 5152921 9567622 22440032 32704371
37772 32704371 32495881 25252516 18944658 16851505 16030293 12284902 6064983 2747701
37764 2747701 4803261 5845546 -1330643 -11680360 -11897298 522331 12004039 11387945
37756 11387945 4186478 1409600 3090584 2669133 974551 4093444 10609918 12611618
37748 12611618 9068924 7796859 12258400 15130887 8695823 -4170077 -13138280 -11482833
37740 -11482833 -1816145 7287102 9556884 6946677 6182028 8525579 7085421 -2011036
37732 -2011036 -10591605 -7756129 4457011 13354146 13165478 11073421 13558497 16211555
37724 16211555 12918685 7768745 9196513 15711419 16447378 6256387 -7137756 -13466531
37716 -13466531 -11650330 -7600362 -5002353 -3640098 -4009925 -6806887 -8118753 -2404417
37708 -2404417 7369626 9569988 -1018038 -13578631 -13935208 -3153480 4886673 2574406
37700 2574406 -4202799 -7978109 -8544669 -7040076 -1260776 7519217 11582754 7762683
37692 7762683 4291164 8492622 13771722 8720334 -4902204 -14055063 -12625529 -7227925
37684 -7227925 -4674404 -3970846 -2894611 -2985530 -4140838 -2441380 1917653 1909381 -5262783
37675 -5262783 -10849000 -5786736 5259790 9714350 5100038 2362500 9822222 21295794
37667 21295794 24144057 14368673 -855233 -12826132 -18639597 -20002598 -19639309 -19701178
37659 -19701178 -19901324 -15947852 -3813194 12234107 20498055 15325574 5776425 4032294
37651 4032294 7867238 4357835 -8425224 -15089767 -4255661 13573238 19314875 10349321
37643 10349321 1144433 2098063 9487753 16049037 19752917 19591508 13363036 4338357
37635 4338357 1245310 6081100 9569818 4696348 -2458833 -2497282 3069365 5837904
37627 5837904 4072166 3085086 4895204 6644658 8020246 11309381 14051163 10307132
37619 10307132 723441 -6500055 -7056078 -5911813 -8180180 -11024804 -8939800 -2439502
37611 -2439502 2848282 2890042 -1937652 -8137580 -11053877 -8164603 -1952440 3005037
37603 3005037 5999959 9597061 13592598 15158108 15161932 17383033 20234873 17347703 8963948
37594 8963948 3858925 5679169 6693265 1072248 -5293864 -6134937 -6020185 -9762562
37586 -9762562 -10249639 -814618 7881814 417784 -17748632 -25243299 -15060259 -2003852
37578 -2003852 2358191 3904982 9219332 11830204 5034203 -4844325 -8553041 -7092420
37570 -7092420 -5665439 -4070688 -1712928 -2347008 -5048332 -943201 11182673 17198258
37562 17198258 7903689 -3468234 866875 15819359 20418823 7413639 -10204989
37555 -10204989 -19308642 -17777618 -7619116 7134575 15806009 9790311 -2612337 -4139846
37547 -4139846 7262706 16481715 15041678 11012526 11129164 9377219 969264 -6815111
37539 -6815111 -7498526 -6993131 -11730829 -15799477 -11926047 -6719419 -11200749 -21042464
37531 -21042464 -20284828 -4249883 13079724 16977714 8647740 470772 627104 6942493
37523 6942493 13133501 16481119 18283909 19176967 17396491 12456707 7182449 3521773
37515 3521773 -414245 -5409914 -7014512 -2166891 3313781 1577285 -4889598 -6631766
37507 -6631766 -2270307 -84441 -3133329 -3287157 5656772 17773983 23565910 21981075
37499 21981075 18231264 14707520 9458091 689547 -10632545 -20428533 -23138403 -17483584
37491 -17483584 -10020090 -7661778 -8007511 -4201925 2330803 3698276 -482940 -2358478
37483 -2358478 -344028 -2066764 -9582773 -13897497 -9080510 -581335 5346261 9057824
37475 9057824 9754751 3358746 -5788580 -4891232 7981295 18540452 18666686 18296808
37467 18296808 23748479 21664016 1528753 -20720432 -22587506 -8257547 -270771 -5227719
37459 -5227719 -10194536 -8958780 -8668545 -10806656 -7951262 -2114602 -5317347 -16926990
37451 -16926990 -20216502 -9066247 -86604 -7884895 -23223929 -27678159 -18541308 -6822076
37443 -6822076 1180300 7620607 12755408 12277944 5150387 -3016418 -6038549 -3848414
37435 -3848414 -2312209 -6290794 -12568016 -12286285 -2669167 8038704 12005661 12843664
37427 12843664 17587187 22733497 18976542 6982045 -3273991 -7620999 -10031032 -10506604
37419 -10506604 -4389245 4627475 5090250 -4319885 -10665709 -5982349 2087969 5438710
37411 5438710 8250450 15387135 19918852 14350499 5574622 5274828 10779667 8993335
37403 8993335 -2506277 -10994364 -6866594 3847329 9447371 8086890 7484940 11912980
37395 11912980 15503805 10700068 68279 -5674215 -2270276 1490635 -3706704 -13915772
37387 -13915772 -18002821 -13713301 -8284754 -4846245 907868 9480175 13812710 10351808
37379 10351808 4984744 3920588 6311992 9449739 13426258 16695787 14742162 7721353
37371 7721353 2487621 2770923 4112692 2425609 307392 587364 833211 -1241855 -3720194
37362 -3720194 -5500449 -7945792 -8717328 -3535003 2401990 -3242776 -19930968 -29416688
37354 -29416688 -20451546 -6228149 -4845417 -13022019 -14263903 -5152666 3313699 5881699
37346 5881699 7324088 8175027 3090261 -4969325 -4483573 6353579 14185072 9133815
37338 9133815 -1535079 -4562544 2621775 12031247 15382491 9479654 -2644796 -11591320
37330 -11591320 -8221050 5261599 15962319 15988198 12024182 14478163 22481962 26416366
37322 26416366 22046970 14661105 9726765 6388319 2304111 -364360 1892193 7003432
37314 7003432 8227689 2660386 -4741752 -7761235 -6704531 -6180499 -7272190 -6980970
37306 -6980970 -4859340 -4083712 -4526873 -1114282 7398090 13566269 10271523 657767
37298 657767 -6231718 -6792429 -4712358 -4149490 -6368483 -10867005 -14353627 -10819530 1172508
37289 1172508 12916486 14136009 6475309 1310510 3986882 8179963 7843483 6396311
37281 6396311 9060710 12706519 10642229 4269249 2437142 9206045 18167724 20573098
37273 20573098 14943045 6572036 858483 -196399 2428096 5052862 2750036 -5320283
37265 -5320283 -12555842 -11422460 -3541457 2008932 1567772 1260714 5138692 6843202
37257 6843202 338453 -7747438 -7065385 -832129 -1633415 -10803071 -15640249 -10026181
37249 -10026181 -4360018 -8362242 -15602886 -14577778 -6451437 -860813 397353 4170557
37241 4170557 12374103 17375359 12061572 -1363020 -13514981 -15714108 -6700328 6319281
37233 6319281 15139890 19427027 23661157 25797310 18310090 3521061 -3493368 4988033
37225 4988033 16275439 14609759 3211393 -3061086 -129829 4389927 8129359 15905411
37217 15905411 25267294 25401362 13614124 652201 -4307012 -3732181 -3180288 -2376305
37209 -2376305 435748 2971427 2330587 -1598792 -8495802 -17394715 -22904688 -18974367
37201 -18974367 -8409209 -1350357 -1985930 -3863225 -653871 5764008 10675541 12929790
37193 12929790 13091471 11720755 11928752 17079123 23942950 25123615 19920269 14922242
37185 14922242 12316200 7093398 -1488738 -6311214 -4842090 -4655414 -10396094 -15203406
37177 -15203406 -12196694 -4846916 1807477 9894397 18899008 17777256 426705 -18779091
37169 -18779091 -20336370 -6080943 5011004 4782929 2934249 5453935 3719894 -8214246
37161 -8214246 -19650955 -16967676 -2891936 7820910 7307727 878459 -3054972 -2122611
37153 -2122611 745802 2369195 2539573 3791608 7843286 12274435 12563506 7466482
37145 7466482 57295 -6134921 -8893174 -6298935 935511 6137818 2057414 -8467370
37137 -8467370 -13372815 -6132959 5957587 12137068 11038277 7825652 3881382 -2934856
37129 -2934856 -10536705 -13231745 -9957494 -5428550 -2685822 -206116 3044892 5337041
37121 5337041 6161736 7399209 9098419 8864336 6843524 6376208 7954628 7634467 3687711
37112 3687711 -319373 -1722025 -2612710 -4283700 -3726577 -165908 822743 -4402110 -10626559
37103 -10626559 -12154731 -12752210 -18226634 -23437013 -18111054 -4118175 5143938 3792809
37095 3792809 113722 1076854 2082481 -1931369 -5955320 -4018431 -386510 -1912085
37087 -1912085 -5539717 -3967728 563336 -667926 -7850492 -11638263 -7742883 -2740831
37079 -2740831 -3105812 -6995786 -10380326 -13919850 -18938981 -22172424 -20218436 -15962368
37071 -15962368 -15047421 -17154451 -15634889 -6669881 4392350 8046159 1269394 -8752320
37063 -8752320 -12439897 -7967804 -1473480 1887451 3151658 5053096 7142672 8580713
37055 8580713 11769916 18509421 25203364 27071979 25469720 25649023 28106059 27753459
37047 27753459 22025339 14755663 10960802 11728426 14654537 15190790 7687389 -9259390
37039 -9259390 -27113964 -32778671 -22781059 -7873623 -509635 -1814538 -4479438 -4401182
37031 -4401182 -4037554 -6201053 -10021760 -13198443 -14225017 -11946546 -6430630 -1097607
37023 -1097607 -611794 -4914880 -7982024 -4815206 2178182 6440256 5648225 3597383
37015 3597383 3947357 5810338 6846006 7311153 8433844 9367640 9069521 9301421 11885562
37006 11885562 14228475 12194763 7396635 6736312 13041494 20010666 19034526 9003329
36998 9003329 -2445941 -6283721 -252659 8920954 11869882 6692003 1102137 2252010
36990 2252010 7760900 11547346 14613764 21719377 29192342 26643745 12599491 -1488557
36982 -1488557 -6506451 -6035474 -7100955 -9419104 -9572230 -7879036 -4803754 1946666
36974 1946666 10109232 10444998 -307713 -10933627 -9054933 2680491 12317207 14927030
36966 14927030 14024295 11758744 7761931 4227593 2769172 -616789 -8720469 -14978183
36958 -14978183 -11394954 -1243018 5233302 4382177 -221046 -5934958 -10079059 -6373992
36950 -6373992 5780779 13476176 5266721 -9920450 -13505069 -3992413 3003731 60618
36942 60618 -4215146 -3957507 -4862703 -9725647 -11345253 -6353615 -2224542 -3679912 -4530908
36933 -4530908 128274 4898118 3820071 -1002443 -5906142 -10565548 -12065058 -5580389
36925 -5580389 4410324 6037014 -1580278 -5029557 2304851 10007289 8889005 4537120
36917 4537120 3214983 -400005 -9138433 -11553476 600947 15045360 15474480 5844474
36909 5844474 1734948 5678498 8211707 6849270 6202070 3942151 -5247869 -14558585
36901 -14558585 -11969564 -1259571 1804596 -5109090 -7530987 576910 6336122 -378565
36893 -378565 -10610769 -11417205 -5015223 -1852578 -3168622 -1665363 5034456 10987483
36885 10987483 10182434 2167165 -8669398 -15310699 -12658591 -4108612 -418765 -7391482
36877 -7391482 -17486096 -18923632 -11242585 -5766603 -10308861 -19014269 -20103453 -10075295
36869 -10075295 3617496 12392813 14732093 14239166 13771083 13933479 14487230 14160702 10996142
36860 10996142 5554959 1354077 -685583 -4356305 -10325321 -11244979 -2371515 7294512
36852 7294512 5474221 -3617068 -3126845 11077498 22653957 17899322 4101532 -3476837
36844 -3476837 -2390964 -581145 -1119308 -495529 2499131 5717975 8392211 9831123
36836 9831123 7545132 3058786 3833163 11836202 16484484 8243439 -6369208 -13875882
36828 -13875882 -13192440 -13917036 -18170114 -17523017 -9082813 -2627175 -7193962 -18537385
36820 -18537385 -24964258 -21411648 -13853823 -10912238 -12764094 -10036403 3439232 18672210
36812 18672210 20097310 7120639 -3562376 -1905124 1413726 -5830431 -15998917 -13949022
36804 -13949022 -2812662 -86161 -10637176 -20198561 -17098257 -6492409 275001 -579356
36796 -579356 -5607201 -9609392 -8222577 -1655838 3612375 2747914 -45086 775160 1238780
36787 1238780 -5027912 -12752831 -11036193 -1602540 2911865 -948251 -3316320 1072923
36779 1072923 4849547 1781828 -4141922 -8013976 -10721693 -11667805 -6196468 4281776
36771 4281776 10143766 7134631 2434518 2259704 3463087 2400162 1298721 -6301
36763 -6301 -7167600 -18541177 -20563274 -5949981 12407817 16460462 5394949 -6740784
36755 -6740784 -9970469 -5143510 3443266 11966951 15811679 12608371 5645620 -566440
36747 -566440 -5121516 -7203837 -3400612 5700005 11974576 9754971 4191272 2632034
36739 2632034 3480874 2188851 2634236 11328743 23237982 25233363 13945212 -26748
36731 -26748 -7111283 -8645261 -9282976 -8350801 -3531380 3031133 7443342 9036462 8568534
36722 8568534 4895612 -2031478 -7037956 -3658697 7553660 18483640 22689984 22413192
36714 22413192 23891398 27623466 27481067 20023464 10354637 5875080 7392293 10234695
36706 10234695 11601705 11840159 10061872 4634310 -1687931 -3124391 792944 3266076
36698 3266076 -797657 -7815876 -10269903 -5421603 3058964 9604143 10712710 6513634
36690 6513634 481987 -3334127 -3601914 -1691792 515113 1191145 -1024039 -4298221
36682 -4298221 -3698002 1989098 6140411 2310327 -6067667 -10451212 -9455101 -8402742
36674 -8402742 -8123439 -3981314 3276294 6022408 1967557 -1686004 -186699 1984131
36666 1984131 1190649 2003829 7367335 9729253 1220086 -12703454 -18952011 -13210652
36658 -13210652 -3121789 2523391 1135570 -4720600 -9217277 -6189041 3466474 9243986
36650 9243986 2666671 -9749532 -12498951 -548447 14116945 17709497 10770536 5231842
36642 5231842 8835812 17328380 21926624 20527435 18728736 20963454 24389408 23312160
36634 23312160 16958620 9868266 6264728 7257941 12050201 18070323 21104619 19310985
36626 19310985 15778591 12887953 6670092 -6656597 -20298845 -21718994 -8740555 7346502
36618 7346502 16475173 19145697 18597542 13517946 4534427 -268364 5300652 15411874
36610 15411874 19103718 14289471 8150665 5909592 6010583 5678487 5082109 4960308 4382552
36601 4382552 2544524 559971 82198 884556 804131 -1225422 -2565856 266806 5310312
36592 5310312 5752631 -82198 -4115852 122970 5682867 665747 -13165175 -20577852
36584 -20577852 -13259813 -566662 3788324 -1977820 -9317443 -11091539 -6571485 1440406
36576 1440406 9861488 16598363 20012577 17334271 6953183 -5233379 -7731582 1924389
36568 1924389 10558242 6406254 -3528812 -5288810 -926497 -3185435 -10823091 -9167650
36560 -9167650 3773374 12552153 10364567 9150416 15370653 16019057 1409429 -15525472
36552 -15525472 -17820931 -8674829 -1956873 -64421 3517440 8858629 11441852 12136164
36544 12136164 12782116 9185465 -22685 -5630315 -340200 9248676 13860254 15004007
36536 15004007 15952627 10778030 -3579108 -15015751 -11667700 -504068 4588136 3596202
36528 3596202 3403867 867767 -8528744 -15098245 -8767131 152012 -3678547 -12269571
36520 -12269571 -6526244 8457668 8507207 -9414881 -20543825 -10951948 3270946 4137771
36512 4137771 -3846479 -8156767 -7697488 -6408403 -3558615 -930257 -5564448 -16155930
36504 -16155930 -20169501 -12802411 -5182369 -5466713 -5994804 1171397 9605826 10645666
36496 10645666 8494796 11431185 17193410 18299503 14592203 10582002 6424344 184725
36488 184725 -5841414 -7754125 -4784313 2057773 10114204 12300305 3166797 -10133965
36480 -10133965 -13554883 -5661239 331932 -2751453 -7076266 -6499087 -7027385 -12570749
36472 -12570749 -15096715 -9658971 -5928525 -12467699 -20958645 -19013060 -8774529 260379
36464 260379 7724381 17689726 25200436 22246804 12299852 5657130 4160060 2355343
36456 2355343 -104114 1209249 6059674 10731405 14817178 17370994 12082784 -2331176
36448 -2331176 -12693954 -5915403 10735945 17951233 10967826 3596570 5641336 10210295
36440 10210295 6449049 -6215373 -20062777 -27042168 -22857463 -10589608 -947314 -1572230
36432 -1572230 -6462241 -3861641 6571725 13732575 11349583 4165896 -1940757 -5091539
36424 -5091539 -2196511 8978962 19739482 15120190 -5575478 -23683928 -23686854 -11658834
36416 -11658834 -3652989 -4204415 -5889604 -3994828 -923670 1189070 2752052 2474624
36408 2474624 -1178387 -4447718 -1547425 5736178 8579357 3297508 -3144058 -3183568
36400 -3183568 971429 2203523 431314 2814954 11578211 18024832 12906808 -555422
36392 -555422 -9391992 -6276193 2576703 6198941 1445312 -5697121 -7961942 -2444705
36384 -2444705 9175136 21605817 27768749 23740066 12766174 2171988 -3581020 -4627879
36376 -4627879 -1963733 3556061 8208438 6654197 -855432 -6262004 -2724242 6303330
36368 6303330 11257597 8483859 3217243 478615 -1472725 -5998469 -10946272 -11241731
36360 -11241731 -6415147 -1040544 1390740 1005456 -1215490 -4209072 -5017396 -1115196
36352 -1115196 4811026 7385217 6847714 9123692 15459260 18238402 11267567 -991294
36344 -991294 -9318149 -10322173 -5980288 2560128 13590977 20427177 16466078 4268957
36336 4268957 -6756292 -11694899 -13743801 -16842146 -20335356 -21697015 -20013750 -15720829
36328 -15720829 -9818399 -3526612 3055525 10425386 16328444 16560532 11709862 8411969
36320 8411969 10303619 13230777 13597991 14075286 14910533 8772848 -5825079 -14816806
36312 -14816806 -5902248 11075045 16653157 9652456 4827514 5899342 2023891 -7594519
36304 -7594519 -8177599 4571670 13868874 8415019 953311 5870366 14230173 9186940
36296 9186940 -4891636 -8510893 3012241 14170405 13262775 6322399 4691357 10530292
36288 10530292 18440611 23271889 22691251 17348803 11255116 8880570 10511783 12131306
36280 12131306 9737859 2938853 -4284632 -6196096 -1592245 2579649 -1823503 -13474670
36272 -13474670 -23100262 -25541977 -23535768 -19316617 -11243470 -808853 6160455 8665477
36264 8665477 11970164 16251591 13716323 2373617 -7035715 -4928234 4329560 10301658
36256 10301658 9762767 5873891 1779335 1335465 8300568 18229159 19272754 7963614
36248 7963614 -3897661 -4996796 1408459 6204065 7703682 7859663 4682776 -1892837
36240 -1892837 -4891448 -381286 5443783 7738832 11705191 20122213 23085947 12418840
36232 12418840 -3159689 -9866843 -7109467 -2065243 3622305 8520602 4354040 -9763798
36224 -9763798 -17214075 -6259091 7860143 3759162 -12586623 -18553619 -11703632 -9579449
$$ [...]
##END NTUPLES=NMR SPECTRUM
##END=
