##TITLE=31Pdec_SR115_k2
 DMSO-d6, 24 sc
 7.7.2022
##JCAMPDX= 6.0         $$ Bruker NMR JCAMP-DX V2.0
##DATA TYPE= NMR SPECTRUM
##DATA CLASS= NTUPLES
##ORIGIN= UXNMR, Bruker Analytische Messtechnik GmbH
##OWNER= root
$$ XWIN-NMR		Version 3.5
$$ Thu Jul  7 14:58:43 2022 Russian Standard Time (UT+4h)  she@DPX200
##.OBSERVE FREQUENCY= 81.013821
##.OBSERVE NUCLEUS= ^31P
##.ACQUISITION MODE= SIMULTANEOUS
##.ACQUISITION SCHEME= undefined
##.AVERAGES= 24
##.DIGITISER RES= 16
##SPECTROMETER/DATA SYSTEM= spect
##.PULSE SEQUENCE= zgpg30
##.SOLVENT NAME= CD2Cl2
##.SHIFT REFERENCE= (INTERNAL, CD2Cl2, 0, 248.564)
##AUDIT TRAIL= $$ (NUMBER, WHEN, WHO, WHERE, WHAT)
$$ ##TITLE= Audit trail, XWIN-NMR		Version 3.5
$$ ##JCAMPDX= 5.01
$$ ##ORIGIN= Bruker BioSpin GmbH
$$ ##OWNER= she
$$ F:/spectra/data/she/nmr/P31/1/pdata/1/auditp.txt
$$ ##AUDIT TRAIL=  $$ (NUMBER, WHEN, WHO, WHERE, WHAT)
(   1,<2022-07-07 14:57:45.85 +0400>,<she>,<DPX200>,
      <created by zg, POWCHK disabled, PULCHK disabled
       configuration hash MD5:
       00 E9 B6 7A A2 85 ED C7 34 08 36 98 17 FE 4E 26
       data hash MD5: 32K
       0D E9 B2 07 7F 2F 05 55 89 CA 16 C8 D3 28 E6 23>)
(   2,<2022-07-07 14:57:48.29 +0400>,<she>,<DPX200>,
      <Start of raw data processing
       efp BC_mod = 2 LB = 1 FT_mod = 6 PKNL = 1 PHC0 = -10130.93 PHC1 = 591.6562 SI = 64K 
       data hash MD5: 64K
       3B 87 42 B0 56 39 DB E1 56 57 8C 55 72 EA CD 94>)
(   3,<2022-07-07 14:58:10.35 +0400>,<she>,<DPX200>,
      <pk PHC0 = -50.47482 PHC1 = 110.4 
       data hash MD5: 64K
       AE 8D 2C 67 BA 13 36 2F FF 9F 0F E4 9A 79 65 E2>)
(   4,<2022-07-07 14:58:22.09 +0400>,<she>,<DPX200>,
      <abs ABSG = 5 
       data hash MD5: 64K
       D8 5F CB 02 C1 1C 84 62 EF C3 4A 69 55 99 FF 0F>)
$$ ##END=
$$ 
$$ hash MD5
$$ E5 BF 7F 56 14 0F 92 BC B1 08 FC 2F 93 BB 67 8E
##$RELAX= 
##$RELAX= 
##$RELAX= 
##$RELAX= 
##$RELAX= 
##$RELAX= 
##$RELAX= 
##$RELAX= 
$$ Bruker specific parameters
$$ --------------------------
##$DU= <F:/spectra>
##$EXPNO= 1
##$NAME= <P31>
##$PROCNO= 1
##$TYPE= <nmr>
##$USER= <she>
##$AMP= (0..31)
100 100 100 100 100 100 100 100 100 100 100 100 100 100 100 100 100 100 
100 100 100 100 100 100 100 100 100 100 100 100 100 100 
##$AQSEQ= 0
##$AQ_mod= 1
##$AUNM= <au_zg>
##$AUTOPOS= <>
##$BF1= 81.014009
##$BF2= 200.13
##$BF3= 200.13
##$BF4= 200.13
##$BF5= 200.13
##$BF6= 200.13
##$BF7= 200.13
##$BF8= 200.13
##$BYTORDA= 1
##$CFDGTYP= 0
##$CFRGTYP= 5
##$CHEMSTR= <none>
##$CNST= (0..31)
1 1 145 1 1 1 1 1 1 1 1 1 1 1 1 1 1 1 1 1 1 1 1 1 1 1 1 1 1 1 1 1 
##$CPDPRG= <waltz16>
##$CPDPRG1= <>
##$CPDPRG2= <waltz16>
##$CPDPRG3= <>
##$CPDPRG4= <mlev>
##$CPDPRG5= <mlev>
##$CPDPRG6= <mlev>
##$CPDPRG7= <mlev>
##$CPDPRG8= <mlev>
##$CPDPRGB= <>
##$CPDPRGT= <>
##$D= (0..31)
0 1 0 0 0 0 0 0 0 0 0 0.03 2e-05 3e-06 0 0 0 0 0 0 0 0 0 0 0 0 0 0 0 0 
0 0 
##$DATE= 1657191465
##$DBL= (0..7)
120 120 120 11 120 120 24 19 
##$DBP= (0..7)
150 150 150 150 150 150 150 150 
##$DBP07= 0
##$DBPNAM0= <>
##$DBPNAM1= <>
##$DBPNAM2= <>
$$ [...]
##$SUBNAM3= <"">
##$SUBNAM4= <"">
##$SUBNAM5= <"">
##$SUBNAM6= <"">
##$SUBNAM7= <"">
##$SUBNAM8= <"">
##$SUBNAM9= <"">
##$SW= 501.771253377433
##$SWIBOX= (0..15)
0 1 3 0 0 0 0 0 0 0 0 0 0 0 0 0 
##$SW_h= 40650.406504065
##$TD= 32768
##$TD0= 1
##$TE= 0
##$TE2= 300
##$TE3= 300
##$TEG= 300
##$TL= (0..7)
0 120 53 12 22 120 120 120 
##$TP= (0..7)
150 150 150 150 150 150 150 150 
##$TP07= 0
##$TPNAME0= <>
##$TPNAME1= <>
##$TPNAME2= <>
##$TPNAME3= <>
##$TPNAME4= <>
##$TPNAME5= <>
##$TPNAME6= <>
##$TPNAME7= <>
##$TPOAL= (0..7)
0.5 0.5 0.5 0.5 0.5 0.5 0.5 0.5 
##$TPOFFS= (0..7)
0 0 0 0 0 0 0 0 
##$TUNHIN= 0
##$TUNHOUT= 0
##$TUNXOUT= 0
##$USERA1= <user>
##$USERA2= <user>
##$USERA3= <user>
##$USERA4= <user>
##$USERA5= <user>
##$V9= 5
##$VALIST= <valist>
##$VCLIST= <CCCCCCCCCCCCCCC>
##$VD= 0
##$VDLIST= <DDDDDDDDDDDDDDD>
##$VPLIST= <PPPPPPPPPPPPPPP>
##$VTLIST= <TTTTTTTTTTTTTTT>
##$WBST= 1024
##$WBSW= 4
##$XGAIN= (0..3)
0 0 0 0 
##$XL= 0
##$YL= 0
##$YMAX_a= 1379
##$YMIN_a= -1320
##$ZGOPTNS= <>
##$ZL1= 120
##$ZL2= 120
##$ZL3= 120
##$ZL4= 120
##$ABSF1= 248.5645
##$ABSF2= -253.2056
##$ABSG= 5
##$ABSL= 3
##$ALPHA= 0
##$AQORDER= 0
##$ASSFAC= 0
##$ASSFACI= 0
##$ASSFACX= 0
##$ASSWID= 0
##$AUNMP= <proc_1d>
##$AZFE= 0.1
##$AZFW= 0.5
##$BCFW= 0
##$BC_mod= 2
##$BYTORDP= 0
##$COROFFS= 0
##$CY= -3
##$DATMOD= 1
##$DC= 0
##$DFILT= <>
##$DTYPP= 0
##$F1P= 0
##$F2P= 0
##$FCOR= 1
##$FTSIZE= 65536
##$FT_mod= 6
##$GAMMA= 0
##$GB= 0
##$INTBC= 1
##$INTSCL= 5.30512e-09
##$ISEN= 30
##$LB= 1
##$LEV0= 0
##$LPBIN= 0
##$MAXI= 10000
##$MC2= 0
##$MEAN= 0
##$ME_mod= 0
##$MI= 50
##$NCOEF= 0
##$NC_proc= -8
##$NLEV= 6
##$NOISF1= 182.463
##$NOISF2= 159.3651
##$NSP= 0
##$NTH_PI= 0
##$NZP= 0
##$OFFSET= 248.5645
##$PC= 4
##$PHC0= -10181.4
##$PHC1= 702.0562
##$PH_mod= 1
##$PKNL= yes
##$PPARMOD= 0
##$PSCAL= 0
##$PSIGN= 0
##$REVERSE= no
##$SF= 81.014009
##$SI= 65536
##$SIGF1= 159.3651
##$SIGF2= -187.1042
##$SINO= 113.3802
##$SIOLD= 16384
##$SREGLST= <1H.CDCl3>
##$SSB= 0
##$STSI= 65536
##$STSR= 0
##$SW_p= 40650.406504065
##$SYMM= 0
##$S_DEV= 0
##$TDeff= 32768
##$TDoff= 0
##$TI= <>
##$TILT= no
##$TM1= 0
##$TM2= 0
##$TOPLEV= 0
##$USERP1= <user>
##$USERP2= <user>
##$USERP3= <user>
##$USERP4= <user>
##$USERP5= <user>
##$WDW= 1
##$XDIM= 65536
##$YMAX_p= 521964878
##$YMIN_p= -21591409
$$ End of Bruker specific parameters
$$ ---------------------------------
##NTUPLES= NMR SPECTRUM
##VAR_NAME=  FREQUENCY,     SPECTRUM/REAL,   SPECTRUM/IMAG
##SYMBOL=    X,             R,               I
##VAR_TYPE=  INDEPENDENT,   DEPENDENT,       DEPENDENT
##VAR_FORM=  AFFN,          ASDF,            ASDF
##VAR_DIM=   65536,         65536,           65536
##UNITS=     HZ,            ARBITRARY UNITS, ARBITRARY UNITS
##FACTOR=    0.620285442955139, 1,           1
##FIRST=     20137.2065510759, 0,            0
##LAST=      -20513.1999529892, 0,           0
##MIN=       -20513.1999529892, -21591409,   0
##MAX=       20137.2065510759, 521964878,    0
$$ Real data points
##PAGE= N=1
##DATA TABLE= (X++(R..R)), XYDATA
$$ [...]
$$ plain form
41888 -7637646 -3775661 5094696 10012515 6087055 -1405478 -5451319 -6021593 -6246098
41880 -6246098 -5367917 -1598940 1688280 -542721 -6926184 -11239414 -11139617 -9548358 -7783525
41871 -7783525 -3629405 2653477 6210698 4106301 -173445 -1476194 714454 3193557
41863 3193557 3860133 3067762 1621846 -211624 -2026493 -2952945 -2185362 188965 2602973
41854 2602973 2970506 1264426 310709 2508207 6531458 9050995 8871089 7218179 4842032
41845 4842032 1717875 -702624 -219740 2527352 4097232 2947133 1612892 2817507
41837 2817507 5497268 6452156 4624059 2040175 1058388 1905106 2931844 2782837 2050431
41828 2050431 2383507 3952739 4967461 4381825 3600153 4164458 5283659 5515270 5284902
$$ packed form
41888g637646L861985Q870357M917819l925460p492533m045841n70274k24505
41880f246098Q78181L768977L287220k231001o383463m313230R9797J591259J764833
41871g783525M154120O282882L557221k104397m279746j302749K190648K479103
41863C193557O66576p92371j445916j833470j814869r26452P67583K374327K414008
41854B602973L67533j706080r53717K197498M023251K519537j79906j652910k376147
41845D842032l124157k420499M82884K747092J569880j150099j334241J204615
41837B817507K679761R54888j828097k583884r81787Q46718J026738j49007p32406
41828B050431L33076J569232J014722n85636p81672N64305J119201K31611k30368
$$ plain form
41819 5284902 5193781 3405921 -1665850 -6849655 -6748135 -1448265 2424031 184635 -4763823
41810 -4763823 -5844566 -1897893 2241223 2627882 697373 549678 3618111 7131257
41802 7131257 7593136 4995904 2639841 2708865 3755261 3942310 4850334 8941993 14035703
41793 14035703 14440220 8797049 3199342 3916162 9347574 12299336 9103869 3235001
41785 3235001 -283865 -1019424 -1933602 -3848893 -3984366 -462766 4137190 5837922 4700584
41776 4700584 4384151 6323770 7630134 6063646 3887363 4179371 5759178 5100986 1785314
41767 1785314 -1429094 -3170903 -4670412 -6557924 -7469548 -6091655 -2393424 2823699
41759 2823699 7466401 8315456 4548988 159596 -327814 2440908 4671240 5618455 7017724
$$ packed form
41819E284902r1121j787860n071771n183805J01520N299870L872296k239396m948458
41810d763823j080743L946673M139116L86659j930509j47695L068433L513146
41802G131257M61879k597232k356063O9024J046396J87049R08024M091659N093710
41793A4035703M04517n643171n597707P16820N431412K951762l195467n868868
41785C235001l518866p35559r14178j915291j35473L521600M599956J700732j137338
41776D700584l16433J939619J306364j566488k176283K92008J579807o58192l315672
41767A785314l214408j741809j499509j887512r11624J377893L698231N217123
41759B823699M642702Q49055l766468m389392m87410K768722K230332R47215J399269
$$ plain form
41750 7017724 7427839 3294666 -3796365 -7185191 -4343393 -377235 -12504 -1673587
41742 -1673587 -2470200 -3300589 -4840406 -3761808 1739723 6845687 6291503 2416669 1190690
41733 1190690 2876905 3014857 932357 409198 2121625 2054003 -1369430 -4265806 -3454065
41724 -3454065 -1021101 -271388 -743802 21854 2258750 4031530 4021891 2448582 291009
41715 291009 -1192077 -1124365 -39130 504167 -342113 -2121421 -4026467 -5358854 -5414441
41706 -5414441 -4224727 -2940035 -2110299 -511531 2380858 3887280 1079157 -4120794
41698 -4120794 -6202418 -3113218 1052679 1712194 -550522 -1805784 -163453 2824734
41690 2824734 4857137 4839990 2698856 -855737 -4119475 -5197440 -3788301 -1901809
$$ packed form
41750G017724M10115m133173p091031l388826K841798L966158L64731j661083
41742a673587p96613q30389j539817J078598N501531N105964n54184l874834j225979
41733A190690J686215J37952k082500n23159J712427o7622l423433k896376Q11741
41724c454065K432964P49713m72414P65656K236896J772780r639j573309k157573
41715B91009j483086O7712J085235N43297q46280j779308j905046j332387n5587
41706e414441J189714J284692Q29736J598768K892389J506422k808123n199951
41698d120794k081624L089200M165897O59515k262716j255262J642331K988187
41690B824734K032403j7147k141134l554593l263738j077965J409139J886492
$$ plain form
41682 -1901809 -2083023 -4402684 -5659696 -2801798 2748723 5855398 3574846 -1428500
41674 -1428500 -4654631 -5000172 -4228408 -3223692 -1807490 -965667 -1730790 -2434455 -699782
41665 -699782 2005064 1706107 -1803058 -4172170 -3135114 -1762490 -3028742 -5051422
41657 -5051422 -4733892 -2938036 -2462538 -3289561 -3731755 -4625066 -8128818 -12932316 -14780570
41648 -14780570 -12282447 -8760944 -7323016 -7065989 -5690536 -3337983 -1563351 -65966
41640 -65966 2786178 6217424 6237865 60495 -9517540 -15837584 -14968936 -9549024 -5238256
41631 -5238256 -4313621 -4345253 -2754067 -314988 833392 817098 1787035 4614173 7386278
41622 7386278 7479997 4520375 1019896 -126313 975948 1116346 -1589336 -4180016 -2369528
$$ packed form
41682a901809j81214k319661j257012K857898N550521L106675k280552n003346
41674a428500l226131l45541P71764J004716J416202Q41823p65123p03665J734673
41665f99782K704846k98957l509165k369112J037056J372624j266252k022680
41657e051422L17530J795856M75498q27023m42194q93311l503752m803498j848254
41648a4780570K498123L521503J437928K57027J375453K352553J774632J497385
41640f5966K852144L431246K0441o177370r578035o320044Q68648N419912M310768
41631e238256R24635l1632J591186K439079J148380j6294R69937K827138K772105
41622G386278R3719k959622l500479j146209J102261J40398k705682k590680J810488
$$ plain form
41613 -2369528 2551915 3970155 -1312844 -8018631 -9035169 -4508083 -510009 -367690
41605 -367690 -1795095 -2186707 -2031365 -1978830 -581247 2862744 6036364 6501479 5001277
41596 5001277 3876804 3642868 2961695 971524 -1843892 -4273992 -4914631 -3233176 -924679
41587 -924679 -662327 -2433864 -2870252 312497 4901498 7035949 5975553 3932168 2394771
41578 2394771 1112279 194599 800331 3357371 6423914 7553984 5046525 -148940
41570 -148940 -3923557 -2505265 2394959 4530860 1108708 -3303728 -3891875 -3015527 -5357436
41561 -5357436 -8458722 -5513512 2546370 5737556 -1365277 -11277264 -13348826 -7080460
41553 -7080460 -634193 599575 -1512838 -3144610 -3156747 -2333951 -1479286 -846139 236198
$$ packed form
41613b369528M921443J418240n282999o705787j016538M527086L998074J42319
41605c67690j427405l91612J55342N2535J397583L443991L173620M65115j500202
41596E001277j124473k33936o81173j990171k815416k430100o40639J681455K308497
41587i24679K62352j771537m36388L182749M589001K134451j060396k043385j537397
41578B394771j282492r17680O05732K557040L066543J130070k507459n195465
41570a48940l774617J418292M900224K135901l422152m412436n88147Q76348k341909
41561e357436l101286K945210Q059882L191186p102833r911987k071562O268366
41553g080460O446267J233768k112413j631772j2137Q22796Q54665O33147J082337
$$ plain form
41544 236198 2697492 5533564 5937662 3264754 767882 1223902 3004295 2950365 789211
41535 789211 -2180184 -6166191 -10897802 -12894368 -9357559 -3557676 -1825351 -5706275
41527 -5706275 -10992321 -13730106 -13151964 -9620844 -4358925 -847296 -1761675 -4464164
41519 -4464164 -4045988 -748257 565448 -1567225 -3193884 -1808533 330551 1282837
41511 1282837 2355177 3724864 2330353 -2885189 -7939561 -8970956 -6759601 -3766904
41503 -3766904 -674405 1731129 1516849 -733677 -1310525 809357 1842791 -249792
41495 -249792 -1895248 -59282 2733318 3667477 4730785 7419177 7516377 1713107 -4770453
41486 -4770453 -4642914 312193 2284660 -326866 -1830330 303858 2108933 1169042
$$ packed form
41544B36198K461294K836072M04098k672908k496872M56020J780393n3930k161154
41535G89211k969395l986007m731611j996566L536809N799883J732325l880924
41527e706275n286046k737785N78142L531120N261919L511629r14379k702489
41519d464164M18176L297731J313705k132673j626659J385351K139084R52286
41511A282837J072340J369687j394511n215542n054372j031395K211355K992697
41503c766904L092499K405534k14280k250526n76848K119882J033434k092583
41495b49792j645456J835966K792600R34159J063308K688392R7200n803270o483560
41486d770453J27539M955107J972467k611526j503464K134188J805075r39891
$$ plain form
41478 1169042 544181 2535838 4741722 4838989 4108214 3698722 2014707 -1526190 -4125443
41469 -4125443 -3696384 -1980880 -1031282 391701 4046142 7993832 8119696 3258984 -2948960
41460 -2948960 -5455807 -2878060 754806 364983 -3571759 -5111292 -1052434 4275179
41452 4275179 5657132 4831386 6482813 9290754 7940476 2900375 445604 2191203
41444 2191203 2271641 -2603828 -7257482 -5962788 -542056 3705891 5451515 6180330 5466349
41435 5466349 2339166 -987666 -1075204 2306009 6526333 9279487 9309238 6311044 2428300
41426 2428300 1383955 3779018 5859031 5238479 4645845 6960408 9813774 9208941 6059473
41417 6059473 4573419 5497774 5434395 2510248 -1230497 -3461313 -4323490 -4560261 -3269425
$$ packed form
41478A169042o24861J991657K205884R7267p30775m09492j684015l540897k599253
41469d125443M29059J715504R49598J422983L654441L947690J25864m860712o207944
41460b948960k506847K577747L632866l89823l936742j539533M058858N327613
41452D275179J381953q25746J651427K807941j350278n040101k454771J745599
41444B191203Q0438m875469m653654J294694N420732M247947J745624P28815p13981
41435E466349l127183l326832q7538L381213M220324K753154K9751k998194l882744
41426B428300j044345K395063K080013o20552n92634K314563K853366o04833l149468
41417F059473j486054R24355o3379k924147l740745k230816q62177k36771J290836
$$ plain form
41408 -3269425 861102 6671578 10019341 7286269 130768 -4630452 -2209174 3908075
41400 3908075 6145826 2895143 63068 1942760 5624326 6777839 6214849 7108272
41392 7108272 9373285 10682539 10295157 8487795 4974283 1169575 901053 5092910
41384 5092910 8706027 7029343 2218790 -640692 -1060599 -1951912 -3604799 -4185234 -4080998
41375 -4080998 -4317184 -2675657 2695269 7553925 6055880 33960 -3087234 -1438849
41367 -1438849 -598894 -3635453 -6622062 -6123755 -4308943 -3569100 -2070193 1742580 5379838
41358 5379838 6747859 7689155 9363079 8740560 4163420 304484 2356268 8095856
41350 8095856 10845923 8403559 4303632 1758399 1057032 2067250 4794520 7630955
$$ packed form
41408c269425M130527N810476L347763k733072p155501m761220K421278O117249
41400C908075K237751l250683k832075J879692L681566J153513n62990Q93423
41392G108272K265013J309254l87382j807362l513512l804708k68522M191857
41384E092910L613117j676684m810553k859482m19907q91313j652887n80435J04236
41375d080998k36186J641527N370926M858656j498045o021920l121194J648385
41367a438849Q39955l036559k986609M98307J814812P39843J498907L812773L637258
41358E379838J368021R41296J673924o22519m577140l858936K051784N739588
41350H095856K750067k442364m099927k545233p01367J010218K727270K836435
$$ plain form
41342 7630955 8745716 8863503 9299210 8248098 3298278 -3000728 -5174147 -2857869
41334 -2857869 -1443511 -3219494 -3619753 418845 3838847 788004 -5144779 -5098032 1840206
41325 1840206 6901884 4221856 -1763369 -4462351 -4242831 -4319833 -2893764 3160431 9573934
41316 9573934 8222769 -450470 -6698439 -5364261 -2829490 -5818096 -10212251 -7868577
41308 -7868577 -32391 4174510 1079232 -3441523 -3752015 -1558193 -954135 -1769203 -1364478
41299 -1364478 295113 955229 -60683 -982136 -65212 2625303 5608968 7356513 7430281
41290 7430281 6374272 4468235 1646515 -702765 212442 4766258 8870129 8565406
41282 8565406 5386409 3876126 4739313 4366579 934667 -3074332 -4893892 -4276451 -1800511
$$ packed form
41342G630955J114761J17787M35707j051112m949820o299006k173419K316278
41334b857869J414358j775983m00259M038598L420002l050843n932783M6747O938238
41325A840206N061678k680028n985225k698982K19520p7002J426069O054195O413503
41316I573934j351165q673239o247969J334178K534771k988606m394155K343674
41308g868577P836186M206901l095278m520755l10492K193822O04058q15068M04725
41299a364478J659591O60116j015912r21453R16924K690515K983665J747545P3768
41290G430281j056009j906037k821720k349280R15207M553816M103871l04723
41282H565406l178997j510283Q63187l72734l431912m008999j819560O17441K475940
$$ plain form
41273 -1800511 1694935 3303035 41190 -5917228 -8242890 -4574972 424358 2150332
41265 2150332 1672998 1499761 591829 -2046573 -2918441 1259744 7036854 8273677 5307626
41256 5307626 4156237 6785881 8061209 3795421 -3051289 -6648165 -5341004 -1883078
41248 -1883078 999259 2698887 3565854 3727787 3014080 1402390 -320442 -811599 -82426
41239 -82426 -381815 -3327073 -6757559 -7037437 -4436310 -3046425 -4441402 -4806019 -655635
41230 -655635 5308203 7397343 4612034 1564740 1903986 4162520 5008231 3730028 1796270
41221 1796270 203357 -429883 1289002 5646589 9359387 8226677 2920605 -821969
41213 -821969 631282 4035620 4082275 828819 -1191859 -246720 466025 -1363640 -3233494
$$ packed form
41273a800511L495446J608100l261845n958418k325662L667918M999330J725974
41265B150332m77334j73237r07932k638402q71868M178185N777110J236823k966051
41256E307626j151389K629644J275328m265788o846710l596876J307161L457926
41248a883078K882337J699628Q66967J61933p13707j611690j722832m91157P29173
41239h2426k99389k945258l430486k79878K601127J389885j394977l64617M150384
41230f55635N963838K089140k785309l047294L39246K258534Q45711j278203j933758
41221A796270j592913o33240J718885M357587L712798j132710n306072l742574
41213h21969J453251L404338M6655l253456k020678R45139P12745j829665j869854
$$ plain form
41204 -3233494 -2002252 911002 1582715 -725341 -3059140 -3376225 -2678570 -2250104 -1434148
41195 -1434148 579730 2549239 2517779 718305 -410373 690115 2656260 2995592 1464588
41186 1464588 549366 2226972 5272450 6752129 5391918 2056105 -2378403 -7335447
41178 -7335447 -10772183 -10047026 -5811693 -2342610 -1928956 -1442446 2533602 7415423 7840479
41169 7840479 4213029 2761589 6084098 8774508 5275645 -2104310 -6992013 -7672967
41161 -7672967 -7252839 -7039909 -5218859 -1768649 705542 1963710 4893575 9529519
41153 9529519 11304641 8193234 4979790 6268227 9054545 7394250 1739808 -2130377
41145 -2130377 -1948515 -744472 -372844 563662 1781211 415769 -3297111 -5027217 -3242972
$$ packed form
41204c233494J231242K913254O71713k308056k333799l17085O97655M28466Q15956
41195a434148K013878J969509l1460j799474j128678J100488J966145L39332j531004
41186A464588r15222J677606L045478J479679j360211l335813m434508m957044
41178g335447l436736P25157M235333L469083M13654M86510L976048M881821M25056
41169G840479l627450j451440L322509K690410l498863p379955m887703o80954
41161g672967M20128K12930J821050L450210K474191J258168K929865M635944
41153I529519J775122l111407l213444J288437K786318j660295n654442l870185
41145b130377J81862J204043L71628R36506J217549j365442l712880j730106J784245
$$ plain form
41136 -3242972 -1830078 -3218955 -4238762 -2267159 -363742 -1861645 -4363009 -4213141
41128 -4213141 -3192353 -5234801 -9395672 -11559809 -10725658 -8360387 -4201458 1528990
41120 1528990 4523893 1848346 -1273830 1982240 8061435 6682471 -3074957 -9967419
41112 -9967419 -6745818 -156222 178209 -4628882 -6794380 -4233663 -1596179 -1611034 -1963415
41103 -1963415 -302987 2323082 3342768 1308513 -3031000 -6685427 -6555964 -2969595
41095 -2969595 413992 1227305 839823 1222216 2036270 2246952 2064170 1918292 1971490
41086 1971490 3461668 7458285 11667191 12419973 10721587 11537315 15532094 16962203
41078 16962203 12359991 5750818 1771973 -791100 -4135798 -5510238 -1876577 3633437
$$ packed form
41136c242972J412894j388877j019807J971603J903417j497903k501364J49868
41128d213141J020788k042448m160871k164137Q34151K365271M158929N730448
41120A528990K994903k675547l122176L256070O079195j378964r757428o892462
41112i967419L221601O589596L34431m807091k165498K560717K637484j4855l52381
41103a963415J660428K626069J019686k034255m339513l654427J29463L586369
41095b969595L383587Q13313l87482L82393Q14054K10682j82782j45878N3198
41086A971490J490178L996617M208906P52782j698386Q15728L994779J430109
41078A6962203m602212o609173l978845k563073l344698j374440L633661N510014
$$ plain form
41070 3633437 5765081 4383571 2357819 -305481 -4507931 -7533747 -6561483 -3916777
41062 -3916777 -2979175 -1977277 1837002 5319152 4264477 2055150 4720308 9290359
41054 9290359 6801630 -3149327 -10504078 -8981063 -3407602 -319609 589287 2099468
41046 2099468 3589791 3669044 3344770 3215779 2156333 1042196 2547757 5139069 3207995
41037 3207995 -4046904 -9825432 -9079705 -4889398 -1922414 492500 4155866 6296145
41029 6296145 3719716 -1101819 -3277188 -2058222 -6414 1531719 2338120 1635248
41021 1635248 -28079 -201942 1118038 174204 -4450395 -8679858 -9440740 -9533928 -11657186
41012 -11657186 -12576032 -8777400 -3384727 -1184520 -857636 946478 1618570 -3181762
$$ packed form
41070C633437K131644j381510k025752k663300m202450l025816R72264K644706
41062c916777R37602J001898L814279L482150j054675k209327K665158M570051
41054I290359k488729r950957p354751J523015N573461L087993R08896J510181
41046B099468J490323P9253l24274j28991j059446j114137J505561K591312j931074
41037C207995p254899n778528P45727M190307K966984K414914L663366K140279
41029F296145k576429m821535k175369J218966K051808J538133Q06401p02872
41021A635248j663327j73863J319980r43834m624599m229463p60882r3188k123258
41012a1657186r18846L798632N392673K200207L26884J804114O72092m800332
$$ plain form
41004 -3181762 -9855644 -10258217 -4031979 809269 -73868 -2639986 -2892773 -2361075 -2978615
40995 -2978615 -3276555 -2492191 -2685572 -3916813 -2578253 2511252 7176687 8080543 7351763
40986 7351763 7922197 8642030 7607122 6286601 6227940 5138692 898402 -3135341 -1915093
40977 -1915093 3434736 6376474 3631020 -968390 -2223450 20289 1951187 1377491
40969 1377491 57292 565729 2432582 2763502 558144 -1459638 -685486 1242428 676269
40960 676269 -2434416 -4370836 -3432281 -2613230 -5032663 -9373669 -11970496 -11581827 -9874636
40951 -9874636 -8319198 -6771772 -4780954 -2611850 -737743 837312 2396580 3678093
40943 3678093 3409821 522711 -3672052 -5803363 -4219058 -1135058 671812 1546867
$$ packed form
41004c181762o673882m02573O226238M841248q83137k566118k52787N31698o17540
40995b978615k97940P84364j93381j231241J338560N089505M665435R03856p28780
40986G351763N70434P19833j034908j320521n8661j089248m240290m033743J220248
40977a915093N349829K941738k745454m599410j255060K243739J930898n73696
40969A377491j320199N08437J866853L30920k205358k017782P74152J927914n66159
40960F76269l110685j936420R38555Q19051k419433m341006k596827L88669J707191
40951i874636J555438J547426J990818K169104J874107J575055J559268J281513
40943C678093k68272k887110m194763k131311J584305L084000J806870Q75055
$$ plain form
40935 1546867 2677799 2160352 -2243773 -7319748 -6823333 -506593 4630011 4062842 1533680
40926 1533680 2066168 4131302 3287342 -145268 -2370780 -2705939 -3431095 -4256893 -2321474
40917 -2321474 2257864 5635747 5926945 5637502 7110773 8933633 8622170 6330772 4001135
40908 4001135 2493274 1239624 -175507 -1309473 -1399429 -219527 1331612 1878784 1423910
40899 1423910 1683312 3405495 4475736 2678120 -461574 -1209897 1045828 2746907
40891 2746907 1177623 -1990723 -3636212 -3689472 -4581919 -7091313 -8913882 -7697044 -4073289
40882 -4073289 -805278 409682 160379 -558576 -1930966 -4040961 -5320153 -4204710
40874 -4204710 -1750083 -380254 -333999 -37364 27646 -2568545 -7168205 -8985766 -5448131
$$ packed form
40935A546867J130932n17447m404125n075975M96415O316740N136604n67169k529162
40926A533680N32488K065134q43960l432610k225512l35159p25156q25798J935419
40917b321474M579338L377883K91198k89443J473271J822860l11463k291398k329637
40908D001135j507861j253650j415131j133966q9956J179902J551139N47172m54874
40899A423910K59402J722183J070241j797616l139694p48323K255725J701079
40891B746907j569284l168346j645489n3260q92447k509394j822569J216838L623755
40882d073289L268011J214960k49303p18955j372390k109995j279192J115443
40874d204710K454627J369829M6255K96635O5010k596191m599660j817561L537635
$$ plain form
40865 -5448131 -249052 1779066 801940 -188721 -537411 -909303 33180 3154537 5332907
40856 5332907 3679230 1349923 3208560 7120759 6521729 1417512 -747330 3424121
40848 3424121 8341512 8674493 6537408 5480153 3625585 -1929341 -8627306 -11808210
40840 -11808210 -11034087 -8302892 -3644746 2292127 4892614 1187497 -3550701 -1551384
40832 -1551384 6132259 10554196 7145794 833854 -2153291 -1790061 -1290669 -1453033 -1324857
40823 -1324857 -1554651 -3687557 -7229011 -9691820 -9339209 -6859739 -4460650 -3516056 -3031569
40814 -3031569 -1077259 2005761 3423746 1995354 397952 1384450 3587944 3707087
40806 3707087 1480297 -396374 -401099 487078 845884 -228221 -3183536 -6602711 -7158846
$$ packed form
40865e448131N199079K028118r77126r90661l48690l71892R42483L121357K178370
40856E332907j653677k329307J858637L912199n99030n104217k164842M171451
40848C424121M917391L32981k137085j057255j854568n554926o697965l180904
40840a1808210P74123K731195M658146N936873K600487l705117m738198J999317
40832a551384P683643M421937l408402o311940k987145L63230M99392j62364J28176
40823a324857k29794k132906l541454k462809L52611K479470K399089R44594M84487
40814c031569J954310L083020J417985j428392j597402R86498K203494J19143
40806C707087k226790j876671m725Q88177L58806j074105k955315l419175n56135
$$ plain form
40797 -7158846 -3799170 -388359 -975848 -4136535 -5654788 -4883700 -3943489 -2452029 1342068
40788 1342068 5208408 4953053 1792904 1407998 4902043 7115217 5349641 3140375
40780 3140375 2966059 1856761 -2128533 -5106408 -3606885 -538319 -10167 -521525 1447296
40771 1447296 4540491 4604533 1179389 -2901499 -6187419 -8394428 -7802529 -3648522 649076
40762 649076 1264407 -524186 -913568 46158 -590860 -2678674 -3056981 -1106751 576604
40753 576604 1078465 2370463 5284114 8079807 9423176 9593065 8757168 7092271 6183321
40744 6183321 7146415 8120668 7025548 5632625 6712021 8208356 5353863 -1655192
40736 -1655192 -7384993 -8900601 -8325111 -6876343 -2447422 4575524 8802763 6785818
$$ packed form
40797g158846L359676L410811n87489l160687j518253P71088R40211J491460L794097
40788A342068L866340k55355l160149l84906L494045K213174j765576k209266
40780C140375j74316j109298l985294k977875J499523L068566N28152n11358J968821
40771A447296L093195O4042l425144m080888l285920k207009N91899M154007M297598
40762F49076O15331j788593l89382R59726o37018k087814l78307J950230J683355
40753E76604N01861J291998K913651K795693J343369J69889q35897j664897r08950
40744F183321R63094R74253j095120j392923J079396J496335k854493p009055
40736a655192n729801j515608N75490J448768M428921P022946M227239k016945
$$ plain form
40728 6785818 2059508 -561721 -1906003 -5414272 -10263899 -12342920 -10513204 -7590685
40720 -7590685 -5822542 -5063072 -5042698 -6037210 -7148136 -6838179 -5621886 -5725534 -7390794
40711 -7390794 -7763494 -4697187 -92231 2156710 931642 -905175 -335799 1959063
40703 1959063 2661656 359071 -2403916 -2111568 1805834 6720156 9331032 7700607
40695 7700607 2382344 -3022522 -3970845 364432 5707130 7821498 7385987 7284019 7249913
40686 7249913 5300189 3009475 3947383 6726606 5396473 -1376913 -6863704 -5234141
40678 -5234141 386083 2863844 720556 -1757676 -1918557 -1434652 -2350588 -4638283 -7643598
40669 -7643598 -10385424 -10294974 -5273881 2137750 5920285 3517722 -837935 -1556101 1639257
$$ packed form
40728F785818m726310k621229j344282l508269m849627k079021J829716K922519
40720g590685J768143P59470K0374r94512j110926L09957J216293j03648j665260
40711g390794l72700L066307M604956K248941j225068j836817N69376K294862
40703A959063P02593k302585k762987K92348L917402M914322K610876j630425
40695G700607n318263n404866r48323M335277N342698K114368m35511j01968l4106
40686G249913j949724k290714R37908K779223j330133o773386n486791J629563
40678e234141N620224K477761k143288k478232j60881M83905r15936k287695l005315
40669g643598k741826R0450N021093P411631L782535k402563m355657p18166L195358
$$ plain form
40660 1639257 4789898 5865673 6491801 7466503 6139459 559023 -5944102 -7768222
40652 -7768222 -4289242 -699748 -822620 -2441178 -1689829 1007795 2435102 1705840 274851
40643 274851 -1557807 -4175831 -5723181 -3983118 -810529 -252009 -2186547 -2571679 -576674
40634 -576674 -177066 -2951826 -4602336 -1659203 2859189 4191764 2655565 1880908 3099687
40625 3099687 4921458 6388783 6797223 4841164 1300069 25777 2685396 5222207
40617 5222207 3488941 -494635 -2485017 -3065711 -4849094 -5326254 -96147 7712907
40609 7712907 9583495 4290895 276398 2504178 4878094 783707 -5649735 -5996249
40601 -5996249 -775506 1892275 -938888 -3643560 -1956640 938592 870377 -534070
$$ packed form
40660A639257L150641J075775O26128R74702j327044n580436o503125j824120
40652g768222L478980L589494j22872j618558P51349K697624J427307p29262j430989
40643B74851j832658k618024j547350J740063L172589N58520j934538l85132J995005
40634e76674L99608k774760j650510K943133M518392J332575j536199p74657J218779
40625C099687J821771J467325M08440j956059l541095j274292K659619K536811
40617E222207j733266l983576j990382n80694j783383m77160N230107P809054
40609G712907J870588n292600m014497K227780K373916m094387o433442l46514
40601e996249N220743K667781k831163k704672J686920K895232o8215j404447
$$ plain form
40593 -534070 409963 2731392 2495384 -623377 -2820082 -1825274 541646 1818412 1735782
40584 1735782 683849 -1825791 -5452340 -7812011 -6999115 -4131232 -1649835 -139852
40576 -139852 1359001 2832356 3260384 2710438 2358229 2425897 1989951 1014329 847200
40567 847200 2395146 5233270 8543124 11343938 11932929 9213708 4978548 2836494
40559 2836494 4107555 6426631 7066430 6025323 5144479 5718418 7740825 10247286 11857912
40550 11857912 12051165 11974921 12834229 13947038 13976577 13137331 11849201 8470650 1935455
40541 1935455 -4196180 -4981972 -1617445 -611931 -4198136 -6904212 -4202572 471840
40533 471840 1072695 -2642084 -6090352 -6341902 -3992812 -1117207 -463447 -3951828 -9074231
$$ packed form
40593e34070R44033K321429k36008l118761k196705R94808K366920J276766q2630
40584A735782j051933k509640l626549k359671Q12896K867883K481397J509983
40576a39852J498853J473355M28028n49946l52209O7668m35946r75622j67129
40567H47200J547946K838124L309854K800814N88991k719221m235160k142054
40559B836494J271061K319076O39799j041107q80844N73939K022407K506461J610626
40550A1857912J93253p6244Q59308J112809K9539q39246j288130l378551o535195
40541A935455o131635p85792L364527J005514l586205k706076K701640M674412
40533D71840O00855l714779l448268k51550K349090K875605O53760l488381n122403
$$ plain form
40524 -9074231 -9991847 -5232075 -503162 -348177 -1467385 931578 4653582 4561383 1453368
40515 1453368 -74234 59847 -1339742 -3084547 -1069189 3386458 4573926 1896187
40507 1896187 557693 2022198 1735827 -1907430 -4285244 -3176953 -3174240 -7295159 -10726426
40498 -10726426 -8069597 -1776140 1943630 1852406 1311262 2009867 2726587 2502492 1300480
40489 1300480 -1060038 -3873109 -5162689 -4546056 -4370625 -5968025 -7238161 -6030059
40481 -6030059 -3299158 -861536 1145521 2577774 2385972 1662318 3806313 8744544
40473 8744544 10944899 6952769 1182477 -295059 1585423 1648406 -789535 -1958455
40465 -1958455 -967806 -873025 -2436942 -2637371 -525567 537041 -1428923 -3245098 -1399336
$$ packed form
40524i074231r17616M759772M728913J54985j119208K398963L722004r2199l108015
40515A453368j527602J34081j399589j744805K015358M455647J187468k677739
40507A896187j338494J464505k86371l643257k377814J108291K713m120919l431267
40498a0726426K656829O293457L719770r1224n41144O98605P16720k24095j202012
40489A300480k360518k813071j289580O16633J75431j597400j270136J208102
40481f030059K730901K437622K007057J432253j91802p23654K143995M938231
40473H744544K200355l992130n770292j477536J880482O2983k437941j168920
40465a958455R90649R4781j563917k00429K111804J062608j965964j816175J845762
$$ plain form
40456 -1399336 2052014 1706946 -3701982 -8446909 -5406352 5703205 16485551 17555636
40448 17555636 8359660 -2286686 -6149710 -3759867 -969214 -105815 1603546 5700260
40440 5700260 8902247 7360972 2076317 -1947541 -1376997 1878093 3264534 1512606
40432 1512606 616046 4360704 9950268 10322434 3242630 -5556712 -9904491 -10099872 -9588542
40423 -9588542 -8484295 -4829077 -8096 2053489 417280 -2245798 -4036785 -4953766
40415 -4953766 -4251787 -1087959 2130565 1587358 -1915368 -3130216 10737 3229930
40407 3229930 2610764 443705 962793 3307342 3143144 43534 -1166565 2890685 9294010
40398 9294010 12257533 9606309 4152042 -362051 -2676469 -3290651 -2397079 -239326
$$ packed form
40456a399336L451350l45068n408928m744927L040557J1109557J0782346J070085
40448A7555636r195976j0646346l863024K389843K790653Q63399J709361M096714
40440E700260L201987j541275n284655m023858N70544L255090J386441j751928
40432A512606q96560L744658N589564L72166p079804q799342m347779j95381N11330
40423i588542J104247L655218M820981K061585j636209k663078j790987r16981
40415d953766P01979L163828L218524n43207l502726j214848L140953L219193
40407C229930o19166k167059N19088K344549j64198l099610j210099M057250O403325
40398I294010K963523k651224n454267m514093k314418o14182Q93572K157753
$$ plain form
40390 -239326 1307929 -182982 -4385280 -7627830 -6689942 -2137751 2888569 5838343
40382 5838343 5676676 2404623 -2318118 -5108035 -3716699 191075 2765423 2238711
40374 2238711 64824 -1551207 -1366739 1192900 5666620 9555942 9834114 6405445
40366 6405445 2600582 1335959 2011873 2189278 1153309 216382 -79750 -1083727 -3466557
40357 -3466557 -5060517 -3387231 34575 731473 -2333035 -4428460 -1707624 2507575
40349 2507575 2243567 -2016592 -4057171 -1492532 1268723 808145 -558622 -409528 -832051
40340 -832051 -3571381 -5706583 -4856032 -4119077 -6475393 -8467818 -5738633 -1295147 -1051924
40331 -1051924 -3705752 -3000945 1192134 2423614 -1454952 -5065013 -4687536 -3157672
$$ packed form
40390b39326J547255j490911m202298l242550R37888M552191N026320K949774
40382E838343j61667l272053m722741k789917J391336L907774K574348n26712
40374B238711k173887j616031J84468K559639M473720L889322K78172l428669
40366F405445l804863j264623O75914J77405j035969r36927k96132j003977k382830
40357c466557j593960J673286L421806O96898l064508k095425K720836M215199
40349B507575k64008m260159k040579K564639K761255m60578j366767J49094m22523
40340h32051k739330k135202Q50551P36955k356316j992425K729185M443486K43223
40331a051924k653828P04807M193079J231480l878566l610061L77477J529864
$$ plain form
40323 -3157672 -3203127 -2918065 -1079666 -559986 -2503049 -2731818 1598269 6544999 7265081
40314 7265081 5337766 5369670 7574886 8714918 7985400 7029228 5633037 2066299 -2874996
40305 -2874996 -6028590 -6078452 -4870164 -4625410 -5810905 -7387421 -7787222 -6379476 -4689793
40296 -4689793 -4588963 -4839616 -2285839 2425664 3981649 -355322 -6069098 -7169806
40288 -7169806 -3787507 -464488 573431 423121 -261964 -1733904 -2839798 -2098226 -571200
40279 -571200 -518487 -1882293 -2908717 -3119639 -2718602 -562987 3700994 6856055 5620734
40270 5620734 2137836 1585732 4542631 6260866 4061588 953998 347242 979380 -496931
40261 -496931 -4286321 -7101812 -6049187 -1717829 2079506 1765289 -1945280 -4389665
$$ packed form
40323c157672m5455K85062J838399N19680j943063k28769M330087M946730P20082
40314G265081j927315L1904K205216J140032p29518r56172j396191l566738m941295
40305b874996l153594m9862J208288K44754j185495j576516l99801J407746J689683
40296d689793J00830k50653K553777M711503J555985m336971n713776j100708
40288g169806L382299L323019J037919j50310o85085j471940j105894P41572J527026
40279e71200N2713j363806j026424k10922M01037K155615M263981L155061j235321
40270E620734l482898n52104K956899J718235k199278l107590o06756O32138j476311
40261d96931l789390k815491J052625M331358L797335l14217l710569k444385
$$ plain form
40253 -4389665 -2763363 88264 59553 -2059741 -2567462 -1376661 -1556900 -2868507 -1551077
40244 -1551077 2406216 3685586 6725 -3160975 -304187 5617134 7105542 2278327
40236 2278327 -3474902 -4871705 -1787250 2652488 5557388 5638883 3712805 2196355
40228 2196355 2381202 2506005 285629 -3329541 -5158739 -4132257 -2182192 -864006
40220 -864006 279116 1460678 1421478 -136941 -999637 595317 2650243 1498356 -2896482
40211 -2896482 -6055702 -4452069 -167860 1816148 186290 -1415896 -162961 1680341
40203 1680341 457089 -2816284 -3553994 -508343 2110385 768769 -2228737 -2292210 672886
40194 672886 2254035 -117750 -3772634 -4618125 -2322955 -160893 -473921 -1791362 -931325
$$ packed form
40253d389665J626302K851627k8711k119294n07721J190801j80239j311607J317430
40244a551077L957293J279370l678861l167700K856788N921321J488408m827215
40236B278327n753229j396803L084455M439738K904900Q1495j926078j516450
40228B196355J84847J24803k220376l615170j829198J026482J950065J318186
40220h64006J143122J181562l9200j558419q62696J594954K054926j151887m394838
40211b896482l159220J603633M284209J984008j629858j602186J252935J843302
40203A680341j223252l273373p37710L045651K618728j341616k997506o3473K965096
40194F72886J581149k371785l654884q45491K295170K162062l13028j317441Q60037
$$ plain form
40185 -931325 2579273 5125462 2784744 -3756418 -9242123 -9361384 -5241439 -1437234
40177 -1437234 -232216 397953 3015932 6557047 7155051 2666829 -4661245 -10151949
40169 -10151949 -10688713 -6699032 -1128755 2714193 2870665 -183832 -3546613 -3913216
40161 -3913216 -540808 4040444 6642907 6184961 3558345 -3282 -3204607 -4298033
40153 -4298033 -2297197 1403052 4024560 4144873 2404372 -87885 -2334859 -2607143
40145 -2607143 590735 5739883 8447495 6001981 688684 -2956605 -3388449 -2842296
40137 -2842296 -3181999 -2942089 369686 5858398 8844309 5860902 -662190 -4459870
40129 -4459870 -2622399 1133914 1793285 -237413 -521453 2199874 3859620 933479
$$ packed form
40185i31325L510598K546189k340718o541162n485705j19261M119945L804205
40177a437234J205018O30169K617979L541115N98004m488222p328074n490704
40169a0151949n36764L989681N570277L842948J56472l054497l362781l66603
40161c913216L372408M581252K602463m57946k626616l561627l201325j093426
40153d298033K000836L700249K621508J20313j740501k492257k246974k72284
40145b607143L197878N149148K707612k445514n313297l645289m31844N46153
40137b842296l39703K39910L311775N488712K985911k983407o523092l797680
40129d459870J837471L756313O59371k030698k84040K721327J659746k926141
$$ plain form
40121 933479 -4704709 -8581968 -8970414 -7359618 -5347770 -3464649 -2145109 -1523829 -408644
40112 -408644 2646667 6834578 8879263 6157079 3541 -4507563 -3042369 3040947
40104 3040947 7347835 5660369 1323169 735573 4407520 6707576 4888849 3158812
40096 3158812 5231668 7755587 5691022 675884 -1587450 -258600 486482 -202680
40088 -202680 2205352 9452346 15466339 13069312 3049456 -6536587 -8983555 -4962711
40080 -4962711 -737581 -1598723 -6640479 -9778638 -6526847 858397 6252807 6615267
40072 6615267 3941033 1423967 875449 3445347 8990543 14117367 14554903 10648889
40064 10648889 7141832 6358890 5406093 1941541 -1279844 -664712 2531424 4263663
$$ packed form
40121I33479n638188l877259l88446J610796K011848J883121J319540O21280J115185
40112d08644L055311M187911K044685k722184o153538m511104J465194O083316
40104C040947M306888j687466m337200n87596L671947K300056j818727j730037
40096C158812K072856K523919k064565n015138k263334J328850P45082o89162
40088b02680K408032P246994O013993k397027j0019856r586043k446968M020844
40080d962711M225130q61142n041756l138159L251791P385244N394410L62460
40072F615267k674234k517066n48518K569898N545196N126824M37536l906014
40064A0648889l507057p82942r52797l464552l221385O15132L196136J732239
$$ plain form
40056 4263663 3338149 1718414 739189 52171 -641975 -1208091 -1522700 -730129 2306642
40047 2306642 6352522 8011176 6376584 4460330 3811770 1785838 -2264823 -2743184
40039 -2743184 4293092 12535474 12361583 4716316 -224429 1718558 3722331 438913
40031 438913 -3358698 -1710668 2052947 860040 -4404142 -6239724 -1895981 3266003
40023 3266003 3970326 1333930 -328185 593683 2046995 1596721 -406263 -782852 2653625
40014 2653625 7201304 7559748 3069994 -505116 1238572 5215732 6297036 5778477
40006 5778477 8813683 14729637 16203991 9147699 -1690657 -8914892 -10233947 -7876446
39998 -7876446 -3863836 1015300 5388180 7209596 5358785 819722 -2991819 -2013614
$$ packed form
40056D263663r25514j619735r79225o87018o94146n66116l14609P92571L036771
40047B306642M045880J658654j634592j916254o48560k025932m050661m78361
40039b743184P036276Q242382j73891p645267m940745J942987K003773l283418
40031D38913l797611J648030L763615j192907n264182j835582M343743N161984
40023C266003P04323k636396j662115R21868J453312m50274k002984l76589L436477
40014B653625M547679L58444m489754l575110J743688L977160J081304n18559
40006E778477L035206N915954J474354p056292j0838356p224235j319055K357501
39998g876446M012610M879136M372880J821416j850811m539063l811541R78205
$$ plain form
39990 -2013614 3786044 8194614 5113743 -2629088 -5589894 -369066 5294703 3460743
39982 3460743 -2901669 -5088158 -1477029 1593139 550142 -964143 323171 1685563
39974 1685563 -105249 -2225765 332897 6476258 9666251 7019193 3368320 4230745
39966 4230745 7897741 8179842 3842042 736157 3102311 6942182 5907986 1027291
39958 1027291 -1035492 1302824 2150097 -1777301 -5275649 -3192024 630115 -757524
39950 -757524 -6215823 -8601723 -6329673 -4964398 -6967959 -7676829 -3891964 354638
39942 354638 454479 -1727665 -1824433 196562 1641952 2180638 2843805 2737848 1270357
39933 1270357 1199794 4628993 7913978 5839148 -218137 -3676960 -2078229 323358
$$ packed form
39990b013614N799658M408570l080871p742831k960806N220828N663769j833960
39982C460743o362412k186489L611129L070168j042997j514285J287314J362392
39974A685563j790812k120516K558662O143361L189993k647058l650873Q62425
39966D230745L666996K82101m337800l105885K366154L839871j034196m880695
39958A027291k062783K338316Q47273l927398l498348K083625L822139j387639
39950g57524n458299k385900K272050J365275k003561p08870L784865M246602
39942C54638R9841k182144r6768K020995J445390N38686O63167j05957j467491
39933A270357p0563L429199L284985k074830o057285l458823J598731K401587
$$ plain form
39925 323358 -5850 -1013653 456153 3537205 5313133 5017796 3843728 2650838 1931165
39916 1931165 2450616 4180956 5701202 5706373 4009968 765611 -3449123 -6471068 -6004781
39907 -6004781 -3137145 -1803125 -3459955 -4981515 -3644047 -1489316 -2084119 -4982443
39899 -4982443 -6412213 -4260707 312090 5155823 8291875 7791093 3678886 -348251
39891 -348251 -251946 3130611 5187104 4123079 2942536 3730756 3861875 686669 -3160008
39882 -3160008 -3262548 -489571 267157 -1791380 -1757476 2742072 6615315 4390292 -1358509
39873 -1358509 -3688447 -1310738 844743 497436 1009132 4081559 5759825 3154922
39865 3154922 -99251 312907 2396790 2146851 1331537 4406106 9743822 11190647 7990168
$$ packed form
39925C23358l29208j007803J469806L081052J775928k95337j174068j192890p19673
39916A931165N19451J730340J520246N171j696405l244357m214734l021945M66287
39907f004781K867636J334020j656830j521560J337468K154731n94803k898324
39899d982443j429770K151506M572797M843733L136052n00782m112207m027137
39891c48251R6305L382557K056493j064025j180543P88220J31119l175206l846677
39882c160008j02540K772977P56728k058537L3904M499548L873243k225023n748801
39873a358509k329938K377709K155481l47307N11696L072427J678266k604903
39865C154922l254173M12158K083883k49939q15314L074569N337716J446825l200479
$$ plain form
39856 7990168 5996213 7966765 9470190 6776120 2727190 1419672 1988632 1342022
39848 1342022 -817543 -3035392 -4742180 -5008724 -2267429 1973285 3130916 325851
39840 325851 -1209779 1774056 4642750 1928087 -3828725 -5996285 -3367798 189336
39832 189336 2781053 4786669 4435454 152156 -3948313 -2104785 3890730 6530789
39824 6530789 3778742 1241736 2250405 3181359 971615 -1499694 -851458 1647474
39816 1647474 3833184 6544026 10157459 11682939 9082521 4846116 2011622 251606
39808 251606 -1092735 -237661 3083078 4800536 1952141 -2282328 -3307055 -1932747
39800 -1932747 -1897231 -3131993 -2555265 1098 1557341 947399 -272236 -1531275 -4091366
$$ packed form
39856G990168j993955J970552J503425k694070m048930j307518N68960o46610
39848A342022k159565k217849j706788k66544K741295M240714J157631k805065
39840C25851j535630K983835K868694k714663n756812k167560K628487L557134
39832A89336K591717K005616l51215m283298m100469J843528N995515K640059
39824F530789k752047k537006J008669R30954k209744k471309O48236K498932
39816A647474K185710K710842L613433J525480k600418m236405k834494j760016
39808B51606j344341Q55074L320739J717458k848395m234469j024727J374308
39800a932747L5516j234762N76728K556363J556243o09942j219635j259039k560091
$$ plain form
39791 -4091366 -8124712 -11778055 -13008684 -10538802 -4461960 1923828 3304833 -1278902
39783 -1278902 -5497588 -3198638 3198083 6467767 5027629 3845945 5401897 6068231
39775 6068231 2968438 -1044221 -1993256 -422255 488483 -200250 -792581 119501 2070987
39766 2070987 3106433 1331243 -2583647 -4966293 -3471489 -945502 -1564667 -3893974
39758 -3893974 -2592021 2664755 5641861 2891347 -998579 -983909 730429 -457158
39750 -457158 -2949313 -1341439 4608431 9425749 9754805 7443540 4943421 2869474
39742 2869474 2577567 5702161 9545178 8120053 498325 -6382940 -6676049 -3416509
39734 -3416509 -3064739 -5579791 -5524046 -1373913 2438238 3038779 2868410 4166139 4869483
$$ packed form
39791d091366m033346l653343j230629K469882O076842O385788J381005m583735
39783a278902m218686K298950O396721L269684j440138j181684J555952O66334
39775F068231l099793m012659r49035J571001R10738o88733n92331R12082J951486
39766B070987J035446j775190l914890k382646J494804K525987o19165k329307
39758c893974J301953N256776K977106k750514l889926J4670J714338j187587
39750d57158k492155J607874N949870M817318L29056k311265k500119k073947
39742B869474k91907L124594L843017j425125p621728o881265k93109L259540
39734c416509L51770k515052N5745M150133L812151O00541j70369J297729P03344
$$ plain form
39725 4869483 3093327 1437640 2646287 4015134 1107600 -4494096 -6446178 -2772923
39717 -2772923 1185199 480757 -2914723 -3939770 -1876257 -631399 -2834593 -6584216
39709 -6584216 -8075629 -5602513 -673202 3732735 5682943 5489982 4590377 3665546 2616286
39700 2616286 1955659 2670945 4489336 5815335 5838536 5245550 4449844 2821274 268570
39691 268570 -2191040 -4126366 -6054544 -7431063 -6634051 -4041558 -2445597 -2668267 -1564825
39682 -1564825 3008352 7731241 7775012 3621321 235866 189666 1210699 503741 -1889190
39673 -1889190 -4573805 -6679694 -7269679 -5273919 -1325425 1876271 2146544 -43187
39665 -43187 -2404328 -3052439 -1864994 -368789 -102594 -681705 -423478 557647 -236131
$$ packed form
39725D869483j776156j655687J208647J368847k907534n601696j952082L673255
39717b772923L958122p04442l395480j025047K063513J244858k203194l749623
39709f584216j491413K473116M929311M405937J950208j92961q99605r24831j049260
39700B616286o60627P15286J818391J325999K3201n92986p95706j628570k552704
39691B68570k459610j935326j928178j376519P97012K592493J595961k22670J103442
39682a564825M573177M722889M3771m153691l385455m6200J021033p06958k392931
39673a889190k684615k105889n89985J995760L948494L201696K70273k189731
39665d3187k361141o48111J187445J496205K66195n79111K58227R81125p93778
$$ plain form
39656 -236131 -3660984 -6450385 -5386606 -2264263 -1338172 -2878077 -3158203 -724233 1392043
39647 1392043 686206 -1129900 -1169009 557776 2026736 2328585 2109083 1956794 1717316
39638 1717316 997272 -105464 -453655 1396267 4995561 7566057 7310103 5881234 5397681
39629 5397681 4611198 1377411 -2337527 -2438520 421426 923661 -2757338 -5757725 -3972572
39620 -3972572 -487422 -1013138 -5768532 -9675526 -9073446 -5033051 -889550 910296
39612 910296 9344 -1862266 -2434959 -1494764 -1027426 -2075645 -3133545 -2769772 -1953958
39603 -1953958 -2200757 -2969294 -2475062 111180 4172790 7686825 7285094 1148962 -6895860
39594 -6895860 -9576387 -4804844 1099819 1796890 -766494 -563576 2834973 4375724
$$ packed form
39656b36131l424853k789401J063779L122343R26091j539905k80126K433970K116276
39647A392043p05837j816106l9109J726785J468960L01849k19502j52289k39478
39638A717316p20044j102736l48191J849922L599294K570496k55954j428869m83553
39629E397681p86483l233787l714938j00993K859946N02235l680999l000387J785153
39620c972572L485150n25716m755394l906994O02080M040395M143501J799846
39612I10296r00952j871610n72693R40195M67338j048219j057900L63773Q15814
39603a953958k46799p68537M94232K586242M061610L514035m01731o136132q044822
39594f895860k680527M771543N904663O97071k563384K02918L398549J540751
$$ plain form
39586 4375724 2176837 93503 841089 1836296 92108 -2785759 -3388530 -1601365 32806
39577 32806 464218 940683 2286038 3533925 3359777 1607851 -741068 -2458638 -2964979
39568 -2964979 -2663119 -2168727 -1247995 659021 2632191 2280069 -1246885 -5025778 -4991903
39559 -4991903 -1122992 1794894 -15143 -4003326 -4226574 526430 4600653 3008339
39551 3008339 -1694801 -3203764 -417691 1624180 -344862 -3492710 -4095224 -3072365
39543 -3072365 -3291813 -4222282 -3203760 -691974 -147824 -2500066 -4205841 -2207785 1570365
39534 1570365 2688261 91421 -2463806 -1164478 3022420 5465741 3562053 -190105
39526 -190105 -1647800 -272623 803815 -727400 -4030916 -7340054 -10105895 -12103189
$$ packed form
39586D375724k198887k083334P47586R95207j744188k877867o02771J787165J634171
39577C2806M31412M76465J345355J247887j74148j751926k348919j717570n06341
39568b964979L01860M94392R20732J907016J973170l52122l526954l778893L3875
39559d991903L868911K917886j810037l988183k23248M753004M074223j592314
39551C008339m703140j508963K786073K041871j969042l147848o02514J022859
39543c072365k19448r30469J018522K511786N44150k352242j705775J998056L778150
39534A570365J117896k596840k555227J299328M186898K443321j903688l752158
39526a90105j457695J375177J076438j531215l303516l309138k765841j997294
$$ plain form
39518 -12103189 -12394853 -10453517 -7068269 -3382859 -300971 919603 -467350 -2636434
39510 -2636434 -2433240 174321 1408520 -896720 -3713450 -3009645 556083 2882871
39502 2882871 1904436 -954362 -3729297 -5505784 -5615002 -3894189 -1739358 -911785 -1378235
39493 -1378235 -1811255 -1589032 -693296 1299526 3865643 4081072 -529010 -7598832 -11119305
39484 -11119305 -7966145 -1407815 2822517 2616791 704164 571818 2193421 2165454 -1905992
39475 -1905992 -7879215 -11182466 -10198904 -7545708 -5588529 -3311822 778082 5032174
39467 5032174 6399518 4329093 738675 -2597135 -4588328 -4284588 -2070108 28964
39459 28964 1360542 3952267 8141022 9507485 4400935 -3292568 -6079653 -3028749
$$ packed form
39518a2103189k91664J941336L385248L685410L081888J220574j386953k169084
39510b636434K03194K607561J234199k305240k816730P03805L565728K326788
39502B882871r78435k858798k774935j776487j09218J720813K154831Q27573m66450
39493a378235m33020K22223Q95736J992822K566117K15429m610082p069822l520473
39484a1119305L153160O558330M230332k05726j912627j32346J621603k7967m071446
39475a905992n973223l303251R83562K653196J957179K276707M089904M254092
39467E032174J367344k070425l590418l335810j991193L03740K214480K099072
39459B8964J331578K591725M188755J366463n106550p693503k787085L050904
$$ plain form
39451 -3028749 -700463 -3413341 -7847705 -8930417 -6248135 -2196443 1941266 4937588
39443 4937588 4287196 -226176 -4060285 -2862030 1556335 3636188 1454814 -1697125
39435 -1697125 -2668197 -1966329 -1363454 -801385 802590 3088054 4078654 2411406 -730000
39426 -730000 -2266136 -405725 2871252 3777347 1640247 133817 2258635 5865050
39418 5865050 6558910 3920254 1729881 2173178 3211349 2678415 1785224 2567249 4434187
39409 4434187 5758417 6728760 7663813 6506508 1967885 -2149348 -731566 4564143
39401 4564143 6476611 2793688 125136 3885383 9879190 10840777 7166381 4947203
39393 4947203 6020513 6784756 5715123 5145494 5445659 4020666 1094817 187180 1258720
$$ packed form
39451c028749K328286k712878m434364j082712K682282M051692M137709K996322
39443D937588o50392m513372l834109J198255M418365K079853k181374l151939
39435a697125r71072P01868O02875N62069J603975K285464R90600j667248l141406
39426g30000j536136J860411L276977R06095k137100j506430K124818L606415
39418E865050O93860k638656k190373M43297J038171n32934q93191P82025J866938
39409D434187J324230R70343R35053j157305m538623m117233J417782N295709
39401D564143J912468l682923k668552L760247N993807R61587l674396k219178
39393D947203J073310P64243j069633n69629L00165j424993k925849r07637J071540
$$ plain form
39384 1258720 -307078 -5529182 -8858108 -6667731 -2839960 -1693304 -793197 3871497
39376 3871497 9942868 12039145 10236261 9171353 10110131 9464455 5141008 96933
39368 96933 -1062030 3309448 10448149 14907253 13072093 7315814 3759154 4879782
39360 4879782 7182244 7171685 5550019 3772363 1282260 -1148606 -330713 3845211 6902127
39351 6902127 7047782 7960624 10503658 9159542 2586991 -198295 7529838 18382569
39343 18382569 21381507 18098100 17319770 19272149 18098930 16072710 21068468 31772361
39335 31772361 39930974 46616165 60986156 82609068 102310875 123358841 161854209
39328 161854209 216639147 256301761 251171233 208616501 164606009 148508568 165883984
$$ packed form
39384A258720j565798n222104l328926K190377L827771J146656R00107M664694
39376C871497O071371K096277j802884j064908R38778o45676m323447n044075
39368I6933j158963M371478P138701M459104j835160n756279l556660J120628
39360D879782K302462j0559j621666j777656k490103k430866Q17893M175924L056916
39351F902127J45655R12842K543034j344116o572551k785286P728133J0852731
39343A8382569K998938l283407p78330J952379j173219k026220M995758J0703893
39335C1772361Q158613O685191J4369991K1622912J9701807K1047966L8495368
39328A61854209N4784938L9662614n130528m2554732m4010492j6097441J7375416
$$ plain form
39321 165883984 204091270 238868271 242536701 204291858 143860529 93779271 68031814
39314 68031814 56706050 47518990 39033449 32671370 25842509 18111789 14393195 16435025
39306 16435025 18105600 14139883 8045145 6409814 9357489 11352895 9206066 5304421
39298 5304421 3534227 4564977 5739607 5071374 4454016 7180380 12162898 13881862
39290 13881862 9916366 4915238 3808798 4594988 2553947 -1214257 -1413591 2488943
39282 2488943 4912468 2129689 -3294476 -6744916 -6211177 -2185508 3326352 7048727
39274 7048727 6903934 4676441 3592573 3738497 2946669 1277634 654161 661759 -680034
39265 -680034 -1859551 1424330 9141029 14971726 13852285 8268032 4565395 5305283
$$ packed form
39321A65883984L8207286L4777001L668430l8244843o0431329n0081258k5747457
39314F8031814j1325764r187060q485541o362079o828861p730720l718594K041830
39306A6435025J670575l965717o094738j635331K947675J995406k146829l901645
39298E304421j770194J030750J174630o68233o17358K726364M982518J718964
39290A3881862l965496n001128j106440P86190k041041l768204j99334L902534
39282B488943K423525k782779n424165l450440N33739M025669N511860L722375
39274G048727j44793k227493j083868J45924p91828j669035o23473P598j341793
39265f80034j179517L283881P716699N830697j119441n584253l702637P39888
$$ plain form
39257 5305283 7750701 8561004 7561471 6820814 7464064 8552791 9368778 11412346 15971197
39248 15971197 20330936 20029451 15672409 13220987 15312008 16860613 12994740 7017766
39240 7017766 5290445 7642083 8978456 7951551 7306595 7090105 4767403 1932225
39232 1932225 3591288 9531402 13077465 10571133 6177178 4712433 5161082 4493429
39224 4493429 3139061 2894288 3090154 2684819 3489460 7687809 13773220 17803385 17708921
39215 17708921 14665546 11425491 10370853 11638695 12406760 9867817 5287561 2737339
39207 2737339 3564157 5246143 6331899 8694471 13192743 16661637 15750171 11148499
39199 11148499 5693144 677982 -3588836 -5844054 -5305767 -3640933 -3061667 -3418193
$$ packed form
39257E305283K445418Q10303r99533p40657O43250J088727Q15987K043568M558851
39248A5971197M359739l01485m357042k451422K091021J548605l865873n976974
39240G017766j727321K351638J336373j026905o44956k16490k322702k835178
39232A932225J659063N940114L546063k506332m393955j464745M48649o67653
39224D493429j354368k44773J95866m05335Q04641M198349O085411M030165r4464
39215A7708921l043375l240055j054638J267842P68065k538943m580256k550222
39207B737339Q26818J681986J085756K362572M498272L468894r11466m601672
39199A1148499n455355n015162m266818k255218N38287J664834N79266l56526
$$ plain form
39191 -3418193 -3077444 -1674176 -183647 919400 1936224 2908964 3539902 3760337 3664891
39182 3664891 3359473 3151403 3166544 2808811 1596939 257284 -277032 -311242 -59017
39173 -59017 2136784 7391927 12627831 13060140 8875423 5573036 6189156 6968192 3384079
39164 3384079 -2631983 -5109318 -2151161 1931588 2476376 -364771 -3153131 -4034914
39156 -4034914 -4470767 -6264953 -8335111 -7938292 -4859247 -2184813 -1929543 -2214151 -802052
39147 -802052 828826 60348 -1909281 -1531357 1514576 4233408 5488164 7012412 8973655
39138 8973655 8927947 6339031 4206789 4717659 6684450 8510503 10062402 10278393 6971855
39129 6971855 1107152 -2536097 -1594067 302041 -1012105 -4209142 -5048077 -2515814
$$ packed form
39191c418193L40749J403268J490529J103047J016824R72740O30938K20435r5446
39182C664891l05418k08070J5141l57733j211872j339655n34316l4210K52225
39173e9017K195801N255143N235904M32309m184717l302387O16120P79036l584113
39164C384079o016062k477335K958157M082749N44788k841147k788360q81783
39156d034914m35853j794186k070158L96819L079045K674434K55270k84608J412099
39147h02052J630878p68478j969629L77924L045933K718832J254756J524248J961243
39138H973655m5708k588916k132242N10870J966791J826053J551899K15991l306538
39129F971855n864703l643249R42030J896108j314146l197037q38935K532263
$$ plain form
39121 -2515814 861557 3019485 3584072 2419124 -228693 -2817631 -3740167 -2831404 -606950
39112 -606950 2522051 5215301 5420568 3113702 903648 513166 779415 538739 926984
39103 926984 2906650 5009189 5749640 5946692 6305636 5064967 812685 -4312415 -7051870
39094 -7051870 -7088719 -6155705 -4767894 -2506160 -34955 1837712 3749885 5917513 6222436
39085 6222436 2981929 -1677621 -4118331 -3864539 -3245478 -3325585 -2991754 -1464745 787533
39076 787533 3095068 4525992 3858992 1693404 978306 2824868 3656247 12175 -5408389
39067 -5408389 -6880167 -4088129 -2565282 -5258559 -8519599 -8219095 -5542267 -3876950
39059 -3876950 -3238719 -1416031 1145991 1309841 -2141575 -6638892 -8989744 -8450614 -6144762
$$ packed form
39121b515814L377371K157928N64587j164948k647817k588938r22536R08763K224454
39112f06950L129001K693250K05267k306866k210054l90482K66249k40676L88245
39103I26984J979666K102539P40451J97052L58944j240669m252282n125100k739455
39094g051870l6849R33014J387811K261734K471205J872667J912173K167628L04923
39085F222436l240507m659550k440710K53792O19061q0107L33831J527009K252278
39076G87533K307535J430924o67000k165588p15098J846562Q31379l644072n420564
39067e408389j471778K792038J522847k693277l261040L00504K676828J665317
39059c876950O38231J822688K562022J63850l451416m497317k350852N39130K305852
$$ plain form
39050 -6144762 -3207245 -593653 516244 -294513 -1649619 -1814043 -1256840 -2247172 -5305808
39041 -5305808 -7732681 -7068581 -4640151 -3594348 -4266408 -4048136 -1720060 827844 1903555
39032 1903555 2582158 4564606 7123720 7654024 4483144 -1483091 -6972055 -8081890
39024 -8081890 -3414854 3967582 9019980 9423044 6645899 2939759 -345655 -1745406
39016 -1745406 -288017 2003949 1214348 -3501550 -8514680 -10363392 -9141860 -6241593
39008 -6241593 -1985425 2711337 5498901 5789939 6159599 8264489 10027835 9362533 7936764
38999 7936764 8186013 8908017 7174866 2983497 -1008718 -2954330 -2472932 306679 3631954
38990 3631954 4141563 1184686 -852623 1901610 6760627 8039286 5176074 2589726
$$ packed form
39050f144762K937517K613592J109897q10757j355106j64424N57203r90332l058636
39041e305808k426873O64100K428430J045803o72060K18272K328076K547904J075711
39032A903555O78603J982448K559114N30304l170880n966235n488964j109835
39024h081890M667036P382436N052398M03064k777145l706140l285414j399751
39016a745406J457389K291966p89601m715898n013130j848712J221532K900267
39008f241593M256168M696762K787564K91038L69660K104890J763346o65302j425769
38999G936764K49249P22004j733151m191369l992215j945612M81398K779611L325275
38990C631954N09609k956877k037309K754233M859017J278659k863212k586348
$$ plain form
38982 2589726 1979469 -151869 -6218846 -12961512 -15214177 -11822258 -6144516 -2172471
38974 -2172471 -1155240 -1035825 1111331 5311588 7945087 6035385 1276709 -2181917
38966 -2181917 -3064962 -3523464 -4755984 -5016946 -2698087 908833 3206023 3365739 2710984
38957 2710984 2680283 3414334 4478175 6185184 8857592 10474423 7364198 -375331 -6072615
38948 -6072615 -3320054 4894848 8929508 5084422 -216373 -1007610 -304190 -3498213
38940 -3498213 -8517427 -9035679 -4491597 -304625 606839 529603 1458776 2146528 1165466
38931 1165466 -1004281 -3201429 -3928773 -1319011 4038078 7711854 6702092 4427023
38923 4427023 5947384 9901220 10712294 7787715 6100818 7235312 6358196 214164
$$ packed form
38982B589726o10257k131338o066977o742666k252665L391919N677742L972045
38974b172471J017231J19415K147156M200257K633499j909702m758676l458626
38966b181917q83045m58502j232520k60962K318859L606920K297190J59716o54755
38957B710984l0701P34051J063841J707009K672408J616831l110225p739529n697284
38948f072615K752561Q214902M034660l845086n300795p91237P03420l194023
38940c498213n019214n18252M544082M186972R11464p7236R29173O87752r81062
38931A165466k169747k197148p27344K609762N357089L673776j009762k275069
38923D427023J520361L953836Q11074k924579j686897J134494q77116o144032
$$ plain form
38915 214164 -7178069 -9699722 -6318846 -721358 3310451 4221754 2765901 1191401
38907 1191401 681463 -423110 -3703824 -7021178 -7307857 -6001958 -6968698 -9238767 -7315367
38898 -7315367 192548 7517375 9301968 6614152 3176971 34622 -3074029 -4672540
38890 -4672540 -3275417 -10144 2860422 4258210 3828095 1541991 -986098 -1300022
38882 -1300022 594941 2082120 1695579 272462 -1825996 -4955623 -7159388 -5238630
38874 -5238630 -94347 3309341 2860810 1805979 2679668 3655811 3430624 4698559 9167157
38865 9167157 13416913 13705544 11246120 8850956 6076213 2152968 232311 3271271
38857 3271271 7915093 7952637 2850548 -1950982 -2697359 -919041 404226 196226 -1539932
$$ packed form
38915B14164p392233k521653L380876N597488M031809R11303j455853j574500
38907A191401n09938j104573l280714l317354k86679J305899r66740k270069J923400
38898g315367P507915P324827J784593k687816l437181l142349l108651j598511
38890d672540J397123L265273K870566J397788m30115k286104k528089l13924
38882a300022J894963J487179l86541j423117k098458l129627k203765J920758
38874e238630N144283L403688m48531j054831Q73689R76143k25187J267935M468598
38865I167157M249756K88631k459424k395164k774743l923245j920657L038960
38857C271271M643822L7544n102089m801530p46377J778318J323267k08000j736158
$$ plain form
38848 -1539932 -4384724 -6532775 -5775629 -2297898 1184293 2428305 1646956 717438 1380393
38839 1380393 3574180 4851462 2812005 -1090335 -2331087 654263 3800638 3131812
38831 3131812 612063 845632 3675139 4225946 27718 -5734989 -8843299 -8856450 -7887395
38822 -7887395 -6773456 -4602694 -1512865 -67918 -2614332 -7555249 -9928929 -6872799
38814 -6872799 -1221241 2199707 2614305 2872114 4005560 4149419 2910558 2370864 2632355
38805 2632355 854679 -3278858 -5515955 -3272837 78515 537665 -596725 -122371
38797 -122371 981513 -448272 -3970917 -6549281 -7814710 -9634313 -11434730 -10710623
38789 -10710623 -7956164 -6578236 -7389819 -7160371 -3705376 814755 2995013 2176810
$$ packed form
38848a539932k844792k148051P57146L477731L482191J244012p81349r29518O62955
38839A380393K193787J277282k039457l902340j240752K985350L146375o68826
38831C131812k519749K33569K829507N50807m198228n762707l108310j3151R69055
38822g887395J113939K170762L089829J444947k546414m940917k373680L056130
38814f872799N651558L420948M14598K57809J133446J43859j238861n39694K61491
38805B632355j777676m133537k237097K243118L351352M59150j134390M74354
38797a22371J103884j429785l522645k578364j265429j819603j800417P24107
38789a0710623K754459J377928q11583K29448L454995M520131K180258q18203
$$ plain form
38781 2176810 132916 -1452374 -2151399 -2608024 -3815312 -5835442 -7161242 -6074102
38773 -6074102 -2558841 1533163 3772932 2526955 -1730367 -6001162 -6942103 -4000422
38765 -4000422 628247 4769812 7074504 5890825 852303 -4346011 -4923182 -1729162
38757 -1729162 -762305 -4721974 -9719221 -12018892 -12513347 -11858055 -7404088 598654 5542763
38748 5542763 2976261 -2155408 -2861922 -289193 188279 -1074467 134947 2958982
38740 2958982 2783832 -124038 -1345642 -587628 -1203469 -2218363 637588 5857420 6938562
38731 6938562 3387104 2155591 5823048 7922713 3712776 -2076352 -2947849 143715
38723 143715 2195297 1870552 1166275 1117360 1666952 2753765 2947176 378187 -3226299
$$ packed form
38781B176810k043894j585290o99025m56625j207288k020130j325800J087140
38773f074102L515261M092004K239769j245977m257322m270795r40941K941681
38765d000422M628669M141565K304692j183679n038522n198314n77171L194020
38757a729162R66857l959669m997247k299671m94455O55292M453967Q002742M944109
38748E542763k566502n131669p06514K572729M77472j262746J209414K824035
38740B958982j75150k907870j221604P58014o15841j014894K855951N219832J081142
38731F938562l551458j231513L667457K099665m209937n789128q71497L091564
38723A43715K051582l24745p04277m8915N49592J086813J93411k568989l604486
$$ plain form
38714 -3226299 -3675234 -1079826 -455629 -3682472 -6507856 -5920934 -4351760 -3551977 -995710
38705 -995710 3604761 5068960 1263623 -1676383 1159980 4839700 2624867 -2857466
38697 -2857466 -4644759 -3033991 -3085545 -4006706 -1002543 3933719 3279768 -3566685 -8354699
38688 -8354699 -6016454 -362240 4105036 7838625 10799203 9270471 2658860 -2840697
38680 -2840697 -2413033 423955 -119931 -3344757 -4555084 -3011258 -1852773 -1967413 -1189784
38671 -1189784 947468 2101337 1083004 -445292 -975252 -1477733 -3818659 -8078556
38663 -8078556 -11922461 -12288769 -8282607 -2899212 -795508 -3462238 -7605423 -9053322
38655 -9053322 -6937255 -3184416 273227 2227576 1868165 -61425 -799371 1568270
$$ packed form
38714c226299m48935K595408O24197l226843k825384N86922J569174P99783K556267
38705i95710M600471J464199l805337k940006K836363L679720k214833n482333
38697b857466j787293J610768n1554r21161L004163M936262o53951o846453m788014
38688h354699K338245N654214M467276L733589K960578j528732o611611n499557
38680b840697M27664K836988n43886l224826j210327J543826J158485j14640P77629
38671a189784K137252J153869j018333j528296n29960n02481k340926m259897
38663h078556l843905l66308M006162N383395K103704k666730m143185j447899
38655i053322K116067L752839L457643J954349l59411j929590p37946K367641
$$ plain form
38647 1568270 5325673 7036804 5610928 2627790 -570302 -3666922 -5587928 -4761078
38639 -4761078 -1811472 387833 444866 243146 1728752 3796397 4242495 3382567 3271689
38630 3271689 3860817 2612773 -1388329 -5145635 -5149696 -1865333 978372 1124898 -75598
38621 -75598 -509032 -259128 -389574 -288694 1471225 4107414 5158651 4577176 5351276
38612 5351276 8286997 9153943 4585503 -1156852 -384373 7039146 12359596 9529310
38604 9529310 3068169 853266 3607448 6597545 8125939 9693915 9726622 4813704
38596 4813704 -2605034 -5339735 -2038980 402330 -2163524 -4842225 -2663798 1028659
38588 1028659 1211298 276546 2901049 6307799 4425492 -854148 -1842637 2332017 4544875
$$ packed form
38647A568270L757403J711131j425876k983138l198092l096620j921006Q26850
38639d761078K949606K199305N7033k01720J485606K067645M46098q59928j10878
38630C271689N89128j248044m001102l757306m061L284363K843705J46526j200496
38621g5598m33434K49904j30446J00880J759919K636189J051237n81475P74100
38612E351276K935721Q66946m568440n742355P72479P423519N320450k830286
38604I529310o461141k214903K754182K990097J528394J567976L2707m912918
38596D813704p418738k734701L300755K441310k565854k678701K178427L692457
38588A028659J82639r34752K624503L406750j882307n279640r88489M174654K212858
$$ plain form
38579 4544875 1919264 159001 3083818 6216696 4951920 2071273 2087476 3729838
38571 3729838 3409010 1785641 1650735 2672155 3028019 3236649 3873703 2560027 -1950288
38562 -1950288 -5472858 -3528161 1166456 1765491 -3136064 -8041427 -8312469 -4841651
38554 -4841651 -852946 1903692 3092409 2999705 2516787 2121777 1227680 -54675 -129386
38545 -129386 1203412 1535812 248498 1063953 6140113 10576002 8371390 1959341 -550866
38536 -550866 3054236 6933507 7037914 6192338 7217564 7327301 3225364 -2674944 -5252077
38527 -5252077 -3249945 273795 2022350 741741 -2447773 -4163957 -1457019 4007495
38519 4007495 6911426 4905886 1463061 477763 1229759 995216 -492883 -2144147 -4343242
$$ packed form
38579D544875k625611j760263K924817L132878j264776k880647J6203J642362
38571C729838l20828j623369j34906J021420L55864K08630O37054j313676m510315
38562a950288l522570J944697M694617N99035m901555m905363k71042L470818
38554d841651L988705K756638J188717r2704m82918l95010q94097j282355p4711
38545a29386J332798L32400j287314Q15455N076160M435889k204612o412049k510207
38536e50866L605102L879271J04407q45576J025226J09737m101937n900308k577133
38527e252077K002132L523740J748555j280609l189514j716184K706938N464514
38519D007495K903931k005540l442825r85298P51996k34543j488099j651264k199095
$$ plain form
38510 -4343242 -7266696 -8409132 -5396627 -73745 3484992 4281854 4774484 6499281
38502 6499281 8204056 8406314 7440684 6460332 5855495 4991150 2856599 -669989 -3839491
38493 -3839491 -4462330 -2938676 -2253785 -3963281 -6028741 -5982673 -4173524 -2042693 589511
38484 589511 3880955 5511891 3291146 -683978 -1920566 530793 3216644 3741076
38476 3741076 3969614 6489907 10296523 11989916 10149110 6722742 4219308 2804474
38468 2804474 876386 -1841492 -2937592 -82065 5313181 8864623 8012898 4470661
38460 4470661 1225859 -1088936 -3450902 -5541098 -5573103 -2698213 1682645 4926589
38452 4926589 5053055 2294233 -940445 -2477705 -2689235 -3071854 -3011697 -492892 3829286
$$ packed form
38510d343242k923454j142436L012505N322882L558737P96862M92630J724797
38502F499281J704775K02258r65630r80352o04837q64345k134551l526588l169502
38493c839491o22839J523654O84891j709496k065460M6068J809149K130831K632204
38484E89511L291444J630936k220745l975124j236588K451359K685851N24432
38476C741076K28538K520293L806616J693393j840806l426368k503434j414834
38468B804474j928088k717878j096100K855527N395246L551442q51725l542237
38460D470661l244802k314795k361966k090196l2005K874890M380858L243944
38452D926589J26466k758822l234678j537260k11530l82619O0157K518805M322178
$$ plain form
38443 3829286 6414349 5655862 3757864 2549620 981211 -1386166 -2329770 -1162486
38435 -1162486 -1154514 -4286621 -7223868 -6614932 -4884619 -5859260 -7782928 -6332000 -2033676
38426 -2033676 1373936 3733204 6886754 8212053 3684226 -3195692 -4162859 1039306
38418 1039306 3247066 -2153503 -8093466 -6857826 -994040 2246789 1609497 985045
38410 985045 1941398 2796277 2506320 1033990 -1729002 -4025927 -2467598 2399250 4571789
38401 4571789 537394 -5220401 -6979559 -5831242 -5833414 -6252314 -3922310 -147106 1479537
38392 1479537 1847240 4204661 7069935 6175783 2337147 467437 1395319 1509603 131174
38383 131174 62086 762476 -1385568 -5177204 -4901877 -461724 803588 -4471106 -10042497
$$ packed form
38443C829286K585063p58487j897998j208244j568409k367377r43604J167284
38435a162486P972l132107k937247O08936J730313r74641j923668J450928M298324
38426b033676L407612K359268L153550J325299m527827o879918r67167N202165
38418A039306K207760n400569n939963J235640N863786L240829o37292o24452
38410I85045R56353Q54879k89957j472330k762992k296925J558329M866848K172539
38401D571789m034395n757795j759158J148317k172m18900K330004L775204J626643
38392A479537L67703K357421K865274q94152l838636j869710R27882J14284j378429
38383A31174o9088P00390k148044l791636K75327M440153J265312n274694n571391
$$ plain form
38374 -10042497 -10012014 -7286004 -6803788 -6759074 -3196015 1591852 2547621 484900 64117
38365 64117 1188732 -403906 -4612254 -5931232 -1939426 2884179 3770744 1740903 821255
38356 821255 2451791 5166582 7758284 10214654 12118914 11950409 8574703 3122431
38348 3122431 -1258634 -2333838 -1250976 -764488 -1114507 111092 3465680 5893448
38340 5893448 5268677 3997041 5342635 8168342 8568377 5550196 1883277 -38661
38332 -38661 -88388 1426348 4204204 6280817 5025012 878899 -2243984 -1642424 683687
38323 683687 553924 -3283398 -7706295 -8751949 -6045213 -3267124 -3788316 -6340268 -6499040
38314 -6499040 -2472930 2753018 5693700 6087145 4879256 1688904 -2773259 -4561784
$$ packed form
38374a0042497L0483K726010M82216M4714L563059M787867R55769k062721m20783
38365F4117J124615j592638m208348j318978L991806M823605Q86565k029841r19648
38356H21255J630536K714791K591702K456370J904260j68505l375706n452272
38348C122431m381065j075204J082862M86488l50019J225599L354588K427768
38340E893448o24771j271636J345594K825707M00035l018181l666919j921938
38332c8661m9727J514736K777856K076613j255805m146113l122883O01560K326111
38323F83687j29763l837322m422897j045654K706736K778089n21192k551952j58772
38314f499040M026110N225948K940682L93445j207889l190352m462163j788525
$$ plain form
38306 -4561784 -1043758 4001898 4496130 562054 -2100605 -1500456 -2307376 -7397243 -11668504
38297 -11668504 -8556970 315345 6707258 5991924 1729045 -369306 356115 240848
38289 240848 -2433816 -4532713 -2346510 2599183 4431902 344635 -5267174 -6412322
38281 -6412322 -3476637 -1920680 -3583713 -3935358 501584 6174943 7028970 2243378
38273 2243378 -3873202 -7732650 -8677953 -6767103 -2402314 1937498 3157214 1335489
38265 1335489 -692194 -1779658 -3408569 -5691977 -6136823 -4039370 -2634596 -4237269
38257 -4237269 -6190520 -5073083 -2621056 -3181996 -6502072 -7822319 -5251991 -2312970
38249 -2312970 -1903138 -2195921 -835664 781889 638981 228178 1675921 3225552 1953145
$$ packed form
38306d561784L518026N045656M94232l934076k662659O00149q06920n089867m271261
38297a1668504L111534Q872315O391913p15334m262879k098351P25421j15267
38289B40848k674664k098897K186203M945693J832719m087267n611809j145148
38281f412322K935685J555957j663033l51645M436942N673359Q54027m785592
38273B243378o116580l859448r45303J910850M364789M339812J219716j821725
38265A335489k027683j087464j628911k283408m44846K097453J404774j602673
38257d237269j953251J117437K452027n60940l320076j320247K570328K939021
38249b312970M09832k92783J360257J617553j42908m10803J447743J549631j272407
$$ plain form
38240 1953145 -672202 -591059 2363925 4564685 4899908 5871183 7726259 6880652 2308026
38231 2308026 -1290542 39597 3480729 3497656 -652242 -4952996 -6299156 -4872547
38223 -4872547 -2245410 -126745 -73914 -1954120 -3496697 -3214841 -2375141 -2224738 -1345068
38214 -1345068 1561287 4160997 3112411 -935067 -4187177 -4810835 -4198877 -3775052 -3563801
38205 -3563801 -3683141 -4559343 -5733701 -6533976 -7331402 -8156863 -7359752 -4183022 -1179007
38196 -1179007 -866621 -1322990 1084696 5391367 6582889 2382502 -4283455 -9652525
38188 -9652525 -12269165 -11715677 -8200561 -4073018 -2183922 -2072638 -1025328 949051
38180 949051 1027282 -1273247 -3124212 -3284625 -3497653 -3884415 -1724747 3214855 6653906
$$ packed form
38240A953145k625347Q1143K954984K200760L35223R71275J855076q45607m572626
38231B308026l598568J330139L441132J6927m149898m300754j346160J426609
38223d872547K627137K118665N2831j880206j542577K81856Q39700J50403Q79670
38214a345068K906355K599710j048586m047478l252110o23658O11958M23825K11251
38205c563801j19340q76202j174358q00275p97426q25461P97111L176730L004015
38196a179007L12386m56369K407686M306671J191522m200387o665957n369070
38188i652525k616640N53488L515116M127543J889096J11284J047310J974379
38180I49051P8231k300529j850965j60413k13028l86762K159668M939602L439051
$$ plain form
38171 6653906 5669811 2731887 1353505 1430601 1478179 1765532 2385329 1808016 268259
38162 268259 815080 3778243 4307474 -469099 -5793514 -5822419 -2404180 -1442295 -3178222
38153 -3178222 -2985681 -611848 -1124989 -5756122 -8728297 -5925711 -1173977 -144042
38145 -144042 -2064848 -1859414 1830105 5096568 4585298 1400945 -1081717 -846405 1854295
38136 1854295 5224598 6677625 4443992 -211882 -3299335 -2142831 1278135 2572598
38128 2572598 324162 -2689873 -3815001 -3449760 -2526898 8599 4661437 8637428
38120 8637428 8941790 6636323 4550148 2360223 -1756488 -5804907 -5620277 -1748958
38112 -1748958 806813 372475 414633 2278386 2354386 -919892 -3384448 -2277801 -1412083
$$ packed form
38171F653906r84095k937924j378382P7096M7578K87353O19797n77313j539757
38162B68259N46821K963163N29231m776573n324415k8905L418239R61885j735927
38153c178222J92541K373833n13141m631133k972175K802586M751734J029935
38145a44042j920806K05434L689519L266463n11270l184353k482662K35312K700700
38136A854295L370303J453027k233633m655874l087453J156504L420966J294463
38128B572598k248436l014035j125128L65241R22862K535497M652838L975991
38120H637428L04362k305467k086175k189925m116711m048419J84630L871319
38112a748958K555771m34338M2158J863753P6000l274278k464556J106647Q65718
$$ plain form
38103 -1412083 -4547645 -8583969 -8760663 -6419188 -5725529 -6207842 -4809798 -2563477 -2687727
38094 -2687727 -4040673 -3013202 -579666 -896107 -3620943 -4203762 -1780596 -379524
38086 -379524 -1660831 -2594136 -1621700 -1489272 -4140751 -7586019 -9556944 -10026192 -8755040
38077 -8755040 -4624578 1159034 5143031 6027792 5228634 2873616 -1775923 -5503453
38069 -5503453 -3104335 3761459 6081384 -528775 -8921096 -10001480 -4545673 -208550
38061 -208550 -258900 -1026191 1243635 6120833 10885808 12736671 9781319 3325232 -1447518
38052 -1447518 -429219 4015572 5549147 1706996 -3394789 -4435078 -706088 4070897
38044 4070897 6153513 5087058 3134370 2106812 1492156 192073 -1065344 -828506
$$ packed form
38103a412083l135562m036324j76694K341475O93659m82313J398044K246321j24250
38094b687727j352946J027471K433536l16441k724836n82819K423166J401072
38086c79524j281307r33305R72436J32428k651479l445268j970925m69248J271152
38077h755040M130462N783612L983997Q84761p99158k355018m649539l727530
38069e503453K399118O865794K319925o610159q392321j080384N455807M337123
38061b08550n0350p67291K269826M877198M764975J850863k955352o456087m772750
38052a447518J018299M444791J533575l842151n101785j040289L728990M776985
38044D070897K082616j066455j952688j027558o14656j300083j257417K36838
$$ plain form
38036 -828506 352747 754501 566640 1209140 1867275 411332 -2040636 -1877696 745923
38027 745923 1326592 -1424445 -2719536 475542 4038278 3645940 2344542 5234047 10244377
38018 10244377 11143708 7672026 5457551 6447306 6573496 3767271 1598192 2753339
38010 2753339 4534554 3808464 2001487 2024726 3690530 5164520 6104760 6578802 5438689
38001 5438689 2558418 450354 926996 2165536 1743257 470471 130119 -540822 -3634246
37992 -3634246 -7024325 -6133284 -1075442 2237488 -299309 -5703192 -8382428 -7039239
37984 -7039239 -4287117 -1635618 1310607 3430769 2056346 -2481936 -5442576 -2927998
37976 -2927998 3296111 8170674 9048274 7028788 4039487 1308549 125226 1179504
$$ packed form
38036h28506J181253M01754j87861O42500O58135j455943k451968J62940K623619
38027G45923N80669k751037j295091L195078L562736l92338j301398K889505N010330
38018A0244377Q99331l471682k214475R89755J26190k806225k169079J155147
38010B753339J781215p26090j806977K3239J665804J473990R40240M74042j140113
38001E438689k880271k108064M76642J238540m22279j272786l40352o70941l093424
37992c634246l390079Q91041N057842L312930k536797n403883k679236J343189
37984g039239K752122K651499K946225K120162j374423m538282k960640K514578
37976b927998O224109M874563Q77600k019486k989301k730938j183323J054278
$$ plain form
37968 1179504 2838566 2603209 857892 729571 3326207 5644890 4771751 1922319 192767
37959 192767 105007 55952 73097 1913389 5201539 6388640 3115998 -2054936 -4233917
37950 -4233917 -2067421 798510 565455 -2080384 -3774532 -3839210 -4936616 -7795856 -8599045
37941 -8599045 -4215689 2320387 5202854 3441131 1069820 512743 475684 661991 3126904
37932 3126904 7118503 7879758 3776022 -72238 699161 2869849 1460598 -1237659
37924 -1237659 965954 7508842 10687122 6254926 -1382676 -5688709 -4830739 -736045
37916 -736045 4114549 7148971 6766268 4727731 4391142 5623057 5207000 3186222 3874181
37907 3874181 8229405 10139288 4268359 -5890196 -12012000 -10523549 -4402223 2083680
$$ packed form
37968A179504J659062k35357j745317j28321K596636K318683q73139k849432j729552
37959A92767q7760m9055J7145J840292L288150J187101l272642n170934k178981
37950d233917K166496K865931k33055k645839j694148o4678j097406k859240q03189
37941h599045M383356O536076K882467j761723k371311n57077l7059J86307K464913
37932C126904L991599P61255m103736l848260P71399K170688j409251k698257
37924a237659K203613O542888L178280m432196p637602m306033Q57970M094694
37916g36045M850594L034422l82703k038537l36589J231915m16057k020778O87959
37907C874181M355224J909883n870929j0158555o121804J488451O121326O485903
$$ plain form
37899 2083680 6066262 5486413 823406 -3219348 -2257193 1729914 3100872 1082819
37891 1082819 656441 4073010 6775522 4462456 -146356 -1571791 278652 820080
37883 820080 -1555801 -3161709 -969826 2812260 3931905 1522878 -1810245 -4070071
37875 -4070071 -5670606 -7212678 -7591564 -5666055 -2918067 -2577528 -5440143 -7850017
37867 -7850017 -5469680 1194791 6885664 7827183 5970298 5375602 6018287 4300641 -377210
37858 -377210 -3181567 21508 6554693 9903469 7713398 3800287 2375226 3323851
37850 3323851 4055045 3410112 2124753 1146220 1079326 2062323 2931254 1884126 -685342
37841 -685342 -1594709 1120483 5081442 6551233 5143617 3037861 953097 -1569113
$$ packed form
37899B083680L982582n79849m663007m042754R62155L987107J370958k018053
37891A082819m26378L416569K702512k313066m608812j425435J850443N41428
37883H20080k375881j605908K191883L782086J119645k409027l333123k259826
37875d070071j600535j542072l78886J925509K747988L40539k862615k409874
37867g850017K380337O664471N690873R41519j856885n94696O42685j717646m677851
37858c77210k804357L203075O533185L348776k190071l913111j425061R48625
37850C323851P31194o44933j285359r78533o6894R82997Q68931j047128k569468
37841f85342r09367K715192L960959J469791j407616k105756k084764k522210
$$ plain form
37833 -1569113 -2680980 401174 5708166 6766396 1032441 -5562156 -5972982 -1362080
37825 -1362080 1079058 -1731240 -5330725 -4712615 -722841 2226544 2059658 421419
37817 421419 -434158 -206236 -422449 -2742523 -6897770 -9861257 -8137219 -1702085 5372837
37808 5372837 9231390 10079419 10393476 10497867 8363156 3775950 79057 356285 3535228
37799 3535228 6079833 6543387 6248094 5710420 3078703 -2556909 -8239196 -9881624 -7404439
37790 -7404439 -4829090 -4824297 -5243911 -2445305 3348399 7912175 7882790 4129119 149358
37781 149358 -1543877 -1077284 -413338 -1472777 -4247495 -6360832 -5345472 -1732990 1191901
37772 1191901 1309333 71783 -74247 584195 -292662 -3199820 -5550892 -4708684 -995134
$$ packed form
37833a569113j111867L082154N306992J058230n733955o594597m10826M610902
37825a362080K441138k810298l599485O18110L989774K949385j66886j638239
37817D21419q55577K27922k16213k320074m155247k963487J724038O435134P074922
37808E372837L858553Q48029L14057J04391k134711m587206l696893K77228L178943
37799C535228K544605M63554k95293n37674k631717n635612n682287j642428K477185
37790g404439K575349M793m19614K798606N793704M563776k9385l753671l979761
37781A49358j693235M66593O63946j059439k774718k113337J015360L612482K924891
37772A191901J17432j237550j46030O58442q76857k907158k351072Q42208L713550
$$ plain form
37763 -995134 2635844 3114586 -288924 -4859574 -6214043 -2788284 1827699 3045463
37755 3045463 1320963 1089697 3537159 4461212 1153376 -2613730 -2004691 1496175 2648205
37746 2648205 573136 -746372 519330 1776300 1349263 992950 1401510 60231 -3584178
37737 -3584178 -5031771 -797216 5326070 6466034 1595651 -3884859 -5812594 -5553284
37729 -5553284 -6276631 -8231777 -8990974 -6600152 -1618191 3049773 4325049 1850802
37721 1850802 -1638642 -3479481 -3460180 -2225749 520364 4206364 6029035 4479916
37713 4479916 2427602 2956140 3722143 305199 -5528233 -6800231 -1648134 3148366
37705 3148366 1670383 -3193703 -5051315 -2904636 -18698 2710015 6536719 9779773
$$ packed form
37763i95134L630978M78742l403510m570650j354469L425759M615983J217764
37755C045463j724500k31266K447462R24053l307836l767106O09039L500866J152030
37746B648205k075069j319508J265702J256970m27037l56313M08560j341279l644409
37737c584178j447593M234555O123286J139964m870383n480510j927735K59310
37729e553284p23347j955146p59197K390822M981961M667964J275276k474247
37721A850802l489444j840839J9301J234431K746113L686000J822671j549119
37713D479916k052314N28538P66003l416944n833432j271998N152097M796500
37705C148366j477983m864086j857612K146679K885938K728713L826704L243054
$$ plain form
37697 9779773 8864610 4430573 1286243 1510759 2118971 827481 -193549 1517655 4362600
37688 4362600 5167426 3424724 556816 -2652002 -5123556 -4312484 330567 4127154
37680 4127154 1807923 -4445826 -5915187 1834070 12312457 15202482 8248549 -1078346
37672 -1078346 -4983914 -3040610 -38957 537742 -1164080 -3451009 -4727164 -3804082
37664 -3804082 -1070019 778944 -552247 -3470322 -4165223 -2048500 -543221 -1524232
37656 -1524232 -2599561 -2193788 -3459912 -8824339 -13537294 -10753203 -2301706 2182089
37648 2182089 -1775828 -7620089 -7844190 -4239753 -3331259 -5964096 -7474966 -5803044
37640 -5803044 -3262443 -1135792 1719948 4802658 5810284 5198787 5947995 7847051
$$ packed form
37697I779773r15163m434037l144330K24516O08212j291490j021030J711204K844945
37688D362600Q04826j742702k867908l208818k471554Q11072M643051L796587
37680D127154k319231o253749j469361P749257J0478387K890025o953933r326895
37672a078346l905568J943304L001653N76699j701822k286929j276155R23082
37664c804082K734063J848963j331191k918075o94901K116723J505279r81011
37656a524232j075329M05773j266124n364427m712955K784091Q451497M483795
37648B182089l957917n844261k24101L604437R08494k632837j510870J671922
37640e803044K540601K126651K855740L082710J007626o11497P49208J899056
$$ plain form
37632 7847051 7016145 2631301 -847448 -329669 1749060 2463073 2749240 3429608 1769707
37623 1769707 -3396696 -7122871 -4246761 2998991 8255134 9116309 6786903 1032786
37615 1032786 -7584693 -12784389 -8250369 1946732 6858018 3716008 1232619 5371735
37607 5371735 10286669 8299774 1807354 -1252512 1095973 4484017 5955475 5868823
37599 5868823 4407546 1967237 1234394 3539272 4869927 952309 -5309877 -7323844
37591 -7323844 -4491699 -1954556 -1184721 1886642 8178766 12127753 10105999 6162281
37583 6162281 5322417 6012031 3906224 -210264 -1647166 906095 3910082 4141585 1690282
37574 1690282 -1840862 -4938064 -5982899 -4194497 -1142122 659826 818992 1048348
$$ packed form
37632G847051q30906m384844l478749N17779K078729P14013K86167O80368j659901
37623A769707n166403l726175K876110P245752N256143Q61175k329406n754117
37615A032786q617479n199696M534020J0197101M911286l142010k483389M139116
37607E371735M914934j986895o492420l059866K348485L388044J471458q6652
37599E868823j461277k440309p32843K304878J330655l917618o262186k013967
37591g323844K832145K537143P69835L071363O292124L948987k021754l943718
37583F162281q39864O89614k105807m116488j436902K553261L003987K31503k451303
37574A690282l531144l097202j044835J788402L052375J801948J59166K29356
$$ plain form
37566 1048348 2227035 3372534 3618525 3241257 2234890 -190365 -3545924 -5059277
37558 -5059277 -2691514 1234602 1573827 -3446207 -9058513 -9007260 -3263625 1956976 2524957
37549 2524957 1567908 3869954 7878063 7735761 2442951 -2054483 -1154130 2353777 2947540
37540 2947540 -313165 -4214848 -6639537 -7854080 -7852301 -5773679 -1848983 2271324 4954053
37531 4954053 5040976 2023205 -2539845 -5213113 -4480399 -3021485 -3900844 -6128404 -6970593
37522 -6970593 -6917597 -8189078 -9265041 -5993968 1240782 6372483 5487946 1663205 -244785
37513 -244785 252187 1059523 1690814 2113608 629503 -2849285 -4060847 51100 4870246
37504 4870246 3036250 -4604026 -9163112 -5929998 -277399 1382100 756210 2970125
$$ packed form
37566A048348J178687J145499K45991l77268j006367k425255l355559j513353
37558e059277K367763L926116L39225n020034n612306N1253N743635N220601N67981
37549B524957r57049K302046M008109j42302n292810m497434R00353L507907N93763
37540B947540l260705l901683k424689j214543J779K078622L924696M120307K682729
37531D954053Q6923l017771m563050k673268P32714J458914q79359k227560q42189
37522f970593N2996j271481j075963L271073P234750N131701q84537l824741j907990
37513b44785M96972Q07336O31291M22794j484105l478788j211562M111947M819146
37504D870246j833996p640276m559086L233114N652599J659499o25890K213915
$$ plain form
37496 2970125 6975700 7113710 2662541 -643280 570382 2355976 -338363 -6250547
37488 -6250547 -9606156 -7235395 -1236732 4254312 6667929 5968267 3945194 2641875
37480 2641875 2593100 2751117 2315327 1618321 878882 -279221 -1205832 -81687 3022694
37471 3022694 4907629 3431000 1239229 2099946 4597892 3637633 -1503693 -5118753
37463 -5118753 -3081184 935855 726540 -3489008 -5722818 -3045214 687443 909700
37455 909700 -1566122 -2873594 -2008547 -1265461 -1730963 -1687261 -143101 837503 -789532
37446 -789532 -3371072 -3444115 -687028 1676439 1780130 1731321 3851722 6590230 6766764
37437 6766764 4711483 4146736 6807794 9763011 9052305 4281875 -1353044 -4388618
$$ packed form
37496B970125M005575J38010m451169l305821J213662J785594k694339n912184
37488f250547l355609K370761N998663N491044K413617o99662k023073j303319
37480B641875m8775J58017m35790o97006p39439j158103r26611J124145L104381
37471C022694J884935j476629k191771Q60717K497946r60259n141326l615060
37463e118753K037569M017039k09315m215548k233810K677604L732657K22257
37455I09700k475822j307472Q65047P43086m65502M3702J544160R80604j627035
37446g89532k581540p3043K757087K363467J03691m8809K120401K738508J76534
37437F766764k055281n64747K661058K955217p10706m770430n634919l035574
$$ plain form
37429 -4388618 -3723564 -1034899 867332 982385 1359284 4008094 7049935 6661280 3215697
37420 3215697 1939435 5522458 9438106 8001247 2685289 94008 2690491 6093068
37412 6093068 5848536 2572464 -955490 -3871835 -5996751 -5556725 -1352442 4307960
37404 4307960 7714338 8120750 7681608 7499221 6114404 2228028 -2921708 -6658119 -7363472
37395 -7363472 -5433891 -2546568 -471187 -78484 -862415 -1305068 -50703 2663301 4527242
37386 4527242 2993338 -1466766 -4747912 -3405886 832731 2953579 1082699 -1481034
37378 -1481034 -1299382 950087 2715844 3306189 3102320 1426845 -1870510 -4386090 -3768425
37369 -3768425 -1171965 647670 1266044 1610099 829116 -1877000 -3724374 -1462766 2624808
$$ packed form
37429d388618O65054K688665J902231J15053L76899K648810L041841l88655l445583
37420C215697j276262L583023L915648j436859n315958k591281K596483L402577
37412F093068k44532l276072l527954k916345k124916M40026M204283N660402
37404D307960L406378M06412m39142j82387j384817l886376n149736l736411p05353
37395g363472J929581K887323K075381L92703p83931m42653J254365K714004J863941
37386D527242j533904m460104l281146J342026M238617K120848j870880k563733
37378a481034J81652K249469J765757N90345k03869j675475l297355k515580O17665
37369c768425K596460J819635O18374L44055p80983k706116j847374K261608M087574
$$ plain form
37360 2624808 3109177 -160578 -1711468 718743 3245499 3564146 4921007 8942457
37352 8942457 10963307 7509041 2846634 2051904 2309013 -1883287 -8543019 -11026941
37344 -11026941 -8638901 -6361204 -5292045 -1774353 3896017 6388897 4508034 3573667
37336 3573667 6185456 7947370 5608512 2510408 1867424 1056680 -2456083 -5158549
37328 -5158549 -3170426 632025 1136753 -821152 -699609 2000910 4027912 4452747 4846369
37319 4846369 4743281 2378706 -646000 -372488 3796730 8233691 9678050 7492619
37311 7492619 2384781 -3592847 -6917639 -6166669 -4648336 -6081339 -9365429 -11379070
37303 -11379070 -12451838 -13978743 -13070184 -6357007 1976526 3546434 -2115790 -6029868
$$ packed form
37360B624808M84369l269755j550890K430211K526756L18647J356861M021450
37352H942457K020850l454266m662407p94730K57109m192300o659732k483922
37344a1026941K388040K277697J069159L517692N670370K492880j880863r34367
37336C573667K611789J761914k338858l098104o42984q10744l512763k702466
37328e158549J988123L802451N04728j957905J21543K700519K027002M24835L93622
37319D846369j03088k364575l024706K73512M169218M436961J444359k185431
37311G492619n107838n977628l324792P50970J518333j433003l284090k013641
37303a1379070j072768j526905R08559O713177Q333533J569908n662224l914078
$$ plain form
37295 -6029868 -2351730 4079844 5707404 2049081 -1989943 -2933359 -325667 4628577
37287 4628577 8776722 8714042 5393210 3534955 4257364 2808346 -3267552 -8521149 -6717265
37278 -6717265 162253 4990994 4785536 1989580 -1253620 -4798253 -7499473 -7354818
37270 -7354818 -4679674 -1794896 49105 820583 189000 -1142433 -449093 2998889 4859978
37261 4859978 1194377 -4501278 -5164715 -634357 1631715 -2647607 -8615841 -9580521
37253 -9580521 -5793884 -2629708 -3061710 -5400577 -6782064 -5929043 -3248999 -346010
37245 -346010 1015327 844549 1213522 3533009 6271077 6443060 2917422 -2340964 -5707434
37236 -5707434 -4382578 1291921 7295527 8853906 4957616 -574558 -3113431 -1617062
$$ packed form
37295f029868L678138O431574J627560l658323m039024r43416K607692M954244
37287D628577M148145o2680l320832j858255P22409j449018o075898n253597J803884
37278f717265O879518M828741k05458k795956l243200l544633k701220J44655
37270g354818K675144K884778J844001P71478o31583j331433O93340L447982J861089
37261D859978l665601n695655o63437M530358K266072m279322n968234r64680
37253i580521L786637L164176m32002k338867j381487Q53021K680044K902989
37245c46010J361337j70778L68973K319487K738068J71983l525638n258386l366470
37236e707434J324856N674499O003606J558379l896290n532174k538873J496369
$$ plain form
37228 -1617062 1450203 3612016 4727484 6099189 8122642 9378424 8331256 5680635
37220 5680635 3953872 4221303 4524619 2891854 631123 422598 1916208 2113715 259351
37211 259351 -719669 1274758 4356794 5814326 6139361 7591540 10281393 12063497 11407847
37202 11407847 8355228 3604293 -1152021 -2903434 -30781 4858519 7236514 5772203
37194 5772203 2861704 395588 -1843257 -3222672 -1540161 2845087 5382116 2662085
37186 2662085 -2815291 -6048994 -5795282 -4294819 -2572517 -64935 1981879 1333480
37178 1333480 -683013 96208 4087201 6234767 3075599 -2008749 -3451793 -710469
37170 -710469 2192984 2229815 -547835 -4737346 -8257761 -8529278 -5074904 -1226540 -611836
$$ packed form
37228a617062L067265K161813J115468J371705K023453J255782j047168k650621
37220E680635j726763K67431L03316j632765k260731k08525J493610J97507j854364
37211B59351r79020J994427L082036J457532L25035J452179K689853J782104o55650
37202A1407847l052619m750935m756314j751413K872653M889300K377995j464311
37194E772203k910499k466116k238845j379415J682511M385248K537029k720031
37186B662085n477376l233703K53712J500463J722302K507582K046814o48399
37178A333480k016493P79221L990993K147566l159168n084348j443044K741324
37170g10469K903453L6831k777650m189511l520415k71517L454374L848364O14704
$$ plain form
37161 -611836 -2753998 -4652015 -5522169 -6778704 -8033442 -6722345 -2106510 3144082
37153 3144082 5932664 5374106 2596651 -42983 65743 3358339 6935411 7744281 6102102
37144 6102102 4105494 2182724 -30219 -1379239 -1438630 -3018872 -7724186 -10867346
37136 -10867346 -6812383 1623016 6053368 4826503 4554584 7812828 8041483 986159
37128 986159 -6649466 -6512345 -878568 1552057 -1712823 -5732950 -7129224 -7219550 -7030683
37119 -7030683 -5529259 -3229460 -2604578 -4177138 -5857320 -6384982 -6260071 -5481368 -3499185
37110 -3499185 -1189526 -45579 173889 448960 129522 -1545939 -2589678 -224077 4724457
37101 4724457 8220446 7436634 2628915 -4195989 -10027796 -11836064 -9757561 -7920906
$$ packed form
37161f11836k142162j898017q70154j256535j254738J311097M615835N250592
37153C144082K788582n58558k777455k639634J08726L292596L577072Q08870j642179
37144F102102j996608j922770k212943j349020n9391j580242m705314l143160
37136a0867346M054963Q435399M430352j226865k71919L258244K28655p055324
37128I86159p635625J37121N633777K430625l264880m020127j396274r0326J88867
37119g030683J501424K299799O24882j572560j680182n27662J24911P78703J982183
37110c499185K309659J143947K19468K75071l19438j675461j043739K365601M948534
37101D724457L495989p83812m807719o824904n831807j808268K078503J836655
$$ plain form
37093 -7920906 -9262944 -11259456 -9796725 -4972495 600645 6476667 12443485 14538373
37085 14538373 9550132 2386790 1793967 8120457 12176742 8084246 850678 -1908427
37077 -1908427 -243045 370060 -2314201 -5411210 -5789860 -3363976 -336027 809757
37069 809757 -538010 -1891392 -45240 4568584 7920680 7668499 6039442 5994551 6700281
37060 6700281 4922794 -212744 -5742494 -8020895 -6517165 -4304052 -4565975 -6681138
37052 -6681138 -7034803 -4222373 -1253867 -945789 -1556041 172284 3599679 5277328 4069158
37043 4069158 1696343 -568679 -2041299 -721221 4453355 10065490 11139902 7397301
37035 7397301 2989464 788856 723845 2428274 4975077 5284481 1796963 -1769335 -1874723
$$ packed form
37093g920906j342038j996512J462731M824230N573140N876022N966818K094888
37085A4538373m988241p163342n92823O326490M056285m092496p233568k759105
37077a908427J665382O13105k684261l097009l78650K425884L027949J145784
37069H09757j347767j353382J846152M613824L352096k52181j629057m4891P05730
37060F700281j777487n135538n529750k278401J503730K213113k61923k115163
37052f681138l53665K812430K968506L08078o10252J728325L427395J677649j208170
37043D069158k372815k265022j472620J320078N174576N612135J074412l742601
37035G397301m407837k200608o5011J704429K546803L09404l487518l566298j05388
$$ plain form
37026 -1874723 -2199903 -7901373 -14576127 -12394499 -1517347 6791501 6649000 4794412
37018 4794412 7345891 9689026 6031290 78024 -1738176 -466181 148069 2224727
37010 2224727 8422300 13295843 9994689 2233189 -383521 3021809 4581666 1520313
37002 1520313 -229231 2325475 3529134 -1163675 -7124240 -7252499 -1914712 2715037
36994 2715037 3396806 2471436 2795108 3607146 2358170 -863848 -2445408 321883 4969571
36985 4969571 6417139 3744025 1109450 1070950 1065509 -1325869 -3946437 -4372422 -4707068
36976 -4707068 -7623548 -10895467 -10867729 -8722229 -7925930 -7560722 -4024267 1781003 4711225
36967 4711225 2623704 -1547294 -4720755 -6131467 -5326072 -2400981 -9648 -557972
$$ packed form
37026a874723l25180n701470o674754K181628J0877152Q308848j42501j854588
37018D794412K551479K343135l657736n953266j816200J271995O14250K076658
37010B224727O197573M873543l301154p761500k616710L405330J559857l061353
37002A520313j749544K554706J203659m692809n960565j28259N337787M629749
36994B715037O81769r25370L23672Q12038j248976l222018j581560K767291M647688
36985D969571J447568k673114k634575l8500n441k391378k620568m25985l34646
36976d707068k916480l271919K7738K145500P96299L65208L536455N805270K930222
36967D711225k087521m170998l173461j410712Q05395K925091K391333n48324
$$ plain form
36959 -557972 -1589060 1464972 8063020 12769384 12848470 11114648 10825889 11970136 13030205
36950 13030205 12564140 8974555 2531060 -2719932 -3069119 -464663 569695 46714
36942 46714 1240560 3576660 3366719 1291605 1927610 5062923 4901026 -282131 -4938757
36933 -4938757 -5262157 -4293210 -4719926 -3695429 529618 3154098 -245828 -6148836 -8281266
36924 -8281266 -6767255 -6544118 -9352279 -12462240 -13566134 -12676164 -10620975 -8857719
36916 -8857719 -8977049 -9976135 -8704369 -5251033 -4080101 -6856699 -8560224 -4799472
36908 -4799472 1266762 4101239 3764840 3183934 1392714 -3728337 -8860829 -8809675 -5054156
36899 -5054156 -3478377 -4635969 -3922023 -1093375 -1175740 -4604502 -5110183 -779260 814808
$$ packed form
36959e57972j031088L054032O598048M706364P9086j733822k88759J144247J060069
36950A3030205m66065l589585o443495n250992l49187K604456J034358n22981
36942D6714J193846K336100k09941k075114O36005L135313j61897n183157m656626
36933d938757l23400R68947m26716J024497M225047K624480l399926n903008k132430
36924h281266J514011K23137k808161l109961j103894Q89970K055189J763256
36916h857719j19330r99086J271766L453336J170932k776598j703525L760752
36908d799472O066234K834477l36399n80906j791220n121051n132492N1154L755519
36899e054156J575779j157592P13946K828648q2365l428762n05681M330923J594068
$$ plain form
36890 814808 -5942379 -14422050 -13989359 -4855142 2556370 1742973 -3045245 -4666823 -2073035
36881 -2073035 874788 1610865 619833 -1166388 -3569910 -5799873 -6076408 -3610870 -102958
36872 -102958 1648724 485362 -2210499 -4070847 -3626189 -978768 2417660 4657479
36864 4657479 5127143 5440428 7342522 9559195 8739486 4462551 992343 1862265 4461197
36855 4461197 3195829 -2479343 -6721112 -5004917 -248617 1045038 -2785595 -6735882
36847 -6735882 -5814120 -1217738 1706875 628213 -931296 1342860 6469656 9186421
36839 9186421 6467679 788264 -3352380 -3949731 -1779610 1496789 3871083 3521082
36831 3521082 1036690 -35439 2860634 7502411 9304628 7093060 4026654 2726215
$$ packed form
36890H14808o757187q479671M32691R134217P411512q13397m788218j621578K593788
36881b073035K947823P36077r91032j786221k403522k229963k76535K465538L507912
36872a02958J751682j163362k695861j860348M44658K647421L396428K239819
36864D657479M69664L13285J902094K216673q19709m276935l470208Q69922K598932
36855D461197j265368n675172m241769J716195M756300J293655l830633l950287
36847f735882R21762M596382K924613j078662j559509K274156N126796K716765
36839I186421k718742n679415m140644n97351K170121L276399K374294l50001
36831C521082k484392j072129K896073M641777J802217k211568l066406j300439
$$ plain form
36823 2726215 2196392 663828 -889895 -292944 1659276 1103745 -4083810 -10854849 -13823523
36814 -13823523 -11171819 -6235914 -2964109 -1584619 -38702 2007594 3088561 3075232
36806 3075232 3348576 3693370 2223018 -611397 -1181824 2193033 6102397 6653844 4965574
36797 4965574 4929430 7111353 8399464 7046909 4672787 3166788 2544948 2342557 2608150
36788 2608150 2821952 1938541 247986 -598877 -125515 37326 -1461442 -3748154 -5026305
36779 -5026305 -4825871 -4171862 -4114777 -4635714 -4768673 -3734468 -2079180 -1272927 -1956508
36770 -1956508 -3330193 -4501401 -5187410 -4732869 -2400874 403367 631716 -1944252 -3411490
36761 -3411490 -1387524 896268 -59972 -1488628 1223695 5314055 3136488 -5354826
$$ packed form
36823B726215n29823j532564j553723N96951J952220n55531n187555o771039k968674
36814a3823523K651704M935905L271805J379490J545917K046296J080967j3329
36806C075232K73344L44794j470352k834415n70427L374857L909364N51447j688270
36797D965574l6144K181923J288111j352555k374122j505999o21840k02391K65593
36788B608150K13802q83411j690555q46863M73362J62841j498768k286712j278151
36779e026305K00434O54009N7085n20937j32959J034205J655288Q06253o83581
36770a956508j373685j171208o86009M54541K331995K804241K28349k575968j467238
36761c411490K023966K283792r56240j428656K712323M090360k177567q491314
$$ plain form
36753 -5354826 -10152233 -4656023 4732346 7627258 3487297 37314 753248 1181209
36745 1181209 -2357748 -6865837 -7536376 -4046005 561453 4149954 5994319 5194615
$$ packed form
36753e354826m797407N496210R388369K894912m139961l449983P15934M27961
36745A181209l538957m508089o70539L490371M607458L588501J844365p99704
$$ [...]
##END NTUPLES=NMR SPECTRUM
##END=
