##TITLE=31Pdec_SR115_k
 DMSO-d6, 24 sc
 4.7.2022
##JCAMPDX= 6.0         $$ Bruker NMR JCAMP-DX V2.0
##DATA TYPE= NMR SPECTRUM
##DATA CLASS= NTUPLES
##ORIGIN= UXNMR, Bruker Analytische Messtechnik GmbH
##OWNER= root
$$ XWIN-NMR		Version 3.5
$$ Mon Jul  4 14:49:22 2022 Russian Standard Time (UT+4h)  she@DPX200
##.OBSERVE FREQUENCY= 81.013821
##.OBSERVE NUCLEUS= ^31P
##.ACQUISITION MODE= SIMULTANEOUS
##.ACQUISITION SCHEME= undefined
##.AVERAGES= 24
##.DIGITISER RES= 16
##SPECTROMETER/DATA SYSTEM= spect
##.PULSE SEQUENCE= zgpg30
##.SOLVENT NAME= DMSO
##.SHIFT REFERENCE= (INTERNAL, DMSO, 0, 248.564)
##AUDIT TRAIL= $$ (NUMBER, WHEN, WHO, WHERE, WHAT)
$$ ##TITLE= Audit trail, XWIN-NMR		Version 3.5
$$ ##JCAMPDX= 5.01
$$ ##ORIGIN= Bruker BioSpin GmbH
$$ ##OWNER= she
$$ F:/spectra/data/she/nmr/P31/1/pdata/1/auditp.txt
$$ ##AUDIT TRAIL=  $$ (NUMBER, WHEN, WHO, WHERE, WHAT)
(   1,<2022-07-04 14:48:19.09 +0400>,<she>,<DPX200>,
      <created by zg, POWCHK disabled, PULCHK disabled
       configuration hash MD5:
       00 E9 B6 7A A2 85 ED C7 34 08 36 98 17 FE 4E 26
       data hash MD5: 32K
       9E E3 68 EC B1 A1 CE 5B BE 2C 22 85 79 EF A7 38>)
(   2,<2022-07-04 14:48:22.53 +0400>,<she>,<DPX200>,
      <Start of raw data processing
       efp BC_mod = 2 LB = 1 FT_mod = 6 PKNL = 1 PHC0 = -9960.598 PHC1 = 200.656 SI = 64K 
       data hash MD5: 64K
       6E 87 FC 2C 65 0A 3C 83 66 15 E7 5F 6A 96 C6 46>)
(   3,<2022-07-04 14:48:51.06 +0400>,<she>,<DPX200>,
      <pk PHC0 = -170.337 PHC1 = 391.0003 
       data hash MD5: 64K
       F2 99 9E F1 AA 95 5C E9 35 8A 62 88 75 3E C1 4C>)
(   4,<2022-07-04 14:48:53.78 +0400>,<she>,<DPX200>,
      <abs ABSG = 5 
       data hash MD5: 64K
       C5 EB A4 97 6E 87 B6 4A 40 BC 7C F1 6D 8E CD BE>)
$$ ##END=
$$ 
$$ hash MD5
$$ E1 1B F8 2F F3 B1 44 AE C2 BC B7 5E E4 3C D1 B3
##$RELAX= 
##$RELAX= 
##$RELAX= 
##$RELAX= 
##$RELAX= 
##$RELAX= 
##$RELAX= 
##$RELAX= 
$$ Bruker specific parameters
$$ --------------------------
##$DU= <F:/spectra>
##$EXPNO= 1
##$NAME= <P31>
##$PROCNO= 1
##$TYPE= <nmr>
##$USER= <she>
##$AMP= (0..31)
100 100 100 100 100 100 100 100 100 100 100 100 100 100 100 100 100 100 
100 100 100 100 100 100 100 100 100 100 100 100 100 100 
##$AQSEQ= 0
##$AQ_mod= 1
##$AUNM= <au_zg>
##$AUTOPOS= <>
##$BF1= 81.014009
##$BF2= 200.13
##$BF3= 200.13
##$BF4= 200.13
##$BF5= 200.13
##$BF6= 200.13
##$BF7= 200.13
##$BF8= 200.13
##$BYTORDA= 1
##$CFDGTYP= 0
##$CFRGTYP= 5
##$CHEMSTR= <none>
##$CNST= (0..31)
1 1 145 1 1 1 1 1 1 1 1 1 1 1 1 1 1 1 1 1 1 1 1 1 1 1 1 1 1 1 1 1 
##$CPDPRG= <waltz16>
##$CPDPRG1= <>
##$CPDPRG2= <waltz16>
##$CPDPRG3= <>
##$CPDPRG4= <mlev>
##$CPDPRG5= <mlev>
##$CPDPRG6= <mlev>
##$CPDPRG7= <mlev>
##$CPDPRG8= <mlev>
##$CPDPRGB= <>
##$CPDPRGT= <>
##$D= (0..31)
0 1 0 0 0 0 0 0 0 0 0 0.03 2e-05 3e-06 0 0 0 0 0 0 0 0 0 0 0 0 0 0 0 0 
0 0 
##$DATE= 1656931698
##$DBL= (0..7)
120 120 120 11 120 120 24 19 
##$DBP= (0..7)
150 150 150 150 150 150 150 150 
##$DBP07= 0
##$DBPNAM0= <>
##$DBPNAM1= <>
##$DBPNAM2= <>
$$ [...]
##$SUBNAM3= <"">
##$SUBNAM4= <"">
##$SUBNAM5= <"">
##$SUBNAM6= <"">
##$SUBNAM7= <"">
##$SUBNAM8= <"">
##$SUBNAM9= <"">
##$SW= 501.771253377433
##$SWIBOX= (0..15)
0 1 3 0 0 0 0 0 0 0 0 0 0 0 0 0 
##$SW_h= 40650.406504065
##$TD= 32768
##$TD0= 1
##$TE= 0
##$TE2= 300
##$TE3= 300
##$TEG= 300
##$TL= (0..7)
0 120 53 12 22 120 120 120 
##$TP= (0..7)
150 150 150 150 150 150 150 150 
##$TP07= 0
##$TPNAME0= <>
##$TPNAME1= <>
##$TPNAME2= <>
##$TPNAME3= <>
##$TPNAME4= <>
##$TPNAME5= <>
##$TPNAME6= <>
##$TPNAME7= <>
##$TPOAL= (0..7)
0.5 0.5 0.5 0.5 0.5 0.5 0.5 0.5 
##$TPOFFS= (0..7)
0 0 0 0 0 0 0 0 
##$TUNHIN= 0
##$TUNHOUT= 0
##$TUNXOUT= 0
##$USERA1= <user>
##$USERA2= <user>
##$USERA3= <user>
##$USERA4= <user>
##$USERA5= <user>
##$V9= 5
##$VALIST= <valist>
##$VCLIST= <CCCCCCCCCCCCCCC>
##$VD= 0
##$VDLIST= <DDDDDDDDDDDDDDD>
##$VPLIST= <PPPPPPPPPPPPPPP>
##$VTLIST= <TTTTTTTTTTTTTTT>
##$WBST= 1024
##$WBSW= 4
##$XGAIN= (0..3)
0 0 0 0 
##$XL= 0
##$YL= 0
##$YMAX_a= 1899
##$YMIN_a= -1708
##$ZGOPTNS= <>
##$ZL1= 120
##$ZL2= 120
##$ZL3= 120
##$ZL4= 120
##$ABSF1= 248.5645
##$ABSF2= -253.2056
##$ABSG= 5
##$ABSL= 3
##$ALPHA= 0
##$AQORDER= 0
##$ASSFAC= 0
##$ASSFACI= 0
##$ASSFACX= 0
##$ASSWID= 0
##$AUNMP= <proc_1d>
##$AZFE= 0.1
##$AZFW= 0.5
##$BCFW= 0
##$BC_mod= 2
##$BYTORDP= 0
##$COROFFS= 0
##$CY= -3
##$DATMOD= 1
##$DC= 0
##$DFILT= <>
##$DTYPP= 0
##$F1P= 0
##$F2P= 0
##$FCOR= 1
##$FTSIZE= 65536
##$FT_mod= 6
##$GAMMA= 0
##$GB= 0
##$INTBC= 1
##$INTSCL= 5.30512e-09
##$ISEN= 30
##$LB= 1
##$LEV0= 0
##$LPBIN= 0
##$MAXI= 10000
##$MC2= 0
##$MEAN= 0
##$ME_mod= 0
##$MI= 50
##$NCOEF= 0
##$NC_proc= -8
##$NLEV= 6
##$NOISF1= 182.463
##$NOISF2= 159.3651
##$NSP= 0
##$NTH_PI= 0
##$NZP= 0
##$OFFSET= 248.5645
##$PC= 4
##$PHC0= -10130.93
##$PHC1= 591.6563
##$PH_mod= 1
##$PKNL= yes
##$PPARMOD= 0
##$PSCAL= 0
##$PSIGN= 0
##$REVERSE= no
##$SF= 81.014009
##$SI= 65536
##$SIGF1= 159.3651
##$SIGF2= -187.1042
##$SINO= 113.3802
##$SIOLD= 16384
##$SREGLST= <1H.CDCl3>
##$SSB= 0
##$STSI= 65536
##$STSR= 0
##$SW_p= 40650.406504065
##$SYMM= 0
##$S_DEV= 0
##$TDeff= 32768
##$TDoff= 0
##$TI= <>
##$TILT= no
##$TM1= 0
##$TM2= 0
##$TOPLEV= 0
##$USERP1= <user>
##$USERP2= <user>
##$USERP3= <user>
##$USERP4= <user>
##$USERP5= <user>
##$WDW= 1
##$XDIM= 65536
##$YMAX_p= 578352236
##$YMIN_p= -24611473
$$ End of Bruker specific parameters
$$ ---------------------------------
##NTUPLES= NMR SPECTRUM
##VAR_NAME=  FREQUENCY,     SPECTRUM/REAL,   SPECTRUM/IMAG
##SYMBOL=    X,             R,               I
##VAR_TYPE=  INDEPENDENT,   DEPENDENT,       DEPENDENT
##VAR_FORM=  AFFN,          ASDF,            ASDF
##VAR_DIM=   65536,         65536,           65536
##UNITS=     HZ,            ARBITRARY UNITS, ARBITRARY UNITS
##FACTOR=    0.620285442955139, 1,           1
##FIRST=     20137.2065510759, 0,            0
##LAST=      -20513.1999529892, 0,           0
##MIN=       -20513.1999529892, -24611473,   0
##MAX=       20137.2065510759, 578352236,    0
$$ Real data points
##PAGE= N=1
##DATA TABLE= (X++(R..R)), XYDATA
$$ [...]
43795 8760480 10338691 12975612 15607686 14238555 9167094 4540505 2455915 1858105
43787 1858105 1868462 2516800 3280587 3798287 4884078 6676335 7453355 6275577 4721928
43778 4721928 3886366 1925106 -2922677 -8738822 -11708129 -10139219 -5230595 377870
43770 377870 3662231 3094971 653359 -321956 176799 -672165 -3017586 -3621724 -1644823
43761 -1644823 -231732 -569491 353341 3526143 4992272 2569958 9127 262234 152218
43752 152218 -3022382 -4987925 -1386167 3110464 508673 -7952778 -12797882 -9288678
43744 -9288678 -2426464 1392221 1480068 325281 -834220 -1698176 -1421778 643999 4061041
43735 4061041 7346670 8085477 4553166 -1221963 -4249352 -2536050 280223 519082
43727 519082 -655297 -971666 -1851598 -5203742 -8782414 -9556278 -8798944 -8951756 -8454984
43718 -8454984 -5039610 -1078126 326091 1581190 6173795 10711987 9160441 3219058
43710 3219058 165189 1194233 577422 -3430762 -5849622 -4580352 -3910158 -5619569
43702 -5619569 -4855822 1012040 6452101 5496690 -19653 -4369645 -5439942 -4332701
43694 -4332701 -1811856 872142 1384578 111596 931132 4917754 7221379 3962146
43686 3962146 -1420039 -2867123 155695 3309497 3926501 3094042 2784021 4033576 6707798
43677 6707798 8844779 7879352 4273523 1764891 2352427 3624607 2769761 293974 -2042891
43668 -2042891 -3626523 -3327846 594788 6210953 7716539 3131881 -1776987 -1564008
43660 -1564008 817670 -577574 -4491113 -4441817 555693 4225209 2422287 -1754349
43652 -1754349 -3654712 -2751892 -752598 1415666 2306590 -422018 -6045581 -9444277
43644 -9444277 -7079104 -2176178 -490035 -2338697 -2765777 595941 3915544 2946788
43636 2946788 -798286 -2543510 -1198480 -325357 -2247752 -4614177 -4275335 -1907225
43628 -1907225 -328829 91187 1334606 3610356 4456922 2625760 332275 232393 1839071
43619 1839071 2567718 1348786 -526445 -1879635 -3202880 -4977330 -5672965 -3237536
43611 -3237536 1360124 4173892 3271135 1856420 3862516 7712541 8164331 4177201
43603 4177201 603244 944137 2886750 3334614 3570674 5860886 8384686 7768543 4342260
43594 4342260 1001515 -1140247 -2396494 -2048273 42696 1632562 1589698 2482708 5711218
43585 5711218 7451438 4416193 7775 -1365160 -2332529 -7209732 -11861395 -8549032
43577 -8549032 523213 4955602 1828536 -1034019 631265 1040706 -3654979 -7398514
43569 -7398514 -4616749 149411 373005 -1912499 -1629712 -740070 -4055736 -9046805 -8774864
43560 -8774864 -3197246 421560 -1760581 -5381531 -4545545 1182873 7119206 8045501
43552 8045501 2721897 -4374003 -7143983 -4993063 -3209999 -4823563 -6170616 -3315693
43544 -3315693 1432311 3371370 2196650 790364 357191 832575 3126804 6876887
43536 6876887 8808264 7160909 4669754 3517246 1238978 -3963345 -8057155 -6814877
43528 -6814877 -3014739 -2165381 -4143383 -4963165 -3819238 -2198989 923004 6203406
43520 6203406 9139537 5742889 721787 1787365 7295715 8401211 3162880 -726093
43512 -726093 1535214 5514805 6274548 5304087 5141815 4197046 1322795 -273912 1717116
43503 1717116 4196518 3708589 2026235 2487245 4159373 3927702 1907219 911072 2337305
43494 2337305 5703565 10394173 14847571 15828944 11885566 6503665 4681445 6690410
43486 6690410 7915214 4997659 -226073 -3629192 -3694694 -1945706 472599 4153963
43478 4153963 8636053 10718165 8230172 4140981 3266586 5143380 4464902 -605904
43470 -605904 -5347291 -5639754 -3294238 -1263321 1422787 5751272 8536162 7402205
43462 7402205 5787152 7083999 7714513 2872409 -4212730 -6530319 -4355119 -3775705
43454 -3775705 -5844956 -6080482 -4067963 -4142335 -6004502 -4379428 109619 -474528 -8319954
43445 -8319954 -14369766 -10852479 -1765664 4417548 5738132 4738238 1571639 -4159620
43437 -4159620 -8823783 -8321409 -3849131 348189 2460038 2939474 2072863 985558 1646170
43428 1646170 3019583 1321287 -3134135 -4545501 -713930 2217455 -1029862 -6501102
43420 -6501102 -7702998 -5442892 -4182172 -3354015 -384293 1295052 -3567439 -11486294
43412 -11486294 -12985945 -6103166 1062996 2438600 936650 1081756 1685378 -244936
43404 -244936 -3299197 -3790101 -1518045 7293 -1889601 -6069482 -8613987 -6513684
43396 -6513684 -1047474 3143024 3259473 1003130 -1236728 -3862455 -7033921 -7694931
43388 -7694931 -4146951 -577680 -1295140 -2879076 848923 7337955 7145405 -1839848
43380 -1839848 -10277059 -10268327 -4974884 -1467464 -786831 -360394 -634436 -2929957 -4536547
43371 -4536547 -2319914 1234206 1457960 -833211 -819776 2419875 5198631 5839111 6250551
43362 6250551 6658913 4582053 546596 -460571 4127270 10236443 12717475 11784600
43354 11784600 10774378 10329137 8635713 5866640 4515830 5509518 6947212 6973738 5643776
43345 5643776 3627256 1092187 -1461551 -2778648 -2117664 -187506 1602564 2321869
43337 2321869 1990568 1550337 2235274 4224253 6020491 5800035 3162734 -866084 -4822267
43328 -4822267 -7129617 -6666457 -4358797 -3089595 -4320157 -5951115 -5617151 -4637527 -5496588
43319 -5496588 -6489722 -3364180 3350151 7498678 5752799 2599441 3794028 8244515
43311 8244515 10225476 7404264 2770218 -134202 -377539 1253075 3302613 4194523
43303 4194523 3936891 4461607 6397612 7185670 4856098 1693186 869868 1199204 -776639
43294 -776639 -4569856 -5960638 -3281601 437987 1944322 1085144 -575029 -1556893 -901097
43285 -901097 635391 522390 -1794125 -2872237 -649120 612070 -3748520 -9840170
43277 -9840170 -9451171 -2884136 540640 -3691555 -9153690 -9272429 -6270998 -4597659
43269 -4597659 -2893298 986184 3162796 -158423 -4225492 -1937527 4185367 5129059
43261 5129059 -357539 -3578849 678222 6727121 7436055 4461011 3945060 6333125
43253 6333125 6356254 1635583 -3928320 -5960095 -4954174 -3966906 -3531964 -1915961 279097
43244 279097 -523249 -5142124 -8211989 -4278631 3765245 6918091 1639794 -5106305
43236 -5106305 -4814561 1932026 7166074 5745824 201893 -3821104 -3715730 -1186089
43228 -1186089 519009 -58928 -1409213 -1310968 -92541 -145213 -1918030 -2646282 -269306
43219 -269306 3388280 4855128 2824878 -1429515 -5579192 -7023850 -4341651 560318
43211 560318 3695876 3510251 1866200 -81068 -3324498 -6890846 -6911716 -2912083 -629912
43202 -629912 -4121475 -8744495 -7464937 -1448076 1908428 221435 -1174740 1762847
43194 1762847 6083672 7201000 5394739 4149049 4808389 5598757 4755931 2736585 1363588
43185 1363588 1332404 1071644 -884066 -2706847 -1045818 3323784 5155962 2076334 -1532319
43176 -1532319 -1166270 1240537 1901658 2447162 6312307 10619885 9368686 3904945 2101476
43167 2101476 5896742 7355152 223649 -10873867 -16708590 -14185601 -7158425 -706726
43159 -706726 1562513 -1873153 -8289875 -11542443 -8589714 -3179115 -242042 603378
43151 603378 2466677 4859030 4594415 1630888 -631145 -682411 -504081 -1528407 -2714045
43142 -2714045 -3544575 -5523414 -8901897 -10490537 -7134441 -220299 5208607 5433123
43134 5433123 1076471 -4093723 -6130046 -3461390 1696882 4573804 2263183 -2707734
43126 -2707734 -4864433 -2327552 1136177 1620402 161150 61058 1364259 1534113 403123
43117 403123 204679 741688 -1007489 -5364875 -8198638 -6596804 -2728600 13377 1242033
43108 1242033 1629240 353639 -2460500 -3951562 -2549539 -1019581 -2083850 -3728853
43100 -3728853 -2499178 1131196 4381232 6380195 6780027 3397668 -3611527 -8086914
43092 -8086914 -4596755 2874675 5371337 1085296 -3553450 -4426077 -4100981 -4725946 -3857149
43083 -3857149 -279462 1867558 -1360651 -7771197 -11782865 -10566471 -5584623 -592590
43075 -592590 682965 -2368936 -5614107 -4386292 514842 4352229 5587848 6900257
43067 6900257 8912911 8414213 4340254 300613 -1174485 -2274422 -5200221 -7955532
43059 -7955532 -7615243 -4364139 53217 4640877 8036806 8615710 7477605 7690333 9057762
43050 9057762 7823520 3183604 -661910 -1051143 -503087 -1397640 -2265497 -2289256 -3903028
43041 -3903028 -7178675 -7276179 -2157430 2447031 1094135 -3238541 -4830526 -4202890 -4715276
43032 -4715276 -4606784 -502169 4126547 2737570 -3238707 -5584977 -1640790 2506383
43024 2506383 2307986 643982 1009656 1529961 -573953 -3610430 -4488953 -3719730 -3797739
43015 -3797739 -4965053 -5551581 -4908727 -3655906 -2118476 -227173 1755249 3333012
43007 3333012 3979368 3219826 1634924 1365186 3786433 6871208 6982729 3478507 -443634
42998 -443634 -1747576 -547470 1162591 1935848 1581713 917382 1140727 2352697 2899873
42989 2899873 1440353 -803895 -1394215 160508 2165751 3125251 2608795 311432 -3655461
42980 -3655461 -7663682 -9680662 -9637986 -9303606 -9923271 -11176972 -12010544 -11312015 -8488493
42971 -8488493 -4590574 -1898957 -1230095 -1085337 -699836 -1608150 -4037601 -4478085 -371550
42962 -371550 4935966 6343762 4763880 5690749 10200049 12697555 9027329 2309979
42954 2309979 -1563118 -864243 1910098 4257445 5452829 5765363 5914276 6408206 6505313
42945 6505313 5057820 2797582 1926165 2859159 3481496 2403453 648437 -982566 -3692651
42936 -3692651 -7929367 -10899643 -9477123 -4871586 -2145982 -4726571 -10405370 -13171674
42928 -13171674 -9069910 -601392 5061214 3302018 -2683482 -5262505 -974831 5959240
42920 5959240 9057229 6533659 1893100 -667984 144577 2789775 4919274 5274094
42912 5274094 4316571 3286133 2901786 3263864 4292192 5237753 4522840 1793746 -329493
42903 -329493 1109803 4828041 6004135 2556993 -1935163 -3446191 -3127124 -4664594
42895 -4664594 -7661102 -7843267 -4089097 -957752 -2010741 -4014917 -1587427 4229691
42887 4229691 6747594 3026463 -2340686 -4593088 -5295105 -7872972 -10560071 -9287387
42879 -9287387 -5557621 -5023813 -8206544 -9069614 -4655197 -142522 -871102 -4324243 -4709632
42870 -4709632 -1895576 -396222 -1379114 -1083341 2886117 7950169 10128551 8558563
42862 8558563 5663192 4266231 4779979 4810182 2431371 -179304 1164387 6372905 10382653
42853 10382653 10188760 8396839 7317952 4405132 -2242496 -8398507 -9358419 -7420155
42845 -7420155 -7387938 -7725250 -3623319 3088950 5307201 1569576 -2327136 -3146778 -3760651
42836 -3760651 -5586397 -5590654 -3416392 -3684799 -7430713 -8523677 -3497052 1579354 40907
42827 40907 -4805153 -4793421 988481 5960233 5890301 2736293 -445847 -2751240 -3314439
42818 -3314439 -593279 4934619 10026493 11539170 8938624 4507386 2037013 3804673
42810 3804673 7545567 8383947 5182805 2287628 2959456 4420920 2770280 -291639
42802 -291639 -362028 1928584 1479959 -3119123 -6998016 -5888358 -1761187 447861 -803885
42793 -803885 -2790300 -2698644 -705092 1094157 1693736 2295971 4215191 6513521 7088038
42784 7088038 5865841 5005600 5556171 6003975 4945562 3065800 1373651 -301556 -1696580
42775 -1696580 -1342069 863821 2592067 2524958 2435033 3490478 3139537 -968304 -6034416
42766 -6034416 -7198112 -4620084 -3278796 -5536630 -7803662 -5925815 -988881 2275299
42758 2275299 1435344 -1167669 -1757425 274323 2067507 1689648 1353706 4362464 9577322
42749 9577322 11938613 9092511 4472557 2407957 3081688 4277203 5245258 6092202 5589163
42740 5589163 2718998 -888858 -2609519 -1872709 154001 2244715 2910837 967351
42732 967351 -1777954 -1452026 1760045 2073738 -3634492 -9681139 -8646045 -1621583 4326279
42723 4326279 6581010 8208676 10014595 8756249 4022626 251958 12114 692758
42715 692758 -259895 -1808652 -2848781 -4331102 -5806463 -4754476 -1817868 -1830128 -6466668
42706 -6466668 -10325863 -8114026 -2071774 1718195 1456657 129087 260892 1966726
42698 1966726 4468781 6237799 5158807 1385098 -1664502 -1693583 -795925 -1738214 -3682264
42689 -3682264 -4933894 -6996867 -11274859 -13991649 -10105980 -1678497 3300601 1201062
42681 1201062 -3019323 -3274922 375416 3994214 5405185 4630033 1551873 -3337796
42673 -3337796 -7136395 -6595167 -1985471 2974219 5059862 4103816 1839946 -279868
42665 -279868 -1607823 -1630103 84981 2877141 4464561 2634784 -1845027 -4924746 -3249989
42656 -3249989 1854999 5843676 6372669 5554090 6258438 8023719 8155003 5728382 2502986
42647 2502986 91706 -1773006 -3532989 -4103272 -2432016 87404 732330 -835637
42639 -835637 -1836625 -372556 1434620 218218 -3569205 -5846568 -4347418 -1352059
42631 -1352059 133640 540598 1838216 3125133 1350029 -3586259 -7496152 -6977912
42623 -6977912 -3690673 -1686973 -1797466 -977862 2954516 8077436 10651193 9302155
42615 9302155 5865046 2842114 1207497 504240 33605 -362984 -217797 987542 2883374
42606 2883374 4113660 3704489 2167563 478373 -1511808 -4300475 -6679318 -6382274
42598 -6382274 -3222717 234189 1799947 1560459 -16543 -3098167 -5910681 -4349008
42590 -4349008 2380988 8074424 6072783 -1539963 -6263579 -4652742 -1958832 -2976571
42582 -2976571 -5107074 -4070828 -1661689 -2479334 -5694546 -5865232 -1339385 3226426
42574 3226426 3469679 537351 -1544277 -817457 1629789 3576831 3431464 1445775 -319608
42565 -319608 -393678 43641 -826776 -2058624 -1186935 1260254 1655231 -1561031 -5544214
42556 -5544214 -7077749 -6175758 -4231779 -1515600 1333264 2081085 127769 -1182162
42548 -1182162 1093484 4405135 3972125 431300 -337686 4152645 8889386 8217199 3414207
42539 3414207 76864 147999 636638 -379900 -865281 762450 1934580 -467879 -4816832
42530 -4816832 -6462898 -4237947 -1829078 -2000357 -2743095 -1181544 1425773 1926617 1081050
42521 1081050 2995311 8346449 12055887 9723901 3550107 -935257 -2166177 -3155274
42513 -3155274 -5405678 -5925434 -1726956 5078381 8952641 7139885 2595263 470479
42505 470479 2523141 5556091 5266651 1118308 -3174781 -3940543 -1355986 1699288 3645114
42496 3645114 5408003 7578261 8250774 5242541 -172366 -3615050 -2508198 444827
42488 444827 240569 -3978706 -7240434 -4757237 1636145 5323771 3073057 -1176905
42480 -1176905 -1778464 1572980 4344279 3410287 225718 -2090735 -2549035 -2378117 -2622859
42471 -2622859 -2532316 -164878 5176285 10812368 12175351 7869142 2331779 1343396 5228987
42462 5228987 8853763 8401617 5463294 3648783 3957911 5236515 6851924 8394479
42454 8394479 8238393 5303747 1765683 1227823 3811356 5437452 3026227 -1504443
42446 -1504443 -4071680 -3965137 -4199649 -6373746 -7716851 -4873648 1003460 5493568
42438 5493568 6723033 6968441 7989471 8229331 6607642 5719087 7682396 9302919 6138120
42429 6138120 172839 -2022352 941133 2967484 -336145 -5452883 -6877903 -4622046
42421 -4622046 -1984306 239211 2710230 3692357 1342558 -1914515 -2140524 172062
42413 172062 1454460 1157781 1464003 1663494 -1428481 -6908736 -9315128 -6459780 -2708899
42404 -2708899 -2039537 -2427571 -396323 2767655 3473419 1863832 985484 1176838 -502182
42395 -502182 -5090758 -9343535 -9705407 -6726264 -4154095 -4296567 -5318256 -3577565 1538164
42386 1538164 6174069 6414372 3229887 1095477 2003726 3386250 2551073 556836 87878
42377 87878 1416706 2508407 2140571 1156896 996604 2143739 3847272 4814881 4498075
42368 4498075 3796277 3926564 4899722 6091413 7658643 9658421 10346784 7838823 3477123
42359 3477123 918050 1525300 3357105 5025967 7205953 9411368 9094135 5893439
42351 5893439 3281417 3467751 3885961 1652170 -1626264 -3040385 -3493193 -5320692 -7083807
42342 -7083807 -5746881 -2751801 -2512528 -4999514 -5297398 -1655466 1218880 -654008
42334 -654008 -4390845 -4802333 -2008389 -321563 -1078676 -1043684 1694465 4063854 2264572
42325 2264572 -2621168 -5966480 -5684669 -4123091 -3558470 -2825917 -341656 2002358 1326906
42316 1326906 -1007576 -651508 3056663 5719699 4495713 2104762 1725463 1425237 -2483868
42307 -2483868 -8621605 -11252466 -7404576 -161005 5070974 5245108 1048473 -4041529
42299 -4041529 -6229532 -4894186 -3394647 -4889559 -8164981 -9373673 -6927293 -2678860
42291 -2678860 707481 1423944 -1240777 -5761533 -8362767 -6709730 -2913231 -615277
42283 -615277 -307018 -154107 96902 -511035 -1115045 -319164 279260 -1901928 -5235121
42274 -5235121 -5195588 -1122795 2747495 3527532 2410445 395166 -3652345 -8854495 -11047620
42265 -11047620 -8312728 -3835766 -784784 1602499 4054003 3822801 -708989 -5443606
42257 -5443606 -5168569 -536273 3517426 4210979 1963610 -2545732 -7770161 -9718644
42249 -9718644 -6198459 -1552713 -1876704 -6089678 -7491073 -4386189 -2710159 -6129780
42241 -6129780 -9820602 -8016475 -2730233 210524 315029 1697823 5055746 6659976
42233 6659976 5342617 4484466 5542731 5175806 1759761 -250378 2875443 6679024
42225 6679024 3896741 -4372028 -9366643 -6761896 -1707714 -14217 -546629 -28942
42217 -28942 134256 -2624072 -5546755 -4092008 -5621 733773 -2488897 -3853484 -346149
42208 -346149 4072327 5307274 4431850 3498899 1373668 -2495638 -4591769 -2235259 1123902
42199 1123902 240130 -4321661 -7342151 -6317837 -3452925 -1181481 179006 541998
42191 541998 -487274 -2081623 -3083933 -4238562 -6584939 -8183085 -6128868 -1792387
42183 -1792387 74716 -1708643 -2821452 -221294 2932560 1869202 -3108890 -7584360
42175 -7584360 -8734167 -7175306 -4640667 -2787235 -3218872 -5672217 -6903881 -4463889
42167 -4463889 -1062702 -1633425 -5923759 -8076379 -5007241 -1256674 -2581094 -7652691
42159 -7652691 -10022600 -6899862 -2019697 9986 -1302242 -3513452 -4452220 -3318625
42151 -3318625 -886121 626822 -102633 -1023199 936505 4857217 6512497 4828942
42143 4828942 3616518 4949219 5172845 1017093 -4066968 -4561409 -1501458 -977307 -4830373
42134 -4830373 -8104834 -6279884 -644596 4582460 6925698 6361037 4358009 3188427
42126 3188427 3741785 3692189 433546 -4306913 -6063823 -3899379 -1413823 -1151386 -1978814
42117 -1978814 -2728295 -4055019 -5291084 -3999897 -880145 -757721 -5625143 -10383174
42109 -10383174 -9058494 -2473669 3597237 5446619 3401981 -771030 -4804217 -5993137
42101 -5993137 -3795448 -1313678 -1558290 -3565188 -4502299 -3675633 -1793818 1513266 6066740
42092 6066740 8878611 7291435 3262046 1077165 1866914 3798513 6435684 10641512
42084 10641512 14504479 13842930 7891813 1271817 -1058549 1232630 4605539 5527736
42076 5527736 3150956 -334793 -1763121 -395897 1319422 1398957 1107838 2136979 2875090
42067 2875090 661955 -3316553 -4885136 -2379937 1810412 5014217 6456370 5746022
42059 5746022 2624617 -1125451 -2516716 -1004018 1103859 2295424 3192550 3755736
42051 3755736 2420177 -562752 -1898442 356718 3212867 2219125 -2255980 -4593829
42043 -4593829 -296335 8383297 14151520 12170108 5210168 385671 1102655 4115021
42035 4115021 4944911 3568236 2876118 3791131 4758319 4759323 3980890 2310195 -235074
42026 -235074 -2347202 -3114280 -3746709 -4943232 -4094512 1108269 7253969 7952803 2312825
42017 2312825 -3534986 -4374277 -1536279 842688 1595381 2238807 3426889 4231062 3878974
42008 3878974 2538018 804445 -908280 -2713918 -4676104 -5581689 -3806354 -489815
42000 -489815 448350 -2371042 -5022577 -3965425 -1722609 -2553445 -5152259 -5410140 -4355740
41991 -4355740 -6108117 -8666645 -5101903 4649601 11396788 9325531 3734505 1999424
41983 1999424 3522093 3930508 3477633 4931031 7189396 7218765 5565311 4578945 3761670
41974 3761670 1956130 1455180 4469438 7720122 6203076 862065 -2812158 -2631718
41966 -2631718 -1013456 439285 2231174 3352339 1765097 -1103645 -1039057 3023388
41958 3023388 7442191 8641863 6269165 1909385 -2009951 -2709902 -44537 1906985
41950 1906985 45281 -2345816 -103298 5267065 7385401 4824641 2665988 3676551
41942 3676551 4642313 3189055 1670301 1531989 53639 -3584635 -4649568 128497
41934 128497 6517170 8623035 6881062 5277186 4251970 2059683 392870 2318936
41926 2318936 5958818 6360108 3462903 2536347 6025930 10088957 10669881 8637445 6898374
41917 6898374 5901577 4267252 1441740 -2151953 -5749668 -7783299 -6786981 -3958128
41909 -3958128 -2780121 -4792631 -7622705 -8412988 -7109587 -4898137 -1664195 2781012
41901 2781012 6644915 7738102 6048287 2748648 -1955499 -7507302 -10871075 -9106457
41893 -9106457 -3809546 269221 1282140 1707825 3217899 4061307 3368810 4050133 7818825
41884 7818825 10307513 6140965 -2119649 -5404273 355418 8448141 9453202 2045426
41876 2045426 -6952355 -11026368 -9246544 -4282159 1239658 5675455 8001591 8038060
41868 8038060 6620382 5089214 4583069 5264250 5767044 4239318 849050 -1517557 -278660
41859 -278660 3655442 6943370 7539950 6018622 3769004 1710848 644971 823568 677475
41850 677475 -2186301 -7747972 -12676931 -13695057 -10868864 -6744112 -3307829 -865285
41842 -865285 1082092 3258958 6335713 9833926 11746061 10852332 9218871 10237529
41834 10237529 13423504 13452687 6673489 -2653331 -5945833 -801421 5241617 3855093
41826 3855093 -3295892 -6657928 -1349123 6523499 7924279 2058597 -3821506 -4231823
41818 -4231823 -1190473 288425 -945730 -2077492 -1509112 -1300552 -3725950 -7135721
41810 -7135721 -7300135 -3083320 1123723 342050 -4582352 -7878447 -6072840 -1528200
41802 -1528200 2003246 4116823 5823284 5837358 2608247 -1439689 -2004502 795533 2247451
41793 2247451 61180 -2162616 -345590 4200807 6894722 5954697 3697355 2705960
41785 2705960 3071251 3405492 3034795 2776312 3898630 6182729 7340842 5482699 1987422
41776 1987422 173363 934339 1872992 1339157 664615 1022482 889658 -940892 -2134057
41767 -2134057 206213 4657812 6865566 5324786 2846626 2257665 3134294 3057041 251817
41758 251817 -4906540 -9472560 -9877175 -6241271 -3309297 -4307992 -5705152 -2415720 3098429
41749 3098429 3099364 -3338372 -7315547 -2447391 5787317 8211494 4815340 2742504 4067731
41740 4067731 3287169 -2723824 -9136088 -10023786 -5944600 -1735497 -207451 -945951 -2730832
41731 -2730832 -4096341 -3216833 -104386 2115270 678926 -2685726 -3572052 -783713
41723 -783713 1918650 750034 -3171788 -5402059 -4013025 -1923262 -2577585 -4886404
41715 -4886404 -4765142 -1361898 1416839 920965 44954 2447933 6076510 6047393 2813876
41706 2813876 1986836 5430555 8132593 6284305 3415381 4535561 7947242 7870921 3342299
41697 3342299 -314722 1420550 7328415 12587556 13040893 7592658 -908131 -7159044
41689 -7159044 -7992395 -5360125 -3131653 -2060349 -254130 2709818 5364642 7269060
41681 7269060 8853633 8640220 4347599 -2668928 -7424701 -6881113 -3114782 -257482
41673 -257482 -486191 -3275929 -6162162 -6066902 -2392965 1298499 1490484 20309 1378719
41664 1378719 5068955 5752863 1965916 -840794 1539088 5913329 7237216 5977297
41656 5977297 5688777 6807283 7590229 8462028 10363647 10829537 7124095 2186313 1882481
41647 1882481 6285150 8977604 6138570 1584489 725666 3342052 5121788 3807724
41639 3807724 924541 -1246738 -1780954 -436010 3115658 8429979 13029987 12976488 6105446
41630 6105446 -4637669 -12377109 -12470197 -7165510 -2907878 -3544174 -7555659 -11265102
41622 -11265102 -12608673 -11510483 -8469241 -3975947 1105149 5077479 5637147 1500522
41614 1500522 -5572085 -11281288 -12293241 -8826873 -3582913 589577 1692880 -477396
41606 -477396 -3194033 -2938299 -303717 -72065 -4054266 -6961622 -3237141 4490399 8689257
41597 8689257 7223631 4847816 4671286 4080606 634017 -3286843 -4388692 -3022432
41589 -3022432 -1128226 964735 3013971 3383729 2100973 2466536 6207877 9535278
41581 9535278 7953806 3240870 1353350 4107701 7139909 6438684 3119954 493907
41573 493907 -554176 -1324605 -2413610 -3194212 -3394048 -3502333 -3728144 -3730584 -3553329 -3906623
41563 -3906623 -4939655 -5285945 -3357720 247287 2651311 1724042 -1575877 -4757363
41555 -4757363 -6720488 -7648879 -6907479 -3504061 1237151 3954074 3150086 865651 -537528
41546 -537528 -1213376 -2044000 -2105731 -232286 2131769 2189633 -373080 -2855397 -2837008
41537 -2837008 -292965 3552300 7554264 10294812 10161325 7059604 3213940 1090025
41529 1090025 806573 459954 -1195585 -3349287 -4532090 -4417089 -3601082 -2388109 -873818
41520 -873818 165812 -153606 -1282419 -1628122 -792016 21892 233908 705105 1509325
41511 1509325 1039887 -1106991 -2442002 -914634 1967638 3892802 5642481 8874219
41503 8874219 11682718 10676809 6744333 4136019 3818520 2571609 -679288 -2843572
41495 -2843572 -2549326 -2756044 -4893121 -5569555 -2855054 -1023666 -4026928 -8133355 -7148127
41486 -7148127 -2479821 -1310978 -5456836 -8638141 -5917972 -214875 2828084 2064756
41478 2064756 49880 -1875833 -4418823 -7537367 -9386998 -8196333 -4361791 -573685
41470 -573685 589675 -212648 560205 4498117 8207916 7481639 3266511 265673 254516
41461 254516 623902 -265446 -473698 1473237 3730819 4347437 4135828 4109324 3006908
41452 3006908 -24500 -2900767 -3621597 -3441468 -3848760 -2721947 2370925 8521991 9894963
41443 9894963 5703541 1311255 608281 1602555 1300559 847080 2607208 4931942 3801470
41434 3801470 -1206210 -5893917 -6472776 -3248133 878057 3524348 4023183 3183332 2529937
41425 2529937 2844851 3354485 3208438 3173942 4314232 5610493 5177742 3597776 3203119
41416 3203119 3794796 2574316 -460683 -1035035 2809970 6375542 4703439 416514
41408 416514 -155442 3059653 4107142 1074556 -1000427 717383 1532439 -2695500 -7604563
41399 -7604563 -6490313 -1003406 1103359 -2319528 -5178369 -3053612 452480 207979
41391 207979 -2287714 -1712340 2347956 4261039 319060 -5791111 -7607360 -4141724
41383 -4141724 -659240 -1293115 -3962885 -4541526 -3583324 -5107671 -9451133 -11948654 -9943394
41374 -9943394 -6755349 -6044226 -6055687 -3359715 561386 1215650 -1921208 -5048685 -5963899
41365 -5963899 -5717262 -4594176 -1426529 2327641 2755204 -387163 -2052892 971003
41357 971003 4962168 4520091 191368 -2791935 -1845398 420360 628241 -1234147 -2688725
41348 -2688725 -2183256 -840750 -957900 -2820836 -3734169 -1402495 2450124 4098845 3246074
41339 3246074 3363513 5821634 7004450 3340584 -3360010 -8093077 -8392130 -5593170
41331 -5593170 -2044877 419455 423406 -1958021 -4551434 -5165313 -3799684 -1723895 347570
41322 347570 1916310 2236662 1708074 1831898 2196282 81974 -4607102 -7023161 -3560274
41313 -3560274 2227187 4342875 2893864 2558900 3882631 2651343 -1587428 -3131830
41305 -3131830 1288380 7270314 9604463 9614921 11324078 13997351 13514219 9098324 4121045
41296 4121045 1370205 1379724 4280036 9200204 12391821 10061369 3415920 -2400307 -4635498
41287 -4635498 -5079679 -5795025 -6298453 -5914748 -5652333 -6266580 -7035784 -7709238 -9117326
41278 -9117326 -10625065 -9845107 -6642529 -4605762 -6156571 -8640670 -8070700 -4734401
41270 -4734401 -2005436 -1239686 -1266170 -1709128 -2972042 -3458597 -930308 2929362 3193529
41261 3193529 -1838647 -8119423 -11180563 -10861304 -9089254 -6276860 -2574762 -10824
41253 -10824 -16571 -371048 2191903 7169124 10841457 10952622 8236319 4028325 -598910
41244 -598910 -3481845 -2371929 1807593 5064747 4718147 1968853 -548929 -1936752
41236 -1936752 -2738775 -2961365 -1757441 1276635 5022632 7036842 5425191 1242065
41228 1242065 -1816257 -1251574 1616136 4096267 5657965 6992436 7330131 5843449
41220 5843449 4432496 5303309 6601140 4851054 1343671 860907 3567191 4104113 567547
41211 567547 -1784720 931469 4852205 5089376 3527159 4181176 5346520 3297787 399801
41202 399801 1613360 4775276 2875215 -3911562 -6878089 -1514336 5783738 7107546
41194 7107546 3151415 -110801 -232123 558102 -93458 -2736162 -6645823 -9589988 -9127092
41185 -9127092 -6134398 -4603330 -6196619 -7959706 -7303355 -5821214 -5719042 -6002083 -5349187
41176 -5349187 -5542383 -8373920 -11712694 -12281821 -10225545 -7687226 -5230924 -2974928
41168 -2974928 -2544861 -4088113 -4155572 -905493 1512399 -978123 -4726161 -3348766 1465614
41159 1465614 1904128 -3342925 -6633473 -3508941 548317 -569779 -4118516 -3774134
41151 -3774134 325879 2860680 1916917 531735 778748 1271205 502206 -1154946 -2970503
41142 -2970503 -4341552 -3763493 -333555 3409300 3128167 -1746208 -6429817 -6295522 -2354688
41133 -2354688 622965 638500 795244 4390257 9582858 11282260 7968713 3688350 2031370
41124 2031370 1159211 -2137004 -5721271 -4224160 2369704 7219296 5341637 -233100
41116 -233100 -3416445 -2758163 -1153741 -517566 -324682 -35594 298942 1253804 3317193
41107 3317193 5421307 6155828 5773962 5265117 4493998 3230329 2886012 4857400 7842953
41098 7842953 9044876 7538326 4536653 1126422 -2082371 -3826639 -3208835 -1534087
41090 -1534087 -867368 -995045 9355 2401414 4124770 3542537 955677 -2377927 -4942529
41081 -4942529 -5239004 -3480700 -2442389 -4231432 -6771436 -6269148 -2807861 -278986
41073 -278986 -644685 -1752257 -1623893 -1375277 -2217115 -2602368 -617439 2916482 5769771
41064 5769771 6934343 6147164 2838454 -2102195 -5254060 -4333677 -2117371 -3636223
41056 -3636223 -9316739 -13733835 -12270210 -6789287 -2811286 -2416237 -2534784 -293222
41048 -293222 2749335 3478256 2374110 2704972 5002331 5782338 2800704 -1457788 -3354112
41039 -3354112 -2521222 -532095 2142229 4820248 4755912 662207 -3521074 -2915816 1008980
41030 1008980 2225565 -757658 -2648642 526322 5689080 7358824 4561505 765066
41022 765066 -442387 2259312 7371625 10770826 8860468 3008613 -1433131 -1468905 950923
41013 950923 3284984 5393140 6648190 4473173 -1297922 -6138114 -6105940 -2599919 725646
41004 725646 2407047 1774105 -2640686 -9129334 -11192879 -5259162 2952862 5567897
40996 5567897 3627051 4450206 9385059 11702307 7411734 1169136 -1097676 55399
40988 55399 401964 -1438136 -3589820 -4345881 -3262681 -657491 2110710 3422657 3522461
40979 3522461 4054591 5018712 4749935 3496440 3764739 5869145 6626186 4544851 2956211
40970 2956211 4958533 7930298 6832506 1478207 -3297705 -4251129 -2946356 -1971407
40962 -1971407 -1222489 485806 2395834 2649673 1277571 297986 855422 2047582 3151963
40953 3151963 5147960 8364542 10013710 6918213 685224 -2924410 -1055786 2520681
40945 2520681 2809133 316561 -651996 1068592 1969150 -617172 -4525034 -5436434 -1905275
40936 -1905275 3236818 5779683 4088191 312919 -2628528 -4654571 -7231642 -8982766
40928 -8982766 -6446402 -421737 3098472 1381992 -362836 2517535 5548259 2045662
40920 2045662 -4645294 -4700769 3170097 9575251 8799445 6273293 8121240 11414582 10305071
40911 10305071 5542966 1764162 34037 -836704 573478 5460885 9775092 8353226
40903 8353226 2728884 -632852 997040 4500059 6537876 6495056 4303969 65586
40895 65586 -3846806 -4262861 -1422973 1206265 1428916 122370 -942887 -485277 2221265
40886 2221265 5886221 6968811 3995624 674616 1006836 2851039 1142817 -3367487
40878 -3367487 -4383082 158888 4209118 1947405 -4358633 -7983057 -6309247 -2683551
40870 -2683551 -1419620 -3504022 -6481912 -7009330 -3944586 549399 3585403 4819055
40862 4819055 5764629 6722118 6820384 6512020 6841443 6349474 2532990 -2892481 -4397837
40853 -4397837 -274488 4007492 3123746 -550199 -704371 3464461 6207202 3708305
40845 3708305 -524217 -736320 3065582 5088989 1447466 -4699184 -7207979 -4700225
40837 -4700225 -1609156 -1493674 -2530708 -1511365 443726 -474252 -4732821 -8622407
40829 -8622407 -9171858 -6818243 -3288463 120072 2059341 1990853 1791269 3593151 6014354
40820 6014354 5815290 3228307 1642868 1752106 838074 -1029932 390473 6013629 9710507
40811 9710507 6177247 -1470798 -6400610 -7076364 -6862574 -7373726 -7509863 -7483937 -8575938
40802 -8575938 -9544705 -7978820 -4924110 -3819976 -4934611 -5046119 -2738163 123399
40794 123399 2446704 5152018 7600721 7053198 3182656 -532046 -1565828 -1226522 -1240202
40785 -1240202 -929208 139176 65676 -1978817 -3026694 -406058 3286646 3052354 -1269465
40776 -1269465 -4132856 -1342564 4550735 7291135 4023565 -2096047 -6015784 -6067538
40768 -6067538 -4391184 -3090376 -1932427 -307445 643522 -359225 -2320410 -3310321
40760 -3310321 -3444486 -4381175 -6393148 -8032825 -8154493 -6253123 -1878082 3647510 6269790
40751 6269790 3637698 -508609 -873488 1101017 -828881 -6998708 -9839893 -5251836
40743 -5251836 554586 193935 -4231226 -5323877 -1304096 3457490 6061433 6888520
40735 6888520 5523010 1258775 -2945075 -2938513 179151 1444814 -120479 -510979 1986253
40726 1986253 4052294 3021772 259588 -2431638 -4973007 -6381249 -5008679 -2786505
40718 -2786505 -3875695 -7373154 -7248878 -2001888 2065229 974961 -165434 3810924
40710 3810924 8263256 5578848 -1952616 -4684526 259381 5525640 4830852 613139
40702 613139 -1644881 -969849 215989 714444 870413 533399 -837958 -3018543 -5037170
40693 -5037170 -5639784 -3926416 -735259 1403172 1342689 1095014 2409822 3428332 1949113
40684 1949113 214624 2026488 6047916 6966716 3373307 -482328 -1418099 -783753 -29303
40675 -29303 1943386 4772261 4852588 757354 -3420486 -3506893 -902025 459619 60485
40666 60485 332978 2299832 4769816 6425453 6454407 4742228 3116124 4117080 6934756
40657 6934756 7587872 5149160 4082121 7342747 10882848 9209705 3489972 -522370
40649 -522370 -508593 1053746 1820916 1265005 -1193412 -5133486 -7318988 -5454240 -2638223
40640 -2638223 -3310037 -5866839 -4783273 404161 4144438 3341462 895728 -454589
40632 -454589 -2067576 -4991582 -6789050 -5614609 -3330599 -1941958 -705516 867649
40624 867649 1094009 -271389 -587224 649696 -394814 -5439875 -9529031 -7487114 -1676930
40615 -1676930 1640758 1149904 471362 1217161 1703672 1877621 3988309 7805765 9771276
40606 9771276 7934435 4153092 796507 -1218028 -727372 3254011 8242225 9317032
40598 9317032 5372456 1144056 946254 3262320 3902860 1998481 44155 -207153 1018655
40589 1018655 3282699 6129931 7914662 6835324 3245193 -787420 -4080817 -6721721
40581 -6721721 -7957695 -5992560 -884016 3992682 4989438 2186349 -838056 -975278
40573 -975278 1792679 5555901 8595803 9583717 7284535 2016709 -3197717 -5186530
40565 -5186530 -4517666 -4627977 -6536125 -7103196 -4027739 250487 2356567 3389169 6724605
40556 6724605 11619887 13347265 9886367 4548407 1156084 251471 1079879 3405555
40548 3405555 5554163 4411121 -116936 -3870024 -4232654 -3807537 -5324569 -6664560
40540 -6664560 -5187448 -3478500 -5094996 -7112189 -3746771 3520081 6775111 3401663
40532 3401663 -257485 776812 3182893 2758739 2511943 7345321 14772001 17502979
40524 17502979 13396624 7028509 2317247 -930157 -3126732 -2729974 587116 4056922
40516 4056922 4622345 1739490 -2811297 -6033412 -5308162 -1410296 859266 -1988498
40508 -1988498 -7021364 -8592419 -6247317 -4485227 -4959180 -4359795 -1196566 949964
40500 949964 -304999 -1600494 528584 3417352 2432406 -1356862 -2920919 -1419389
40492 -1419389 -1309362 -4952824 -8780702 -8614578 -5440060 -3294236 -3285585 -2622110 569804
40483 569804 3945732 3896493 580538 -2252694 -2623255 -2919574 -5570490 -8570414 -8312379
40474 -8312379 -5259773 -3053024 -2879923 -3026625 -3597387 -6397606 -9387374 -7201417 365715
40465 365715 6061822 5032417 1736122 2256982 4559811 2723433 -2610161 -5315014
40457 -5315014 -3684486 -2016436 -2409921 -1797871 1558459 4444826 3680630 263682 -3437791
40448 -3437791 -6869296 -9864934 -11326049 -11003368 -9925161 -8046599 -4281992 410968
40440 410968 3078591 2717838 1213144 -115340 -1526962 -2059833 219288 4142758 5695162
40431 5695162 3766143 1728130 1814867 2172555 1410571 1578705 3855208 5459820 4227786
40422 4227786 2589158 3299063 4429667 2663243 -979070 -2798255 -1907368 -253813
40414 -253813 1224268 2734364 3178143 1211205 -1851516 -3129704 -1700387 1033930
40406 1033930 3312888 3384762 -275223 -6650702 -11807778 -13257745 -12792438 -12610592 -11247770
40397 -11247770 -6614410 -582852 3358637 5024461 6151433 6119544 3452507 -123705
40389 -123705 -1753700 -2032436 -2707333 -1710340 3465211 8734522 7187263 428250 -1493746
40380 -1493746 5933478 14544742 14342919 6165159 -1095436 -1967301 1649337 5281782
40372 5281782 6025738 3294339 -848350 -2786969 -1236595 1013197 1043678 -312358 -668860
40363 -668860 -183008 -828344 -3104968 -6008253 -8898541 -10928774 -10036300 -5340841 355317
40354 355317 3178477 2796374 2107739 2881679 4057500 4112233 2936685 1305837 131410
40345 131410 154606 1094464 1530145 791160 74263 252740 -247952 -3323037 -7710348
40336 -7710348 -9912887 -8442709 -5297734 -3254712 -3141869 -3591769 -2338762 1646549
40328 1646549 6229226 7444602 4146433 -171006 -1941876 -1930621 -2500685 -2792427 -726655
40319 -726655 1662923 132548 -4421712 -5838534 -1453506 3794221 4480319 1797409
40311 1797409 429443 1726319 3559547 4458141 4336030 3051677 1613230 2965531
40303 2965531 7946428 12000336 9884922 2737095 -3411565 -5404536 -5072330 -4065296
40295 -4065296 -1613803 1534237 1748929 -2384140 -6985748 -7574815 -4409138 -796854
40287 -796854 1688664 3710755 5511143 6346432 5813720 3979605 1032938 -1933249 -3109931
40278 -3109931 -2261547 -1269315 -995523 395771 4025441 7319980 7239434 4920485 3895201
40269 3895201 4628508 4286489 1790384 -292553 334028 2546267 3681871 2771501 987875
40260 987875 101736 933090 2353855 1947295 -1198228 -4767929 -5594305 -3120463 858799
40251 858799 4709608 7252717 7050489 4339426 2585389 4608431 7778217 6989935 2271169
40242 2271169 -993082 -65745 1562758 276850 -2330763 -2844459 -1317311 -369287 -1520584
40233 -1520584 -4591065 -8210702 -9255633 -5088823 1554377 3730036 -752880 -5366245
40225 -5366245 -3601756 1933889 3805466 139531 -4644511 -7442024 -8999982 -9673788
40217 -9673788 -8287777 -5593685 -4198263 -4453605 -4323983 -3478197 -3448949 -3579583 -1240030
40208 -1240030 3178307 5717823 4476983 2047115 1221623 1817184 2769480 3767861 3719924
40199 3719924 1246231 -2161498 -3207369 -2061502 -2360849 -4635801 -4637332 -580188 2922140
40190 2922140 1727087 -1347249 -1188329 1967053 4222498 4590986 4952516 5376888 4401297
40181 4401297 2857979 2893560 3872927 3394684 1713013 1076975 1387299 918460 867760
40172 867760 4167440 9333304 10647752 6165871 1197588 1573209 6865606 12390018
40164 12390018 14778693 13433209 9447016 5475572 4116758 4287081 1949791 -3369651
40156 -3369651 -6160126 -2284182 4330406 6673984 4115737 1955131 2725838 3334306
40148 3334306 1156418 -2001575 -3470830 -3281307 -2495631 -1264048 -70765 35567 -378840
40139 -378840 107418 69523 -3367288 -8018355 -7117659 329028 5345635 637931 -8232938
40130 -8232938 -10349199 -4714589 190837 194510 -635231 17911 -1136383 -4108752 -2610667
40121 -2610667 4881151 9575234 4954073 -2065346 -1008788 6364628 9619480 5730774
40113 5730774 1610757 1629359 2440434 1282649 574405 1760073 2085927 521800 417832
40104 417832 3195513 5392760 5076614 5153637 6794607 5862027 534477 -3435147 -920589
40095 -920589 4028122 4321041 567800 -1291571 -50097 651205 504409 2904613 7262812
40086 7262812 8472591 5275665 2507183 3147183 4284729 3457439 3129014 5369781 7200150
40077 7200150 5596320 3136479 3809903 5996021 4662972 -887631 -6082404 -7306352
40069 -7306352 -5045971 -997479 4013217 8508617 10092384 8173340 4930405 2559675
40061 2559675 1186821 85910 -858829 -1686753 -2687148 -3342679 -2453962 -130713 1889472
40052 1889472 2814333 3993402 6275970 7907964 7014887 4956151 4813202 6911091 8119471
40043 8119471 5940277 1550785 -1753067 -1853999 849908 4174004 5644491 4183126
40035 4183126 886387 -2214809 -4050984 -4675004 -4217708 -2847868 -1225592 320302
40027 320302 2328988 4316486 3588960 -1296053 -6728695 -7384458 -3391619 -176736 -625914
40018 -625914 -2028909 -2181081 -3072538 -5444069 -5117893 321477 5687924 5221422 2119482
40009 2119482 3865528 9919590 11968258 6539755 -290051 -2510994 -1591514 -1336763
40001 -1336763 -1245564 982510 4489044 6754502 7338363 7205929 6668990 6068649 5999922
39992 5999922 5376544 2305174 -1896280 -3372572 -1890027 -1812530 -4837577 -6805405 -4836555
39983 -4836555 -2434444 -3168938 -4084119 -793893 4689775 7028749 5472256 2931426
39975 2931426 -115917 -4545108 -7604172 -5792142 -1518074 -190368 -1345509 401031
39967 401031 5604520 8552771 6786544 4900825 6429521 8472857 7741292 6178981
39959 6178981 6464453 6641629 3730141 -849548 -3629154 -3911064 -2472590 1388568 7139114
39950 7139114 10072343 6269938 -876657 -4105246 -1785416 697821 -773443 -4079816
39942 -4079816 -5478339 -4969790 -4532057 -4027132 -2107557 310051 693668 -1141020 -2329825
39933 -2329825 -913971 1397594 1581825 -779738 -3276980 -3758820 -2374580 -804036
39925 -804036 -608337 -2203701 -4393615 -5139235 -3935039 -2864842 -3567308 -3834536 -101215
39916 -101215 6523335 10213671 7791236 2779356 -20306 -669454 -1753509 -2981688
39908 -2981688 -2361396 -804769 -961244 -2331374 -1876073 836135 3096545 3448003 2701440
39899 2701440 908859 -2329865 -4633926 -2822328 1268347 2072586 -1287626 -3156674
39891 -3156674 -94347 3807919 3664648 1092614 478065 1741143 1696077 19753 -1019750
39882 -1019750 -1170389 -2047187 -3483675 -4137277 -4776047 -6843761 -8458612 -6205296 -884760
39873 -884760 2773768 2719309 1926745 3120782 4989308 5423698 5219374 6148880 7782596
39864 7782596 8751830 9381942 10423285 10336878 6739577 508759 -3998423 -3669893 -107837
39855 -107837 2576475 2489884 1345182 1497595 2914319 3670862 2651434 694796 -760359
39846 -760359 -1008392 197207 2945572 6226211 7647025 5587811 1397309 -1930561
39838 -1930561 -3290792 -4223189 -5830551 -6755621 -5526707 -3446604 -2923006 -3504231 -2351065
39829 -2351065 781109 2060284 -818645 -4060976 -2405674 2787207 4461629 -506102
39821 -506102 -6894352 -8469031 -6011016 -4598450 -5498293 -5130143 -1302017 3505317 5532416
39812 5532416 3621157 -731657 -4958101 -6756961 -5710643 -3630472 -1925188 350253
39804 350253 3779043 5621858 3159615 -969170 -1179796 3203601 7029255 7074450 5957770
39795 5957770 6480792 6815753 4519538 1490328 924276 1946170 1404250 -513569 -390806
39786 -390806 3152499 7435477 9086728 7450684 4707260 3733639 5130716 5771798 2142482
39777 2142482 -4059664 -6636877 -3086873 1399339 1385962 -878001 24091 2897403 1529554
39768 1529554 -4251910 -6533357 -891103 6211419 6120159 -277469 -5005192 -4617023 -3245971
39759 -3245971 -4501965 -6418897 -6279564 -5394425 -5614373 -4739907 916 5831632 6846093
39750 6846093 2371527 -1822699 -1584453 857787 2008726 2561825 4669377 7429073
39742 7429073 8821857 9174712 8850125 5655272 -635395 -4185028 239342 8368323
39734 8368323 11159238 7650942 5528894 8390452 10622074 7441868 2439162 1074881
39726 1074881 2865284 4313978 4281801 2465799 -2023222 -6485084 -5002789 2098007
39718 2098007 5388819 -899780 -9268376 -9570470 -3725683 -841616 -2137888 -1369360
39710 -1369360 2133069 2357598 -1219703 -1392433 4424686 9373909 8405033 5721003 6204820
39701 6204820 6895367 3012320 -3015970 -4861572 -1396899 2707015 3399436 425650
39693 425650 -4026737 -6892877 -6281948 -3993993 -3681130 -5235000 -4607434 -856908 1362521
39684 1362521 -626519 -2340578 865792 5623930 5122242 -633027 -5125692 -4793119
39676 -4793119 -2377026 -762119 986556 3914835 5988420 5103666 2411807 233316
39668 233316 -1419953 -3935174 -6895368 -8154055 -7034387 -5550900 -5623972 -6212960 -4629197
39659 -4629197 -538819 2915467 2839603 295217 -1070328 584632 3821580 6453505
39651 6453505 7783949 8162426 7844675 6828873 5020115 2549175 568076 963059 3950176
39642 3950176 6695479 6086592 2477975 -960301 -2105538 -1373844 -6316 1194195
39634 1194195 1934256 2933712 5412871 8422255 8577765 5015368 2262593 4328460 8044963
39625 8044963 7254391 2060425 -2048184 -3456793 -5677922 -8683348 -6841950 1415464
39617 1415464 8792357 8587905 3666747 1165247 2669160 4745668 5613413 5866292 5068537
39608 5068537 2794572 1421943 3270543 6099731 5520826 1056401 -3637605 -5670029
39600 -5670029 -4966722 -2551347 128816 1006285 -732202 -3202318 -4186590 -3776156 -3059934
39591 -3059934 -2067546 -863150 -561446 -1308224 -1492456 -690726 -619599 -1463840 -834089
39582 -834089 1490111 2044529 -216625 -999428 2335506 5666806 4721996 2050061 1788005
39573 1788005 2061594 -775738 -4487564 -5084651 -5028519 -8824472 -13135786 -10693773 -2749721
39564 -2749721 2050937 1133702 632534 3618322 5519370 3693541 2222696 3555462
39556 3555462 3844720 841434 -1404927 -450972 -673304 -5213340 -9485038 -8682819 -5677174
39547 -5677174 -4948277 -4135591 1029960 7588740 8896541 4740058 763422 -488400
39539 -488400 -1165085 -1738688 280643 4834739 8054886 7675308 5685918 4612760 4217825
39530 4217825 2613229 -1408303 -7046463 -10965212 -9430029 -3004934 2692567 3394953
39522 3394953 1233996 489006 861049 -865099 -4381353 -6044987 -4879277 -3665260
39514 -3665260 -3803690 -3297931 -705717 2368276 3839608 3658516 3014602 3075429 4765760
39505 4765760 7882913 10492690 10945840 9932541 8783561 7057929 4308101 2689518
39497 2689518 4333768 7084026 6735400 3262665 978145 2301928 5089051 6643194
39489 6643194 6741777 5844196 3833185 1790919 1848561 3802454 4664795 3066141 1564280
39480 1564280 2993807 6687307 9823850 10685150 9284618 6455649 3537606 1737948
39472 1737948 1149952 1383148 2670249 4519391 4351381 711399 -2808026 -1108693 4703282
39463 4703282 7978831 6135762 4342895 6950344 10385748 8908495 3466148 -364731
39455 -364731 -650759 32778 407052 1672791 3258674 2541305 -423255 -2103836 -558627
39446 -558627 2159221 3691988 4194541 4262709 3280253 1584733 1456879 3701410 5397814
39437 5397814 3617370 73404 -577977 3113324 7043780 6140088 435468 -4424495
39429 -4424495 -3275692 2327020 5514672 2591352 -1910287 -1218393 4108147 6789060
39421 6789060 3262442 -1310865 -952411 2461474 2898698 -2498 -486633 4000961 8530757
39412 8530757 7960233 4398492 3752057 6993518 8990318 5870259 23937 -3462924
39404 -3462924 -2877636 -472973 1440168 2570771 3215119 3128649 2501779 2345080 2956007
39395 2956007 3376279 3301413 3842215 4862921 3469609 -2048338 -7905081 -8151833 -2606406
39386 -2606406 2178386 1145189 -3424051 -6272049 -6135153 -5328999 -4961960 -4456138 -4398780
39377 -4398780 -5742007 -6535922 -3441767 2902464 7371669 6257438 1134132 -3869638
39369 -3869638 -5993692 -4228061 1221407 7989541 12077831 11237561 6966127 2483087
39361 2483087 55461 539624 3422514 6496992 7376223 6073635 4425199 2915271
39353 2915271 474943 -2583845 -4601194 -5839083 -8011694 -9956151 -8253245 -3450289
39345 -3450289 -492653 -666946 1086411 6971155 10390837 5229554 -3489666 -5448110
39337 -5448110 1146947 8581549 10649337 7779318 2548762 -2782643 -4878909 -2428786
39329 -2428786 -232253 -3224024 -7292366 -4478342 2946144 3990931 -3366145 -7222841
39321 -7222841 192549 9818199 9230086 663141 -4283648 -2411019 -709609 -2976211
39313 -2976211 -4901788 -2728305 1496670 4663456 6219123 5798949 2642576 -1451735
39305 -1451735 -3224353 -2874699 -3654436 -6120422 -7329608 -6432247 -6305643 -8155199 -8816201
39296 -8816201 -5555840 -222047 3466381 4209268 3088507 1547833 849575 1600312 2643609
39287 2643609 1990312 -540536 -3128802 -4387567 -4106273 -1955660 1947249 5262449
39279 5262449 5117295 1989772 -681687 -1035540 -309860 173538 349009 -589187 -3872667
39270 -3872667 -7733689 -7789530 -2666224 3540637 6209273 5209964 3447579 2820873 3275026
39261 3275026 3650110 2017548 -2481029 -6845170 -6255020 -800869 3073179 686370
39253 686370 -4331272 -5371880 -2283264 -640055 -2700351 -4554588 -3206117 -1494032
39245 -1494032 -3104423 -6075804 -5176881 515098 6051202 6925036 4207620 2297660
39237 2297660 3511439 6469327 8629029 8583002 6311327 2937975 345571 -452208 -840291
39228 -840291 -3135650 -7190781 -9861132 -8563827 -4213828 104499 2364738 2824955
39220 2824955 2997347 4052659 5553756 5635755 3398520 846648 876935 3594490 6614712
39211 6614712 8627848 9937933 9726719 6468310 1650682 -820836 -19944 1220179
39203 1220179 2022590 4997060 10074734 12427703 9916487 7168205 7970715 9044165
39195 9044165 6677784 4194121 6093337 9310946 7977119 3422003 1410110 2112343
39187 2112343 1186210 -1197140 -1075582 979286 1197437 1360971 6687932 14843345 16850841
39178 16850841 10445091 3379850 1513539 2425167 2989689 4246034 5855349 4468003
39170 4468003 910707 671819 4143517 5122581 2286920 2530247 8428402 12281752 8566863
39161 8566863 2990743 2232889 3412560 1668644 355521 4759741 11718147 14186144
39153 14186144 11577728 8094709 5183041 2545825 2401933 6286623 11303696 14401284
39145 14401284 15868673 15134064 9861048 3101460 2952690 10236898 15774758 15218403
39137 15218403 15838917 22235094 27721750 28165901 30996937 40467614 48358500 51052852
39129 51052852 59812684 80151685 100129091 118078420 159549298 236633716 307899002
39122 307899002 317063335 264474055 203261338 170013164 161172019 176017454 228730746
39115 228730746 299699865 324936803 269188660 176706209 114794530 93599628 77586820
39108 77586820 52373811 35840529 33981674 29663655 16738384 9706080 13792757 14890820
39100 14890820 6387132 530712 4890098 9650132 7171938 4746384 8573293 11984636
39092 11984636 9049713 5333975 6220925 7471015 5596458 5437201 9283861 9949973
39084 9949973 3206776 -3139334 -1203076 4821511 6656481 4282519 2595784 2655311
39076 2655311 3307241 5287983 7602333 6076241 972034 -738017 3802162 7442445
39068 7442445 4029405 -1880158 -3057978 -523814 1034322 2577931 7227236 12289212
39060 12289212 13052249 11132014 11570226 14448242 16210954 16704519 18294751 20165822
39052 20165822 19743900 18091235 18225879 19500359 18634787 15027920 10965433 8324333
39044 8324333 8424454 12243977 17163422 17167194 10567345 3664814 2150169 3342187 2398689
39035 2398689 1175372 3686379 7169672 6366214 3686247 5713710 11177866 12208466
39027 12208466 7566495 4890924 8234473 12640060 14028320 15818178 21237038 26262167
39019 26262167 25623069 20544776 15490936 11560981 7863337 5544046 5526719 5383778 3264684
39010 3264684 2239709 5719164 10637816 10626749 5072928 -278780 -1909159 -2544839 -5047496
39001 -5047496 -6912331 -4362890 600791 1552990 -3761743 -9501710 -8375881 -606208
38993 -606208 6294605 6478167 1856547 -1669915 -1512802 280937 1231888 987272 234591
38984 234591 -271310 370953 2109043 3055189 1904470 554515 1489307 3290957 2563057
38975 2563057 113458 413732 3881644 5081898 1402879 -1592610 1884693 8389900
38967 8389900 9563173 3920257 -1719946 -2240142 79840 948129 220212 513854 3144083
38958 3144083 7511638 11951058 13750427 11086982 6372645 4662914 6970666 8374316
38950 8374316 5156357 505030 -330810 2218599 3501510 2065189 773933 1110815
38942 1110815 1321241 872204 2086836 5505001 7461674 4900619 -54076 -2922230
38934 -2922230 -2403370 -791330 -336689 -1387388 -3155237 -4486276 -4540162 -3901668 -4084974
38925 -4084974 -5124893 -5173202 -3344587 -896727 1536265 5096165 9097318 9469736 4325248
38916 4325248 -1352250 -1030858 4620496 8902649 8441533 6410779 5971040 5741667 3921103
38907 3921103 2463252 3723776 5721860 4326161 -1033215 -6574049 -8554265 -6624982
38899 -6624982 -3314115 -1552794 -2287545 -3659053 -3011664 15899 3327465 5201511
38891 5201511 5663633 5051816 3486239 2186365 2692954 3888141 2613883 -1408417 -4334546
38882 -4334546 -3799055 -2492007 -3265642 -3852629 -693223 4140387 4994123 1076261 -2265751
38873 -2265751 -1632018 -292380 -2530629 -6856227 -8276883 -5616105 -3116755 -4664317
38865 -4664317 -8872607 -11068333 -9016549 -5122443 -2712900 -1511378 1536045 7166181
38857 7166181 11722056 11309539 6429478 920549 -2416936 -3349746 -2639184 -1424880 -1629362
38848 -1629362 -4366104 -7766506 -8604451 -6435436 -4109159 -3745806 -4177997 -3027231 405009
38839 405009 4858676 8010590 7297563 2050850 -4330180 -6567213 -3238193 1579238
38831 1579238 3817852 4440011 6778966 10656761 12199518 9058605 3126503 -2204120
38823 -2204120 -5336543 -6484935 -6195329 -4848630 -2785614 -373774 1660353 2307496
38815 2307496 1635145 1536415 3520264 6011400 5973974 3562137 2673289 5504621 8788852
38806 8788852 7873190 3331398 692164 3577821 9517659 13256138 12312125 8247525
38798 8247525 4046179 1827162 2311023 4755357 7165104 7605937 5853382 3469700
38790 3469700 2105488 1953733 1936492 1112991 -441204 -2167595 -3903309 -5521962 -5882086
38781 -5882086 -3469457 1107053 4409724 3499992 -536186 -3996937 -5170036 -5584673
38773 -5584673 -6617572 -7214577 -5985988 -3614066 -1742588 -898074 -914397 -2150460 -4747803
38764 -4747803 -7617376 -9543642 -10482215 -10679162 -9645204 -7260414 -4679382 -2787565
38756 -2787565 -1070109 646792 1105801 72048 -154238 1866833 3876076 3644491 3494156
38747 3494156 6790940 11274057 11173308 5968002 1487884 1087013 1367767 -697562 -1834166
38738 -1834166 1863363 7314578 8122575 3998012 1076999 3067464 6833498 7727387
38730 7727387 5517454 3366976 3630642 6503413 10974098 15186732 16844694 14992968
38722 14992968 11236340 8172737 6715987 5657603 3645981 715467 -2220209 -4439210
38714 -4439210 -5450724 -4817883 -2940347 -1413839 -1232308 -1017934 1078679 3778247 3576485
38705 3576485 73337 -2525779 -1108422 1977542 3035696 2849101 4498085 7271280
38697 7271280 7556902 5183166 3964158 5431330 6476073 4325429 -14523 -4349684
38689 -4349684 -7538641 -8110226 -4781509 62050 1476810 -1426335 -3815516 -2244122
38681 -2244122 551416 661508 -1072390 -1605157 -957764 -1124499 -1997995 -1952416 -898003
38672 -898003 119721 858726 1151330 95324 -1927972 -2494898 -395480 2429761 3671372
38663 3671372 2801132 -413226 -5622141 -8961300 -5676884 1979673 5342049 1215794
38655 1215794 -3167227 -1629699 1511475 19644 -3087449 -1725503 1461177 -77114
38647 -77114 -4000174 -2572435 2975815 3666136 -1498763 -3246138 2124827 6281630 2825991
38638 2825991 -2526425 -1852074 3258781 6621988 7417482 8310496 8727989 6714626 3956852
38629 3956852 3303129 4100705 4400434 4608986 4994259 3313032 -819828 -3065371 -538080
38620 -538080 2828998 2141097 -617990 -123147 3630928 5969021 5036158 3203172 2187956
38611 2187956 1824103 2830372 6065170 9503981 10136872 8352912 6655435 5001889
38603 5001889 1679856 -1885572 -1887735 1993795 5600854 5985339 4707797 4530489 5609907
38594 5609907 6020979 4164328 92586 -4176469 -5772347 -3631922 558213 4998256
38586 4998256 9595783 13626443 14236681 10362996 6038763 5918891 8742535 9185188 5442222
38577 5442222 913474 -1408883 -2176644 -2974870 -4077577 -5559515 -7364055 -7684663 -4578054
38568 -4578054 85720 1715931 -703437 -2596853 168053 5866676 9542797 9028710
38560 9028710 6280462 4067412 3294531 3070877 2109667 154144 -1594243 -1813884 -728276
38551 -728276 222975 11590 -1521587 -4020095 -6026456 -5072499 -600191 3830766 4040622
38542 4040622 947036 -225823 2904472 6737247 7318947 6089094 7046279 9950677
38534 9950677 10035656 4760624 -2014156 -4175701 -410084 4499425 5237811 1525048 -2458144
38525 -2458144 -3353152 -2020797 -1466527 -2638702 -3597975 -2746028 -1545444 -2919324 -7165494
38516 -7165494 -10860741 -10847043 -8281744 -6630147 -5928289 -2344869 5045260 10543072 8444446
38507 8444446 1159248 -3586789 -2376333 1689008 5366940 8132241 8670097 5186718
38499 5186718 899040 2425357 9505839 12870873 6896306 -1724898 -3736663 -198771
38491 -198771 1543358 226793 470404 2897102 3478723 1984472 2454935 4727495 3685087
38482 3685087 -1434086 -4626531 -2559480 502433 416220 -420881 1736506 5565890 7581201
38473 7581201 7348786 6084855 3666099 402189 -1616260 -1934747 -2924691 -4757505 -3473914
38464 -3473914 2281573 6902393 4887095 -1254136 -5210552 -5930870 -6769390 -7794491
38456 -7794491 -5403713 717783 6019649 7352953 6383161 5802546 5926027 6090339 6190151
38447 6190151 5768088 4237248 2631269 2479945 2611210 228076 -4055826 -5626191 -1925033
38438 -1925033 3774553 6678670 6199799 5136640 5145249 5692064 6187486 6350980 5137943
38429 5137943 2100000 -434608 410142 3166833 2649414 -2873096 -8208001 -7918625 -4110978
38420 -4110978 -3290645 -6503867 -7923158 -4279370 -242037 -1020418 -3951286 -2575856
38412 -2575856 3341275 7635143 7047301 5094962 5465968 6361255 4005054 -1325086 -5562460
38403 -5562460 -5717627 -2797256 -742997 -2920286 -8396443 -11966946 -9829507 -4595927
38395 -4595927 -1841788 -2436417 -2418376 -442809 -91807 -3100803 -5418345 -3199338 1258798
38386 1258798 3072656 1129383 -2324642 -5391033 -6579936 -4358943 -276828 588386
38378 588386 -3667058 -7715493 -6201779 -1881822 -983642 -3082578 -2419685 1914411 4472060
38369 4472060 2557092 -271908 -1579654 -4208551 -9802581 -13910902 -12049901 -6608552
38361 -6608552 -3010166 -1816768 497943 4518537 6609423 4829743 2063370 1809882
38353 1809882 3521376 4097686 2601116 1164739 1172438 784246 -2042869 -5453612 -5579427
38344 -5579427 -2523139 -790804 -2158123 -2031911 3537781 10409245 11010386 4772662
38336 4772662 -1723300 -4526357 -6144648 -8717530 -9621791 -6631492 -2289963 394663
38328 394663 2412363 5121892 5933421 2179498 -3323785 -5264697 -2909422 -117738
38320 -117738 571845 45247 -389298 -498868 -50993 690625 19819 -2715439 -4588665
38311 -4588665 -2426325 2004345 3696434 1020507 -2784849 -4521616 -3905294 -1693903
38303 -1693903 1139682 2051580 -1192653 -6354338 -8242543 -5547112 -2466570 -2341952
38295 -2341952 -3696257 -4211279 -4220891 -3757341 -625922 4887901 7351965 2967443 -3808487
38286 -3808487 -5534710 -1846275 1015280 -240608 -2309087 -1460125 1628139 4392161
38278 4392161 5623778 4748277 1423803 -2521015 -3785920 -1843504 82736 -485378
38270 -485378 -2473930 -4042296 -5099242 -5518206 -4040309 -1108457 73098 -2187601
38262 -2187601 -5151464 -5445671 -3430754 -1287799 665262 2651513 2842549 -130512
38254 -130512 -3733598 -4409703 -2669910 -1584332 -1422312 41600 2724858 4268810 4586282
38245 4586282 5679180 6708731 4283856 -1222472 -4593834 -2963760 359164 1498225
38237 1498225 1018207 537532 -1198905 -4991838 -7717384 -6686540 -4441752 -4413486 -4526382
38228 -4526382 -836990 4280390 4171826 -1978287 -7520032 -8055067 -6622148 -6747673 -6323556
38219 -6323556 -2760646 512728 -1369394 -6177833 -6935065 -2316802 1321738 -356951
38211 -356951 -3426474 -2420475 806960 -94883 -5915619 -9924059 -6921127 -169688
38203 -169688 3130510 721434 -3301155 -4661849 -3368311 -1926722 -1693849 -2109431 -2223858
38194 -2223858 -2005616 -2525219 -4868864 -8354474 -10468142 -9674924 -7424203 -5711435 -3843839
38185 -3843839 -441896 2221002 83682 -5913151 -9496314 -7560326 -4554086 -5110854
38177 -5110854 -6580926 -3868201 1526952 3625113 1619507 509352 1815853 775192
38169 775192 -4793660 -9239275 -7064056 -1462610 390408 -2382440 -4284416 -2144370
38161 -2144370 1514925 3679254 4440851 4375735 2626436 -410067 -1764391 306754 3495310
38152 3495310 4739090 4408568 4628315 5034943 3478157 347528 -1320592 -626166 -391490
38143 -391490 -2369910 -3774221 -1289043 3443520 5772520 4625721 3500182 4730460
38135 4730460 6537411 6983457 7156677 8030464 7382742 3332969 -1309514 -2298849 -242233
38126 -242233 710484 -136931 721540 4066706 5406415 1769573 -3165414 -4159367 -1565695
38117 -1565695 381290 181955 -222252 -158193 -1263193 -3633170 -4613423 -2517792 919998
38108 919998 2766123 1848227 -825910 -2862730 -1667590 3138208 8341762 10143637
38100 10143637 8454864 6023020 3808690 562157 -2875274 -3049308 699768 4067936
38092 4067936 3405254 250009 -2316151 -4364575 -6712754 -7195437 -4095844 -939371
38084 -939371 -2417054 -6730412 -7616884 -3685147 -15478 -26886 -1641720 -2797452 -4631836
38075 -4631836 -6773886 -5523088 -355065 3282550 2101366 688873 3760365 7697296
38067 7697296 6622695 2781302 2610528 5112051 3499232 -2211644 -4120494 402025
38059 402025 3903345 774399 -4475685 -5751324 -4500503 -4113152 -1988865 4959846
38051 4959846 11817222 11287012 4930088 552680 328171 -39995 -1353774 617164 5689270
38042 5689270 7292134 2959510 -1129347 -287842 1137863 -2115355 -6707922 -6384955
38034 -6384955 -2941054 -3428920 -8207122 -9837178 -4531280 2362532 4640275 3249202
38026 3249202 2512720 2794123 1575155 -667083 -739448 1508083 2230005 -402553 -2883673
38017 -2883673 -1529029 1587600 1383171 -2529410 -4993347 -3071053 -645885 -2293295
38009 -2293295 -5494311 -3769944 3033557 6848670 1726632 -7970747 -13074048 -10764094
38001 -10764094 -6289670 -4713649 -5242675 -4402202 -1233488 2612097 5679318 7333276
37993 7333276 6756863 3582129 -571776 -2838973 -1866409 935196 3094927 3364921 2090392
37984 2090392 47673 -2280769 -4262560 -4744273 -3089717 -744785 -650840 -3870962 -7262533
37975 -7262533 -6309299 -793441 4068895 3423636 -1659148 -6144209 -7350142 -6801862 -6374240
37966 -6374240 -5888037 -5241260 -5608723 -6616230 -5177598 42045 5184356 5683610 2814747
37957 2814747 1854527 4224113 5715659 3215281 -811744 -2206529 -253146 2978614
37949 2978614 5637059 6398621 4355547 909751 -386263 1897473 5036698 6408214
37941 6408214 7074740 8446849 8455254 5147913 1774433 3248236 8571205 11861871 10704019
37932 10704019 8282903 6678191 3626198 -1889866 -5811971 -4370471 54021 2207428
37924 2207428 1035733 -8944 1486044 4219902 5667547 4795543 2309106 -85200
37916 -85200 -647381 988941 3396762 4850668 4736103 3283873 1097844 -597453 -641984
37907 -641984 565731 1805527 3611724 7672019 12581724 13211623 6957298 -1474765
37899 -1474765 -4792966 -1661909 2554607 3147831 996850 -338251 291065 920623 -428745
37890 -428745 -3124694 -4144237 -921293 5498683 10586707 10527524 5920814 502600 -2942516
37881 -2942516 -4041287 -3236446 -1118453 599749 -222841 -3462569 -6185631 -5852964 -3166567
37872 -3166567 -878836 -543029 -1423440 -2254306 -2995193 -4345135 -5908884 -5842890 -3203480
37863 -3203480 -219788 -562683 -4671989 -8412019 -7926844 -4642855 -3169225 -4625267
37855 -4625267 -4859317 -382140 6160151 8705274 5260633 380966 -467844 2652988
37847 2652988 4949030 3429491 384864 -494776 603574 539156 -1555172 -3049064 -2279491
37838 -2279491 -1236706 -2123385 -3594976 -2807297 305135 3291525 4741539 5098612 4634420
37829 4634420 3325759 2533805 3946531 6324100 5864110 928380 -5466626 -8984871
37821 -8984871 -8376006 -5741571 -3880803 -4276071 -6348941 -7689651 -6102413 -2278079
37813 -2278079 576898 435665 -1378318 -2329401 -1570553 165138 2136879 3881868 5055059
37804 5055059 5992006 7282888 8073337 6621910 3714878 3169187 6718725 10563515 10169603
37795 10169603 6948768 6274112 9493445 12199918 10863082 6944116 3194374 92842
37787 92842 -1892598 -630944 3723803 6494256 4362104 969643 1906470 5846518 6225677
37778 6225677 1398655 -2796921 -2080709 42811 -1807781 -6673256 -8802165 -5333891
37770 -5333891 832174 4679939 3246352 -2560601 -8144430 -8468920 -3209616 2405782
37762 2405782 3556193 1161093 -377450 1236988 5000779 8771376 9825484 5500661
37754 5500661 -3006061 -9075565 -7067804 507938 6184150 7072449 6681746 7647303 8141468
37745 8141468 6726614 5590174 6379118 6835235 4522576 885320 -1189740 -1402341 -1115115
37736 -1115115 -623880 222805 627958 300077 467799 1468776 1413055 -590758 -2066255
37727 -2066255 -605198 2216165 3132082 1865736 686946 524888 443885 265219 920934
37718 920934 2356236 3315921 3298269 3201544 4127415 6402510 9045506 9606680 6188279
37709 6188279 697746 -2023439 -81562 2573085 1514283 -1752072 -1833703 2919562
37701 2919562 7784110 6997895 187378 -6721282 -6752558 986966 9536404 11527822 8149677
37692 8149677 7024060 10765728 13038574 8461096 724149 -3640321 -4477085 -5096779
37684 -5096779 -4535231 -138437 4922187 4796953 484762 -1588882 -110740 58538 -2165352
37675 -2165352 -1720217 2703771 4601288 -431167 -7475219 -9757652 -7831938 -6294859
37667 -6294859 -5924756 -4487071 -2157422 -1095801 -1703271 -3242476 -6039545 -9575330
37659 -9575330 -10798033 -7993414 -4128384 -2760157 -2818670 -1209762 1482482 2050016 -49255
37650 -49255 -2528771 -4419124 -6478474 -8017422 -7016101 -3475785 215059 2157070
37642 2157070 1832094 -1094187 -5948834 -9486720 -8258527 -2850138 2627359 5455237
37634 5455237 6543740 7643158 8587326 8069804 5748344 2877952 1342162 1935179 3290401
37625 3290401 3249167 1593328 143199 -151175 -159742 71417 2108272 5596972 6868547
37616 6868547 3779768 -443896 -1347854 756580 2357498 2493263 2847976 3199983 1347666
37607 1347666 -2269357 -4051734 -2380635 29903 133265 -1805526 -3752616 -4743245
37599 -4743245 -4951419 -4852294 -5371268 -7117598 -8536478 -6672742 -1111581 4272848 5101571
37590 5101571 1397097 -2548710 -3028031 -681067 855642 -529222 -3132274 -3987976
37582 -3987976 -2716358 -1510994 -1844146 -3084579 -4365651 -5630065 -6404115 -5839946 -4564931
37573 -4564931 -3927468 -2802305 1462980 7605323 9952719 5953826 465335 -833677
37565 -833677 1176957 2213452 1604406 1015534 -935961 -6455346 -12368495 -12754129 -7827814
37556 -7827814 -4068324 -4632123 -5484602 -2795414 1188272 2318408 351168 -2312256
37548 -2312256 -4491175 -6098836 -6409789 -4693555 -1265335 2920502 6172085 5933074
37540 5933074 1586561 -2910892 -2837038 731838 2166817 -553829 -3471174 -3308024 -1571431
37531 -1571431 -372391 843540 2062925 1129778 -1636863 -2014567 1386099 3598705
37523 3598705 838404 -2804277 -1566202 2657017 3478611 324791 -1164859 1495899
37515 1495899 4402189 4445790 3902271 5228051 5786269 1693659 -5273752 -8601544 -4970542
37506 -4970542 1450019 3952420 1087092 -2507851 -2782070 -1016215 -414597 -679872 656516
37497 656516 3109766 3811721 2808787 3036889 4427322 3110116 -1806920 -5704913 -5464366
37488 -5464366 -4389325 -6528024 -10034088 -10316446 -6699249 -1932341 2153073 4585928
37480 4585928 3693864 -120753 -2537593 -598562 2516834 2432226 785880 2314706 6646480
37471 6646480 8658766 6198498 2280698 27286 36647 2193770 5544707 7042562 4963711
37462 4963711 2688497 4282306 7449274 6502250 1648025 -950550 1415196 4834953
37454 4834953 5964985 6181779 6844302 6178631 3259977 294973 -1169865 -1965408 -1810909
37445 -1810909 989039 4785352 4783857 91809 -4505495 -5870208 -6264918 -7562524 -7636668
37436 -7636668 -5599484 -4677129 -6019040 -5413845 -652976 3414248 2332275 -714565
37428 -714565 -864656 186724 -1465269 -3665216 -1712116 2969550 5187828 4703738 5092718
37419 5092718 5750721 3001184 -1735124 -3025165 -796021 -616981 -3688631 -4594372 -1083048
37410 -1083048 1717854 94144 -2439149 -2269596 -2031829 -4565415 -6240037 -2791824
37402 -2791824 2235848 1920485 -3388758 -6694939 -4883475 -2128594 -2146374 -3077375 -2288859
37393 -2288859 -1303366 -2424076 -3810250 -2167683 1134503 922676 -4392436 -9767584
37385 -9767584 -9691104 -5253428 -2610201 -5159171 -9679955 -10664535 -6663844 -1326108 851456
37376 851456 -1163701 -4398924 -5046121 -2314219 1014912 2227685 1897815 2068417 2392017
37367 2392017 883908 -1851961 -2793554 -1596260 -1525630 -3593632 -4074023 -983006 1070189
37358 1070189 -2784860 -9463829 -11613841 -7848773 -3434730 -1428054 491829 3461088
37350 3461088 4097803 661714 -2431395 -296442 5269583 8182222 5831083 1084538
37342 1084538 -2427421 -3944807 -4524655 -4670232 -3831585 -1491936 1726104 4206201 4841993
37333 4841993 4050344 2826147 1569411 685237 1112204 2707906 3351809 1689329 -418226
37324 -418226 -519796 698712 1127076 1087074 1775619 1344938 -2600322 -7292992 -7268178
37315 -7268178 -2998565 -1132837 -4580620 -8335414 -7773042 -5251888 -4649004 -4637209 -2363654
37306 -2363654 317795 -216236 -3009363 -4377316 -4096751 -4757161 -6354559 -6269160 -3858228
37297 -3858228 -1008963 1140797 2377105 1330977 -2913421 -7847075 -9845161 -8887174
37289 -8887174 -7661315 -6889750 -5182100 -2742550 -1327586 -838132 432980 2434333
37281 2434333 3658599 4322544 5632107 6374606 4268121 699974 61303 3722136 8089112
37272 8089112 9268287 6787329 2679506 -91938 1346702 6827847 11466685 10564169
37264 10564169 5802808 2673666 2487579 1849054 -259303 -742793 1370423 2801686
37256 2801686 1878181 983556 1016467 -955811 -5557941 -8005204 -4852267 850560 4902353
37247 4902353 7694594 10272385 9532220 3266905 -3438419 -3357849 2909366 7821728 6960606
37238 6960606 3235357 1396730 2764639 5511823 6761188 4555368 436413 -875612
37230 -875612 2975162 8373934 10568730 9770182 8672208 6609362 1476391 -4301331
37222 -4301331 -5695787 -2454641 995928 2634264 4038506 4727995 1978882 -2718828
37214 -2718828 -3716111 261458 3924403 4143878 4263169 6397540 6435238 1889173 -1586559
37205 -1586559 1579285 6901772 5973929 -417291 -3621677 -397997 3381451 2858014
37197 2858014 320027 -858774 -1593654 -3049453 -2763028 1001822 4912282 4674428 785517
37188 785517 -3258235 -5969625 -7624384 -7341082 -4342933 -736876 601184 -30943 -540425
37179 -540425 -1155844 -3472479 -6232922 -6245684 -3516274 -1340647 -776877 668578 3549695
37170 3549695 4121037 87649 -4917518 -5985885 -3476000 -1441708 -1575350 -2486554 -3610240
37161 -3610240 -5692043 -7704756 -7195894 -4320454 -2367935 -3399193 -5936230 -7728083
37153 -7728083 -8271927 -7662223 -5428017 -1934718 901951 1608214 528746 -1446340 -3893127
37144 -3893127 -6074320 -7121788 -7629306 -8903184 -10022048 -8403767 -4424710 -2255354
37136 -2255354 -3942852 -5700449 -3223140 1642170 3308841 206736 -3729750 -4927315
37128 -4927315 -3914613 -2838916 -2382195 -2178401 -2129716 -2319812 -2911184 -4289653 -5927365
37119 -5927365 -5517994 -1405596 4081652 6082689 2737535 -2480890 -4659078 -2190581
37111 -2190581 2892235 7735437 10778192 11864287 11153997 8317121 3596858 -289025
37103 -289025 466222 5707026 9737384 7781911 2573816 773866 3650803 5826441
37095 5826441 3538082 -768151 -3698300 -6023634 -9508570 -12396013 -11973239 -9290627
37087 -9290627 -7478287 -6809619 -5069451 -2027230 -37349 -117670 -264232 1760308 5820834
37078 5820834 9923273 12012139 11298571 8889752 6786697 5453322 3296859 -478377
37070 -478377 -3963974 -5038877 -4272012 -3394241 -2410158 -702512 404780 -655123 -2247319
37061 -2247319 -1269908 1777157 2957449 647624 -2224229 -2741260 -1738165 -1516335 -2500141
37052 -2500141 -3830828 -4869155 -4313876 -250302 6578746 11562347 11037146 6990504
37044 6990504 4259178 4132627 3825605 1798568 35973 191716 568329 -1088780 -3719766
37035 -3719766 -4211264 -1778086 1006093 1606949 259102 -1314372 -2586829 -4327618
37027 -4327618 -6427169 -7090852 -4894748 -894794 2323200 3588791 4210108 5819413
37019 5819413 7997639 8777594 7111220 4004992 1225757 -326870 -671210 21152 1296017
37010 1296017 1707943 -520628 -5259261 -9404333 -9236536 -4218637 2136943 5510940
37002 5510940 4513578 1136932 -1762848 -2953401 -3335928 -4587011 -7144439 -9344430
36994 -9344430 -8922826 -5509057 -1156785 1577037 1356610 -1798958 -6454189 -9550401
36986 -9550401 -8413591 -4233715 -1633462 -3024587 -5212788 -3900450 184720 2753525
36978 2753525 2282707 1074089 414471 -1034609 -3227662 -3256389 201493 4190378 5348733
36969 5348733 3820130 1463200 -947087 -2594211 -1797587 883889 1635561 -1231212
36961 -1231212 -3661321 -1520225 2776905 4143914 3167966 4540285 8012482 7794837
36953 7794837 2239174 -2311050 -369090 5077138 7530863 5664221 3010822 1931583
36945 1931583 2075036 2974339 4298570 4626550 3186687 1809761 2315393 3207547 2014430
36936 2014430 -250840 -314329 2403579 5317174 6608029 6379364 4460653 786152 -2124060
36927 -2124060 -1110591 2459853 3341617 -425968 -4561294 -4547970 -1312659 1381584 2289094
36918 2289094 2629897 2982927 3305066 4476105 6794773 7986989 5651658 1084884 -2090500
36909 -2090500 -2736182 -2875510 -3659791 -3687818 -2139084 -889204 -1888698 -4190130 -5289604
36900 -5289604 -4323356 -2326532 -123501 2139237 3474762 2192452 -1257719 -2984361
36892 -2984361 576517 7502197 11246679 8080169 2010782 26392 3430297 6937852
36884 6937852 6359276 3558097 2267482 2360113 1311415 -783959 -1333154 298632 1756798
36875 1756798 1322155 -37832 -655491 -73350 1375093 2952292 3197796 1073604 -2366450
36866 -2366450 -5227255 -7511447 -10299734 -12343906 -10612968 -5044843 299487 2254531
36858 2254531 2024592 2156856 3010772 4333584 7279771 11761747 14304838 12334568 8876115
36849 8876115 8849357 11708147 12236583 8512852 4416406 3257259 3301256 1566642 -1687743
36840 -1687743 -4771204 -7638389 -10156716 -9967667 -5677225 -475184 1096440 -944849
36832 -944849 -2743234 -2442277 -1542868 -782950 929936 2650285 1025804 -3928386 -6737711
36823 -6737711 -3693836 953325 606215 -3756185 -4676894 834457 6999336 7823277 5190900
36814 5190900 4896369 7918366 10146402 9316895 7688002 7572553 7847158 6065959 1653614
36805 1653614 -3997154 -8781382 -10654687 -9078115 -6300372 -5310156 -6021351 -5629153 -3237533
36796 -3237533 -1393885 -1913161 -3101717 -2932906 -2140778 -1809554 -701779 1949861 3581443
36787 3581443 2032870 -33538 1025663 3187343 1284601 -4444893 -8170853 -7396519
36779 -7396519 -6095253 -7215608 -8029863 -5979272 -3608760 -3529686 -3359650 -699314 1167463
36770 1167463 -1419820 -4957705 -3576806 853861 1258034 -2721625 -3797866 587380
36762 587380 3384335 -797183 -6764675 -6722580 -1901057 358260 -2065432 -4407252 -3461123
36753 -3461123 -1444048 -971965 -1319407 -1218297 -1629549 -3781358 -6719701 -8259206 -6965531
36744 -6965531 -2731828 2901434 6674361 5855643 1358221 -2851022 -3945894 -2413899
36736 -2413899 130982 3178415 6299462 7672325 5452055 141964 -5518706 -8776241
36728 -8776241 -8335572 -4259881 2283582 8833896 12193846 10536210 5406378 790320
36720 790320 -617209 445807 2195857 4766967 8382174 9867980 5397718 -2569170
36712 -2569170 -5986867 -1594118 3859873 3003032 -1419227 -1183699 4416161 7474972
36704 7474972 3336548 -3534049 -7279004 -7843024 -7440085 -5505169 -1484995 1514986
36696 1514986 544661 -2519420 -4208418 -4802513 -6302974 -7525365 -6050574 -3516237
36688 -3516237 -3869582 -6781109 -7576956 -4142570 305719 2214866 1825774 1230415 1514518
36679 1514518 3066051 5855625 8073356 7099502 3266543 243610 136506 538291 -1670212
36670 -1670212 -5688142 -8287669 -8414146 -7724245 -7306475 -6414289 -4523891 -2555315 -1438439
36661 -1438439 -911018 -469301 -480032 -1493424 -3040190 -3970584 -3834691 -3287858 -3152897
36652 -3152897 -3661992 -4679677 -5946705 -6700506 -5717451 -2502172 1811956 5328504 6898981
36643 6898981 6406071 4299770 1642155 -253746 -1358488 -3136285 -5827608 -6945261
36635 -6945261 -4823069 -2238918 -2945619 -5369070 -4355517 464995 3383507 1540023
36627 1540023 -338762 2284255 6160566 5517348 1161091 -1668905 -2058379 -3448583
36619 -3448583 -5960294 -5467248 -978528 3134554 3990525 4091913 6096653 8095927 6894387
36610 6894387 2734523 -1826032 -5160616 -6463968 -4712113 -33135 5316437 8864741
36602 8864741 9703794 7998468 4684996 1988421 1815404 3031777 2646690 33756 -2539668
36593 -2539668 -3602668 -3659164 -2764677 -652494 580474 -1694135 -5446047 -5411149 -881864
36584 -881864 3050445 3644811 4095858 6349007 6579861 2118515 -2722995 -3069457 -1027306
36575 -1027306 -1047796 -1929490 107428 3683430 4389064 2235893 362580 -1489863 -5229701
36566 -5229701 -8083172 -5811211 -1286085 -1618056 -6604877 -8546851 -4878970 -2255746
36558 -2255746 -5041320 -7978597 -5068607 1075176 4352418 4332312 4498216 5488466 5869264
36549 5869264 6520248 8687458 10035392 7892745 4509698 3952171 5287153 4055454
36541 4055454 -385399 -4070522 -4586139 -3125203 -466027 3940113 8031836 7412278
36533 7412278 1732365 -3241932 -2558867 2046399 5772478 7290024 8367142 9155898
36525 9155898 7920070 4910485 2792417 2598737 2277484 515708 -553945 1504246
36517 1504246 5347749 7437449 6786388 5356750 3960823 1122435 -2852849 -4052690
36509 -4052690 -47586 5419678 6523453 3181949 852937 2429870 4528055 3320528
36501 3320528 262911 -787809 526105 1408552 692971 17139 776477 2708939 5326695
36492 5326695 8245451 10107006 9600646 7743736 6762697 6413247 4138901 -209352 -2742874
36483 -2742874 -673393 3167410 3725450 394247 -2665807 -2419551 -99033 1909667
36475 1909667 3180473 3772895 2388482 -1440970 -5110154 -5982396 -5792888 -8489781 -13480161
36466 -13480161 -14840907 -9087712 -669480 3181579 1173170 -1753327 -1893790 -908696
36458 -908696 -2022661 -5248635 -8001885 -8546710 -7094930 -4498792 -1421539 1423576
36450 1423576 3230666 3618264 3196518 3546939 5832916 8726094 8796016 4609245 -367783
36441 -367783 -1389320 1230001 2441690 -57120 -2083701 867436 6465415 8366949
36433 8366949 5064344 1607275 1806850 2772319 -134254 -5568829 -7432735 -3463297
36425 -3463297 1325525 1437178 -1876151 -3280018 -1539090 -697939 -2687839 -3325477 1414990
36416 1414990 8293769 10202561 5446504 -566057 -2837329 -1893320 -540540 360336
36408 360336 596864 -1602038 -7027476 -12361187 -12925570 -8275221 -2596318 461100 1255022
36399 1255022 2119610 3672134 4215075 2172794 -1728738 -4948925 -5652497 -4212598 -1836458
36390 -1836458 1332396 5318670 8293580 7945813 5138172 3496557 4309961 4612072 2209898
36381 2209898 -45277 2036088 7690378 11776498 10737627 5140427 -2693333 -10005275
36373 -10005275 -12892781 -8551702 259667 6117093 4405218 -1888515 -6248724 -5611466
36365 -5611466 -1853462 1546745 2109041 -860063 -5427977 -7548406 -4811536 290970
36357 290970 2807424 1171121 -1303565 -1153229 1040084 2276004 1299164 -538587 -1703140
36348 -1703140 -2063863 -2334155 -3371206 -5939600 -9758577 -12655708 -12078491 -7890806 -2561426
36339 -2561426 1606794 3987194 4219877 1616182 -2759437 -5589791 -4975784 -2937034
36331 -2937034 -1901355 -478775 3841471 8885717 9152586 3570508 -2276962 -3440461
36323 -3440461 -1617189 -1468146 -3844581 -5784333 -5414006 -3721619 -2307151 -1911844 -2685910
36314 -2685910 -3976498 -4437409 -3881233 -3998579 -5659711 -6930579 -5772388 -3209439 -1415105
36305 -1415105 -191679 1676321 2971784 1731971 -284200 917716 5213128 7697524
36297 7697524 5762257 3006169 3801789 7023313 8099916 5366701 1457924 -640490
36289 -640490 -429541 846619 1850192 2013259 1859670 2324464 3272844 3553560 3116610
36280 3116610 3649148 5812349 7197687 5069521 594200 -1784032 482467 5003953
36272 5003953 7188910 5053060 700047 -2331261 -2457078 -939542 -67588 -939747 -2946135
36263 -2946135 -4769805 -5434389 -4832928 -3890107 -3855645 -4734140 -4902281 -3246330 -1092834
36254 -1092834 -605432 -1720594 -2495894 -2234249 -1882712 -1090238 2143308 7435552 10403144
36245 10403144 7677614 1849379 -1431981 -402200 1605575 1635866 922548 2413327
36237 2413327 6457036 10083317 9752794 4611513 -2005544 -4529558 -238890 7376521
36229 7376521 11900922 10960905 8166236 7633784 8974452 9448057 9025397 10062597 12099128
36220 12099128 10293463 1155262 -11442000 -18413175 -14346549 -3185456 5843524 7454963
36212 7454963 4386209 2468199 3516325 4685651 3857031 2831079 4004695 6000979
36204 6000979 5273121 1661931 -527149 1710477 5345073 4752598 -972235 -6953490
36196 -6953490 -9089523 -8705029 -9000128 -9591127 -7957069 -4970341 -4591127 -7361008 -8423397
36187 -8423397 -4477680 617057 872474 -3238487 -5604124 -3282042 93014 543536
36179 543536 -946647 -1616693 -1874178 -3616129 -5694285 -4876932 -846198 2938747 3668338
36170 3668338 2069809 403987 -387837 -758127 -1214422 -1755778 -2061655 -2102440 -2797676
36161 -2797676 -5011389 -6963464 -4561299 3131063 10270731 10002539 3610260 -506022
36153 -506022 2051689 6244759 5592798 1058284 -1974649 -1962930 -1299849 -407167 2383281
36144 2383281 5579121 5065443 1069351 -557214 3604108 9163658 9465286 3615056
36136 3615056 -3828684 -8841875 -10587849 -9662322 -6844936 -3389157 -584105 1001787
36128 1001787 1169302 -18088 -1355561 -1190515 38765 -25952 -1740544 -2283302 -356101
36119 -356101 831237 -1586548 -4809238 -4106158 -299736 1252764 -1384994 -4770581
36111 -4770581 -6408687 -7737697 -9236212 -7928965 -3067106 230841 -2314025 -6867852
36103 -6867852 -6301451 -710346 2670183 233077 -3011966 -1313356 3644306 5952557
36095 5952557 3727845 55783 -2509367 -4000303 -4104779 -1665583 1956323 3007681
36087 3007681 753061 -700448 1378078 3585782 1741071 -1628939 -566884 4504466
36079 4504466 6510012 2475834 -1620626 -102937 3569879 2359462 -3586802 -7847908
36071 -7847908 -7574747 -5995949 -5300986 -3491496 114714 2108718 777436 -26157 3285629
36062 3285629 7832514 8316699 4997835 3010490 4733861 7180689 6976964 4123503
36054 4123503 151884 -4119600 -7677970 -8736684 -6749480 -3540934 -1293604 -531423
36046 -531423 -660689 -1046265 -890625 403509 1919187 1773323 -139017 -1529626 -870982
36037 -870982 585082 1253607 1603560 1989359 237251 -5083938 -10053560 -8528031 -729098
36028 -729098 5371828 3534572 -2998853 -6257288 -3755744 -172524 169046 -1594538
36020 -1594538 -1887237 490202 4038006 6788075 7337204 5351492 2512091 1581041 3069607
36011 3069607 4019679 1637144 -2860624 -5754540 -5526309 -4138847 -3673833 -3601647 -2304768
36002 -2304768 -217115 20908 -3057749 -6937725 -6958455 -1569616 5296686 8520534 7749524
35993 7749524 6925141 8056984 8523640 5859763 2255362 1467075 3038541 3036540 129621
35984 129621 -2346800 -1131464 2691576 5522651 5722918 4718516 4359629 4590896 4008035
35975 4008035 2113499 316547 280504 1707473 2770541 2656642 2242993 1984597 1052493
35966 1052493 -491807 -778958 897011 2096866 484496 -2589749 -4454947 -5605666
35958 -5605666 -8417544 -12210186 -13516001 -11471219 -9150047 -8665857 -8572835 -7545600 -7013924
35949 -7013924 -7813738 -7399850 -3636580 817264 1597229 -930013 -2042602 393612 2781890
35940 2781890 960604 -3970516 -7156494 -6141579 -3254351 -1947577 -2863732 -4368120
35932 -4368120 -5159796 -4587164 -1699022 3302628 7064589 5905199 1467566 55752
35924 55752 4393027 9511202 9912437 7457674 7513737 9760695 8926195 4026707 383961
35915 383961 1172374 2917044 1967005 182571 544013 1403180 -456868 -3981043 -5485391
35906 -5485391 -4216992 -2319699 -866991 227187 -160330 -2602103 -4007837 -956081
35898 -956081 3888402 3570225 -3498539 -9955282 -8386393 -968062 3238127 -583323
35890 -583323 -7995935 -11792253 -10527564 -8491455 -8599686 -8508717 -4860451 1046298 4459895
35881 4459895 3164236 -525326 -3663659 -5562723 -6026531 -3821838 1085378 5893067
35873 5893067 7721381 6623484 4231527 1187830 -1992696 -3227461 -928548 2858010
35865 2858010 4003437 1195342 -2446446 -2883839 743236 5395222 6820463 3531805
35857 3531805 -1319877 -2907848 69769 4536688 7576866 9322799 10263140 8754433
35849 8754433 3769863 -2103345 -5321000 -5519568 -4449378 -2539405 493631 3205860
35841 3205860 4018057 4185928 5840355 8024073 8191299 6785197 6375008 6714065 5085150
35832 5085150 1942182 1645168 5971635 10667530 10723597 6478762 2417333 1799766 4122016
35823 4122016 6336569 5330737 554621 -4948272 -7361123 -6192152 -4026728 -2501083
35815 -2501083 -1024384 425852 366233 -1341953 -2492515 -1684765 -52853 1266916 2699439
35806 2699439 3849957 2487946 -1878997 -5841304 -6097877 -3869537 -2727813 -3359509
35798 -3359509 -3158484 -373785 3690044 6539482 6947681 5569805 4080668 3518335 3217116
35789 3217116 2221384 1568096 3038676 5226633 3941683 -1574623 -5763300 -3282815
35781 -3282815 3451487 6966715 4156498 -685183 -2260151 -99625 2904251 4613224
35773 4613224 4511165 2728268 338427 -602121 785602 2574942 2013322 -1193704 -4666164
35764 -4666164 -6041339 -4847442 -2168402 135897 -60876 -3766975 -9258200 -13003428
35756 -13003428 -13121626 -11040614 -8885080 -6548972 -3093958 48822 105275 -2667661
35748 -2667661 -4517703 -3194868 -807168 -71795 -328109 250962 774354 -678802 -2979502
35739 -2979502 -3374828 -2340016 -2976358 -5393151 -5824343 -2558882 949233 837021 -2266576
35730 -2266576 -5159928 -6250918 -5559437 -2988428 672776 2895479 2441783 1822644 3754655
35721 3754655 6286478 4896902 -760888 -5626822 -5512551 -1768939 1597432 2975658
35713 2975658 3273880 2768692 697971 -2205219 -3410323 -1911825 -127814 -942350 -4008586
35704 -4008586 -6833407 -8570791 -10061242 -10437632 -7399670 -2079870 308717 -2371894
35696 -2371894 -4735331 -892233 6433740 9141689 5014064 -217345 -2322717 -3639725
35688 -3639725 -6551418 -8038916 -4910060 -6647 1649428 51523 -968823 51357
35680 51357 1593521 3116520 5144359 6301925 4571072 1327832 378192 2817084 5940424
35671 5940424 7199691 6339368 3951104 1008910 -454063 585574 1691158 -60556
35663 -60556 -3124113 -3515484 -1541287 -1499329 -3849034 -3333937 2423801 7637694 6010414
35654 6010414 -55594 -3026852 -796153 1734312 901567 -1218396 -1510557 -585692 -684309
35645 -684309 -1793899 -2310583 -1857801 -1292787 -886802 -281171 296888 202270 -581387 -1641063
35635 -1641063 -2916429 -4152003 -4098072 -1842769 1058828 1497750 -1402846 -4707961 -5010854
35626 -5010854 -2554709 -747991 -1955871 -5128513 -7660918 -8206416 -6952022 -4201216
35618 -4201216 -107856 4167233 6262712 4622119 615622 -2275334 -2047398 -475219
35610 -475219 -946903 -4294102 -8044560 -9873622 -10085812 -9889069 -9008748 -6679388 -3727034
35601 -3727034 -1633324 -297914 1235266 2505585 2449666 2089617 3673166 6873541 8512276
35592 8512276 6844584 3835454 2345801 3157419 5419132 7646288 7549713 3685634 -1530694
35583 -1530694 -3412528 -1181731 624284 -933248 -2420963 426855 5520524 7378606
35575 7378606 5333842 3632575 4049423 3775133 1442669 300490 3184694 7993843
35567 7993843 10804047 10910321 10108504 8814953 5837406 1477655 -1521584 -751830 2986016
35558 2986016 6015164 5183601 1249890 -1632904 -735781 1612566 953817 -3019577 -5540553
35549 -5540553 -2885178 2826234 6502219 6144632 4111008 3224177 3746476 4348136 4437713
35540 4437713 4602259 5262576 5737836 5002611 3152428 1493167 895216 737115 141079
35531 141079 -470830 -213728 412770 188359 -320677 1135069 5045790 8448396 8168960
35522 8168960 4878297 2336893 2849300 4881408 5418285 3541310 1026324 51104 1071137
35513 1071137 2796904 3697309 3464122 3260288 4356785 6162639 6060971 2213059 -3585968
35504 -3585968 -7258956 -7039965 -5138176 -4098427 -3622677 -2705361 -2667618 -5034964 -7903551
35495 -7903551 -8131577 -6323556 -5441052 -4846620 -920797 5604374 8766902 6238155 3287015
35486 3287015 4001268 4130667 -1519960 -9020912 -10077224 -4561055 -572445 -2439691
35478 -2439691 -6010128 -6770585 -5771099 -5382700 -5163294 -4671491 -5213688 -5894876 -2863168
35469 -2863168 4063636 8601657 6076919 577876 -712263 2370651 3566094 -479974
35461 -479974 -6195644 -8302251 -5513418 -773208 1730595 -203871 -4800271 -8042824
35453 -8042824 -8556650 -9064658 -11405553 -12826719 -10326316 -6219702 -5057240 -6475158
35445 -6475158 -6002819 -2547784 38768 -529642 -1940833 -2278412 -3130980 -5134232 -5011895
35436 -5011895 -927977 2863564 1484472 -2927976 -4366343 -2455960 -2941189 -8244588
35428 -8244588 -13340597 -13357794 -10469163 -9576824 -10593619 -9390086 -4576601 851422 3867309
35419 3867309 3835061 1190821 -2675015 -4525879 -2135916 1661630 1580299 -2868234 -6708025
35410 -6708025 -6954964 -6073444 -6129421 -4740383 -615187 1567508 -2573893 -8945837 -9440858
35401 -9440858 -3478439 1228220 -87385 -3159446 -1875510 3335332 7538980 8483118
35393 8483118 8073282 8062172 7541894 5120665 1807209 488033 2395106 4931061 4465621
35384 4465621 1257315 -707854 386345 1449913 -328669 -2860305 -3147563 -2869866
35376 -2869866 -5243205 -8531962 -8328440 -5078790 -3260236 -3508011 -2213307 447299
35368 447299 -712775 -6808060 -11373333 -9666354 -5726301 -5628547 -8411869 -8810009 -5615339
35359 -5615339 -2256759 -1178376 -1983287 -3709281 -5471726 -6082171 -5572252 -5528435 -6123518
35350 -6123518 -5322254 -2837887 -1554574 -2738031 -3607684 -2459035 -2024272 -4217972 -5903682
35341 -5903682 -4294112 -2345217 -3554601 -5259222 -3044336 1542746 4115084 5222358
35333 5222358 7805479 9378503 5014053 -2917019 -6486385 -3966649 -1620340 -2685252
35325 -2685252 -3072099 -535281 253448 -3775733 -7538265 -5372855 102374 2617735
35317 2617735 1866828 2389424 5141156 6145827 3192185 -826451 -2074390 -377120
35309 -377120 1242971 257395 -2508690 -3437256 -230997 4571284 5865756 2083190 -3017926
35300 -3017926 -5192439 -4026100 -1616605 450788 1316388 167981 -2957669 -6982578
35292 -6982578 -11117711 -14733061 -15792934 -12200916 -5480149 -129597 1920278 3237310
35284 3237310 5887898 7864403 6704394 3615519 1264245 8745 -781553 16003
35276 16003 3335795 6804530 6907965 3533433 -306265 -2544538 -3449495 -3726411 -3712851
35267 -3712851 -4075730 -5186723 -6054051 -5556259 -4285124 -3637542 -3720536 -3730738 -3774067 -4686393
35257 -4686393 -6423209 -7902939 -8122350 -6740094 -4395789 -2907316 -3589938 -4689117
35249 -4689117 -2652662 2746070 6971881 6402594 3120766 1465880 1920235 1670498 -282309
35240 -282309 -2284332 -3634711 -5326815 -6977539 -6328431 -2791102 908641 1773408 -183161
35231 -183161 -2270003 -1697213 2195958 7253617 10289155 10399620 9706305 9957188 10030677
35222 10030677 8343611 5702998 3410775 688740 -2744452 -3620633 813621 6828072
35214 6828072 7564113 2418356 -2246911 -2534951 -1382788 -1608981 -811557 2889630 5515797
35205 5515797 3295970 145251 2439858 8469583 10123715 4745144 -1530967 -3424746
35197 -3424746 -2998270 -3758741 -4033506 -753630 3946751 4968343 1323143 -3212863 -5425194
35188 -5425194 -4997857 -2515222 1103667 3628170 3567606 3000143 4862829 7734497 7423258
35179 7423258 3850010 1514938 2053599 1683454 -1511671 -3279219 -385535 2808854
35171 2808854 926939 -2776057 -646963 6853924 10564598 5470766 -2764163 -6524443
35163 -6524443 -5515552 -3771549 -2339056 352170 3805310 5681284 5310743 3699224
35155 3699224 1359964 -1072584 -1610055 733077 3539045 3768468 1961703 1062081 2104035
35146 2104035 3765467 5202699 6440412 6732378 5534359 4521304 5492728 6629982
35138 6629982 4268614 -1418924 -5969436 -6555538 -4986984 -3642116 -1914687 1131386
35130 1131386 3599653 3310314 1496242 621637 -175611 -3586385 -8270845 -8850692 -3540927
35121 -3540927 1824677 799716 -4742048 -6910596 -2574495 2696678 2683277 -1755219
35113 -1755219 -5658725 -6922984 -6253674 -3088426 3024239 8263172 7650522 2579964
35105 2579964 -466820 286788 -409173 -5025279 -7700281 -3178605 4033813 5648196
35097 5648196 1280140 -2351081 -1854515 -204186 -87749 -570630 -890693 -2021797 -3375384
35088 -3375384 -2733919 -591750 -113587 -1742719 -2442491 -1507968 -2113077 -5094009 -6341351
35079 -6341351 -3469547 -369203 -1065249 -3046847 -1676517 1649461 1377524 -3441246
35071 -3441246 -7727455 -7821506 -5518632 -3644322 -1966170 323340 1456251 -422270
35063 -422270 -3363287 -3404710 56888 3344326 3530499 2174196 2532472 4581541 5215854
35054 5215854 3105092 678789 318457 988649 609984 -158452 626055 2020255 919246
35045 919246 -2868794 -5541186 -4479491 -1881182 -1492791 -3585070 -5071827 -3569690
35037 -3569690 191709 3327500 3080878 -1141144 -6976398 -10697699 -10158546 -5989091
35029 -5989091 -290477 4693317 6946483 5758539 3135644 2638415 5933330 11263718
35021 11263718 15317239 15462291 10842928 3656949 -849550 1175543 6916539 9057647
35013 9057647 4501417 -2032359 -4672215 -3347267 -1630833 -868291 -113643 259548 -996422
35004 -996422 -2918769 -3416198 -2953232 -3652579 -4927748 -3665889 730066 4924170 6371693
34995 6371693 6317312 6403913 5260445 1363382 -2506748 -1463939 4460718 8730184 5875313
34986 5875313 -1201678 -4665791 -2123089 498065 -1715503 -4621590 -1100384 7187186
34978 7187186 10780704 5650153 -1305700 -2710769 -366225 237636 -347867 1997124
34970 1997124 6105613 6707039 3380458 1173431 1986173 2009687 -901732 -3475863 -2936647
34961 -2936647 -1327642 -1140522 -1240629 -150977 705563 204610 292846 2361619 4213769
34952 4213769 3794986 2560561 1835518 -506469 -5713669 -10020880 -9605689 -6666098 -5351813
34943 -5351813 -4481642 -533935 4232747 3994523 -801023 -3330217 -1049160 917630
34935 917630 -839031 -2586099 -1140551 -214256 -3607573 -7416366 -5622913 86088
34927 86088 2967329 1606219 725750 2356567 3134983 1271533 -138784 1054323 2314985
34918 2314985 1503781 1118940 3596755 5894414 3409179 -2627558 -6355812 -5361437 -3233255
34909 -3233255 -3442084 -4569531 -3598031 -1115928 -286390 -1832552 -3087977 -2213402 -641735
34900 -641735 -50508 813267 3838212 7444563 8119593 6044272 5519628 8390978 10559867
34891 10559867 7722328 1633049 -2958049 -5179334 -7142110 -7752585 -3477104 4117707
34883 4117707 7604921 3182110 -3653682 -5263690 -1170848 3355955 5077049 5033367
34875 5033367 4837706 4799667 5192544 6298311 7416386 7807983 7701950 6681399 2950107
34866 2950107 -3409092 -8509163 -9078259 -7032360 -6245756 -6502914 -4773207 -1302924 283961
34857 283961 -1092227 -2372059 -1390522 283754 537468 -428907 -1402893 -1704049 -795590
34848 -795590 1360863 3450933 4439664 5275735 6330124 4782494 -1336941 -7896032 -8781993
34839 -8781993 -4807210 -2664286 -4773096 -6600729 -5239689 -3685270 -4048062 -3425589
34831 -3425589 -387044 864633 -2227312 -4797362 -1884165 3129748 3723520 259411
34823 259411 -1640413 42328 2848422 5565370 8304160 8511380 3694601 -2498004
34815 -2498004 -3456974 928023 3957527 1813700 -2171499 -3904069 -3544857 -2357659
34807 -2357659 350821 4496438 7272837 6656463 4281840 2883565 3012200 3610362 3814943
34798 3814943 3223608 2193654 2258959 4313916 6470735 5978125 2961259 -209912 -2590594
34789 -2590594 -4712942 -5826446 -4805705 -3253639 -3492964 -3714326 31156 6487363
34781 6487363 9069213 4866997 -858036 -1731310 1834959 4445757 2675899 -2006224
34773 -2006224 -5128087 -2711649 4762400 11151732 10321627 3611042 -1724425 -1916066
34765 -1916066 -274034 -631519 -2378366 -3959707 -6083375 -8489281 -8328257 -5212327
34757 -5212327 -3343782 -4752683 -4933393 78046 6375938 7514206 4031910 1666266
34749 1666266 2178477 2151664 10085 -1664844 -1009129 893494 3097453 5717909 7218466
34740 7218466 5003004 -117246 -3524971 -2280103 1516565 3885418 3452941 2023679
34732 2023679 2253338 5096749 8453924 8828947 5538433 2095508 1785385 3480986 4009910
34723 4009910 2748575 948140 -1595246 -5432937 -8427711 -8070237 -6049084 -6035173 -7200138
34714 -7200138 -4892536 1386326 5466389 2127453 -6148581 -12207319 -11681992 -5996295
34706 -5996295 -127873 1463963 -1316316 -3701124 -1390061 3640760 5505483 2589038
34698 2589038 -451784 261462 2933350 4215525 4360498 5302975 6518120 6086513 3998986
34689 3998986 1522980 -1135534 -3803474 -4380580 -851321 5323606 10173599 11315800
34681 11315800 9559361 7116049 5590399 4882023 3034384 -1372538 -5700510 -4750373
34673 -4750373 1999428 7593762 5985866 1100373 2074553 9748925 14131470 7745556
34665 7745556 -3816531 -9236302 -5946683 -1467854 -1408269 -2584223 -64940 4314759
34657 4314759 5034077 1680596 -697669 266347 825664 -2445863 -6813161 -7117664 -2913167
34648 -2913167 1647412 3849050 4799550 5913965 6322021 4786332 1942915 -572086
34640 -572086 -1824737 -1615790 -50650 2177234 3934584 4487422 3588600 1069702 -2507077
34631 -2507077 -5280605 -5822071 -5099065 -4854195 -4482598 -2056890 1613635 3084571 1286093
34622 1286093 -566348 495040 3461692 5848224 7213687 7995692 7372329 5044926
34614 5044926 3053087 2761565 1860036 -2127236 -6746499 -7146632 -3268157 -306781 -1505266
34605 -1505266 -4406602 -5434092 -4486565 -3078516 -1198745 1304125 2577483 891232
34597 891232 -2525084 -5139596 -6244314 -6267074 -4793207 -2172910 -1390238 -4475599 -8025883
34588 -8025883 -6829051 -1916930 135112 -2821733 -4878386 -1560366 2482693 765280
34580 765280 -4033343 -3643689 2834168 7533646 6214212 4171528 6615328 10282262
34572 10282262 9957142 7649764 8222572 9618553 5756211 -1981033 -4726256 763459
34564 763459 6528952 4644838 -1908126 -4568103 -1069053 3841929 6954821 9355788
34556 9355788 11025194 9070752 3385629 -944812 -351816 1589514 -453448 -4735272
34548 -4735272 -4415673 1560818 5348289 912092 -6581087 -7107994 665157 8010125
34540 8010125 8304371 4654877 3221405 4193157 3620339 827372 -991675 -210814 1529650
34531 1529650 2619817 2929164 2300758 860267 475932 2643977 5257899 4959146 2482623
34522 2482623 1792062 3714303 4706575 2947004 1346854 2514051 4382165 3398492 -605378
34513 -605378 -4941723 -7182498 -6048380 -1767677 2695044 3539118 1175109 389304 3305764
34504 3305764 5670083 3283329 -1318175 -3006264 -2280609 -4002467 -8960092 -12115031
34496 -12115031 -9824789 -4302528 397130 3090032 4431436 4268144 2389548 217564
34488 217564 -249370 1519007 4499654 7159288 8007173 6307153 3050297 312991 -1002820
34479 -1002820 -1944455 -3473260 -4618098 -3613737 -476438 2420095 2542946 -223714
34471 -223714 -3347447 -4148504 -2500796 -672044 -451212 -1131044 -750034 1301822 3593449
34462 3593449 4270859 2841492 465963 -1297067 -2136015 -3190467 -5206342 -6932703
34454 -6932703 -6292592 -2919287 1484232 5006705 6593012 5830361 3395544 1312961
34446 1312961 778440 158016 -2417119 -4972810 -3558619 1679587 6104123 6997139 6198612
34437 6198612 5123757 2171907 -2241612 -3259548 1386302 6160603 4929145 65201
34429 65201 -1730336 -203396 -1049608 -5589731 -8488580 -6834255 -4473577 -4633681 -4296688
$$ [...]
##END NTUPLES=NMR SPECTRUM
##END=
