##TITLE=31Pdec_SR115_Ph
 , 24 sc
 5.4.2022
##JCAMPDX= 6.0         $$ Bruker NMR JCAMP-DX V2.0
##DATA TYPE= NMR SPECTRUM
##DATA CLASS= NTUPLES
##ORIGIN= UXNMR, Bruker Analytische Messtechnik GmbH
##OWNER= root
$$ XWIN-NMR		Version 3.5
$$ Tue Apr  5 11:09:30 2022 Russian Standard Time (UT+4h)  she@DPX200
##.OBSERVE FREQUENCY= 81.013821
##.OBSERVE NUCLEUS= ^31P
##.ACQUISITION MODE= SIMULTANEOUS
##.ACQUISITION SCHEME= undefined
##.AVERAGES= 24
##.DIGITISER RES= 16
##SPECTROMETER/DATA SYSTEM= spect
##.PULSE SEQUENCE= zgpg30
##.SOLVENT NAME= CDCl3
##.SHIFT REFERENCE= (INTERNAL, CDCl3, 0, 248.564)
##AUDIT TRAIL= $$ (NUMBER, WHEN, WHO, WHERE, WHAT)
$$ ##TITLE= Audit trail, XWIN-NMR		Version 3.5
$$ ##JCAMPDX= 5.01
$$ ##ORIGIN= Bruker BioSpin GmbH
$$ ##OWNER= she
$$ F:/spectra/data/she/nmr/P31/1/pdata/1/auditp.txt
$$ ##AUDIT TRAIL=  $$ (NUMBER, WHEN, WHO, WHERE, WHAT)
(   1,<2022-04-05 11:08:29.15 +0400>,<she>,<DPX200>,
      <created by zg, POWCHK disabled, PULCHK disabled
       configuration hash MD5:
       00 E9 B6 7A A2 85 ED C7 34 08 36 98 17 FE 4E 26
       data hash MD5: 32K
       26 2D 1C D2 EA 5B 19 8D 4E C2 A9 12 00 3E 11 FC>)
(   2,<2022-04-05 11:08:31.34 +0400>,<she>,<DPX200>,
      <Start of raw data processing
       efp BC_mod = 2 LB = 1 FT_mod = 6 PKNL = 1 PHC0 = -9539.915 PHC1 = 70.87561 SI = 64K 
       data hash MD5: 64K
       35 38 6F 51 48 DD 28 90 E2 2C 28 2E 09 07 EA 08>)
(   3,<2022-04-05 11:08:49.48 +0400>,<she>,<DPX200>,
      <pk PHC0 = -92.69923 PHC1 = 233.6 
       data hash MD5: 64K
       C0 26 CB C2 83 C7 C1 92 34 E7 AE 70 22 24 7A 8B>)
(   4,<2022-04-05 11:09:09.14 +0400>,<she>,<DPX200>,
      <abs ABSG = 5 
       data hash MD5: 64K
       45 B8 38 C3 2B 1A FC 17 A2 60 06 CA 08 19 0A 26>)
$$ ##END=
$$ 
$$ hash MD5
$$ A7 7C 57 3C 4E D3 F4 E6 C4 10 01 34 8E C8 A4 04
##$RELAX= 
##$RELAX= 
##$RELAX= 
##$RELAX= 
##$RELAX= 
##$RELAX= 
##$RELAX= 
##$RELAX= 
$$ Bruker specific parameters
$$ --------------------------
##$DU= <F:/spectra>
##$EXPNO= 1
##$NAME= <P31>
##$PROCNO= 1
##$TYPE= <nmr>
##$USER= <she>
##$AMP= (0..31)
100 100 100 100 100 100 100 100 100 100 100 100 100 100 100 100 100 100 
100 100 100 100 100 100 100 100 100 100 100 100 100 100 
##$AQSEQ= 0
##$AQ_mod= 1
##$AUNM= <au_zg>
##$AUTOPOS= <>
##$BF1= 81.014009
##$BF2= 200.13
##$BF3= 200.13
##$BF4= 200.13
##$BF5= 200.13
##$BF6= 200.13
##$BF7= 200.13
##$BF8= 200.13
##$BYTORDA= 1
##$CFDGTYP= 0
##$CFRGTYP= 5
##$CHEMSTR= <none>
##$CNST= (0..31)
1 1 145 1 1 1 1 1 1 1 1 1 1 1 1 1 1 1 1 1 1 1 1 1 1 1 1 1 1 1 1 1 
##$CPDPRG= <waltz16>
##$CPDPRG1= <>
##$CPDPRG2= <waltz16>
##$CPDPRG3= <>
##$CPDPRG4= <mlev>
##$CPDPRG5= <mlev>
##$CPDPRG6= <mlev>
##$CPDPRG7= <mlev>
##$CPDPRG8= <mlev>
##$CPDPRGB= <>
##$CPDPRGT= <>
##$D= (0..31)
0 1 0 0 0 0 0 0 0 0 0 0.03 2e-05 3e-06 0 0 0 0 0 0 0 0 0 0 0 0 0 0 0 0 
0 0 
##$DATE= 1649142508
##$DBL= (0..7)
120 120 120 11 120 120 24 19 
##$DBP= (0..7)
150 150 150 150 150 150 150 150 
##$DBP07= 0
##$DBPNAM0= <>
##$DBPNAM1= <>
##$DBPNAM2= <>
$$ [...]
##$SUBNAM3= <"">
##$SUBNAM4= <"">
##$SUBNAM5= <"">
##$SUBNAM6= <"">
##$SUBNAM7= <"">
##$SUBNAM8= <"">
##$SUBNAM9= <"">
##$SW= 501.771253377433
##$SWIBOX= (0..15)
0 1 3 0 0 0 0 0 0 0 0 0 0 0 0 0 
##$SW_h= 40650.406504065
##$TD= 32768
##$TD0= 1
##$TE= 0
##$TE2= 300
##$TE3= 300
##$TEG= 300
##$TL= (0..7)
0 120 53 12 22 120 120 120 
##$TP= (0..7)
150 150 150 150 150 150 150 150 
##$TP07= 0
##$TPNAME0= <>
##$TPNAME1= <>
##$TPNAME2= <>
##$TPNAME3= <>
##$TPNAME4= <>
##$TPNAME5= <>
##$TPNAME6= <>
##$TPNAME7= <>
##$TPOAL= (0..7)
0.5 0.5 0.5 0.5 0.5 0.5 0.5 0.5 
##$TPOFFS= (0..7)
0 0 0 0 0 0 0 0 
##$TUNHIN= 0
##$TUNHOUT= 0
##$TUNXOUT= 0
##$USERA1= <user>
##$USERA2= <user>
##$USERA3= <user>
##$USERA4= <user>
##$USERA5= <user>
##$V9= 5
##$VALIST= <valist>
##$VCLIST= <CCCCCCCCCCCCCCC>
##$VD= 0
##$VDLIST= <DDDDDDDDDDDDDDD>
##$VPLIST= <PPPPPPPPPPPPPPP>
##$VTLIST= <TTTTTTTTTTTTTTT>
##$WBST= 1024
##$WBSW= 4
##$XGAIN= (0..3)
0 0 0 0 
##$XL= 0
##$YL= 0
##$YMAX_a= 13642
##$YMIN_a= -17547
##$ZGOPTNS= <>
##$ZL1= 120
##$ZL2= 120
##$ZL3= 120
##$ZL4= 120
##$ABSF1= 248.5645
##$ABSF2= -253.2056
##$ABSG= 5
##$ABSL= 3
##$ALPHA= 0
##$AQORDER= 0
##$ASSFAC= 0
##$ASSFACI= 0
##$ASSFACX= 0
##$ASSWID= 0
##$AUNMP= <proc_1d>
##$AZFE= 0.1
##$AZFW= 0.5
##$BCFW= 0
##$BC_mod= 2
##$BYTORDP= 0
##$COROFFS= 0
##$CY= -3
##$DATMOD= 1
##$DC= 0
##$DFILT= <>
##$DTYPP= 0
##$F1P= 0
##$F2P= 0
##$FCOR= 1
##$FTSIZE= 65536
##$FT_mod= 6
##$GAMMA= 0
##$GB= 0
##$INTBC= 1
##$INTSCL= 5.30512e-09
##$ISEN= 30
##$LB= 1
##$LEV0= 0
##$LPBIN= 0
##$MAXI= 10000
##$MC2= 0
##$MEAN= 0
##$ME_mod= 0
##$MI= 50
##$NCOEF= 0
##$NC_proc= -7
##$NLEV= 6
##$NOISF1= 182.463
##$NOISF2= 159.3651
##$NSP= 0
##$NTH_PI= 0
##$NZP= 0
##$OFFSET= 248.5645
##$PC= 4
##$PHC0= -9632.614
##$PHC1= 304.4756
##$PH_mod= 1
##$PKNL= yes
##$PPARMOD= 0
##$PSCAL= 0
##$PSIGN= 0
##$REVERSE= no
##$SF= 81.014009
##$SI= 65536
##$SIGF1= 159.3651
##$SIGF2= -187.1042
##$SINO= 113.3802
##$SIOLD= 16384
##$SREGLST= <1H.CDCl3>
##$SSB= 0
##$STSI= 65536
##$STSR= 0
##$SW_p= 40650.406504065
##$SYMM= 0
##$S_DEV= 0
##$TDeff= 32768
##$TDoff= 0
##$TI= <>
##$TILT= no
##$TM1= 0
##$TM2= 0
##$TOPLEV= 0
##$USERP1= <user>
##$USERP2= <user>
##$USERP3= <user>
##$USERP4= <user>
##$USERP5= <user>
##$WDW= 1
##$XDIM= 65536
##$YMAX_p= 420085109
##$YMIN_p= -131723031
$$ End of Bruker specific parameters
$$ ---------------------------------
##NTUPLES= NMR SPECTRUM
##VAR_NAME=  FREQUENCY,     SPECTRUM/REAL,   SPECTRUM/IMAG
##SYMBOL=    X,             R,               I
##VAR_TYPE=  INDEPENDENT,   DEPENDENT,       DEPENDENT
##VAR_FORM=  AFFN,          ASDF,            ASDF
##VAR_DIM=   65536,         65536,           65536
##UNITS=     HZ,            ARBITRARY UNITS, ARBITRARY UNITS
##FACTOR=    0.620285442955139, 1,           1
##FIRST=     20137.2065510759, 0,            0
##LAST=      -20513.1999529892, 0,           0
##MIN=       -20513.1999529892, -131723031,  0
##MAX=       20137.2065510759, 420085109,    0
$$ Real data points
##PAGE= N=1
##DATA TABLE= (X++(R..R)), XYDATA
$$ [...]
43605D168021k430287j614471N50796P87787m25942o45015j478n92866k293644
43596b497099k484680j63825K349868K652030J192629j13913o59131j070771j335490
43587b130382p13220N58661R71434k52616j830971j951133n76071P66037J217979
43578c940282J386901J722939J489786K28307q59850l92449Q93930R19784o91966
43569G57100j942215j304996J74373N67650k10148o18461J02395J054477J191329
43560b28496N95867l8715l40308k33865L00292Q63547O27610n61405j530943j176722
43550a723138j62042J6771m90142m5595J447684J729640l33453k381681j762967
43541c704923M20916J158971L57693N08199J857905J699357p70511k559261j482758
$$ y = [4168021, 1737734, 123263, 674059, 1461846, 1035904, 390889, 389411, -203455, -2497099, -4981779, -5145604, -2795736, -143706, 1048923, 935010, 275879, -794892, -2130382, -2843602, -2284941, -1313507, -1566123, -3397094, -5348227, -5924298, -5158261, -3940282, -2553381, -830442, 659344, 887651, 27801, -364648, 529282, 1449066, 757100, -1185115, -2490111, -2315738, -1748088, -1958236, -2576697, -2474302, -1419825, -228496, 367371, 328656, -11652, -245517, 54775, 918322, 1545932, 984527, -546416, -1723138, -1885180, -1868409, -2358551, -2404146, -956462, 773178, 439725, -1941956, -3704923, -3284007, -2125036, -1767343, -1259144, 598761, 2298118, 1527607, -1031654, -2514412]
43532b514412N35879Q31426j55984o82981p57592r27436m80501N74953L26025
43523c250623j426169j328298K166906M746396K277451j911675j759068J526147
43515A041067J341338l000037m769805j002595K706512J781204k18381J151837
43507i68860L110005J019583k784789k584857J100053K535586J78193j649993
43499d5079n40120P16971j72544j324829p24295L05222J02795j55153J107565
43490g29467K634203K122912k27899k164405k453949j706405p08564M28669J515353
43481a289552J884481J148094j31458q99038p16213j41088K20920O29772J448425
43472B154343J859907P25663j231778j840230o03224M49959o0809q58894n27846
$$ y = [-2514412, -1978533, -1147107, -1303091, -1986072, -2743664, -3671100, -4151601, -3576648, -3250623, -4676792, -6005090, -3838184, 908212, 3185663, 1273988, -485080, 1041067, 2382405, -617632, -5387437, -6390032, -3683520, -1902316, -2120697, -968860, 2141145, 3160728, 375939, -2208918, -1108865, 1426721, 1604914, -45079, -585199, 131772, -40772, -1365601, -2089896, -1784674, -1681879, -1837032, -729467, 1904736, 4027648, 3799749, 1635344, -818605, -2525010, -3233574, -2804905, -1289552, 594929, 1743023, 1611565, 712527, -3686, -144774, 76146, 705918, 2154343, 4014250, 4739913, 3508135, 1667905, 1064681, 1514640, 1453831, 594937, 67091]
43463F7091N0086l35367p45740P1189J027595N27201m34532Q3857J319379R81696
43453B612455o04709q79213O06877J494411N44675p29325q60660k00179N60187
43444B544519J164395Q56539p80376k012597q70394J127476N96346k082268k762059
43435b218419j53348J885867O22163j237649m32785J412077J000168r00125j145789
43426a167840L29401J014057N42982P58086J670262J384674l7316m78316J74867
43417D190857l76255k423265l108948j106804R52436P09887k79357L47874J587427
43408D93852J144555j82732J20288J435674N62896k572673l742870o26257L129125
43399b38142K800297p41589k615564j003514J013189P14273o62740p43231L65584
$$ y = [67091, 117177, -218190, -963930, -892741, 134854, 662055, 227523, 311380, 1630759, 2612455, 2007746, 1128533, 1735410, 3229821, 3774496, 3045171, 2184511, 1984332, 2544519, 3708914, 4565453, 3785077, 1772480, 902086, 2029562, 2625908, 543640, -2218419, -2371767, -485900, 136263, -1101386, -1534171, -122094, 878074, -22051, -1167840, -838439, 175618, 718600, 1476686, 3146948, 4531622, 4494306, 4015990, 4190857, 3814602, 1391337, -1717611, -2824415, -1871979, -1162092, -1441449, -1093575, 493852, 1638407, 1455675, 1575963, 3011637, 3574533, 1001860, -2741010, -3367267, -238142, 2562155, 1820566, -794998, -1798512, -785323, -71050, -733790, -1477021, -1111437]
43390a111437J032706P23808o7287j001930j478837m96703J543840K416443J061251
43381B621854o32808q28171o03527j475708k075831n01517J610619J233433p52760
43372a404416o76712J704308K636227O87018r35347P153J127112j59836k191563
43363G93944k115502n80220q5993o66501m64310O92710J270989Q59514N56355
43354B60986R50609J546757J724100R99343p80563k471521k250527l27086P30653
43345C82751k93075j340577n75648N68739J42957q08442l32803Q04483P33476
43336g18139N3150M23049R95811j20115j897742j688350J94899J024467L82958
43327a350012L96289J353035J205872k01079n51426N13883N24146j038982j262903
$$ y = [-1111437, -78731, 645077, 577790, -424140, -1902977, -2399680, -855840, 1560603, 2621854, 1989046, 1160875, 557348, -918360, -2994191, -3495708, -1885089, -651656, -1404416, -2081128, -376820, 2259407, 2946425, 2011078, 2018231, 3145343, 2985507, 793944, -1321558, -1901778, -1987771, -2654272, -3118582, -2425872, -1154883, -295369, 260986, 1211595, 2758352, 4482452, 5481795, 4701232, 2229711, -20816, -347902, 382751, 89676, -1250901, -1826549, -1257810, -1114853, -1923295, -2256098, -1451615, -718139, -664989, -241940, 753871, 633756, -1263986, -2952336, -2757437, -1732970, -1350012, -953723, 399312, 1605184, 1404105, 852679, 1366562, 1890708, 851726, -411177]
43318d11177J008807K504966O81075j899232j542192Q88507J759023L30588q71318
43309B449047m29155M06565L56619k23747n62810n77387m79983l98760m55446
43300H4943n87067n68191n13019o28545l49676R71020K295614J697774m55635
43291A947218j343962J45344J476364M17301j417301j345893J02794N78714L9698
43282F00277L04120J410947J616424N61896n34385j452542k675381k891442l44153
43273c404239L166171L467877J16213k482139j568342J37975n39110j991382j051489
43264d148465J353826J987160J014625J354560K905397K163006j636382m332083
43256F61644k739749P21045J894268P42982K31177J089210J212455k15604j353846
$$ y = [-411177, 597630, 3102596, 3783671, 1884439, 342247, 1230754, 2989777, 3320365, 2449047, 2019892, 2426457, 2783076, 2559329, 1996519, 1419132, 939149, 540389, 84943, -502124, -1070315, -1583334, -2211879, -2561555, -1590535, 705079, 2402853, 1947218, 603256, 748600, 2224964, 2642265, 1224964, -120929, -18135, 560579, 600277, 904397, 2315344, 3931768, 4493664, 3959279, 2506737, -168644, -3060086, -3404239, -238068, 3229809, 3346022, 863883, -704459, -566484, -1105594, -3096976, -4148465, -2794639, -807479, 207146, 1561706, 4467103, 6630109, 4993727, 661644, -2078105, -1357060, 537208, 1280190, 1511367, 2600577, 3813032, 3597428, 2243582]
43247B243582j034190o82152j596013k392156j019228J845007L380316K329948
43239C075114M32926j78779L16976K06024j024720j927021j177163N56007J518400
43230A797764J114625K88896j91203o35819j206713r93074O13909K359262K287890
43221E435537K90133j717174k188331j412423m35444K96104P23200N92650j39266
43212A444986q18405o49430L81533J371538J232340k42428j813477j836688l88269
43203a318300M84460l86591j262730p2222J908661J558882j097918k447829n41594
43194c175181K158769K635551J176721l79383j613820k461601j608279J199677
43186b067546L151037J770346j107892j855658k74751R71726J019269J182514
$$ y = [2243582, 1209392, 527240, -1068773, -3460929, -4480157, -2635150, 745166, 3075114, 3508040, 3329261, 3646237, 3852261, 2827541, 900520, -276643, 279364, 1797764, 2912389, 3201285, 3010082, 2374263, 1167550, 174476, 788385, 3147647, 5435537, 5725670, 4008496, 1820165, 407742, -27702, 268402, 991602, 1584252, 1444986, 626581, -22849, 358684, 1730222, 2962562, 2720134, 906657, -930031, -1318300, -833840, -1220431, -2483161, -2555383, -646722, 912160, -185758, -2633587, -3175181, -1016412, 1619139, 2795860, 2416477, 802657, -1658944, -3267223, -2067546, 1083491, 2853837, 1745945, -109713, -384464, 587262, 1606531, 2789045]
43178B789045J337071p3525k385929k961186j521229n04480n31071M77546K638305
43169g35453K871683K27940j660617j62089J953247J042215j491209j699667N86241
43160I32291K004779J094017l00826n95208j61795M00161Q83193N04455j087343
43151C673724k096315n87921J953571K058887m99756k071501o05285J329578P33912
43142C888894j221817j342730M34700R96806j043569l034228j918247J442571
43134a797620L252230J667522r88936j511406N1463J013914J23293j010766q15573
43125a5879o9514k50404j131644j451361r05879p2194P98083J548610J486312
43116f3870M02863m63391O5187J227590J378501L52941o63822j055684j037227
$$ y = [2789045, 4126116, 4052591, 1666662, -1294524, -2815753, -3320233, -3851304, -3373758, -735453, 2136230, 2364170, 703553, 541464, 2494711, 3536926, 2045717, 346050, 932291, 2937070, 4031087, 3730261, 3135053, 2973258, 3373419, 4256612, 4761067, 3673724, 1577409, 989488, 2943059, 5001946, 4502190, 2430689, 1825404, 3154982, 3888894, 2667077, 1324347, 1759047, 2755853, 1712284, -1321944, -3240191, -1797620, 1454610, 3122132, 2133196, 621790, 673253, 1687167, 1810460, 799694, -15879, -85393, -335797, -1467441, -2918802, -3824681, -3896875, -3098792, -1550182, -63870, 338993, -124398, -59211, 1168379, 2546880, 2899821, 2235999, 1180315, 143088]
43107A43088n27241N98944J498144J188365R6877o51055r81546j347715j145457
43098a127596L66134K026050J839880m5247j526843j638276j329642j178379n91815
43089c205734M68080J126930J253257J432804J239895j52920j648279j263627
43081g49594K99551K73382j450562j790450K00034J398874M6249q55614J271452
43072a356678L496453J716242k351334l319334j68733K604018J880982l70414
43064B131202j180225o44915k97367k11399L37808J079599J256494Q63341L15810
43055C650348k20326n04256j87264L69740K26830p24311j451310j308251q94911
43046a043711r07378j023755n17212O20870J614321J620889M63544r64136j250355
$$ y = [143088, -384153, 214791, 1712935, 2901300, 2998177, 2347122, 1365576, 17861, -1127596, -761462, 1264588, 3104468, 3059221, 1532378, -105898, -1435540, -2613919, -3205734, -2737654, -1610724, -357467, 1075337, 2315232, 2162312, 514033, -749594, -450043, -176661, -1627223, -3417673, -3217639, -1818765, -1772516, -2628130, -1356678, 2139775, 3856017, 1504683, -1814651, -1983384, 620634, 2501616, 2131202, 950977, 306062, 8695, -202704, 135104, 1214703, 2471197, 3334538, 3650348, 3430022, 2925766, 2738502, 3108242, 3335072, 2610761, 1159451, -148800, -1043711, -1951089, -2974844, -3492056, -2871186, -1256865, 364024, 827568, -136568, -1386923]
43037a386923j4209J412476J559787O53676M04L0632R7015j25798k84632k24318
43027A718110q6130K60587P84485O71281n50815j642717r82239Q74179J569173
43018B615914K0518k261292l085868j699180Q91318K632410J924465l84982j328783
43009f75480L39993J897719N01294k106845k038540N25305J692764L41361m14439
43000F3132Q23486J167150j052427k755960j213313J194876R93766q31694j295181
42991b906165o54984q36924r02575J101379L370072K502184m09434j035634R71974
42982A199893J333996j478168l408400j307948K184606K940040J076506m83861
42974B056664o02949k17804J03387L08169j28064j197351j506816k65880J032320
$$ y = [-1386923, -1401132, 11344, 1571131, 2224807, 2225211, 2255843, 2352858, 2227060, 1942428, 1718110, 1631980, 1892567, 2677052, 3348333, 2797518, 1154801, 172562, 1046741, 2615914, 2636432, 375140, -2710728, -4409908, -3518590, -886180, 1038285, 653303, -675480, -335487, 1562232, 2063526, -43319, -2081859, -1556554, 136210, 477571, 63132, 886618, 2053768, 1001341, -1754619, -2967932, -1773056, -779290, -1610984, -2906165, -3561149, -4398073, -5300648, -4199269, -829197, 1672987, 1263553, 227919, 1199893, 2533889, 1055721, -2352679, -3660627, -1476021, 1464019, 2540525, 2056664, 1453715, 1235911, 1339298, 1647467, 1519403, 322052, -1184764, -1450644, -418324]
42965d18324P04118m54526m65440P34772J420720Q32394K7205K1698M60216L74566
42955C237399n18446j480050j480586l95375O34490N81194K9029L25746J436825
42946B370226J978534J380357M99282n0343n34611q75592o13474l46152j126460
42937B681767k076617j109738J264726J756394p10693k781603j534525J177831
42929a332458J917053Q00780K68367N67952O6001j044554r79539J06793K09591
42920E79986q73628j075792L83042J730186J514511M00708m46033o77637q4107
42911A451236J339293K299924J241743j149132k441775j740687m65403K79969
42903H15168Q24560J160501N62330m93824n32488K06524p8789j223042q43322
$$ y = [-418324, 285794, -168732, -634172, 100600, 1521320, 2353714, 2380919, 2402617, 2862833, 3237399, 2718953, 1238903, -241683, -637058, -2568, 578626, 607655, 933401, 2370226, 4348760, 5729117, 6228399, 6178056, 5643445, 4767853, 4154379, 3808227, 2681767, 605150, -504588, 760138, 2516532, 1805839, -975764, -2510289, -1332458, 584595, 1385375, 1653742, 2221694, 2287695, 1243141, 263602, 370395, 579986, -293642, -1369434, -986392, 743794, 2258305, 2659013, 2212980, 1535343, 1451236, 2790529, 5090453, 6332196, 5183064, 2741289, 1000602, 535199, 815168, 1639728, 2800229, 3362559, 2868735, 2336247, 2542771, 2463982, 1240940, 397618]
42894C97618J219088J686329q66375k890281j053398K266194K451109l23720j723939
42885A162625m9064J801512J338363k70033q79219k84413P31165J826121K371765
42876G748822J374839o87901j822333j405498j187669k139514k416794m18645
42868i54693J931133J597540q47991j813968M3555J911602J058942j301180k018537
42859c93597m32508J186143J125117K57544J89700Q13024P36197m57904j544838
42850A478878j394704m94103p9918k25922J81712J417116J986647O31731j469689
42841B031748j915488m05786P16426j67371j529402r29695J327036K517610J260374
42832B905452p42697j125492K91749J767865J872512P17948n24464p81555o9686
$$ y = [397618, 1616706, 3303035, 2436660, -453621, -1507019, 759175, 3210284, 2886564, 1162625, 1113561, 2915073, 4253436, 3983403, 3104184, 2819771, 3550936, 5377057, 7748822, 9123661, 8435760, 6613427, 5207929, 4020260, 1880746, -536048, -954693, 976440, 2573980, 1725989, -87979, -44424, 1867178, 2926120, 1624940, -393597, -826105, 360038, 1485155, 1742699, 1932399, 2745423, 3481620, 3023716, 1478878, 84174, -409929, -489847, -715769, -534057, 883059, 2869706, 3501437, 2031748, 116260, -289526, 426900, 259529, -1269873, -2199568, -872532, 1645078, 2905452, 2162755, 1037263, 1329012, 3096877, 4969389, 5687337, 5162873, 4381318, 4311632]
42823D311632M28764k85434j540423j623091j55691J084368L74582j625899k611657
42814a642849j377037R17166K186807J642405M25737J33190Q48302J080904o5376
42805D149249j406941j283702m2731N12082r9043n23454J831N71445M95235L97685
42795B771656N52457m7970j682304k578683j182276J428655K855563K145268Q5523
42786D347889k062384k929238j546078J094271K386850J439313L72445P37775
42778C840843Q64001q56749k372071j070039J317054J048392j387003j943200
42770e58772J88940J307723k95881j324259Q06756L315348K353743r26235k233710
42761B633653m58231J329146O84683j298810k209638j403687j37303L08269q7750
$$ y = [4311632, 4740396, 4454962, 2914539, 1291448, 1135757, 2220125, 2594707, 968808, -1642849, -3019886, -2102720, 84087, 1726492, 2152229, 2285419, 3133721, 4214625, 4149249, 2742308, 1458606, 1415875, 1927957, 1828914, 1305460, 1307291, 1878736, 2373971, 2771656, 3324113, 3276143, 1593839, -984844, -2167120, -738465, 2117098, 4262366, 4347889, 2285505, -643733, -2189811, -1095540, 1291310, 2730623, 3103068, 3840843, 4704844, 3848095, 1476024, 405985, 1723039, 2771431, 1384428, -558772, -369832, 937891, 642010, -682249, 124507, 3439855, 5793598, 4867363, 2633653, 2175422, 3504568, 4189251, 2890441, 680803, -722884, -860187, -551918, -639668]
42752f39668m53672l01432l6192k6190J29146P11405J057261O83960L66721P07913
42742B199252O73236n89251j610629p45921N97327j6452j596153j082776J133193
42733a038174J466928n94410j298922Q22066K147858K77767j545474R572K381416
42724B628627J226827k369162l635675j330062J357091K114390J573571O15062
42716B180669o21447j242932l51038R23964Q84502J20981J45852K47545j008889
42707A279207k205765q83469J719296J999351m5358p16165R75885J556442p32429
42698B946995k595500j145684J202067P76180j275873r87700J854608L207945
42690C983038Q35310k482442k903195m78409J496043J067132k57145k51128O72331
$$ y = [-639668, -1093340, -1394772, -1430964, -1457154, -1328008, -616603, 440658, 1124618, 1491339, 2199252, 2872488, 2283237, 672608, -73313, 524014, 507562, -1088591, -2171367, -1038174, 428754, -165656, -1464578, -642512, 1505346, 1783113, 237639, 247211, 2628627, 3855454, 1486292, -2149383, -3479445, -2122354, -7964, 1565607, 2180669, 1559222, 316290, -34748, 889216, 1773718, 1894699, 2040551, 2288096, 1279207, -926558, -1810027, -90731, 1908620, 1863262, 1147097, 2122982, 3679424, 2946995, 351495, -794189, 407878, 1184058, -91815, -1079515, 775093, 3983038, 4818348, 2335906, -567289, -1045698, 450345, 1517477, 1260332, 1009204, 1681535]
42681A681535L83095j203684j540504N63380K570019J747824o06917j099457O43696
42672C138987J803458R78157k35945o41828j219089k375680k331306q5244K230200
42663A261710K107934K61249o59804N2306O74305N2845q28782n98372M93303J014510
42653C831204L16803o22064n57830J80995J5557j526969k818548k257436m25461
42644c863749R59437J314710J099087M54697l48728p4249J740513K971410J346917
42635E600045j795437l008743j771100q03886j131926n21021J968242L524228
42627B060402J885585q86743j615546o43341l70826r99405q76457Q3062M89123
42618h74146M36214J319574K689637K189959o74711l126694k657189k59611J202925
$$ y = [1681535, 2064630, 860946, -679558, -116178, 2453841, 4201665, 3594748, 2495291, 3138987, 4942445, 5920602, 5684657, 5042829, 3823740, 1448060, -883246, -968490, 1261710, 3369644, 3630893, 2971089, 3023395, 3697700, 3750545, 2921763, 2323391, 2816694, 3831204, 4148007, 3525943, 2968113, 3149108, 3164665, 1637696, -1180852, -3438288, -3863749, -2904312, -1589602, -490515, -35818, -384546, -458795, 1281718, 4253128, 5600045, 3804608, 795865, -975235, -1779121, -2911047, -3432068, -1463826, 2060402, 3945987, 3059244, 1443698, 800357, 429531, -569874, -1446331, -1363269, -874146, -437932, 881642, 3571279, 5761238, 5086527, 1959833, -697356, -956967, 245958]
42609B45958P07940k56226j82150O69210J145747Q90317M59643J35897m82627
42600C333709j465476j939092j197354J19330Q44232R05954J111757J581974J589863
42591D884897R06444J13316m73085j028927j359638j058619n50957o14899q28637
42582a0105m1145J481296K103203J314605L78213Q3687j92620o26330k93539P36861
42572D934126Q25332n81133j827715j819764j612999j747433o10179K333794M209428
42563D103457K597163l06060q03954N97829M79846j487895k201064p80015p1403
42554B127904j368681j847541N28716L070401K362793l21643j095706N15663J260780
42545E232686m46188k253311j785492o8298N29434q1592r6563J052429J872730
$$ y = [245958, 953898, 697672, 515522, 1184732, 2330479, 3220796, 3680439, 3816336, 3333709, 1868233, -70859, -1268213, -1148883, -304651, 601303, 1713060, 3295034, 4884897, 5791341, 5904657, 5431572, 4402645, 3043007, 1984388, 1433431, 818532, -10105, -51250, 1430046, 3533249, 4847854, 5226067, 5309754, 5117134, 4490804, 4197265, 4934126, 5759458, 5178325, 3350610, 1530846, -82153, -1829586, -2439765, -105971, 4103457, 6700620, 6394560, 5590606, 6188435, 6668281, 5180386, 2979322, 2199307, 2127904, 759223, -1088318, -559602, 2510799, 4873592, 4551949, 3456243, 3971906, 5232686, 4786498, 2533187, 747695, 679397, 1208831, 1127239, 1030676, 2083105, 3955835]
42536C955835J140638m05392j227107r49691m89534o38314j146255j199776m51911
42527a411507N93410J203716J264844J185056R44406m7541j611161k144810n52882
42518e76469J660028J923849K12621q75503j08489O09959l40047j444215o85676
42509C76058Q99544R56040k43039n22753L41611N90187o0494p7332O98692O55791
42499C614305l81192o37546K40903M09498o37737r29804K69543Q30650l72114
42490B406506j098818M12171K084073J288301q79278j660293j053763r72290j465919
42481i39310j113275k20386l47547j102184m85048J590930K853827J994642K07837
42472B439486p96289m58078Q96601K187152J700438r83872l452234k900139K7884
$$ y = [3955835, 5096473, 4691081, 3463974, 2514283, 2024749, 1386435, 240180, -959596, -1411507, -818097, 385619, 1650463, 2835519, 3779925, 3732384, 2121223, -23587, -576469, 1083559, 3007408, 3220029, 2344526, 2236037, 2845996, 2505949, 1061734, 376058, 1275602, 2231642, 1988603, 1465850, 1807461, 2397648, 2337154, 2259822, 2958514, 3614305, 3233113, 2595567, 2836470, 3245968, 2608231, 1678427, 1947970, 2778620, 2406506, 1307688, 1719859, 3803932, 5092233, 4212955, 2552662, 1498899, 526609, -939310, -2052585, -2272971, -2620518, -3722702, -4207750, -2616820, 237007, 2231649, 2439486, 1643197, 1185119, 2081720, 4268872, 5969310, 4985438, 1533204, -1366935, -1339051]
42463a339051J923575J083561q42533j755027j440663n91485M68724J377455J651575
42454E36131J599186J981085K455559J768747k13710k042968k524618j761310
42446A798102l18545J212367J780586O22206j297480k048049j155737J03622P92479
42437A489551J053640Q01282l62432j651826j530686j30599P28375M46506L92556
42428A236367J022964P72718q24997j472364K78469J940211N51786k225610k003243
42419g23699J642000M024130J902539k020718l243756j659243n94520j018365
42411a691632m66203J957946L261268J242868j413708r00118J620479J575808
42403E186708j788950l955387j950855J267582J571832k81818n65250J407186
$$ y = [-1339051, 584524, 1668085, 825552, -929475, -2370138, -2961623, -2492899, -1115444, 536131, 2135317, 4116402, 6571961, 8340708, 8126998, 6084030, 3559412, 1798102, 1479557, 2691924, 4472510, 5094716, 3797236, 1749187, 593450, 697072, 1489551, 2543191, 3344473, 2982041, 1330215, -200471, -331070, 397305, 843811, 1236367, 2259331, 3032049, 2207052, 734688, 1013157, 2953368, 3505154, 1279544, -723699, 918301, 4942431, 6844970, 4824252, 1580496, -78747, -673267, -1691632, -2157835, -199889, 3061379, 4304247, 2890539, 1990421, 3610900, 5186708, 3397758, -557629, -2508484, -1240902, 330930, 49112, -516138, 891048]
42395H91048K723709J615921m32188j416332j136653l86346K63227M16669l5503
42386B503552n36619n43978l05228p7537N73941J504484J256708o51381k020837
42377A703105q88747J011541O21782j375386j316553J592238L772485K552309
42369G672774k31770j415831o90739J59904J82734l93921j274057j957178j553970
42360D97946j6275J306936J262369K32075o74893q14604q2803R95657J054312
42351C760720p22267k745281k379759L57899K438125J929543M20849J78012Q51915
42342D089756O60970o17641j613834j449695m29565P22004J270594P85462j64765
42333C253286m01854J85557L84643l30011q36349k91699L16837k25625j256132
$$ y = [891048, 3614757, 5230678, 4798490, 3382158, 2245505, 1859159, 2122386, 2539055, 2503552, 1966933, 1422955, 1117727, 1040190, 1614131, 3118615, 4375323, 3723942, 1703105, 814358, 1825899, 2447681, 1072295, -244258, 1347980, 5120465, 7672774, 7441004, 6025173, 5334434, 5494338, 5677072, 5283151, 4009094, 2051916, 497946, 481671, 1788607, 3050976, 3283051, 2608158, 1793554, 1710751, 2706408, 3760720, 3038453, 293172, -2086587, -1728688, 709437, 2638980, 3059829, 3237841, 4089756, 4750726, 4133085, 2519251, 1069556, 639991, 1361995, 2632589, 3418051, 3253286, 2851432, 3036989, 3421632, 3091621, 2255272, 1963573, 2280410, 2054785, 798653]
42324G98653j115473M39149J897578J869652N40669o53186n21026N58286J019891
42315D834193K20148n74601k79483l574j127476k316199j172364J467682K135840
42306C184166N6715j572953q00575R8838j069097k360049r78351J722498K043150
42297C24342m49386k420983j580664P28852J950376J304107k0191m02685O50366
42288H4134J859844J494274k38419j185022l00205P54638J75754j327045j913400
42279e95447j301265m24432L93704J152302J098015j88652j389193r04219Q26958
42270a332229J970110J694876O16710m67861j057756r41128p75268j596621k741120
42261d630287j875363J408706L873026K679986l95524j395704L04086J741129
$$ y = [798653, -316820, 122329, 2019907, 3889559, 4430228, 3777042, 3256016, 3814302, 4834193, 5054341, 4479740, 4200257, 4196683, 3069207, 753008, -419356, 1048326, 3184166, 3240881, 1667928, 867353, 966191, -102906, -2462955, -3441306, -1718808, 324342, -125044, -2546027, -4126691, -3397839, -1447463, -143356, -163547, -566232, 84134, 1943978, 3438252, 3199833, 2014811, 1714606, 2469244, 2644998, 1317953, -595447, -1896712, -2321144, -1927440, -775138, 322877, 134225, -1254968, -2159187, -1332229, 637881, 2332757, 2949467, 2481606, 1423850, 482722, -292546, -1889167, -4630287, -6505650, -5096944, -1223918, 1456068, 1060544, -335160, -31074, 1710055]
42253A710055J044108m68873r03464q7573J064279J631912R44979p17589j752038
42244B465796r71276N71249R24340o3516r03880p68902k9406R07333J622010J181705
42234D935453o18871k125050j707995j44223O38311L70987R8406l0085m43857
42225I73076n18564L79320J032376K8251j539060j647033p58673p43195j212248
42216d005750k52097J737449K488568J849372J603088J497408l64538k941696
42208A611804k695372L95875J980430K00383j302356K56017K046723P56800j559041
42199A691263j188278P18489L24986k030374k286775N67700K909811K143079o0368
42190B789533j215401j326392j234300m42694J415912K804854K070935O0182q68465
$$ y = [1710055, 2754163, 2285290, 1381826, 1294253, 2358532, 3990444, 4935423, 4217834, 2465796, 1494520, 2065769, 2990109, 2926593, 2022713, 1253811, 1224405, 2131738, 3753748, 4935453, 4316582, 2191532, 483537, 339314, 977625, 1348612, 1447018, 1416933, 973076, 454512, 833832, 1866208, 1894459, 355399, -1291634, -2050307, -2793502, -4005750, -4257847, -2520398, -31830, 1817542, 3420630, 4918038, 4553500, 1611804, -1083568, -687693, 1292737, 1493120, 190764, 446781, 2493504, 3250304, 1691263, 502985, 1221474, 1546460, -483914, -2770689, -2202989, 706822, 2849901, 2789533, 1574132, 247740, -986560, -1429254, -13342, 2791512, 4862447, 4922629, 4054164]
42181D054164q4569O25275k13028j637907j675687k12267P55952j26300j704006
42172b18373j949850o25484Q09976J382636J330255R37585K00702k82260L43635
42163A928822J593656J845389O29867o68854r79855r62339j408514j590497m47445
42154e9770J433693K309946J473898K3535n99633l23541l71798j353077j864995
42145F68258j25719K893780L832368J496856j066783j064207k81521j735970l902418
42136G14644k787729J002061K478719J43875j648441K3104K109287J240404p03755
42127B572169n70080L41223q35019k699041j694156J518381K704568N61289j780479
42118A18855j842345o00738K54890O18510P83911N22785M8011M266K25536J00352
$$ y = [4054164, 3969595, 4594870, 4381842, 2743935, 1068248, 855981, 1611933, 1485633, -218373, -2168223, -2793707, -1983731, -601095, 729160, 1666745, 1867447, 1585187, 1928822, 3522478, 5367867, 5997734, 5328880, 4349025, 3386686, 1978172, 387675, -59770, 1373923, 3683869, 5157767, 5181302, 4581669, 4258128, 3886330, 2533253, 668258, 542539, 3436319, 7268687, 8765543, 7698760, 6634553, 6353032, 4617062, 714644, -2073085, -1071024, 1407695, 1551570, -96871, -73767, 2035520, 3275924, 2572169, 2002089, 2343312, 1508293, -1190748, -2884904, -1366523, 1338045, 1899334, 118855, -1723490, -2324228, -2069338, -1450828, -666917, -144132, -96121, -91855, 133681, 234033]
42108B34033n3013L76615Q27775M97456l8738k485j23058j029239j295797K69741
42098c36710J837426J230133l5320P73734K306035J007890k220928k654315L80000
42089B287945J912950m92561k481984p4936L640725L342471m38409k872767k300014
42080B523420j275307j182244n06665J294305K193225R62483p51350r95986p7088
42071B184793O07480O53853L87865k36160j165062j392404O0509K326849L012388
42062F440111R96723j744845k253658m19543Q25915k40734j524100m30962J818242
42053C467149J952553r3893j077476J77413Q29551j249901l918244l940321j313072
42044e166241J675745L607826L999960K236597j047896l130086k303753m97888
$$ y = [234033, 181020, 557635, 1385410, 1882866, 1844128, 1841643, 1718585, 689346, -606451, -336710, 1500716, 2730849, 2695529, 3469263, 5775298, 6783188, 4562260, 1907945, 2287945, 4200895, 3708334, 1226350, 1151414, 4792139, 8134610, 7696201, 4823434, 2523420, 1248113, 65869, -440796, 853509, 3046734, 4009217, 3257867, 2261881, 2184793, 2792273, 3446126, 3833991, 3597831, 2432769, 1040365, 1100874, 3427723, 6440111, 7436834, 5691989, 3438331, 3018788, 3844703, 3603969, 2079869, 1648907, 3467149, 5419702, 5325809, 4248333, 4425746, 5255297, 4005396, 87152, -3853169, -5166241, -3490496, 117330, 4117290, 6353887, 5305991, 2175905, -127848, -625736]
42036f25736l34558j039233j73329J799529K081893J63667j486923j401321o72027
42027a688038k16179N20603J454345J246283k19562j140725n63843L37115O03780
42018C33779Q06098J047609J63461j693392k119905l62K170592J719901k38896
42009B188885p56986M27432J065239K66003o25469p81637q27218p91822L09976
42000D74403K118338K478301O12894j154106n19518J328144J354210r00509k686792
41991C105365j955969M7970R34791L70400k50466l53465o09571j054141o99444
41982d64530M59608P93878m90019j642235p00858J464021K287704J102979m44396
41973B366152j323945k118291k738584j640885J410442L808241L123925L78447
$$ y = [-625736, -960294, -1999527, -2172856, -373327, 1708566, 1872233, 385310, -1016011, -1688038, -1904217, -1383614, 70731, 1317014, 1097452, -43273, -607116, -270001, 333779, 1139877, 2187486, 2350947, 657555, -1462350, -1462712, 707880, 2427781, 2188885, 1431899, 1859331, 2924570, 3190573, 2565104, 1783467, 956249, 164427, 474403, 2592741, 5071042, 5683936, 4529830, 4010312, 5338456, 6692666, 5792157, 3105365, 1149396, 1197366, 2132157, 2502557, 2252091, 1898626, 1289055, 234914, -464530, -4922, 788956, 298937, -1343298, -2044156, -580135, 1707569, 2810548, 2366152, 1042207, -1076084, -3814668, -5455553, -4045111, -236870, 2887055, 3265502]
41965C265502j463661j331976n84749l18664n9635Q26516J928780K367001J708189
41956F337303J80109j425581k208396k049958j688750j447160o60857Q75897J904585
41947a82808J372118K35875P5816N88215K40493r71069j365445k31762J123737
41938H85170J285167K57575j086414j789914j098263O22509J480832K34367j474213
41929f83184j124981P62776J370445K35236p3887J340095J872859k510j695385
41920B001464o11267J502106J420411n24683j621772j333484j160558j104283
41912a432066J00724J782742J879789N66886O6338P95846R26394m246l28446L71887
41902D725848L91828p17435j057221J41304R35952K4611j070534p73113J07364
$$ y = [3265502, 1801841, 469865, -114884, -433548, -493183, 333333, 2262113, 4629114, 6337303, 6517412, 5091831, 2883435, 833477, -855273, -2302433, -2963290, -2087393, -182808, 1189310, 1425185, 1501001, 2089216, 2329709, 1358640, -6805, -238567, 885170, 2170337, 2427912, 1341498, -448416, -1546679, -924170, 556662, 791029, -683184, -1808165, -1045389, 325056, 560292, 486405, 1826500, 3699359, 3696849, 2001464, 1390197, 2892303, 4312714, 3788031, 2166259, 832775, -327783, -1432066, -1331342, 451400, 2331189, 2898075, 2964413, 3760259, 4686653, 4682407, 4353961, 4725848, 5117676, 4400241, 3343020, 3484324, 4420276, 4444887, 3374353, 2601240, 2708604]
41893B708604L13897J19542j46320r90842j637829J60L220560L708057k93300
41884G002529m141295k908287J319768K785705P51562m23168R06269J457207o12210
41875F138080k391976j367491M22457K10106q03928J37347K410191K888902P94243
41866H437931j317996j358311k22432r19j099228j927942j051316Q77906J753409
41857D091102P63196l37690K37546J311381K73403k571224l720026j357295J866879
41848E57272K514301Q87214j79180K95108O61412k05275j224520r55719L79687
41839B730300J351589J048862p2640p90812m49937L44706O37485M72096N01606
41830E773255M65770m87500j751508j396756P67998K162555R37449j187549j521778
$$ y = [2708604, 3022501, 3142043, 2995723, 2004881, 367052, 367212, 3587772, 7295829, 7002529, 2861234, -47053, 1272715, 4058420, 4809982, 4386814, 5293083, 6750290, 6138080, 3746104, 2378613, 2801070, 3011176, 2207248, 2344595, 4754786, 7643688, 8437931, 7119935, 5761624, 5539192, 5538273, 4439045, 2511103, 1459787, 2337693, 4091102, 4854298, 4516608, 4754154, 6065535, 6338938, 3767714, 47688, -1309607, 557272, 3071573, 3958787, 3779607, 4074715, 4736127, 4530852, 3306332, 2350613, 2730300, 4081889, 5130751, 5058111, 4267299, 3817362, 4162068, 4799553, 5271649, 5773255, 6239025, 5751525, 4000017, 2603261, 3371259, 5533814, 6471263, 5283714, 3761936]
41821C761936l86220q0142q81825r01498L86418J316401J020360N61126M16119
41812E212675n35042k339108k767232n70487K025535K172572K97382j027216r45116
41803A523963o17818m34180L05322R94953p9591k383354k690539L85390L610995
41794F15141L142460j45972k003548q06658P15703J29604j158831n46079J570766
41785A512586K414719Q15571j424587k076064q85312P37419J290633K32169j589794
41776A027340k330540q23544J856079L232022K150808N4583q25034n1149P38165
41767E028730L7678j455620j515852N56520K301396R32061k366887l199238L7264
41758C56052L327971K377230j296201k772707r12136Q17649M17536m2411J113685
$$ y = [3761936, 3375716, 3295574, 2413749, 1512251, 1898669, 3215070, 4235430, 4796556, 5212675, 4677633, 2338525, -428707, -999194, 1026341, 3198913, 3496295, 2469079, 1523963, 906145, 471965, 777287, 1772240, 1692649, -690705, -3381244, -2995854, 615141, 3757601, 3611629, 1608081, 801423, 1517126, 1646730, 487899, -58180, 1512586, 3927305, 4742876, 3318289, 1242225, 356913, 1094332, 2384965, 2617134, 1027340, -1303200, -2126744, -270665, 2961357, 5112165, 5166748, 4341714, 4290565, 5028730, 5066408, 3610788, 2094936, 2651456, 4952852, 5884913, 3518026, 318788, 356052, 3684023, 6061253, 4765052, 1992345, 1080209, 1897858, 2315394, 2272983, 3386668]
41749C386668K128335J203874l85671r11168j096608j920690k076058l72068J557223
41740A513837J789943J304823J718129J965219N71936q13337n3412J049094n96051
41731H450181l508631l376181j70063J691560N88148k79947P46361Q87369j323039
41722C705758k500349J415L190552L067764P84369n8870M13144n18415k605060
41713E480308k925141j090892J34245m97178j156932m98391M99542R50698J426112
41704B322371J986032J412196m53421j749262j208440J8391L52659O3811K40666
41695B985003P10676M66053m68776r09883j53892J088624J505673N74390r17431
41686D880437j684374j284988m45487N5792L01248N96647N55116k98864j366566
$$ y = [3386668, 5515003, 6718877, 6333206, 5422038, 4325430, 2404740, 328682, -43386, 1513837, 3303780, 4608603, 6326732, 8291951, 8863887, 8050550, 7997138, 9046232, 8450181, 4941550, 1565369, 1395306, 3086866, 3675014, 3395067, 4141428, 5028797, 3705758, 1205409, 1206824, 4397376, 7465140, 8249509, 8190639, 8603783, 8085368, 5480308, 2555167, 1464275, 1598520, 1101342, -55590, -553981, -54439, 896259, 2322371, 4308403, 5720599, 5267178, 3517916, 2309476, 2327867, 2680526, 2744337, 2985003, 3695679, 4161732, 3692956, 2783073, 2629181, 3717805, 5223478, 5797868, 4880437, 3196063, 1911075, 1465588, 1521380, 1822628, 2419275, 2974391, 2675527, 1308961]
41677A308961j466813m80697M56179N95560N26995J020439J570856Q98544j098814
41668C331210k588211j684153R82499K530788J284742r29324j167374N99790J642172
41659D002139N50905r62445r59778L6049M07879r8906o20808o94884l98400j7042
41649A244709l12167j688287k472807j89863M242458O105688K767580k249362
41641G447949l691394j187651J482594K102184J606329J011802K84906j26285
41633H930434K15911P2910j640428k985756j394796J587902J935741n19891j742642
41624D459385j36318J055112m01482j892389o03133J648283J480866p21643j835603
41615C053078p49662P41689Q36024n92884k411048k927855j236209J227085J976758
$$ y = [1308961, -157852, -638549, -182370, 413190, 940185, 1960624, 3531480, 4430024, 3331210, 742999, -941154, 41345, 2572133, 3856875, 2927551, 1760177, 2359967, 4002139, 4553044, 3590599, 2630821, 2666870, 3074749, 2975843, 2355035, 1660151, 1261751, 1244709, 932542, -755745, -3228552, -3418415, 824043, 6929731, 9697311, 7447949, 3756555, 2568904, 4051498, 6153682, 7760011, 8771813, 9056719, 8930434, 9146345, 9219255, 7578827, 4593071, 3198275, 4786177, 6721918, 6202027, 4459385, 4323067, 5378179, 4976697, 3084308, 2481175, 4129458, 5610324, 4888681, 3053078, 2303416, 3045105, 3881129, 3288245, 877197, -2050658, -3286867, -2059782, -83024]
41606h3024J003199Q07051K104823K407823L75039j583450j305238m37812j149071
41597B139340k059541q88016J123774J205863k18280o23652J14763J88934j72464
41588H10721P55886K207891J569795r48749k190104j036940J60704j08058l29698
41579H91448P29188J739101J369965M68449J01705k75133j130399j362124j36624
41570B395576J365262J544829N33858l97213n08656J50415J047269J147549j76529
41561G102360j788938j769429j56248R29506M03628l76355r5909N31056M30868
41552E210539J48924O91249J585061J548053L88674q36612j045327R1671J865519
41543I647751K599556R76917k156072m200367l502119r11493J461743K115491
$$ y = [-83024, 920175, 1727226, 3832049, 6239872, 6614911, 5031461, 3726223, 3288411, 2139340, 79799, -808217, 315557, 1521420, 1303140, 679488, 794251, 983185, 810721, 1566607, 3774498, 5344293, 4395544, 2205440, 1168500, 1329204, 1221146, 891448, 1620636, 3359737, 4729702, 5198151, 5299856, 5024723, 3894324, 2532200, 2395576, 3760838, 5305667, 5839525, 5442312, 4933656, 5084071, 6131340, 7278889, 7102360, 5313422, 3543993, 3387745, 4317251, 4720879, 4344524, 4248615, 4779671, 5210539, 5359463, 6050712, 7635773, 9183826, 9572500, 8735888, 7690561, 7782232, 9647751, 12247307, 13224224, 11068152, 6867785, 3365666, 2454173, 3915916, 6031407]
41535F031407R02779q26652j006177P50141J921882K49886k342281j883109J498840
41526E296716L145341P50771k035651j231919J506023J861519n06119k138351
41518F648330j422647k72991l09215o68475k35269M71803N23151k9961o61455
41509D043271j027171p81789J69219J103534J164300N71218K21022L19098L96450
41500F179152L31824K76058m8335q35312j400534j061505l44926j14992o4437
41491B916993N83378J462398J644126J256045R44885M02869p11147j090292O01422
41482H010677K764375K244323j022235l415043k471986J40631J599997J531964
41474I382703J119143O14621l44251j288723j561552j476033j462557j100608
$$ y = [6031407, 6934186, 6107534, 5101357, 5851498, 7773380, 8023266, 5680985, 3797876, 5296716, 8442057, 9192828, 7157177, 5925258, 7431281, 9292800, 8786681, 6648330, 5225683, 4952692, 4643477, 3975002, 3739733, 4211536, 4734687, 4704726, 4043271, 3016100, 2234311, 2403530, 3507064, 4671364, 5242582, 5463604, 5782702, 6179152, 6510976, 6787034, 6738699, 5903387, 4502853, 3441348, 3096422, 2981430, 2916993, 3500371, 4962769, 6606895, 7862940, 8807825, 9210694, 8499547, 7409255, 8010677, 10775052, 13019375, 11997140, 8582097, 6110111, 6250742, 7850739, 9382703, 10501846, 11116467, 10772216, 9483493, 7921941, 6445908, 4983351, 3882743]
41466C882743k98790j77208j181696j561647K81280K859497L257642J226044o83694
41457G604171r38701n93948o99316n33505N16083J250545L74646j275466j726482
41448C978027m64987J178785J860798J426648N02334k88267p02567q98459r97346
41439E594966o41652M35048J425824J126774j03831m45106O14818J209259R4543
41430I310643r37333K53888K336843K155042l50827j951091j075435J86650l7306
41421I891074n71351J15279J066401Q57664K74224O07410J135834P91575O07137
41412A4775247J756839K782977J906460O36209J403665K748501J237742k223102
41404B5024538k891774L47415K989008K022342J86753M76072J013812p44603k572354
$$ y = [3882743, 3583953, 3406745, 2225049, 663402, 944682, 3804179, 7061821, 8287865, 7604171, 6665470, 6071522, 5372206, 4838701, 5354784, 6605329, 6979975, 5704509, 3978027, 3513040, 4691825, 6552623, 7979271, 8481605, 8193338, 7490771, 6592312, 5594966, 4953314, 5388362, 6814186, 7940960, 7837129, 7392023, 8006841, 9216100, 9310643, 8373310, 8627198, 10964041, 13119083, 12768256, 10817165, 9741730, 9928380, 9891074, 9319723, 9435002, 10501403, 11359067, 11633291, 12240701, 13376535, 14168110, 14775247, 16532086, 19315063, 21221523, 21857732, 23261397, 26009898, 27247640, 25024538, 22132764, 22480179, 25469187, 27491529, 27678282, 28154354, 29168166, 28423563, 25851209]
41395B5851209j118005J629495Q88553l154208n418409l632504j001728m31373
41387A3613030o81050P9240Q44600K62889n06289l0352N62328l81066j853865
41378A1909465j714445k79985K59060n31349q72049k416N51094l01852j187113
41369G830410l19710J616284K234116O96952j229514j544684k96158R58961J034999
41360A0981656j81176k006887l008218j675478J495541L279799J092871l067976
41352F910132m422619j617075J472072J344860m49566m78334J123999J601294
41344E484763N16399L2497O66068M99342q66233j109910P37956K129575Q96104
41335H986561j151759r64080J108233K076349Q58616n27344l02662P01639O53202
$$ y = [25851209, 24733204, 26362699, 27251252, 24097044, 18678635, 15046131, 14044403, 13613030, 12931980, 13011220, 13855820, 14118709, 13612420, 13582068, 14144396, 13763330, 11909465, 10195020, 9915035, 10174095, 9642746, 8770697, 8768281, 9319375, 9017523, 7830410, 7510700, 9126984, 11361100, 12058052, 10828538, 9283854, 8987696, 9946657, 10981656, 10800480, 8793593, 5785375, 4109897, 5605438, 8885237, 9978108, 6910132, 2487513, 870438, 2342510, 3687370, 3237804, 2759470, 3883469, 5484763, 6001162, 6033659, 6699727, 7199069, 6332836, 5222926, 5960882, 8090457, 8986561, 7834802, 6870722, 7978955, 10055304, 10913920, 10386576, 10083914, 10785553, 11438755]
41326A1438755p07287j959273j836787n28371O98097Q68894K42163j43155K63716
41317H336752R86280J213177O41223m04076j253078j206780k9197J640882K629022
41308A2554205K170943N56405r96031j184563O0357J025700m5630k315751k833119
41299H992516n30942J886245J646923j01560l61467R64006J438470M87672j00463
41290A4321400p380q44192k123702r63095K521045L716805K36731l582866k695516
41281A0579230J085375K087692n55372k274190m77023K356084L523917L567960
41273A9893673L521741K587547N88727l56483J052257K821444K551311R19542
41265C3579759O3325R4193l80887j397851j714069j133620n74409j80637N93883
$$ y = [11438755, 10731468, 8772195, 6935408, 6407037, 7105134, 7974028, 8216191, 8073036, 8336752, 9323032, 10536209, 11177432, 10773356, 9520278, 8313498, 8284301, 9925183, 12554205, 14725148, 15281553, 14285522, 13100959, 13161316, 14187016, 14141386, 11825635, 8992516, 8461574, 10347819, 11994742, 11893182, 11531715, 12495721, 13934191, 14421863, 14321400, 14314020, 13469828, 11346126, 10383031, 12904076, 16620881, 16857612, 13274746, 10579230, 11664605, 13752297, 13196925, 10922735, 10445712, 12801796, 16325713, 19893673, 23415414, 26002961, 26591688, 26235205, 27287462, 30108906, 32660217, 33579759, 33643084, 33737277, 33356390, 31958539, 30244470, 29110850, 28536441, 28355804, 28949687]
41256B8949687J252672P14056m24535k10816J598114K853532K265472J325433
41248C8323615J557676J697928j65808k848523l307810j414527m30287j896585
41240C1515679l083822j533672N07362n44458l403519l192697J131727M806524
41232B6203124M025591R72285j75199Q83551J730217J757851J855086J242970
41224C8495476j263549l622372k494403J085040K237338o29576l339535k289418
41216B8179001O06767J803764J473985J623026J567771o59696l862812m661578
41208B6070228k513731k91787J46388j82623j99295l77072q20276m25114R83169
41199B2389887J868022J355975M77014J55771j09981o53137o90263k7583K26417
$$ y = [28949687, 30202359, 30916415, 30491880, 30281064, 31879178, 34732710, 36998182, 38323615, 39881291, 41579219, 41413411, 38564888, 35257078, 33842551, 33412264, 31515679, 28431857, 26898185, 27405547, 26861089, 23457570, 20264873, 21396600, 26203124, 30228715, 31201000, 31025801, 31909352, 33639569, 35397420, 37252506, 38495476, 37231927, 33609555, 31115152, 32200192, 34437530, 33807954, 30468419, 28179001, 28785768, 30589532, 32063517, 33686543, 35254314, 34594618, 30731806, 26070228, 23556497, 23264710, 23411098, 23228475, 23029180, 22652108, 21831832, 21406718, 22389887, 24257909, 25613884, 26090898, 26246669, 26136688, 25483551, 24793288, 24765705, 24992122]
41190B4992122k08958Q024J179412J392530j43564r33723R97791L166084J950718
41181C2400436j384921k057079R56960L223545J646150r37372m82657J893211
41173C5258273J879252j053177k563305J82326M254213M929065K024732j85418
41165D4725961J086984L750518M241674K429460J213025K098408L542952L920567
41157F7009549L801925M150071M232388L160068K111913K868914M971063O535318
41149I8841209P372519Q952895J1468357J3400411J4256535J5347050J7328180
41142A86967156J9329738K1252154K4469736K9063223L2593309L2985237L0474375
41135C77134928K5264592J5823136J862453j3028459k4523437l1966856l7027090
$$ y = [24992122, 24783164, 24791188, 25970600, 27363130, 27219566, 26285843, 27283634, 30449718, 32400436, 31015515, 28958436, 29915396, 33138941, 34785091, 33847719, 33365062, 35258273, 37137525, 36084348, 33521043, 33703369, 37957582, 42886647, 44911379, 44725961, 45812945, 49563463, 53805137, 56234597, 57447622, 59546030, 63088982, 67009549, 70811474, 74961545, 79193933, 82354001, 84465914, 87334828, 92305891, 98841209, 106213728, 115166623, 126634980, 140035391, 154291926, 169638976, 186967156, 206296894, 227549048, 252018784, 281082007, 313675316, 346660553, 377134928, 402399520, 418222656, 420085109, 407056650, 382533213, 350566357, 313539267]
41128C13539267l9404529l7249059l1305175k5214607k1258124j8477296j5497472
41121A25133005j2683688j0740663r407228q490263q380940q711887q159448o360075
41113E2198813m504472l393483k488073j516340j308976k190484l114561l250318
41105C0432106k907201k162316m15897J673589J860313m79140k608295j924370
41097B3468789K27583N51236j341909k637289j645036N7610L15617p57988j576014
41088A6662599j383306o97433j52917J42991K67976J12601m46057j092799j052918
41079A2360737P9748J488428J703691L18938j397724j947493j120038K33982J235549
41070A2955818J341356M84873n23191n31594L37160N58520m30551r17770N77336
$$ y = [313539267, 274134738, 236885679, 205580504, 180365897, 159107773, 140630477, 125133005, 112449317, 101708654, 92301426, 83811163, 75430223, 66718336, 58558888, 52198813, 47694341, 44300858, 41812785, 40296445, 38987469, 36796985, 33682424, 30432106, 27524905, 25362589, 24946692, 26620281, 28480594, 28001454, 25393159, 23468789, 23696372, 24247608, 22905699, 20268410, 18623374, 18680984, 18996601, 18238613, 16662599, 15279293, 14581860, 14428943, 14571934, 14839910, 14952511, 14506454, 13413655, 12360737, 12440485, 13928913, 15632604, 15951542, 14553818, 12606325, 11486287, 11720269, 12955818, 14297174, 14782047, 14258856, 13727262, 14064422, 14622942, 14192391, 13274621, 13851957]
41061A3851957K510968K121865l81981j827865o26163J016164N46612j233372
41053A5978185j697885l51397Q83836R02764P78028J439322J808238M99342j610292
41044A8630141k092660k39535J698781J253592j024616k131223l65261K498943
41036A8228162L346455J347230j418737k647454k047628p52544L53839R75682
41028A7385005Q87709J78216l22213P5098P36028N06975l61236m70241L08578
41019A8923919L39119j043296j991322p83775J427400K385440K076858K044089
41011B3378432K263664J476054K01141K89220J332755R15354q76288q75754J811127
41002B9915705L744530K752568J705861L292431M639368J869115k597946k929340
$$ y = [13851957, 16362925, 18484790, 18102809, 16274944, 15648781, 16664945, 17211557, 15978185, 14280300, 13928903, 14812739, 15715503, 16493531, 17932853, 19741091, 20240433, 18630141, 16537481, 16297946, 17996727, 19250319, 18225703, 16094480, 15729219, 18228162, 21574617, 22921847, 21503110, 18855656, 16808028, 16055484, 16409323, 17385005, 18272714, 18450930, 18128717, 18203815, 18939843, 19446818, 19085582, 18615341, 18923919, 19263038, 18219742, 16228420, 15444645, 16872045, 19257485, 21334343, 23378432, 25642096, 27118150, 27319291, 27608511, 28941266, 29856620, 28980332, 28104578, 29915705, 33660235, 36412803, 38118664, 41411095, 46050463, 47919578, 45321632, 42392292]
40994D2392292J108908L825124K373469K38415P54132K319320K313715J520402
40986E6845777J871507K969012L471136L472023L381621K795048K270129L655692
40978H0731945O804128Q668727P709441O442020P382463R335197J0317402J1251446
40970A48642769J3528127J5484083J5036842J3895846J5319628J9037640K2060192
40963B63005127K3430037K4501060K5250757K3894366J9785298J3519660M697257
40956C98083562p092678j9371780k8155673l2234761l3280442l2211576k8728291
40949B17008361k4081715k0637553j8470055j5774404j2812311j1799454j2448742
40942A00984127j1568726q222828n570429n932604p335946o927142m983515l396563
$$ y = [42392292, 43501200, 47326324, 49699793, 49938208, 50692340, 53011660, 55325375, 56845777, 58717284, 61686296, 65157432, 68629455, 72011076, 74806124, 77076253, 80731945, 87536073, 96204800, 103914241, 110356261, 117738724, 127073921, 137391323, 148642769, 162170896, 177654979, 192691821, 206587667, 221907295, 240944935, 263005127, 286435164, 310936224, 336186981, 360081347, 379866645, 393386305, 398083562, 390990884, 371619104, 343463431, 311228670, 277948228, 245736652, 217008361, 192926646, 172289093, 153819038, 138044634, 125232323, 113432869, 100984127, 89415401, 81192573, 75622144, 69689540, 62353594, 55426452, 50442937, 47046374]
40934D7046374k503940j594719q44583r07747j803496l245571m655755m440447
40926B7050116j471246K160303K625751l98991k911719k333975q51114j045635
40918B2823490j563240j47379J742331J086726j499267k396106j90070K806914
40910B2663399M034479L176619J291452m17141r63460l83130n3741r77772k290874
40901B6079831k660538k246611j888855j449427o29072l41866j357169k463988
40893A3042305j963053k72244Q27275Q10770M42218M1654l32497R7269J482850
40884A4176547K007958L42533j499355o56126J863474K287077j10376j775577
40876A6636155k18707K583957L449273K034584J42756q59070m76117J198292K864486
$$ y = [47046374, 44542434, 42947715, 42103132, 41195385, 39391889, 36146318, 31490563, 27050116, 25578870, 27739173, 30364924, 29965933, 27054214, 24720239, 23869125, 22823490, 21260250, 21112871, 22855202, 23941928, 22442661, 20046555, 19856485, 22663399, 26697878, 29874497, 31165949, 30748808, 29785348, 29402218, 29348477, 28370705, 26079831, 23419293, 21172682, 19283827, 17834400, 17205328, 16863462, 15506293, 13042305, 11079252, 10807008, 11634283, 12445053, 12887271, 12928925, 12596428, 12693697, 14176547, 16184505, 16527038, 15027683, 14371557, 16235031, 18522108, 18411732, 16636155, 16417448, 19001405, 22450678, 24485262, 24628018, 23768948, 23292831, 24491123, 27355609]
40867B7355609K783667J257581N38168J286051J406862j49527j004864R13459
40859C4387006L488993L321983R89687p1808Q17294Q85078r07795j812661N8186
40850D1155963K238581J566189q67205j450174L52349J314041n94034l447266
40842D0268444m523916l869348l160386k812798k220905j673123j750696j495347
40834A8761925L07831K206160J324155j858116l051861j61621L093409K277343
40826B2899225j239928k451082j92588J716105Q89976l37688M76683J736982Q79214
40817B4376899j114650j426441J5206Q74212N10462N86492J614389J827867K39851
40808B7504287j495661j434774Q217Q62093L1444j840272l138005k516382k80994
$$ y = [27355609, 30139276, 31396857, 31935025, 33221076, 34627938, 34478411, 33473547, 34387006, 37875999, 41197982, 42187669, 42115861, 42933155, 43818233, 42910438, 41097777, 41155963, 43394544, 44960733, 44093528, 42643354, 42995703, 44309744, 43715710, 40268444, 35744528, 31875180, 28714794, 25901996, 23681091, 22007968, 20257272, 18761925, 19069756, 21275916, 22600071, 20741955, 17690094, 17528473, 20621882, 22899225, 21659297, 19208215, 19015627, 20731732, 21621708, 21284020, 21760703, 23497685, 24376899, 23262249, 21835808, 21851014, 22725226, 23235688, 23822180, 25436569, 27264436, 27504287, 26008626, 24573852, 24582069, 25444162, 25475606, 23635334, 20497329, 17980947, 17699953]
40799A7699953J337577N28467j388423j322687J118380K723825J383017o20343
40791B1459766j28816J945400K115284k08319j974945j254147L31061P01637J41672
40782B3128593k48492n74309r88701n09712J053065J633754l55163k991111l019436
40773A7128488m32661J630306J377639K19539j81143j77666m79389m55385L35364
40764A8965092O05781p31216k159007j233136J652352L260191J682016j227559
40756B0814514k520339j894814j307087j606763j471064N8708J744204J954415
40748A5771774J088065O67403P39777L3324j462836k081909j072233K76910Q72458
40739A4832733J326211K131914K257788J192178O14753J869883L258539K466632
$$ y = [17699953, 19037530, 19565997, 18177574, 16854887, 17973267, 20697092, 22080109, 21459766, 21330950, 23276350, 25391634, 25183315, 23208370, 21954223, 22285284, 22986921, 23128593, 22880101, 22305792, 21317091, 20807379, 21860444, 23494198, 23139035, 20147924, 17128488, 16695827, 18326133, 19703772, 19923311, 19742168, 19564502, 19085113, 18629728, 18965092, 19570873, 18839657, 16680650, 15447514, 17099866, 20360057, 22042073, 20814514, 18294175, 16399361, 15092274, 13485511, 12014447, 12073155, 13817359, 15771774, 16859839, 17527242, 18267019, 18300343, 16837507, 14755598, 13683365, 13960275, 14832733, 16158944, 18290858, 20548646, 21740824, 22355577, 24225460, 27483999, 29950631]
40731B9950631N83365O04480K470523L132611J938037K277672O226470J0489542
40723E7673331J0122988M570483k229339o591598p856668p160850n585882l773894
40715C9168571k132554r19156k84879n5748M32343J536476K358628J664263j04754
40706D1663190r76870Q3474K110239L778965M646124M492181L261043K213268
40698F1271614L153179N671777P236434P052381P463227R957834J2282351J1892604
40690A25981401J0231064J0696012J3712830J6695388J7915120J7499110J5309089
40683B28040014J0956189N768556J726099j822367p478032j5130086k0690786
40676B01369587k0837793j7081054j3731481j3191166j4441048j5113315j3861489
$$ y = [29950631, 30533996, 31138476, 33608999, 36741610, 38679647, 40957319, 47183789, 57673331, 67796319, 72366802, 70137463, 63545865, 55689197, 48528347, 42942465, 39168571, 37036017, 36116861, 35831982, 35776234, 36208577, 37745053, 40103681, 41767944, 41663190, 40686320, 40769794, 42880033, 46658998, 51305122, 55797303, 59058346, 61271614, 64424793, 70096570, 77333004, 84385385, 91848612, 101806446, 114088797, 125981401, 136212465, 146908477, 160621307, 177316695, 195231815, 212730925, 228040014, 238996203, 244764759, 246490858, 244668491, 237190459, 222060373, 201369587, 180531794, 163450740, 149719259, 136528093, 122087045, 106973730, 93112241]
40669I3112241j1166454q581803p132131o488238n944774n528289n321179m553192
40661C8396181k781285j305960j669005l162333l735910l101438k766492l005309
40653A6868449k273214k05697J228340P26511k31409K42425J523644J594222P0344
40644A9543615j484271j796858j163021o00030n53521n47195J06936J234298J750270
40635A6490223J133305L96498P13542J711171K422402L259378N136547O985111
40627C8248177O533719L897822K006680K575482L768075L005042J92062l140264
40619E7086795o100714q240451q604764o838604m360414k909612k587093k455130
40611A4990013k166227j796306j004734K84348J089735N30481p92128j585834
$$ y = [93112241, 81945787, 73363984, 66231853, 59743615, 53798841, 48270552, 42949373, 38396181, 35614896, 34308936, 32639931, 29477598, 25741688, 22640250, 19873758, 16868449, 14595235, 14389538, 15617878, 16344389, 16112980, 16355405, 17879049, 19473271, 19543615, 18059344, 16262486, 15099465, 14499435, 13945914, 13398719, 13505655, 14739953, 16490223, 17623528, 18020026, 18733568, 20444739, 22867141, 26126519, 31263066, 38248177, 44781896, 48679718, 50686398, 53261880, 57029955, 60034997, 60227059, 57086795, 50986081, 42745630, 34140866, 27302262, 22941848, 20032236, 17445143, 14990013, 12823786, 11027480, 10022746, 10307094, 11396829, 11927310, 11135182, 9549348]
40603I549348j388469m61025R03069K001981J736921J66911r94198o71559p5718
40594A0767261o09855j364435o23757J049975J474142K05153r50105q45442m32198
40585H670739q55880j717965j849594p45766J142706K687466K592243O16320j625272
40576H914997k041640l71893J644014K293590J298591n00997j844847j679490
40568G712325j96628R48983N68859k36077M33197K218434K730436J062978p85313
40559A4457194q20062K34945M67079q5252M11578K414659L619056J725391k045823
40550B0378765l629608r23736L154974L960442J074895j193571J62205K772820
40542B5757186K629390j41055j987502j288728J39680O70794Q78127J353959J314823
$$ y = [9549348, 8160879, 7699854, 8602923, 10604904, 12341825, 12508736, 11514538, 10842979, 10767261, 10157406, 8792971, 8169214, 9219189, 10693331, 10898484, 9948379, 9102937, 8670739, 7814859, 6096894, 4247300, 3501534, 4644240, 7331706, 9923949, 10540269, 8914997, 6873357, 6501464, 8145478, 10439068, 11737659, 11236662, 9391815, 7712325, 7515697, 8464680, 9033539, 8797462, 9230659, 11449093, 14179529, 15242507, 14457194, 13637132, 13872077, 14339156, 14253904, 14665482, 17080141, 20699197, 22424588, 20378765, 16749157, 15825421, 18980395, 22940837, 24015732, 22822161, 22984366, 25757186, 28386576, 28245521, 26258019, 24969291, 25108971, 25779765, 26657892, 28011851, 29326674]
40533B9326674M93088J11826P02232R52408P2962n74226K26268J269135P22477
40524C3302844j058048k229897j989291q44278O53762J875826J765637K15181
40516C1691736j013303m33219Q66704Q37487m02755j089792q04111n79034l66468
40507B8707245R03085K485435J893458j128748l187271j449158K601890N424682
40499C6250618N911581N592708N503643N196167M415811L477104J875413j342965
40491F6880080n263296p092412n547295k766081j524825j764090j543736n42515
40483D0835830l18137j053818n04067K577915N832426O163297M262750L851358
40475F1647554O318400Q418320O317459K77507n992598r422774r612601p851796
$$ y = [29326674, 29819762, 29931588, 30633820, 31586228, 31659190, 31084964, 31311232, 32580367, 33302844, 32244796, 30014899, 28025608, 27181330, 27835092, 29710918, 31476555, 31691736, 30678433, 30245214, 31111918, 31949405, 31546650, 30456858, 29652747, 29073713, 28707245, 29610330, 32095765, 33989223, 32860475, 29673204, 28224046, 30825936, 36250618, 42162199, 47754907, 53258550, 58454717, 62870528, 66347632, 68223045, 66880080, 61616784, 54524372, 48977077, 46210996, 44686171, 42922081, 41378345, 40835830, 40517693, 39463875, 38959808, 41537723, 47370149, 53533446, 57796196, 61647554, 67965954, 76384274, 82701733, 82979240, 76986642, 67563868, 57951267, 50099471]
40467E0099471n898407n198189n580265m981071k071527J232037J896970K13846
40459B9712865m77172J033718J864823k26429k927278k747856k71424J145201
40451B7106448O93442O11118J723249K157808J106883M07436J013325J018001
40443C5837710q16739k313734j278887N47859P8033k055827k483741n10376J030297
40434B8034595N57944m3266R43178K208132J888985N69185j65100l79265q88009
40425C2726379j042950K90081K276640K815630J486534K3587l8045J338162L480732
40416D3356750N429253N782748M079024K410458L512142O703184Q017640N593963
40408H4885162K795288L954302Q522157J1954552J1757675J0037532R858479J1499096
$$ y = [50099471, 44201064, 39002875, 33422610, 28441539, 26370012, 27602049, 29499019, 29712865, 29235693, 30269411, 32134234, 31907805, 28980527, 26232671, 25961247, 27106448, 27799890, 28411008, 30134257, 32292065, 33398948, 33806384, 34819709, 35837710, 35020971, 32707237, 31428350, 31976209, 32054242, 29998415, 27514674, 27004298, 28034595, 28592539, 28549273, 29492451, 31700583, 33589568, 34158753, 33993653, 33614388, 32726379, 31683429, 31973510, 34250150, 37065780, 38552314, 38575901, 38537856, 39876018, 43356750, 48786003, 54568751, 58647775, 61058233, 64570375, 71273559, 79291199, 84885162, 87680450, 91634752, 100156909, 112111461, 123869136, 133906668, 143765147, 155264243]
40400A55264243J3272862J4129508J3964747J2576314R900704O674588L522029
40393B29304995j45250m981454r850955j2728894j3489403j4082401j5398298
40386A58628340j5695160j3411954j0198271r211429j0838277j2079131j0514732
40379G6679386p194642m724246l851623l370075k689377k767928m217008n812628
40371D2051859n813315m200556k651449k283665k271015j227092N31370J078508
40363B5214645n13594k548636k613778p50478N10820m61643k237913k466553j201109
40354A2931761n51270j299000j687328k43637J709073J758564j88904j864232
40346A0565027j867180j250013j332766j469256k78633J772630K624724J369331
$$ y = [155264243, 168537105, 182666613, 196631360, 209207674, 219108378, 225782966, 229304995, 229159745, 224178291, 214327336, 201598442, 188109039, 174026638, 158628340, 142933180, 129521226, 119322955, 110111526, 99273249, 87194118, 76679386, 69484744, 64760498, 60908875, 57538800, 54849423, 52081495, 47864487, 42051859, 36238544, 32037988, 29386539, 27102874, 24831859, 23604767, 24136137, 25214645, 24701051, 22152415, 19538637, 18788159, 19298979, 18837336, 16599423, 14132870, 12931761, 12380491, 11081491, 9394163, 9150526, 10859599, 12618163, 12429259, 10565027, 8697847, 7447834, 6115068, 4645812, 4367179, 6139809, 8764533, 10133864]
40338A0133864o36124j686296j575644r97393j99781Q06612J420222R82391p4356
40329H173495n93254k11901L14242L91213L75810P81123J337400J325144N48612
40320A2441884l96469p64204m30545j4448j28881n41117n10557q0462k04572r79200
40310H391429p64283J556545M116229L839442P16191j813366j418211K56262N24496
40301A5404734n23179j114096j151263j850667k734725j864166O61477K041477
40293H869592O19708j639223j891115j63262J166973P43207m30726p22607J95368
40284F747915J215057J076567j89822j103095m96691P33756P07609o21887j290817
40275F778592m20627L82674j71173p60697K23388J657848J394481p4964m05277
$$ y = [10133864, 9497740, 7811444, 6235800, 5238407, 5038626, 5845238, 7265460, 8247851, 8173495, 7580241, 7368340, 7682582, 8073795, 8449605, 9230728, 10568128, 11893272, 12441884, 12045415, 11281211, 10850666, 10836218, 10707337, 10166220, 9655663, 9575201, 9370629, 8391429, 7627146, 9183691, 13299920, 17139362, 17855553, 16042187, 14623976, 14880238, 15404734, 14881555, 13767459, 12616196, 10765529, 8030804, 6166638, 6828115, 8869592, 9489300, 7850077, 5958962, 5795700, 6962673, 7705880, 7275154, 6552547, 6747915, 7962972, 9039539, 8849717, 7746622, 7249931, 7983687, 8691296, 8069409, 6778592, 6357965, 6740639, 6569466, 5808769, 6032157, 7690005, 9084486, 9009522, 8604245]
40266H604245O21816P98238o96624k018043j805094r33745k41674P96582J870805
40257F996506J118017j499341k734059n27661K283441J823814r71796j939070
40249D549851r7654J443529Q82536M0082M09509N67581p00157j661344l44293
40240E089640K066130K859092J467378n09055j839623k320362j817106n71530
40232D424564J31300o18153j638428r97791J116736K383096J269147j212618k815489
40223B042364k268631j36869J866719K404485J646795O74984q7138q78108j128675
40214D135926K20933K353411K647061M02353j666689j502996r52018k241181l445592
40205d8792j380026K336645K854994k94546k103613J20458K593832J264355j861168
$$ y = [8604245, 9226061, 10024299, 9327675, 7309632, 5504538, 4570793, 4329119, 5125701, 6996506, 8114523, 6615182, 3881123, 3353462, 5636903, 7460717, 6488921, 4549851, 4452197, 5895726, 6778262, 6818344, 7227853, 7795434, 7095277, 5433933, 5089640, 7155770, 10014862, 11482240, 10973185, 9133562, 6813200, 4996094, 4424564, 4555864, 3937711, 2299283, 1301492, 2418228, 4801324, 6070471, 4857853, 2042364, -226267, -363136, 1503583, 3908068, 5554863, 6229847, 6142709, 5264601, 4135926, 4356859, 6710270, 9357331, 9759684, 8092995, 6589999, 5637981, 3396800, -48792, -1428818, 907827, 3762821, 3468275, 1364662, 1485120, 4078952, 5343307, 3482139]
40196C482139k273159l629J100527l13431j637231q77611P99627J544649J121086
40187B942967J01578j060535j545412o03408R63809J412977N97965J95890Q89598
40178C895429J201642N3326j308426j319281n71280n57115r69868k79823J395677
40169A540281K115410J099209o1807n6609L1653j184260k519858j722471O08243
40160a50209J296835n85193j861910L6299K791898K430216n99917k113125o73844
40151E71050M72739j004098k680971j486355J229728J940052M74628k16285R07670
40142B08158J701801Q23830j92160J03290O19760j74098j481684j290649O80684
40133I98932K648302K979436J706787M1705r03578r52295p31632p00999n80696
$$ y = [3482139, 1208980, 1205351, 2305878, 1992447, 355216, -522395, 277232, 1821881, 2942967, 3044545, 1984010, 438598, -164810, 798999, 2211976, 2809941, 3005831, 3895429, 5097071, 5150397, 3841971, 2522690, 1951410, 1394295, 424427, 144604, 1540281, 3655691, 4754900, 4693093, 4636484, 4668137, 3483877, 964019, -758452, -150209, 1146626, 561433, -1300477, -1264178, 1527720, 3957936, 3358019, 1244894, 571050, 1043789, 39691, -2641280, -4127635, -2897907, -957855, -483227, -699512, 208158, 1909959, 2733789, 2541629, 2644919, 3264679, 3090581, 1608897, 318248, 998932, 3647234, 6626670, 8333457, 8375162, 7471584, 6519289, 5787657, 5086658, 4505962]
40124D505962j58283p0296p31887j017764L12723K006811J312821j798510l689192
40115F72385j784483J701402K838451J322601J80348Q91856J689691R50933l81276
40106H081908q22699p26880j130464j598119q85589R01893K238423K054551O76334
40097H789358r56508k173890k733803k736883k410135j714613m48091J052315
40089c332250J887100J658970R25412K17904m71214p16326M28616K389113K468513
40080E455838o87902m144666l841373k17919K330144J744389O77135J549666K705261
40071E570573J660543o90573j942262k019769k072342j382797J093156L430288
40063C646817K860392N09374j6248J434457J366305j166406k796823j681764m98883
$$ y = [4505962, 4347679, 4277383, 3545496, 2527732, 2840455, 4847266, 6160087, 4361577, 672385, -1112098, 589304, 3427755, 4750356, 4930704, 5822560, 7512251, 8463184, 8081908, 7259209, 6532329, 5401865, 3803746, 2918157, 3820050, 6058473, 8113024, 8789358, 7832850, 5658960, 2925157, 188274, -2221861, -3936474, -4384565, -3332250, -1445150, 213820, 1139232, 1357136, 885922, 169596, 598212, 2987325, 5455838, 4767936, 623270, -3218103, -3436022, -1105878, 638511, 1315646, 2865312, 5570573, 7231116, 6540543, 4598281, 2578512, 506170, -876627, 216529, 3646817, 6507209, 7016583, 7000335, 8434792, 9801097, 8634691, 5837868, 4156104, 3657221]
40054C657221j232159j364978J245410L535384J809146j679252j935160O56469
40046D692081J099054j647573k744733M75791L828714K594081j422240k911833
40038C963342p21552J451466J010755n35842p77392K08584P36240J52579n56118
40029D932062k10687J130120K078713J327716o41444j750081p94249Q59143J019220
40020G950513l15384j051890j58760Q00025M2570j724056k256686q54464R21296
40011C353164J556563J223816O70315k17432j667731k706977k070785k57449P76292
40002F59776K77259k89382L84554J281883N98156j228734j735248J25442K280802
39993B354508K190945K10085j037691l06554P76317L18623j109142j572378p60304
$$ y = [3657221, 2425062, 1060084, 2305494, 5840878, 7650024, 5970772, 4035612, 4692081, 5791135, 4143562, 1398829, 1874620, 5703334, 8297415, 6875175, 3963342, 3241790, 4693256, 5704011, 5168169, 4390777, 4599361, 5335601, 5488180, 4932062, 4721375, 5851495, 7930208, 9257924, 8616480, 6866399, 6072150, 6931293, 7950513, 7635129, 6583239, 6424479, 7224504, 7267074, 5543018, 3286332, 2431868, 3353164, 4909727, 6133543, 6803858, 6586426, 4918695, 2211718, 140933, -116516, 659776, 937035, 647653, 1032207, 2314090, 2912246, 1683512, -51736, 73706, 2354508, 4545453, 4755538, 3717847, 3411293, 4187610, 4506233, 3397091, 1824713, 1064409]
39984A064409j70512m37310l64810P53026J617100R86989j62164k15757M12136
39975C483107J80593o82491m81395Q58792J377876K55660p77644j86888J019244
39966E046854R69306l29909j213103n24410J333105K843214K389504k46747l025565
39957G242249l456640j647500j39004k86595o29552K98404J534841J521439O82790
39948E120432L97838O53610N25819N4512p8489k5391l72319q64611q78114n47455
39938C985832k47491K96225J214854J637930Q11901o74448j745902k027913j472911
39929A778077j51422Q43901J10171j476666j144808J433675K848441R93941j463879
39920C771431j411549j94100n86017j470977q6200K269630J881414q95266j939206
$$ y = [1064409, 893897, 456587, 91777, 844803, 2461903, 3448892, 3286728, 3070971, 3483107, 3663700, 2981209, 2499814, 3358606, 4736482, 4992142, 4214498, 4027610, 5046854, 6016160, 5686251, 4473148, 3948738, 5281843, 8125057, 10514561, 10267814, 7242249, 3785609, 2138109, 1999105, 1712510, 1082958, 1381362, 2916203, 4437642, 5120432, 5518270, 6171880, 6697699, 6752211, 6673722, 6648331, 6276012, 5411401, 4533287, 3985832, 3738341, 4034566, 5249420, 6887350, 7699251, 7024803, 5278901, 3250988, 1778077, 1626655, 2470556, 2580727, 1104061, -40747, 1392928, 4241369, 5235310, 3771431, 2359882, 2165782, 1579765, 108788, 22588, 2292218, 4173632, 3278366, 1339160]
39911A339160l8621J730049J628867J279845J268354k05930k797806l039429n1140
39902A113349K255339J229735m78278N9717R63629p38221l475288l487625q14979
39893c372622J141917R40434L46041P25259J270865R23703j39952j103331j219387
39884d87073j76361J255661J578436M14303q53412r53996j32436Q21274J503057
39875B969453J415114K99694o71355j19966Q81154O1156j809263j426865J376936
39866B976058K556610K49674k015251j209251L23030n13354j997555j129398N89277
39857a70160K7772j483187m48806K166651K319158p6366j162005J09310Q39871
39848B122238J21122N47571K700829L354048J041544j147439n92993R37722Q00424
$$ y = [1339160, 1300539, 3030588, 4659455, 5939300, 7207654, 7001724, 4203918, 1164489, 1113349, 3368688, 4598423, 4120145, 4179862, 5143491, 4405270, 929982, -2557643, -3372622, -2230705, -1290271, -944230, -218971, 1051894, 1975597, 1835645, 732314, -487073, -663434, 592227, 2170663, 2584966, 1731554, 777558, 645122, 1466396, 2969453, 4384567, 4684261, 4012906, 3892940, 4774094, 4835250, 3025987, 1599122, 2976058, 5532668, 5782342, 3767091, 2557840, 2880870, 2367516, 369961, -759437, -170160, -142388, -1625575, -2074381, 92270, 2411428, 2335062, 1173057, 1282367, 2122238, 2243360, 2790931, 5491760, 8845808, 9887352, 8739913, 8146920, 9084642, 9885066]
39839I885066m39358r30878q02975j059592j353274r81470l80536k6286M65356
39830D376053R54266M24741q97162j196612K4447R08726L19805l46366J71934
39821D739832P79857J02536j161816j545505q31485M05912J563723J518491m87601
39812E083944k768026k621879n94324o0229j493048j222412K034325L886005R94968
39803C239324k970869k739453M45460J511200N3857O0989K151465K444114k94503
39794C901584k234235q76308J157663J013448J0854M47945J495515J230529R9274
39785F246269m27549m98484p20116m36376M38097L3956k326429l671597j266707
39776b628936K646598L515675Q99179j379843j061154K45856P64253R21761J096474
$$ y = [9885066, 9445708, 8514830, 7711855, 6652263, 5298989, 4317519, 3936983, 3910697, 4376053, 5330319, 5755060, 4857898, 3661286, 3685733, 4594459, 4914264, 4567898, 4739832, 5519689, 5622225, 4460409, 2914904, 2083419, 2489331, 4053054, 5571545, 5083944, 2315918, -305961, -900285, -960514, -2453562, -3675974, -1641649, 2244356, 3239324, 268455, -2470998, -2025538, -514338, -460481, -399492, 1751973, 4196087, 3901584, 1667349, 791041, 1948704, 2962152, 2973006, 3420951, 4916466, 6146995, 6246269, 5818720, 5320236, 4600120, 4163744, 4601841, 4635797, 2309368, -1362229, -2628936, 17662, 3533337, 4432516, 3052673, 1991519, 2237375, 3001628, 3923389, 5019863]
39767E019863K73238j531995k214793p13513J028469J042763K78636N68459J419179
39758E170306J155971q136m60975M6865M24779M87213R07383J239570L26210j269032
39748H020154j539607j84477O62854l98280k076961k600577k137383j709254j143626
39739c107157K39566J766022J928907N69378p81323q72799j38952J60983l37784
39730e73159o86217O6443J438204J910636Q86270n07646j114307j316223j832254
39721a728253j883498l19696J917735K582979J429182N63865J083056J550809
39713E196179O65859o62100j095104q82484p49620l87692N57741J398033J547185
39704E587997J355956Q02579q04991k633018k144379J021943L303171J831937
$$ y = [5019863, 5293101, 3761106, 1546313, 832800, 1861269, 2904032, 3182668, 3751127, 5170306, 6326277, 6318141, 5857166, 5904031, 6328810, 6816023, 7723406, 8962976, 9289186, 8020154, 6480547, 6296070, 6958924, 6560644, 4483683, 1883106, -254277, -1963531, -3107157, -2867591, -1101569, 827338, 1396716, 615393, -257406, -396358, -235375, -573159, -1259376, -1192933, 245271, 2155907, 3042177, 2534531, 1420224, 104001, -1728253, -3611751, -3931447, -2013712, 569267, 1998449, 2562314, 3645370, 5196179, 5862038, 5199938, 4104834, 3222350, 2472730, 2085038, 2642779, 4040812, 5587997, 6943953, 7746532, 6941541, 4308523, 2164144, 3186087, 6489258, 8321195]
39696H321195j235127j939741l06347N44187k03709m54286M26572N70534o39764
39687E083514j313826m74017L23999m6380l62410N72562J854532K109893J386891
39678I134758L19273r14033j849453j622461m86459J34047j52408j40368O23822
39669E046718Q34739k58253j382756j280291n66584l25476l63126j57193j83810
39660A363968r30567j632643j199987L54768K132928L095671K293204k27760k406944
39651B842638j906768N55684J718874M13070q02785N9853J246031N34764q56735
39642C804626n77833N88866J72367j485472j777743l88199L19648l75964m33949
39633a53653Q76696J234094o57650k201329o78724K174578K395782m04352k558985
$$ y = [8321195, 7086068, 5146327, 4839980, 5384167, 5180458, 4726172, 5152744, 5723278, 5083514, 3769688, 3295671, 3619670, 3573290, 3210880, 3783442, 5637974, 7747867, 9134758, 9454031, 8539998, 6690545, 5068084, 4581625, 4715672, 4563264, 4422896, 5046718, 5881457, 5623204, 4240448, 2960157, 2393573, 2068097, 1704971, 1547778, 1363968, 433401, -1199242, -2399229, -2044461, 88467, 3184138, 5477342, 5249582, 2842638, 935870, 1491554, 3210428, 3623498, 2820713, 2880566, 4126597, 4661361, 3804626, 3226793, 3815659, 3988026, 2502554, 724811, 336612, 656260, 280296, -153653, 723043, 1957137, 1299487, -901842, -1580566, 594012, 2989794, 2585442, 26457]
39624B6457j667726M76069J186054O41353N85698J022149O00909m51012l56287
39615B063664J083365J770820N76750q09355o78196q5039q76334k308125k014851
39606a277301K87084K382195K684037J706178M16640q35800j518668r56386L59819
39597C247798J041809O61758m7871p20920j394412j322074J00226J432084P64215
39588C762613q32681m44657J764420K245725l06924k692718k327394r82565r06973
39579g21154p48344J218213K792830J059901k090201k233682P53366K622434J336781
39570C990144n91557r12086p30442j419127j857128p08314J052333J852960J869949
39561B546732J834723J118716r70332l036879k830712l80659J755411J600315
$$ y = [26457, -1641269, -1165200, 20854, 662207, 1247905, 2270054, 2870963, 2419951, 2063664, 3147029, 4917849, 5494599, 4685244, 4007048, 3922009, 3045675, 737550, -1277301, -990217, 1391978, 4076015, 5782193, 6198833, 5363033, 3844365, 2887979, 3247798, 4289607, 4951365, 4903494, 4182574, 2788162, 1466088, 1566314, 2998398, 3762613, 2929932, 2485275, 4249695, 6495420, 6188496, 3495778, 1168384, 185819, -721154, -1469498, -251285, 2541545, 3601446, 1511245, -722437, 30929, 2653363, 3990144, 3398587, 2486501, 1756059, 336932, -1520196, -2228510, -1176177, 676783, 2546732, 4381455, 5500171, 4529839, 1492960, -1337752, -1718411, 37000, 1637315]
39553A637315j5034p99073J20908J377753J336858J67059o30731l77714Q7610
39544B904951l7244l75617l07812n5751n6074n2741L58199R39965J279628J322605
39534E920109Q59444m94050k052673k078031j96707J428225Q16781r92000j495585
39525A715513k70313Q55878O24831m13810j163757r59097L48093J876580J855878
39516D469796k16943k232840j985485l23688K05419p21731r85410M02390J863124
39507D74632J751339L21240j231149k034537j601039k08292O88584N9043p96515
39498b576694J42901K223450K674346Q10764q54332m39696Q36242J195924J019528
39489E032433J370177J642267O53610j034247j722360r62035O1749K52550k62080
$$ y = [1637315, 1622281, 823208, 944116, 2321869, 3658727, 3825786, 3195055, 2817341, 2904951, 2867707, 2492090, 2184278, 2128527, 2072453, 2019712, 2377911, 3317876, 4597504, 5920109, 6779553, 6285503, 4232830, 2154799, 1958092, 3386317, 4203098, 3211098, 1715513, 1445200, 2301078, 2925909, 2512099, 1348342, 389245, 737338, 2613918, 4469796, 4252853, 2020013, 34528, -289160, -83741, -805472, -1790882, -1388492, 474632, 2225971, 2547211, 1316062, -718475, -2319514, -2527806, -1839222, -1780179, -2576694, -2433793, -210343, 2464003, 3274767, 2420435, 1980739, 2816981, 4012905, 5032433, 6402610, 8044877, 8698487, 7664240, 5941880, 4979845, 5041594, 5294144, 5032064]
39480E032064n42587J22556J326714J639913K35643j685125k133564r43465J74401
39471C226550K33966K3180K43613L72268N8896k9392L44311K78279n01482p14153
39461C536036L89998J436290Q96662m96000r01557j13042M56392M7853o27388
39452D625244o66658L5103R66090J393694Q26662l02682q21977k54612M59180
39443F260044K64406o16367j263121j368251j182146p52309r6898K99952K5012
39434A570322m99527n03689P2395N71570N00321k56m05825k97445K15046N53849
39424A776761M46914L55469N46812K58170j100899k352367j778713J35770J091463
39415f20620L95735q7537Q46433J743660J018952m51144r73620o98038p21383
$$ y = [5032064, 4489477, 4612033, 5938747, 7578660, 7814303, 6129178, 3995614, 3052149, 3226550, 3460516, 3483696, 3727309, 4099577, 4158473, 4129081, 4473392, 4751671, 4250189, 3536036, 3926034, 5362324, 6258986, 5762986, 4861429, 4748387, 5204779, 5252632, 4625244, 3958586, 3993689, 4959779, 6353473, 7180135, 6877453, 6055476, 5800864, 6260044, 6524450, 5908083, 4644962, 3276711, 2094565, 1342256, 1245358, 1545310, 1570322, 1070795, 567106, 639501, 1211071, 1711392, 1711136, 1305311, 1007866, 1222912, 1776761, 2223675, 2579144, 3125956, 3384126, 2283227, -69140, -1847853, -1712083, -620620, -224885, -312422, 534011, 2277671, 3296623, 2845479, 1871859, 1173821, 452438]
39406D52438p99518j8179J117646J298972N87554J54283K74897K67336r773k31850
39396C093806o66211j426905j269972P93004L057442K673101k64832k508538j995578
39387A485317j34205R67095J236851J359371Q77932n82009j703141j124995K15263
39378B597479L34551p94422j425533r08872l33408j79034N51679K069115K563306
39369D474861P05628j885264k472450r03114L56219j34698r16460m7964K021354
39360A198112L089581J955337m38097k178697j980424n0440J934913K127605M28290
39351F086180j301905j468711n15171J80656K52443J35889k08782r65232j501846
39342F93521j247579r47070j393500j530751J15331K498790K976056J228437k70040
$$ y = [452438, -347080, -365259, 752387, 2051359, 2638913, 2793196, 3068093, 3335429, 3325656, 3093806, 2427595, 1000690, -269282, 523722, 3581164, 6254265, 5989433, 3480895, 1485317, 1351112, 2318207, 3555058, 4914429, 5792361, 5210352, 3507211, 2382216, 2597479, 2932030, 2137608, 712075, -196797, -530205, -709239, -157560, 1911555, 4474861, 5180489, 3295225, 822775, -80339, 275880, 141182, -775278, -823242, 1198112, 4287693, 6243030, 5804933, 3626236, 1645812, 1595372, 3530285, 5657890, 6086180, 4784275, 3315564, 2800393, 2981049, 3233492, 3369381, 3160599, 2195367, 693521, -554058, -1501128, -2894628, -4425379, -4310048, -1811258, 1164798, 2393235, 2123195]
39333B123195j01631M37753K82233L53890J038520O98620j321581k657426j278430
39324d24857J138706J747415O78487r7140m32312j332322j813001n9667K669837
39315B075146K925754J82705k220460j984772o24714k33328l43020L39883J358360
39306A475554J522458Q89735J40178o71603j413857j327631m83084l30515j376845
39297a575610j805677j15307K236498K811545J694148P91227M73436n01839j949690
39288B058731j891564J10818J593051M56381k006816k814500j052201J425389
39280b120711K505317J805624L26993q40124j213199q95948k56518L45176N88117
39271B44727K42646m72198q08039k94121N38186Q74782Q27979J001438J065065
$$ y = [2123195, 2021564, 2459317, 2741550, 3095440, 4133960, 4832580, 3510999, 853573, -424857, 713849, 2461264, 3139751, 3042611, 2610299, 1277977, -535024, -594691, 2075146, 5000900, 5183605, 2963145, 978373, 353659, 120331, -222689, 117194, 1475554, 2998012, 3887747, 4027925, 3356322, 1942465, 614834, 131750, -198765, -1575610, -3381287, -3496594, -1260096, 1551449, 3245597, 4036824, 4510260, 4008421, 2058731, 167167, 277985, 1871036, 2327417, 320601, -2493899, -3546100, -2120711, 384606, 2190230, 2517223, 1677099, 463900, -432048, -688566, -343390, 244727, 487373, 15175, -792864, -1086985, -548799, 325983, 1153962, 2155400, 3220465]
39262C220465J61910j122703r53447Q36744J817851L40646j740903j632108L43396
39253A271851J527278R41485m9355o77911j518030k129271r51553J602207K749880
39244B766581J339127l07573q8977Q41587O65029R3746N32917J128065M59616
39235G430118m84704k6612Q72705J67392j470050j767721r69618j194890k122554
39226D34066j289416J102856J782136k19379j661726j83472K129006K252321L94529
39217D740921j436816k448138k497930r21839J754342K990769J465948o49380
39209B997877q49327R7733N0906p60512o09642M27600Q05277L04483J267P4150
39199B539812j02361k50882L31750J127478J113554M98992K7308n33986j379201
$$ y = [3220465, 3382375, 2259672, 1306225, 2142969, 3960820, 4301466, 2560563, 928455, 1271851, 2799129, 3740614, 3691259, 3013348, 1495318, -633953, -1585506, 16701, 2766581, 4105708, 3798135, 3709158, 4550745, 5215774, 5309520, 5842437, 6970502, 7430118, 6945414, 6918802, 7791507, 7958899, 6488849, 4721128, 3751510, 2556620, 434066, -855350, 247506, 2029642, 1810263, 148537, -34935, 2094071, 4346392, 4740921, 3304105, 855967, -1641963, -2563802, -809460, 2181309, 3647257, 2997877, 2148550, 2246283, 2297189, 1536677, 927035, 1354635, 2159912, 2464395, 2465662, 2539812, 2437451, 2186569, 2518319, 3645797, 4759351, 5258343, 5285651, 4751665, 3372464]
39190C372464j321746L26447J679394O35413j606011k097134m56261J218947K034233
39181C785746K632824K273453o12672m479634n085336j260085K917458L482928
39173C654682J443213K76529Q86510J443135P23728p37494k028621k519775j719523
39164A422384k44J035367K48304j409844k116108j520110o77563j23974N55083
39155b586705J316775J266305J35120q94921o13959N24504R65470J64249o82645
39146d05807k92606R77969J651644R70333m59328j552439j508209n0948J999377
39137A329986K657969P40152k041615k612837n67885J140860L31931j454034j438658
39128a914131N49590K338326K395661J021648n96792j268279n54378M38112J11610
$$ y = [3372464, 2050718, 2377165, 4056559, 4691972, 3085961, 988827, 532566, 1751513, 3785746, 6418570, 8692023, 8079351, 3599717, -1485619, -2745704, 171754, 3654682, 5097895, 5374424, 6260934, 7704069, 8427797, 7690303, 5661682, 3141907, 1422384, 1422140, 2457507, 2705811, 1295967, -820141, -2340251, -3017814, -3141788, -2586705, -1269930, -3625, 131495, -763426, -1377385, -852881, 112589, 276838, -405807, -698413, 279556, 1931200, 2901533, 2442205, 889766, -618443, -669391, 1329986, 3987955, 4728107, 2686492, 73655, -494230, 646630, 978561, -475473, -1914131, -1364541, 973785, 3369446, 4391094, 3794302, 2526023, 1971645, 2409757, 2521367]
39119B521367j112442j055066N96221J266225m12557k069960j362518K73164M39250
39110i16316m3032P98414J881912R06737j078253j155119L73239O72695m50350
39101I89927n34684N73534L84498j237322j356993Q01640K265117J264367k60074
39092B890010n64764o25741j146528q49956M29838O33534o10270o53925J423915
39083I26113K519002O09866j456652n24437J679203J570020n37844j526658o51138
39074B607475L9758m71972j075723q38968k5124Q61005J395806J208197P36601
39065D437055R30720J395947N51022j496777k442202j262450K59931P66454J287190
39056D426890K429008K645860J241417L785k15615j158828l085758k956764K42391
$$ y = [2521367, 1408925, 353859, 950080, 2216305, 1803748, -266212, -1628730, -1355566, -916316, -959348, -160934, 1720978, 2627715, 1549462, 394343, 767582, 1440277, 989927, 455243, 1028777, 1413275, 175953, -1181040, -379400, 1885717, 3150084, 2890010, 2325246, 1699505, 552977, -296979, 132859, 766393, 156123, -497802, 926113, 3445115, 4054981, 2598329, 2073892, 3753095, 5323115, 4785271, 3258613, 2607475, 2647233, 2175261, 1099538, 260570, 235446, 1096451, 2492257, 3700454, 4437055, 5367775, 6763722, 7314744, 5817967, 3375765, 2113315, 2373246, 3139700, 4426890, 6855898, 9501758, 10743175, 10746960, 10531345, 9372517, 6286759, 3329995, 3572386]
39047C572386K431495N82403k030762j329881P13935K62704r57507Q68526L443098
39038G556397J331613m090903n643920j491896K412396K224924J021576J481237
39030D801424J070149j852097l523448r98728K228534J764944o02703m69587J733215
39021D151703K129242J44093j232613q33462l87473o42006m21155M04729M09936
39012C722994o43067j325533j003386l80009L43282J384523J605839l67999l004217
39003C32427k840116M54754K856685J461752j330386j460413Q67056J977838N89952
38994B909549n85943L83504J537342M63427j633432j939594n50151R2420m41437
38985B35685j53465J255681J364970o82159k167045j070230N52198J20163j037476
$$ y = [3572386, 6003881, 6586284, 4555522, 3225641, 3939576, 4202280, 3244773, 4113299, 7556397, 8888010, 4797107, -846813, -2338709, 73687, 2298611, 3320187, 4801424, 5871573, 4019476, 496028, -502700, 1725834, 3490778, 2888075, 2418488, 4151703, 6280945, 6425038, 5192425, 4358963, 3971490, 3329484, 2908329, 3313058, 3722994, 3079927, 1754394, 751008, 370999, 714281, 2098804, 3704643, 3336644, 332427, -2507689, -2052935, 803750, 2265502, 935116, -525297, 341759, 2319597, 2909549, 2323606, 2707110, 4244452, 4707879, 3074447, 1134853, 584702, 677122, 235685, 82220, 1337901, 2702871, 2020712, -146333, -1216563, -664365, -544202, -1581678]
38976a581678j46811J920382J891457l95770j655060l97798J142083J052338L78212
38967B207355M01022J68571j348642k726162j896901N79493J958932P66552j434243
38958a324023j890895K21865K811050L207481J351803k47078K9033R18347O24458
38949E702041m73658r87349q92265p91591j76214J297575K027478N64902j528293
38940D742626j696194l07419M45167N31721J368603J906872k23092l660459m073091
38931i65266q81550J373840P5003j519545M5026K746402K599549o262j313321
38922B153876M5098J758486J687365K70211q48018p91561k6337J60030r06871
38913C502279k115017j798629j90120Q85393P85393N06169K91401o52163j668698
$$ y = [-1581678, -1728489, 191893, 2083350, 1687580, 32520, -365278, 776805, 1829143, 2207355, 2608377, 2776948, 1428306, -1297856, -3194757, -2615264, -656332, 110220, -1324023, -3214918, -2993053, -182003, 3025478, 4377281, 4130203, 4159236, 5077583, 5702041, 5228383, 4241034, 3348769, 2557178, 2380964, 3678539, 5706017, 6270919, 4742626, 3046432, 2739013, 3184180, 3715901, 5084504, 6991376, 6768284, 3107825, -965266, -1846816, -472976, -397973, -1917518, -1872492, 873910, 3473459, 3467197, 2153876, 2198974, 3957460, 5644825, 5915036, 5067018, 4275457, 4249120, 4409150, 3502279, 1387262, -411367, -601487, 283906, 1069299, 1575468, 1866869, 1214706, -453992]
38904d53992q62876J360281K129916P18074m9118J292323K067585R6480k244758
38895D053915j832307J02293L41862r58133j169216l9489K73269o31966q48524
38886g08296K37504R67406M55548J1190P84102J900709J808440M14827p48467
38877E122963k75834J186872J173114j404452l834692k610309J208405K751908
38869C317975K97047k120818r38432J701836J900569L9186q78935n52573q93001
38860A872854j724504j165472M09384O74830n55872j005968J74727J232151Q42949
38851G55079k22673p99813o18432K13808J264236J508299N91898j70010M04335
38842B926727J412870J337860L88213l27434p09135r99524o85313J84108M00882
$$ y = [-453992, -1316868, 43413, 2173329, 2891403, 2842285, 4134608, 6202193, 6298673, 4053915, 2221608, 2323901, 2665763, 1707630, 538414, 498925, 772194, 140228, -708296, -470792, 496614, 952162, 963352, 1747454, 3648163, 5456603, 5871430, 5122963, 4847129, 6034001, 7207115, 5802663, 1967971, -642338, 566067, 3317975, 3615022, 1494204, 555772, 2257608, 4158177, 4197363, 3318428, 2765855, 1872854, 148350, -1017122, -607738, 67092, -488780, -1494748, -1320021, -87870, 755079, 532406, -267407, -885839, -672031, 592205, 2100504, 2692402, 2522392, 2926727, 4339597, 5677457, 6065670, 5738236, 5029101, 4029577, 3344264, 3528372, 3929254]
38833C929254P2328J179671L498302L257350q57670l897852j423298L065581L158575
38824A1982241m44155j634563O93284J356311j661741l805639j896768J010696
38816E599666J506864R40133J343745J110122j415528l812831l027013k59847
38808A985311J113077N10266o5275L04338O90016L32495m77495r46761l71132
38799C074840R25949J273630j09122j068531P23032L463290L150032k11103k337146
38790H884871j161603O57401P79031K89406J50984r62985l027413l108615j39854
38781B361223K607984K552183J434562J089796j97945l442492n118808k216297
38773i29794K026216K420300m07940j539844M90237K389081J824514m0308j605208
$$ y = [3929254, 4001582, 5181253, 8679555, 11936905, 11079235, 7181383, 5758085, 8823666, 11982241, 11538086, 9903523, 10596807, 11953118, 10291377, 6485738, 4588970, 5599666, 7106530, 8046663, 9390408, 10500530, 9085002, 5272171, 2245158, 1985311, 3098388, 3608654, 3543379, 3847717, 4537733, 4870228, 4392733, 3445972, 3074840, 4000789, 5274419, 5165297, 4096766, 4819798, 8283088, 11433120, 11222017, 8884871, 7723268, 8380669, 9159700, 9449106, 9600090, 8637105, 5609692, 2501077, 2361223, 4969207, 7521390, 8955952, 10045748, 9847803, 6405311, 1286503, -929794, 1096422, 3516722, 3108782, 1568938, 2059175, 4448256, 6272770, 6232462, 4627254]
38764D627254k528401k206263L0454K749645L202128P98178k188111l516801k924349
38755a956266j352411K13742J223558J790070K064791J338587p29215k106055
38747D86801l88639K773486K933958k93792k008408J89413K062482q9034k973695
38738B692572j971426R44479R54432j174342j068846J051998J188261o54319o59064
38729A303745J123019N12630k719836l616691n17431J930036P00524r03951L21452
38720a866503K028820J213509l03139K56112J214188l11916k662482k008508J302652
38711a137267L282265K268909M11348m42632q04334j252600j053633N1691O79800
38702B003547m65556k592952l385716j560898J368276K469617J016621k26240
$$ y = [4627254, 2098853, -107410, -76956, 2672689, 5874817, 6672995, 4484884, 968083, -1956266, -3308677, -3094935, -1871377, -81307, 1983484, 3322071, 2592856, 486801, 98162, 2871648, 5805606, 5511814, 3503406, 3692819, 5755301, 5666267, 2692572, 721146, 1665625, 2620057, 1445715, 376869, 1428867, 2617128, 1962809, 1303745, 2426764, 2939394, 219558, -3397133, -3914564, -1984528, -1284004, -2187955, -1866503, 162317, 1375826, 1072687, 1328799, 2542987, 2231071, -431411, -2439919, -1137267, 2144998, 4413907, 4825255, 4382623, 3578289, 2325689, 1272056, 1323747, 2003547, 1537991, -1054961, -4440677, -6001575, -4633299, -2163682, -1147061, -1373301]
38694a373301J250532L660974L122681m38357k761002j333403J207481J390763
38686D726368k24682q77660j51259J20224o59304j106365l13960R44942J513614
38677C971918J046092o1372j063367j365958j150549j075003j108699n29758O00050
38668g36646J130123N80699J8928L94590J089383J008903J83588o22267j137240
38659A910061j561240j845783j668757q70468K71136R39095L61138q46739p24710
38650d036267J383504L150072K123710n44221j718114j040340r24934j816417
38642c423007j205023J569505L234852J411009j486652j734487N75220K491453
38634A432870K516853J431792J79124o80849m20460Q70851J632957Q54692l38121
$$ y = [-1373301, -122769, 3538205, 6660886, 6222529, 3461527, 2128124, 3335605, 4726368, 4501686, 3624026, 3472767, 3592991, 2933687, 1827322, 1513362, 2458304, 3971918, 5018010, 4956638, 3893271, 2527313, 1376764, 301761, -806938, -1336696, -736646, 393477, 974176, 993104, 1387694, 2477077, 3485980, 3669568, 3047301, 1910061, 348821, -1496962, -3165719, -4036187, -3765051, -2825956, -2464818, -3311557, -4036267, -2652763, 497309, 2621019, 2076798, 358684, -681656, -1606590, -3423007, -4628030, -3058525, 176327, 1587336, 100684, -1633803, -1058583, 1432870, 3949723, 5381515, 5560639, 4879790, 4459330, 5330181, 6963138, 7817830, 7479709]
38625G479709o31912n81863r62937p68711Q94432K450543J983911M82046J54354
38616A0499572N12198p14125l161345l652933q98176K458878L442992K197984
38608A0685045P55416J05043k39557p98615j356693j322350m86848L93059J00967
38599G835467j397101k406526j548294K03546P31370l69768j463703j223782j7355
38590C43854J083591J522517J303697O90905Q8372k20131j52919M74369J667752
38581F802007K411057J285645j322869k930991j993191L7818J033842J157055
38573F480373J643666J948638O30512j594596k382412j275380j51517N7222N07251
38564E863757J606654J585454o32806l047516k943291o10918J022946J43247j913061
$$ y = [7479709, 6847797, 6265934, 5302997, 4534286, 5428718, 7879261, 9863172, 10345218, 10499572, 11011770, 10297645, 7136300, 3483367, 2585191, 5044069, 8487061, 10685045, 11440461, 11545504, 11305947, 10507332, 9150639, 7828289, 7341441, 7734500, 7835467, 6438366, 4031840, 2483546, 2687092, 3418462, 3048694, 1584991, 361209, 343854, 1427445, 2949962, 4253659, 4944564, 5032936, 4812805, 4659886, 5134255, 6802007, 9213064, 10498709, 9175840, 6244849, 4251658, 4289476, 5323318, 6480373, 8124039, 10072677, 10703189, 9108593, 6726181, 5450801, 5299284, 5356506, 5863757, 7470411, 9055865, 8423059, 5375543, 2432252, 1821334, 2844280, 2987527, 1074466]
38555A074466k491239p18103J575126J924167N5376j770344j505938K18863J194339
38546d43287O81659O5032M46822J012821M91502p23384r72454L31683J616366
38537B506760Q61961j779433l703649k698431L13369K296488J791233L40479q2708
38528a53931M15456O57631N68992Q46216J270510R55197n9853q43277j023934
38519B633007j002784q70986k99654M94590P30343J74104m58595l58085M88259
38510A530199J172447N94508j123695k037074l99047K534678L439825J321982
38502G033823j036436j224361n36695j178893k300978j673352K00473R06602K14352
38493D04535J6781N29488l9221j792703k419184r29711Q05308J256232J281402
$$ y = [1074466, -1416773, -2134876, -559750, 1364417, 1419793, -350551, -1856489, -1637626, -443287, 238372, 303404, 750226, 1763047, 2254549, 1531165, 558711, 890394, 2506760, 3368721, 1589288, -2114361, -4812792, -4499423, -2202935, -411702, -71223, -153931, 261525, 919156, 1488148, 2334364, 3604874, 4560071, 4500218, 3656941, 2633007, 1630223, 759237, 459583, 954173, 1684516, 1858620, 1400025, 1041940, 1530199, 2702646, 3297154, 2173459, 136385, -262662, 2272016, 5711841, 7033823, 5997387, 4773026, 4236331, 3057438, 756460, -916892, -716419, 190183, 404535, 421316, 950804, 911583, -881120, -3300304, -4230015, -3424707, -2168475, -887073]
38484h87073J760464J673949J25149j659539j926088o13661J115629K227530J952439
38475C768799J71068j605679j396194L61602J027679k92027j293549k50127J165611
38466A657183P82027m49376k34762J123337J316498j25106j171763m55567J041453
38457C483924J787047J527365Q26739O522q66700j625767k046897j950202j239473
38448i7442j53203O25449M58046n91108j616065j419705L61572K339232K291117
38439B197893j35355k386645k024585j02366L72387j086741j965764q99200M51019
38430e579357N44495L08338Q47725J229291M85840k29747K88944Q18188k58505
38421a544788j793127j391340P91465K350416K179819J262036L21871p41698j193888
$$ y = [-887073, 873391, 2547340, 2672489, 1012950, -913138, -1526799, -411170, 1816360, 3768799, 3939867, 2334188, 937994, 1299596, 2327275, 2035248, 741699, 491572, 1657183, 2439210, 1989834, 1755072, 2878409, 4194907, 4069801, 2898038, 2442471, 3483924, 5270971, 6798336, 7625075, 7631597, 6764897, 5139130, 3092233, 1142031, -97442, -250645, 374804, 832850, 241742, -1374323, -2794028, -2432456, -93224, 2197893, 2062538, -324107, -2348692, -2451058, -2078671, -3165412, -5131176, -6030376, -5579357, -5034862, -4726524, -3878799, -2649508, -2163668, -2393415, -2104471, -1286283, -1544788, -3337915, -4729255, -3937790, -1587374, 592445, 1854481, 2176352, 1434654, 240766]
38412B40766Q4216K070557K055573m83833k643580j942000L95123J454648N07920
38403A739390q58311j549883j928357k096970j127727J170900K949092K191004
38395D89138l72982j638584Q9783K815217L328817J149734j345918k193522j563646
38386G58037l75311Q72799J493397P28611p36666j074148J8991P14654R7771k38584
38376B259551Q76645J793711P11379j105766j411589p95611j345674k504764j770595
38367c292713O97458J781292K94454j203934o58724N11022L90439k46901L1375
38358a696232L85127m91607j274189K01703K831483L083971J15435k802013k836176
38349b482498j153741m64747r61597q16501L64895R93258L15178l67095J08789
$$ y = [240766, 324982, 2395539, 4451112, 3967279, 1323699, -618301, -223178, 1231470, 1739390, 881079, -668804, -2597161, -4694131, -5821858, -4650958, -1701866, 489138, 116156, -1522428, -1432645, 1382572, 4711389, 5861123, 4515205, 2321683, 758037, 382726, 1255525, 2748922, 3477533, 2740867, 1666719, 1685710, 2400364, 2498135, 2259551, 3136196, 4929907, 5641286, 4535520, 3123931, 2328320, 982646, -1522118, -3292713, -2595255, -813963, -519509, -1723443, -2382167, -1871145, -1480706, -1727607, -1696232, -1311105, -1802712, -3076901, -2875198, -43715, 3040256, 3155691, 353678, -2482498, -3636239, -4100986, -5062583, -5879084, -5514189, -4520931, -4205753, -4572848, -4464059]
38340d464059J077150J451698J329676J046851N9086j659485k361922p48096J452229
38331b816872J564931J04195o3058J385780J601387l57105j514239J4698J502163
38322A421880P1111k252322j756373Q35406J839466R05195J012377K484702K091655
$$ y = [-4464059, -3386909, -1935211, -605535, 441316, 500402, -1159083, -3521005, -4269101, -2816872, -1251941, -1147746, -1210804, 174976, 1776363, 1419258, -94981, -80283, 1421880, 1492991, -759331, -2515704, -1680298, 159168, 1064363, 2076740, 4561442, 6653097]
$$ [...]
##END NTUPLES=NMR SPECTRUM
##END=
