##TITLE=31Pdec_SR115_4
 , 24 sc
 1.4.2022
##JCAMPDX= 6.0         $$ Bruker NMR JCAMP-DX V2.0
##DATA TYPE= NMR SPECTRUM
##DATA CLASS= NTUPLES
##ORIGIN= UXNMR, Bruker Analytische Messtechnik GmbH
##OWNER= root
$$ XWIN-NMR		Version 3.5
$$ Fri Apr  1 11:58:48 2022 Russian Standard Time (UT+4h)  she@DPX200
##.OBSERVE FREQUENCY= 81.013821
##.OBSERVE NUCLEUS= ^31P
##.ACQUISITION MODE= SIMULTANEOUS
##.ACQUISITION SCHEME= undefined
##.AVERAGES= 24
##.DIGITISER RES= 16
##SPECTROMETER/DATA SYSTEM= spect
##.PULSE SEQUENCE= zgpg30
##.SOLVENT NAME= D2O
##.SHIFT REFERENCE= (INTERNAL, D2O, 0, 248.564)
##AUDIT TRAIL= $$ (NUMBER, WHEN, WHO, WHERE, WHAT)
$$ ##TITLE= Audit trail, XWIN-NMR		Version 3.5
$$ ##JCAMPDX= 5.01
$$ ##ORIGIN= Bruker BioSpin GmbH
$$ ##OWNER= she
$$ F:/spectra/data/she/nmr/P31/1/pdata/1/auditp.txt
$$ ##AUDIT TRAIL=  $$ (NUMBER, WHEN, WHO, WHERE, WHAT)
(   1,<2022-04-01 11:57:29.54 +0400>,<she>,<DPX200>,
      <created by zg, POWCHK disabled, PULCHK disabled
       configuration hash MD5:
       00 E9 B6 7A A2 85 ED C7 34 08 36 98 17 FE 4E 26
       data hash MD5: 32K
       94 17 25 95 B5 D7 22 FA B2 FC 4C 7C 21 79 56 3D>)
(   2,<2022-04-01 11:57:36.67 +0400>,<she>,<DPX200>,
      <Start of raw data processing
       efp BC_mod = 2 LB = 1 FT_mod = 6 PKNL = 1 PHC0 = -9370.683 PHC1 = 136.8756 SI = 64K 
       data hash MD5: 64K
       2E 82 AD E6 D6 40 FD FB 7B 9C 41 5B 89 B6 AE 1A>)
(   3,<2022-04-01 11:58:01.01 +0400>,<she>,<DPX200>,
      <pk PHC0 = -5.371797 PHC1 = 0 
       data hash MD5: 64K
       CA F9 44 81 46 62 90 89 A3 D1 4E F4 BE 6C CD 5F>)
(   4,<2022-04-01 11:58:17.71 +0400>,<she>,<DPX200>,
      <pk PHC0 = -3.599997 PHC1 = 0 
       data hash MD5: 64K
       8A 93 6E CF 11 E4 20 A5 DF 92 63 E2 19 7F 2D C0>)
$$ ##END=
$$ 
$$ hash MD5
$$ 81 95 6A 1B 3B 89 35 9E 48 D6 43 76 F5 19 3B 4B
##$RELAX= 
##$RELAX= 
##$RELAX= 
##$RELAX= 
##$RELAX= 
##$RELAX= 
##$RELAX= 
##$RELAX= 
$$ Bruker specific parameters
$$ --------------------------
##$DU= <F:/spectra>
##$EXPNO= 1
##$NAME= <P31>
##$PROCNO= 1
##$TYPE= <nmr>
##$USER= <she>
##$AMP= (0..31)
100 100 100 100 100 100 100 100 100 100 100 100 100 100 100 100 100 100 
100 100 100 100 100 100 100 100 100 100 100 100 100 100 
##$AQSEQ= 0
##$AQ_mod= 1
##$AUNM= <au_zg>
##$AUTOPOS= <>
##$BF1= 81.014009
##$BF2= 200.13
##$BF3= 200.13
##$BF4= 200.13
##$BF5= 200.13
##$BF6= 200.13
##$BF7= 200.13
##$BF8= 200.13
##$BYTORDA= 1
##$CFDGTYP= 0
##$CFRGTYP= 5
##$CHEMSTR= <none>
##$CNST= (0..31)
1 1 145 1 1 1 1 1 1 1 1 1 1 1 1 1 1 1 1 1 1 1 1 1 1 1 1 1 1 1 1 1 
##$CPDPRG= <waltz16>
##$CPDPRG1= <>
##$CPDPRG2= <waltz16>
##$CPDPRG3= <>
##$CPDPRG4= <mlev>
##$CPDPRG5= <mlev>
##$CPDPRG6= <mlev>
##$CPDPRG7= <mlev>
##$CPDPRG8= <mlev>
##$CPDPRGB= <>
##$CPDPRGT= <>
##$D= (0..31)
0 1 0 0 0 0 0 0 0 0 0 0.03 2e-05 3e-06 0 0 0 0 0 0 0 0 0 0 0 0 0 0 0 0 
0 0 
##$DATE= 1648799848
##$DBL= (0..7)
120 120 120 11 120 120 24 19 
##$DBP= (0..7)
150 150 150 150 150 150 150 150 
##$DBP07= 0
##$DBPNAM0= <>
##$DBPNAM1= <>
##$DBPNAM2= <>
$$ [...]
##$SUBNAM2= <"">
##$SUBNAM3= <"">
##$SUBNAM4= <"">
##$SUBNAM5= <"">
##$SUBNAM6= <"">
##$SUBNAM7= <"">
##$SUBNAM8= <"">
##$SUBNAM9= <"">
##$SW= 501.771253377433
##$SWIBOX= (0..15)
0 1 3 0 0 0 0 0 0 0 0 0 0 0 0 0 
##$SW_h= 40650.406504065
##$TD= 32768
##$TD0= 1
##$TE= 0
##$TE2= 300
##$TE3= 300
##$TEG= 300
##$TL= (0..7)
0 120 53 12 22 120 120 120 
##$TP= (0..7)
150 150 150 150 150 150 150 150 
##$TP07= 0
##$TPNAME0= <>
##$TPNAME1= <>
##$TPNAME2= <>
##$TPNAME3= <>
##$TPNAME4= <>
##$TPNAME5= <>
##$TPNAME6= <>
##$TPNAME7= <>
##$TPOAL= (0..7)
0.5 0.5 0.5 0.5 0.5 0.5 0.5 0.5 
##$TPOFFS= (0..7)
0 0 0 0 0 0 0 0 
##$TUNHIN= 0
##$TUNHOUT= 0
##$TUNXOUT= 0
##$USERA1= <user>
##$USERA2= <user>
##$USERA3= <user>
##$USERA4= <user>
##$USERA5= <user>
##$V9= 5
##$VALIST= <valist>
##$VCLIST= <CCCCCCCCCCCCCCC>
##$VD= 0
##$VDLIST= <DDDDDDDDDDDDDDD>
##$VPLIST= <PPPPPPPPPPPPPPP>
##$VTLIST= <TTTTTTTTTTTTTTT>
##$WBST= 1024
##$WBSW= 4
##$XGAIN= (0..3)
0 0 0 0 
##$XL= 0
##$YL= 0
##$YMAX_a= 3148
##$YMIN_a= -2689
##$ZGOPTNS= <>
##$ZL1= 120
##$ZL2= 120
##$ZL3= 120
##$ZL4= 120
##$ABSF1= 0
##$ABSF2= 0
##$ABSG= 0
##$ABSL= 0
##$ALPHA= 0
##$AQORDER= 0
##$ASSFAC= 0
##$ASSFACI= 0
##$ASSFACX= 0
##$ASSWID= 0
##$AUNMP= <proc_1d>
##$AZFE= 0.1
##$AZFW= 0.5
##$BCFW= 0
##$BC_mod= 2
##$BYTORDP= 0
##$COROFFS= 0
##$CY= -3
##$DATMOD= 1
##$DC= 0
##$DFILT= <>
##$DTYPP= 0
##$F1P= 0
##$F2P= 0
##$FCOR= 1
##$FTSIZE= 65536
##$FT_mod= 6
##$GAMMA= 0
##$GB= 0
##$INTBC= 1
##$INTSCL= 5.30512e-09
##$ISEN= 30
##$LB= 1
##$LEV0= 0
##$LPBIN= 0
##$MAXI= 10000
##$MC2= 0
##$MEAN= 0
##$ME_mod= 0
##$MI= 50
##$NCOEF= 0
##$NC_proc= -9
##$NLEV= 6
##$NOISF1= 182.463
##$NOISF2= 159.3651
##$NSP= 0
##$NTH_PI= 0
##$NZP= 0
##$OFFSET= 248.5645
##$PC= 4
##$PHC0= -9379.654
##$PHC1= 136.8756
##$PH_mod= 1
##$PKNL= yes
##$PPARMOD= 0
##$PSCAL= 0
##$PSIGN= 0
##$REVERSE= no
##$SF= 81.014009
##$SI= 65536
##$SIGF1= 159.3651
##$SIGF2= -187.1042
##$SINO= 113.3802
##$SIOLD= 16384
##$SREGLST= <1H.CDCl3>
##$SSB= 0
##$STSI= 65536
##$STSR= 0
##$SW_p= 40650.406504065
##$SYMM= 0
##$S_DEV= 0
##$TDeff= 32768
##$TDoff= 0
##$TI= <>
##$TILT= no
##$TM1= 0
##$TM2= 0
##$TOPLEV= 0
##$USERP1= <user>
##$USERP2= <user>
##$USERP3= <user>
##$USERP4= <user>
##$USERP5= <user>
##$WDW= 1
##$XDIM= 65536
##$YMAX_p= 321079139
##$YMIN_p= -10900156
$$ End of Bruker specific parameters
$$ ---------------------------------
##NTUPLES= NMR SPECTRUM
##VAR_NAME=  FREQUENCY,     SPECTRUM/REAL,   SPECTRUM/IMAG
##SYMBOL=    X,             R,               I
##VAR_TYPE=  INDEPENDENT,   DEPENDENT,       DEPENDENT
##VAR_FORM=  AFFN,          ASDF,            ASDF
##VAR_DIM=   65536,         65536,           65536
##UNITS=     HZ,            ARBITRARY UNITS, ARBITRARY UNITS
##FACTOR=    0.620285442955139, 1,           1
##FIRST=     20137.2065510759, 0,            0
##LAST=      -20513.1999529892, 0,           0
##MIN=       -20513.1999529892, -10900156,   0
##MAX=       20137.2065510759, 321079139,    0
$$ Real data points
##PAGE= N=1
##DATA TABLE= (X++(R..R)), XYDATA
$$ [...]
$$ plain form
44006 -1822505 -881083 463306 1378220 1303248 702010 421454 549867 506546 81060 -400376
43996 -400376 -891422 -1632022 -2208772 -1811883 -881506 -1118166 -2923981 -4210365 -3207007
43987 -3207007 -1291167 -1101245 -2619619 -3391008 -2348329 -999873 -591714 -542478 -420905
43978 -420905 -1098239 -2687274 -3454070 -2442593 -1437275 -2376012 -4160185 -4190538 -2218649
43969 -2218649 -464366 -239655 -524240 -23040 1122320 2135336 2801392 3264676 3422725
43960 3422725 2995162 1867046 330574 -807587 -789184 611 124147 -1069045 -2385265
43951 -2385265 -2444203 -1709340 -1714834 -2712478 -3325751 -2430936 -377144 1627047 2591307 2358449
43941 2358449 1724033 1618523 1781287 1017613 -716138 -1715828 -1013391 -100477 -653590
$$ packed form
44006a822505R41422J344389R14914p4972o01238k80556J28413m3321m25486m81436
43996d00376m91046p40600n76750L96889R30377k36660j805815j286384J003358
43987c207007J915840J89922j518374p71389J042679J348456M08159M9236J21573
43978d20905o77334j589035p66796J011477J005318r38737j784173l0353J971889
43969b218649J754283K24711k84585N01200J145360J013016O66056M63284J58049
43960C422725m27563j128116j536472j138161J8403P89795J23536j193192j316220
43951b385265n8938P34863n494r97644o13273Q94815K053792K004191R64260k32858
43941B358449o34416j05510J62764p63674j733751r99690P02437R12914n53113
$$ plain form
43932 -653590 -1767456 -1400002 363802 1684772 1963049 2124923 2294896 1655898 605485
43923 605485 577886 1451489 1523212 477112 -67584 366010 -8908 -2161459 -4261702
43914 -4261702 -4196490 -2314791 -363938 727110 794910 -247006 -1734785 -2248539 -1447318
43905 -1447318 -626818 -548952 -346013 358839 140313 -1866221 -3964991 -4054043 -2450182
43896 -2450182 -880790 35299 580422 550053 -20912 49744 1291390 2036247 799488
43887 799488 -949852 -836344 587846 878830 -2790 427785 2873803 4937524 4935682
43878 4935682 4263899 4601492 5094487 4131123 2231460 1158540 1130831 825604 -258321
43869 -258321 -1118261 -935410 -60926 985421 2341350 3982475 4923340 4226727 2478086
$$ packed form
43932f53590j113866L67454J763804J320970K78277J61874J69973o38998j050413
43923F05485k7599Q73603P1723j046100n44696M33594l74918k152551k100243
43914d261702O5212J881699J950853J091048O7800j041916j487779n13754Q01221
43905a447318Q20500P7866K02939P04852k18526k006534k098770q9052J603861
43896b450182J569392R16089N45123l0369n70965P0656J241646P44857j236759
43887G99488j749340J13508J424190K90984q81620M30575K446018K063721j842
43878D935682o71783L37593M92995r63364j899663j072920k7709l05227j083925
43869b58321q59940J82851Q74484J046347J355929J641125R40865o96613j748641
$$ plain form
43860 2478086 1179100 634228 -327710 -2022259 -2707254 -1010953 1531800 2254534 1080177
43851 1080177 279200 683386 665676 -662850 -1855033 -1776549 -1431984 -1770707 -1967859
43842 -1967859 -1472454 -1413451 -2089811 -1584997 694947 1711053 -738185 -3557314 -2452143
43833 -2452143 1157162 2063580 -576864 -2155159 -190237 2057145 1343629 -558616
43825 -558616 -345504 1600601 2466856 1277803 -767832 -2573874 -3443202 -2533483 -151887
43816 -151887 1632857 1547025 1008740 1679979 2604094 1942959 261877 -425217 -23584
43807 -23584 -124712 -786471 -251289 1836411 3374503 2818149 1322780 713577 757595
43798 757595 -76782 -1882949 -2856420 -1686795 603398 1770537 909191 -677570 -1137989
$$ packed form
43860B478086j298986n44872r61938j694549o84995J696301K542753P22734j174357
43851A080177q00977M04186j7710j328526j192183P8484L44565l38723j97152
43842a967859M95405N9003o76360N04814K279944J016106k449238k819129J105171
43833b452143L609305R06418k640444j578295J964922K247382p13516j902245
43825e58616K13112J946105Q66255j189053k045635j806042q69328R09719K381596
43816a51887J784744q5832n38285O71239R24115o61135j681082o87094M01633
43807b3584j01128o61759N35182K087700J538092n56354j495369o09203M4018
43798G57595q34377j806167r73471J169625K290193J167139q61346j586761m60419
$$ plain form
43789 -1137989 -30210 1643554 2810421 3126547 2717380 1871496 1004210 390308 -74261
43780 -74261 -516626 -774308 -843654 -1126718 -1617358 -1496535 -406170 607727 582348 321796
43770 321796 1103313 2339087 2331385 962473 -320761 -963258 -1607231 -2007247 -1012007
43761 -1012007 1045630 2262851 1994067 1513523 1358576 533631 -882982 -1091222 259463
43752 259463 992207 81936 -340626 1236060 2541994 912231 -2159527 -2951197 -790366
43743 -790366 1546676 2051130 1396777 832622 450401 -226572 -1406614 -2824771 -3588483
43734 -3588483 -2889204 -1550261 -1557512 -3093124 -3739092 -1967323 495435 1508242 1672758
43725 1672758 2471197 3267265 2819824 2022814 2222775 2381864 1037510 -392003 295551
$$ packed form
43789a137989J107779J673764J166867L16126m09167q45884q67286o13902m64569
43780g4261m42365k57682o9346k83064m90640J20823J090365J013897k5379k60552
43770C21796P81517J235774p702j368912j283234o42497o43973m00016R95240
43761a012007K057637J217221k68784m80544j54947q24945j416613k08240J350685
43752B59463P32744r10271m22562J576686J305934j629763l071758p91670K160831
43743g90366K337042N04454o54353n64155l82221o76973j180042j418157p63712
43734c588483O99279J338943p251j535612o45968J771769K462758J012807J64516
43725A672758P98439P96068m47441p97010J99961J59089j344354j429513O87554
$$ plain form
43716 295551 1980210 1991188 938502 1577911 3449179 3242140 650143 -843144 50897
43707 50897 200568 -2466357 -5312076 -5166280 -2932765 -1558211 -1899418 -2865470 -3603997
43698 -3603997 -3540089 -2031486 290521 1466237 853536 120403 512130 1156946 1233399
43689 1233399 1535228 2417335 2422501 687533 -1208319 -1474853 -504951 305967 319116 -873565
43679 -873565 -3494203 -5854139 -5164124 -1678366 650957 -430309 -2225147 -1529794 555964
43670 555964 1206004 655531 932283 1802369 1611649 717162 579193 626055 -571622 -2094506
43660 -2094506 -2098575 -1467993 -2456758 -4458147 -4863712 -3633120 -3135306 -3607643 -2772770
43651 -2772770 -301159 1258383 774602 125529 522974 739809 215896 534302 2225611
$$ packed form
43716B95551J684659J0978j052686O39409J871268k07039k591997j493287Q94041
43707E0897J49671k666925k845719J45796K233515J374554l41207r66052p38527
43698c603997O3908J508603K322007J175716o12701p33133L91727O44816P6453
43689A233399L01829Q82107N166j734968j895852k66534R69902Q10918J3149j192681
43679h73565k620638k359936O90015L485758K329323j081266j794838O95353K085758
43670E55964O50040n50473K76752Q70086j90720q94487j37969M6862j197677j522884
43660b094506m069O30582r88765k001389m05565J230592M97814m72337Q34873
43651b772770K471611J559542m83781o49073L97445K16835n23913L18406J691309
$$ plain form
43642 2225611 3214200 2257196 1125570 1444930 1983685 1189075 21408 -85876 -35405
43633 -35405 -1298029 -2921219 -2882064 -1372529 -344738 -462433 -672260 -418437 -313854
43624 -313854 -620890 -616112 292541 1731937 2749867 2627225 1582176 831275 1273501
43615 1273501 2024648 1347240 -765436 -2345690 -2217265 -1429109 -1296717 -1724887 -2323735
43606 -2323735 -3323065 -4210032 -3405926 -875511 796544 -147836 -1836242 -1670038 -471329
43597 -471329 -936659 -2976799 -3735571 -2039195 174419 1243635 1847228 2805520 3241419
43588 3241419 2347816 1225771 1368974 2426909 2955872 2691555 2619562 3006904 2740976
43579 2740976 1079897 -837384 -1152929 220155 1310941 771647 -189121 221845 1243866
$$ packed form
43642B225611R88589r57004j131626L19360N38755p94610j167667j07284N0471
43633c5405j262624j623190L9155J509535J027791j17695k09827K53823J04583
43624c13854l07036M778R08653J439396J017930j22642j045049p50901M42226
43615A273501P51147o77408k112676j580254J28425P88156J32392m28170n98848
43606b323735r99330q86967Q04106K530415J672055r44380j688406J66204J198709
43597d71329m65330k040140p58772J696376K213614J069216O03593R58292M35899
43588C241419q93603j122045J43203J057935N28963k64317p1993L87342k65928
43579B740976j661079j917281l15545J373084J090786n39294r60768M10966J022021
$$ plain form
43570 1243866 426143 -2326612 -3922031 -2269137 799901 2295353 1903516 1162155 459414
43561 459414 -729029 -1715187 -1311114 -123532 251382 -88247 152311 669983 -68724
43552 -68724 -1688584 -1928093 -277062 1051411 619641 -171051 403127 1922171 3070746
43543 3070746 3542930 3551595 3059032 2541130 2972502 4114414 4371754 3183597 1890683
43534 1890683 1462746 1257564 855856 942977 1324631 508587 -1343773 -1689231 312966
43525 312966 1746973 471463 -977691 718366 4119721 5285322 3984354 3321476
43517 3321476 3970482 3392241 967206 -609444 -132554 19319 -1660134 -2880742 -1446076
43508 -1446076 878977 1171926 -87792 -161500 1523304 2835081 2335171 966106 339536
$$ packed form
43570A243866q17723k752755j595419J652894L069038J495452l91837p41361p02741
43561D59414j188443r86158M04073J187582L74914l39629K40558N17672p38707
43552f8724j619860k39509J651031J328473m31770p90692N74178J519044J148575
43543C070746M72184Q665m92563n17902M31372J141912K57340j188157j292914
43534A890683m27937k05182m01708Q7121L81654q16044j852360l45458K002197
43525C12966J434007j275510j449154J696057L401355J165601j300968o62878
43517C321476O49006n78241k425035j576650M76890J51873j679453j220608J434666
43508a446076K325053K92949j259718p3708J684804J311777m99910j369065o26570
$$ plain form
43499 339536 922576 2046626 2677542 2148166 784865 -308278 -409225 258871 1208265
43490 1208265 2145126 2618521 2261989 1650997 1790471 2515971 2728952 2391484 2523560
43481 2523560 2837291 1608010 -1139639 -2705393 -1576991 30334 -360544 -1516740
43473 -1516740 -727888 1518963 2294259 919881 -311212 -70702 332391 -302774 -1240324
43464 -1240324 -1499304 -1230507 -651651 424994 1251870 319470 -2108454 -3407982 -1781829
43455 -1781829 1360723 3379006 3516409 2849342 2231715 1685785 1243687 1190597 1594343
43446 1594343 2133661 2142913 802177 -1908135 -4388817 -4768257 -3375203 -2479688 -3038905
43437 -3038905 -3321200 -1790745 203126 196316 -1965517 -4118961 -4570434 -3387870 -1409085
$$ packed form
43499C39536N83040J124050O30916n29376j363301j093143j00947O68096R49394
43490A208265R36861M73395l56532o10992J39474P25500K12981l37468J32076
43481B523560L13731j229281k747649j565754J128402J607325l90878j156196
43473a516740P88852K246851P75296j374378j231093K40510M03093o35165r37550
43464a240324k58980K68797N78856J076645Q26876r32400k427924j299528J626153
43455a781829L142552K018283J37403o67067o17627n45930m42098n3090M03746
43446A594343N39318R252j340736k710312k480682l79440J393054Q95515n59217
43437c038905k82295J530455J993871o810k161833k153444m51473J182564J978785
$$ plain form
43428 -1409085 473152 1229202 366194 -1185081 -1934615 -1617648 -1154081 -921524 -220677
43419 -220677 1317600 2753719 2718009 840739 -1801431 -3391703 -2842080 -1051266 -227782
43410 -227782 -1278396 -2495427 -1847746 119860 1218053 1029851 1346102 2872418 3648480
43401 3648480 1955174 -833760 -1969604 -905758 587565 1310813 1723008 2133999 1756715
43392 1756715 373009 -530486 385165 2084227 2177662 2133 -2546514 -3418912 -2522005
43383 -2522005 -948554 788560 2658369 3865991 3204631 949945 -739472 -104946
43375 -104946 2081735 3437000 2766953 1224236 653317 1428366 2269326 1896923 464502
43366 464502 -731161 -786052 -190114 -148600 -1061218 -2047608 -2078775 -1189048 -219628 397318
$$ packed form
43428a409085J882237P56050q63008j551275p49534L16967M63567K32557P00847
43419b20677J538277J436119l5710j877270k642170j590272N49623J790814Q23484
43410b27782j050614j217031O47681J967606J098193j88202L16251J526316P76062
43401C648480j693306k788934j135844J063846J493323P23248M12195M10991l77284
43392A756715j383706r03495R15651J699062R3435k175529k548647q72398Q96907
43383b522005J573451J737114J869809J207622o61360k254686j689417O34526
43375a04946K186681J355265o70047j542717n70919P75049Q40960l72403j432421
43366D64502j195663n4891N95938M1514r12618r86390l1167Q89727R69420O16946
$$ plain form
43356 397318 1058173 2092127 2937295 2703375 1466257 434679 507512 1079346 874634
43347 874634 -262109 -1274353 -1640346 -2068973 -2873876 -2871789 -1197127 629888 278675
43338 278675 -1901202 -2918029 -1194405 1185052 1342186 -685258 -2494628 -2583010 -1476520
43329 -1476520 -172894 828226 981967 -162309 -1740931 -1771871 489068 3078339 3224146
43320 3224146 577839 -2279369 -2749708 -954592 962289 1696995 1824707 1933436 1220777
43311 1220777 -940772 -3125945 -3336524 -2003068 -1543517 -2722575 -3508931 -2366715 -708041
43302 -708041 -611553 -1650341 -1844602 -788910 118870 117923 -37770 416012 1307291 2137354
43292 2137354 2539818 2213769 1325482 671098 545078 86676 -1091425 -1516357 141366
$$ packed form
43356C97318O60855J033954Q45168k33920j237118j031578P2833N71834k04712
43347H74634j136743j012244l65993m28627q04903K087J674662J827015l51213
43338B78675k179877j016827J723624K379457J57134k027444j809370q8382J106490
43329a476520J303626J001120J53741j144276j578622l0940K260939K589271J45807
43320C224146k646307k857208m70339J795116J916881P34706J27712J08729p12659
43311A220777k161549k185173k10579J333456M59551j179058p86356J142216J658674
43302g08041R6488j038788j94261J055692R07780r47j55693M53782Q91279Q30063
43292B137354M02464l26049q88287o54384j26020m58402j178101m24932J657723
$$ plain form
43283 141366 2332684 2132259 -606310 -2880201 -2673729 -1227138 -446739 -256087 189561
43274 189561 488548 -112612 -987625 -927352 9798 761524 850846 605518 271953 -77055
43264 -77055 -158179 87147 27458 -886482 -2217087 -3088194 -3234763 -2859853 -1964302 -641644
43254 -641644 342663 163088 -970595 -1975877 -2074299 -1340324 -258281 790368 1672535
43245 1672535 2411870 2854136 2461159 931486 -900056 -1488074 -253838 1693496 2779487
43236 2779487 2401649 1086666 -15206 292237 2162038 3948564 3685682 1682788 328572
43227 328572 773201 1380222 440431 -1214494 -1794733 -1325169 -949703 -551626 701664
43218 701664 2001810 1469547 -793206 -2293068 -1310679 1120445 2903619 3137794 2186427
$$ packed form
43283A41366K191318k00425k738569k273891K06472J446591P80399J90652M45648
43274A89561K98987o01160q75013O0273R37150P51726Q9322k45328l33565l49008
43264g7055q1124K45326n9689r13940j330605q71107j46569L74910Q95551J322658
43254f41644R84307j79575j133683j005282r8422P33975J082043J048649Q82167
43245A672535P39335M42266l92977j529673j831542n88018J234236J947334J085991
43236B779487l77838j314983j101872L07443J869801J786526k62882k002894j354216
43227C28572M44629O07021r39791j654925n80239M69564L75466L98077J253290
43218G01664J300146n32263k262753j499862R82389K431124J783174K34175r51367
$$ plain form
43209 2186427 846891 136191 820966 2465822 3714105 3893390 3509025 2973945 2047040
43200 2047040 951312 716819 1588710 2230666 1562784 506158 704326 2098061 3026483
43191 3026483 2487593 1114214 -111449 -991743 -1606295 -1601062 -739873 247698 220818 -834703
43181 -834703 -1487381 -614713 891435 1006028 -811665 -2872887 -3603516 -3543405 -3887295
43172 -3887295 -3924460 -1850394 1850298 3926334 2359000 -644447 -1266476 1088360 3359527
43163 3359527 3116200 1459979 923565 1860627 2344813 1207971 -277418 -160386 1656617
43154 1656617 3360392 3314177 1572583 -505971 -1547839 -1057578 439079 1947273 2901906
43145 2901906 3454182 3717351 3258108 1994127 1027993 1359397 2005817 1014994 -1402907
$$ packed form
43209B186427j339536p10700O84775J644856J248283J79285l84365n35080r26905
43200B047040j095728k34493Q71891O41956o67882j056626J98168J393735R28422
43191C026483n38890j373379j225663q80294o14552N233Q61189R87571k6880j055521
43181h34703o52678Q72668J506148J14593j817693k061222p30629O0111l43890
43172c887295l7165K074066L700692K076036j567334l003447o22029K354836K271167
43163C359527k43327j656221n36414R37062M84186j136842j485389J17032J817003
43154A656617J703775m6215j741594k078554j041868M90261J496657J508194R54633
43145B901906N52276K63169m59243j263981r66134L31404O46420r90823k417901
$$ plain form
43136 -1402907 -2565099 -984247 1381166 1890519 703845 -260498 -537585 -1017635 -1453439
43127 -1453439 -677729 793486 950062 -438377 -1090143 332939 2100301 2000903 389651
43118 389651 -775217 -655586 153290 1053984 1752746 1789000 1050640 352281 510271 1279710
43108 1279710 2013880 2724542 3546633 3842092 3018272 1797159 1477131 2113807 2441013
43099 2441013 1511903 -351049 -2031610 -2380140 -949185 1209749 2034119 816822 -401507
43090 -401507 817999 3797181 5189360 3233080 29499 -1212837 -27567 1324911
43082 1324911 1043072 -288934 -930691 -180042 1060730 1452088 526772 -1003336 -1859506
43073 -1859506 -1105447 1123839 3527752 4598474 4078442 3209947 3099744 3276873 2697011
$$ packed form
43136a402907j162192J580852K365413N09353j186674r64343k77087m80050m35804
43127a453439P75710J471215J56576j388439o51766J423082J767362r9398j611252
43118C89651j164868J19631Q08876R00694O98762L6254p38360o98359J57990P69439
43108A279710P34170P10662Q22091K95459q23820j221113l20028O36676L27206
43099B441013r29110j862952j680561l48530J430955K158934Q24370j217297j218329
43090d01507J219506K979182J392179j956280l203581j242336J185270J352478
43082A324911k81839j332006o41757P50649J240772L91358r25316j530108q56170
43073a859506P54059K229286K403913J070722n20032q68495j10203J77129n79862
$$ plain form
43064 2697011 1758222 1914290 3188974 3735128 2636124 1616063 2631128 4898892 5969339
43055 5969339 5060276 3579560 2665412 2076598 1689254 2276431 4014877 5532152 5477791
43046 5477791 4298693 3486908 3430093 2929875 1007146 -1411241 -2249122 -884379 666271
43037 666271 132645 -1674026 -1516978 1673023 4661732 3976195 721634 -958901 462625
43028 462625 2410959 2402985 1055751 132709 -16399 235729 1092347 2398156 2938031
43019 2938031 2221314 1639334 2265878 2796983 1530244 -675125 -1519688 -657555 206004
43010 206004 240175 233284 367501 -424676 -2220615 -3199944 -2017917 336420 1997770
43001 1997770 2296026 1496231 -181607 -2048999 -2567145 -1017808 1038347 1420441 123186
$$ packed form
43064B697011r38789J56068J274684N46154j099004j020061J015065K267764J070447
43055E969339r09063j480716r14148n88814l87344N87177J738446J517275n4361
43046E477791j179098q11785n6815n00218j922729k418387q37881J364743J550650
43037F66271n33626j806671J57048L190001K988709o85537l254561j680535J421526
43028D62625J948334p974j347234r23042j49108K52128Q56618J305809N39875
43019B938031p16717n81980O26544N31105j266739k205369q44563Q62133Q63559
43010B06004L4171o891J34217p92177j795939r79329J182027K354337J661350
43001A997770K98256p99795j677838j867392n18146J549337K056155L82094j297255
$$ plain form
42992 123186 -911027 -645545 -98175 -403057 -1125423 -1231414 -739685 -440113 -460949 -45448
42982 -45448 1298674 3047632 4129577 3820937 2276730 536593 -119764 688822 1923060
42973 1923060 2195836 1431221 905430 1417110 2091201 1644391 362749 -209159 412925
42964 412925 759089 -519571 -2504165 -3040798 -1636129 -62409 207648 -47350 710313
42955 710313 2227001 2810333 2030917 1546539 2704649 4558819 5272569 4698388 4322768
42946 4322768 4968463 5798032 5700551 4639249 3350687 2528695 2554244 3238109 3576919
42937 3576919 2600215 764001 -369928 -143338 557860 1054234 1870479 3134463 3477634
42928 3477634 2038542 414823 720223 2365643 2799380 1197686 -597583 -888663 58172
$$ packed form
42992A23186j034213K65482N47370l04882p22366j05991M91729K99572k0836M15501
42982d5448J344122J748958J081945l08640j544207j740137o56357Q08586J234238
42973A923060K72776p64615n25791N11680O74091m46810j281642n71908O22084
42964D12925L46164j278660j984594n36633J404669J573720K70057k54998P57663
42955G10313J516688N83332p79416m84378J158110J854170P13750n74181l75620
42946D322768O45695Q29569r7481j061302j288562q21992K5549O83865L38810
42937C576919r76704j836214j133929K26590P01198M96374Q16245J263984L43171
42928C477634j439092j623719L05400J645420M33737j601694j795269k91080R46835
$$ plain form
42919 58172 1258911 2209965 2448877 1767809 1322835 2549043 4386797 3895957 714069
42910 714069 -1506105 169340 3938449 6120598 6110229 5862336 5978170 5431076 4405201
42901 4405201 4216521 4531403 3612107 1522035 286881 494032 548488 -96223 58983
42892 58983 1307114 1537640 -74564 -1049969 536337 2726913 2879645 2008786 2758683
42883 2758683 4664207 5000646 3461983 2271872 1875086 381003 -2146526 -2698922 -143255
42874 -143255 2358588 2010439 693660 1799753 4774930 6058972 4419754 2153061
42866 2153061 1200074 1007708 634908 394956 522247 304350 -370530 -311303 983491
42857 983491 2135678 1964445 1394393 1755416 2297508 1304020 -869597 -1881081 -662586
$$ packed form
42919E8172J200739R51054K38912o81068m44974J226208J837754m90840l181888
42910G14069k220174J675445L769109K182149j0369k47893J15834n47094j025875
42901D405201j88680L14882r19296k090072j235154K07151N4456o44711J55206
42892E8983J248131K30526j612204r75405J586306K190576J52732q70859P49897
42883B758683J905524L36439j538663j190111l96786j494083k527529n52396K555667
42874a43255K501843l48149j316779J106093K975177J284042j639218k266693
42866B153061r52987j92366l72800k39952J27291k17897o74880N9227J294794
42857I83491J152187j71233n70052L61023N42092r93488k173617j011484J218495
$$ plain form
42848 -662586 1102155 1320775 13662 -1292059 -1771156 -1916170 -2264010 -2354509 -1257158
42839 -1257158 1031586 3036238 3086525 1262204 -541297 -909813 -571970 -975740 -1919749
42830 -1919749 -1939181 -769322 116976 -351964 -1544510 -2353077 -2421265 -1649127 143750
42821 143750 2245865 2994697 1758189 31137 -461422 142754 698287 1051336 1823431
42812 1823431 2844351 3253400 2932079 2664611 2992652 3764287 4531295 4674395 3683791
42803 3683791 2091632 1357146 1897693 2192758 1013502 -576648 -976814 -626826 -853639
42794 -853639 -1223912 -525705 396312 -280321 -1743171 -1249864 1230902 2419198 760136
42785 760136 -1118432 -543958 1467256 2570276 2676884 2933194 3211887 2999742 3061543
$$ packed form
42848f62586J764741K18620j307113j305721m79097j45014l47840r0499J097351
42839a257158K288744K004652N0287j824321j803501l68516L37843m03770r44009
42830a919749j9432J169859Q86298m68940j192546q08567o8188P72138J792877
42821A43750K102115P48832j236508j727052m92559O04176N55533L53049P72095
42812A823431J020920M09049l21321k67468L28041P71635P67008J43100r90604
42803C683791j592159p34486N40547K95065j179256j590150m00166L49988k26813
42794h53639l70273O98207R22017o76633j462850M93307K480766J188296j659062
42785G60136j878568N74474K011214J103020J06608K56310K78693k12145O1801
$$ plain form
42776 3061543 3887552 4058564 2534925 1074239 1803812 3705155 4252814 3431058 3162905
42767 3162905 3566386 2960996 1281292 340939 584023 519020 -253693 -256411 1051525 2299263
42757 2299263 2718058 3086216 3427407 2446344 364932 -318377 1520289 3507765 3119219
42748 3119219 1206216 209144 451902 379512 -568790 -1375658 -1171928 54507 1977666
42739 1977666 3832731 4352085 3050518 1090683 -150859 -708820 -1188087 -1147443 305936
42730 305936 2825078 5032584 6165655 6521014 6573873 6496877 6212013 5324709 3592642
42721 3592642 1890237 1623926 2535182 2552370 935954 -103928 1331482 3540804 3601126
42712 3601126 1861859 1128461 1893711 1673066 -551297 -2465134 -2194627 -1095826 -969680
$$ packed form
42776C061543Q26009J71012j523639j460686P29573J901343N47659q21756k68153
42767C162905M03481o05390j679704r40353K43084o5003p72713k718J307936J247738
42757B299263M18795L68158L41191r81063k081412o83309J838666J987476l88546
42748C119219j913003r97072K42758p2390r48302q06868K03730J226435J923159
42739A977666J855065N19354j301567j959835j241542n57961m79267M0644J453379
42730C05936K519142K207506J133071L55359N2859p6996k84864q87304j732067
42721C592642j702405k66311R11256J7188j616416j039882J435410K209322O0322
42712C601126j739267p33398P65250k20645k224363j913837K70507J098801J26146
$$ plain form
42703 -969680 -878130 873545 3235676 3589191 1628967 -472042 -1526256 -2508887 -4006077
42694 -4006077 -4830504 -4104488 -2807251 -1961622 -867960 1196671 2794789 2076077 172423
42685 172423 321003 3192147 5484652 4401352 1503970 219293 999698 1434370 488687
42676 488687 -114362 933230 2368462 2352552 868677 -931764 -2362471 -3108952 -2708094
42667 -2708094 -1239425 346157 1411182 2210892 2719929 2253923 1082535 824225 2006895
42658 2006895 2793597 1667055 -84611 -327028 863944 2069908 3049973 4054591 3959329
42649 3959329 1970765 219894 1299614 3630076 2969365 -1118235 -4062418 -2684909
42641 -2684909 708039 2380271 2138653 1926048 2103677 1897811 1614351 1645107 773838
$$ packed form
42703i69680R1550J751675K362131L53515j960224k101009j054214r82631j497190
42694d006077q24427P26016J297237Q45629J093662K064631J598118p18712j903654
42685A72423J48580K871144K292505j083300k897382j284677P80405M34672r45683
42676D88687o03049J047592J435232j5910j483875j800441j430707p46481M00858
42667b708094J468669J585582J065025P99710N09037m66006j171388k58310J182670
42658B006895P86702j126542j751666k42417J190972J205964R80065J004618r5262
42649C959329j988564j750871J079720K330462o60711m087600k944183J377509
42641b684909L392948J672232k41618k12605J77629k05866k83460L0756q71269
$$ plain form
42632 773838 -1790504 -3967371 -3304632 -1025111 -523023 -2287453 -3517188 -2867549 -2248807
42623 -2248807 -2979516 -3257256 -1298082 1354591 2012299 902657 573495 1810284 2531899
42614 2531899 1056487 -1465058 -2788462 -2439437 -1632722 -1096169 -433900 439726 743061
42605 743061 335747 542468 2271092 4116849 3935202 2021515 906035 1683109 2431477
42596 2431477 1260738 -728630 -1096920 414401 1796295 1683934 653954 -230442 -570690
42587 -570690 -146838 1321077 3421252 4996049 5304379 4671350 3820784 3114331 2488977
42578 2488977 1653232 474409 -412849 71260 1794104 2845152 1863536 271544 543931
42569 543931 2652011 4174903 3881018 3025521 2736570 2412810 1574183 1089881 1320626
$$ packed form
42632G73838k564342k176867O62739K279521N02088j764430j229735O49639O18742
42623b248807p30709k77740J959174K652673O57708j109642l29162J236789P21615
42614B531899j475412k521545j323404L49025Q06715N36553O62269Q73626L03335
42605G43061m07314K06721J728624J845757j81647j913687j115480P77074P48368
42596B431477j170739j989368l68290J511321J381894j12361j029980q84396l40248
42587e70690M23852J467915K100175J574797L08330o33029q50566p06453o25354
42578B488977q35745j178823q87258M84109J722844J051048r81616j591992K72387
42569E43931K108080J522892k93885q55497k88951l23760q38627m84302K30745
$$ plain form
42560 1320626 1123090 226849 499062 2804535 4538453 2927925 -611845 -2337117 -1427770
42551 -1427770 -233795 150405 979184 2315738 2109460 -28066 -1450004 -600909 439209
42542 439209 -347636 -1436140 -685850 619542 32281 -1383614 -423225 2868966 4945732
42533 4945732 4088828 2533095 2474006 3094349 2906195 2391545 2606765 3216623 3611485
42524 3611485 4272973 5406016 5784685 4645634 3318409 3245766 3725792 3497874 3285966
42515 3285966 4514835 6389089 6689389 5123198 3581242 3085546 2672738 1633226 878543
42506 878543 1387466 2729060 3751911 3719483 2526985 818624 -126356 217664 549202
42497 549202 -545387 -2143049 -2134463 -674094 -120341 -1140099 -1451430 442552 2682031
$$ packed form
42560A320626j97536q96241K72213K305473J733918j610528l539770j725272R09347
42551a427770J193975L84200Q28779J336554k06278k137526j421938Q49095J040118
42542D39209p86845j088504P50290J305392n87261j415895R60389L292191K076766
42533D945732q56904j555733n9089O20343j88154n14650K15220O09858L94862
42524C611485O61488J133043L78669j139051j327225p2643M80026k27918k11908
42515C285966J228869J874254L00300j566191j541956m95696m12808j039512p54683
42506H78543N08923J341594J022851l2428j192498j708361r44980L44020L31538
42497E49202j094589j597662Q586J460369N53753j019758l11331J893982K239479
$$ plain form
42488 2682031 2927297 1823630 1517746 2246361 2744896 3031093 4214195 5806502 5658478
42479 5658478 3059572 103188 -785989 519962 2358904 3470049 3893039 4145147 4251441
42470 4251441 3793227 2780948 2106284 2584108 3544615 3146147 498551 -3091757 -5378894
42461 -5378894 -5151585 -2757644 458228 2763975 2990287 1586749 128537 -588967 -1055021
42452 -1055021 -1394230 -739529 949940 2101042 1855664 1603512 2510204 3086097 1500665
42443 1500665 -906779 -1220767 555843 1599415 864777 487854 1818527 2942080 1720148
42434 1720148 -871292 -2263585 -1649194 -91570 1560838 3105224 4005308 3619169 2267096
42425 2267096 992891 386006 362896 783640 1521354 2144969 2191857 1691376 1111926 991686
$$ packed form
42488B682031K45266j103667l05884P28615M98535K86197J183102J592307j48024
42479E658478k598906k956384q89177J305951J838942J111145M22990K52108J06294
42470D251441m58214j012279o74664M77824R60507l98468k647596l590308k287137
42461e378894K27309K393941L215872K305747K26312j403538j458212p17504m66054
42452a055021l39209O54701J689469J151102k45378k52152R06692N75893j585432
42443A500665k407444l13988J776610J043572p34638l76923J330673J123553j221932
42434A720148k591440j392293O14391J557624J652408J544386R00084l86139j352073
42425B267096j274205o06885k3110M20744P37714O23615M6888n00481n79450j20240
$$ plain form
42415 991686 1694464 3041370 4106388 4041678 3214208 2732531 2770636 2453071 1679208 1719390
42405 1719390 3250029 4992594 5352700 4502004 3724038 3446764 3148061 2700926 2531923
42396 2531923 2601196 2311248 1485998 664988 374740 641823 1147844 1437252 1163761 491416
42386 491416 -46096 -332275 -746845 -1153865 -702640 685015 1559827 743185 -820071
42377 -820071 -1239922 -226154 856800 1147572 1055467 958761 673154 468403 1086590 2094001
42367 2094001 1583389 -1356191 -4710204 -5345091 -2547363 1164326 2758015 1514538
42359 1514538 -909637 -2498926 -2499063 -1407868 -58497 982169 1409432 1120275 354914
42350 354914 -379036 -776691 -988132 -1213523 -1242068 -706844 256747 920319 685168 -159308
$$ packed form
42415I91686P02778J346906J065018o4710q27470m81677L8105l17565p73863M0182
42405A719390J530639J742565L60106q50696p77966k77274k98703m47135j69003
42396B531923O9273k89948q25250q21010k90248K67083N06021K89408k73491o72345
42386D91416n37512k86179m14570m07020M51225J387655Q74812q16642j563256
42377h20071m19851J013768J082954K90772r2105r6706k85607k04751O18187J007411
42367B094001n10612k939580l354013o34887K797728L711689J593689j243477
42359A514538k424175j589289j37J091195J349371J040666M27263k89157p65361
42350C54914p33950l97655k11441k25391k8545N35224R63591O63572k35151q44476
$$ plain form
42340 -159308 -532002 380051 2061910 2968831 2234243 799599 248496 718979 867476
42331 867476 -8070 -871336 -498760 760263 1559893 1307312 557397 81757 255003
42322 255003 1002093 1686707 1403134 18261 -1447896 -2070461 -2106833 -2086692 -1473621 589472
42312 589472 3494450 5365534 5147599 3617755 2300985 2151097 3156410 4351249 4337649
42303 4337649 2717407 841958 183323 340463 3278 -484587 506205 2764723 3715380
42294 3715380 2040660 -115165 -133165 1379008 1774218 287607 -1276557 -1365555 -220306
42285 -220306 1399245 3176873 4519455 4482767 3178677 2101882 2291892 3063156 3226271
42276 3226271 2669648 1923406 979833 -384481 -1606804 -1774788 -907539 147480 1003376
$$ packed form
42340a59308l72694R12053J681859R06921p34588j434644n51103M70483J48497
42331H67476q75546q63266L72576J259023P99630k52581p49915m75640J73246
42322B55003P47090O84614k83573j384873j466157o22565l6372K0141O13071K063093
42312E89472K904978J871084k17935j529844j316770j49888J005313J194839j3600
42303D337649j620242j875449o58635J57140l37185m87865R90792K258518R50657
42294C715380j674720k155825j8000J512173L95210j486611j564164q8998J145249
42285b20306J619551J777628J342582l6688j304090j076795J90010P71264J63115
42276C226271n56623p46242r43573j364314j222323j67984Q67249J055019Q55896
$$ plain form
42267 1003376 1937156 2780213 2762071 1923628 1659694 2994541 4970511 5737124 4892250
42258 4892250 3722680 3271969 3322622 3471599 3969332 4785928 4860782 3406929 1400310
42249 1400310 508694 723662 427948 -913896 -1531380 259414 3394864 5105019 4293135
42240 4293135 2587129 1909737 2262156 2548386 2573290 3076975 4173147 4932014 4674451
42231 4674451 3825242 3195158 3086208 3368922 3733910 3518590 2098097 50385 -855813
42222 -855813 271469 1970320 2022555 117365 -2090099 -3104376 -2510330 -247921 3203811
42213 3203811 5819988 5204704 1605504 -1794461 -2545899 -1525073 -895640 -1015059 -822966
42204 -822966 -53862 701059 1347898 2014186 2013704 744220 -836372 -1248457 -594466 3900
$$ packed form
42267A003376R33780Q43057j8142q38443k63934J334847J975970P66613q44874
42258D892250j169570m50711N0653J48977M97733Q16596P4854j453853k006619
42249A400310q91616K14968k95714j341844o17484J790794L135450J710155q11884
42240D293135j706006o77392L52419K86230K4904N03685J096172P58867k57563
42231D674451q49209o30084j08950K82714L64988k15320j420493k047712r06198
42222h55813J127282J698851N2235j905190k207464j014277N94046K262409L451732
42213C203811K616177o15284l599200l399965p51438J020826O29433j19419J92093
42204h22966P69104P54921O46839O66288m82j269484j580592m12085O53991N98366
$$ plain form
42194 3900 584861 2024904 3805748 4292907 3434959 3057577 3946796 4629059 3833063 2383982
42184 2383982 1717418 2038565 2839258 3765802 4077890 2747899 155555 -1662164 -1487086
42175 -1487086 -365448 324861 723498 1295605 1462638 930430 863099 1976556 2802717
42166 2802717 1788323 -58305 -719671 -309766 -293552 -407020 875722 3045808 3609384
42157 3609384 1924099 458816 1287050 3385859 4535665 4201730 3275167 2263872 1079992
42148 1079992 -115518 -880182 -909601 -69430 1364489 2302327 1637379 -224773 -1655879
42139 -1655879 -1974030 -2136676 -2756811 -2818416 -1420342 292505 355708 -1320689 -2779695
42130 -2779695 -2544366 -1322139 -843289 -1577142 -2186426 -1310563 575924 1705941 1327854
$$ packed form
42194C900N80961J440043J780844M87159q57948l77382Q89219O82263p95996j449081
42184B383982o66564L21147Q00693R26544L12088j329991k592344j817719J75078
42175a487086J121638O90309L98637N72107J67033n32208o7331J113457Q26161
42166B802717j014394j846628o61366M09905J6214j13468J282742K170086N63576
42157C609384j685285j465283Q28234K098809J149806l33935r26563j011295j183880
42148A079992j195510p64664k9419Q40171J433919R37838o64948j862152j431106
42139a655879l18151j62646o20135o1605J398074J712847O3203j676397j459006
42130b779695K35329J222227M78850p33853o09284Q75863J886487J130017l78087
$$ plain form
42121 1327854 485456 123962 -329136 -1490588 -2386043 -1939978 -1132258 -1543478 -2354693
42112 -2354693 -1353906 1117470 2031241 146911 -2035020 -1949041 -197095 1339191 2387622
42103 2387622 3487402 4187892 4004360 3657859 3553620 2599198 489800 -496031 1560626
42094 1560626 4741663 5409144 3005211 169990 -1340900 -2169541 -2946020 -2975859 -1766802
42085 -1766802 53516 1682366 2596185 2276297 987155 311956 1211306 2306965 2092601
42076 2092601 1780693 3214049 4873256 3530831 -286725 -2379170 -1058663 579246
42068 579246 -132335 -1649970 -1623808 -750500 -682295 -801806 141647 1300830 1364171 1162113
42058 1162113 2001641 2962424 2520581 1510233 1744216 2790196 2850481 1996655 1847770
$$ packed form
42121A327854q42398l61494m53098j161452q95455M46065Q07720m11220q11215
42112b354693J000787K471376R13771j884330k181931Q5979J751946J536286J048431
42103B387622J099780P00490j83532l46501j04239r54422k109398r85831K056657
42094A560626L181037O67481k403933k835221j510890q28641p76479k9839J209057
42085a766802J820318J628850R13819l19888j289142o75199Q99350J095659k14364
42076B092601l11908J433356J659207j342425l817556k092445J320507J637909
42068E79246p11581j517635K6162Q73308O8205j19511R43453J159183O3341k02058
42058A162113Q39528R60783m41843j010348K33983J045980O0285q53826j48885
$$ plain form
42049 1847770 2668609 3355582 3759720 4492370 4906478 3845692 2049437 1284120 1471139
42040 1471139 1350298 1535014 3667984 6507116 6464715 2973296 -57054 308856 2120669
42031 2120669 2127351 670728 332882 1460832 1992308 1069158 193105 613763 1532166
42022 1532166 1547476 711382 379349 1421338 3105244 3918695 3397802 2670415 2840963
42013 2840963 3451838 3351707 2506094 1747169 1171204 300836 -414160 -58345 775490
42004 775490 501615 -597756 -203563 2495117 5180384 5579246 4362541 3350696 2576696
41995 2576696 1074134 -719793 -1477501 -1145287 -679509 -146035 1122444 2811188 3738672
41986 3738672 3517595 2667961 1349086 -520854 -2116608 -2330772 -1582530 -1395898 -1930768
$$ packed form
42049A847770Q20839O86973M04138P32650M14108j060786j796255p65317J87019
42040A471139j20841J84716K132970K839132m2401l491419l030350L65910J811813
42031B120669O682j456623l37846J127950N31476r23150q76053M20658R18403
42022A532166J5310q36094l32033J041989J683906Q13451n20893p27387J70548
42013B840963O10875j00131q45613p58925n75965q70368p14996L55815Q33835
42004G75490k73875j099371L94193K698680K685267L98862j216705j011845p74000
41995B576696j502562j793927p57708L32214M65778N33474J268479J688744R27484
41986C738672k21077q49634j318875j869940j595754k14164P48242J86632n34870
$$ plain form
41977 -1930768 -1535586 638248 2991197 3444806 2161187 1202885 1844571 3205088 3671726
41968 3671726 2977773 2328639 2689130 3680240 4473760 5004765 5435899 5049779 3118521
41959 3118521 717000 -56530 1002662 1863372 1475464 1310553 2489551 3471322 2586089
41950 2586089 1143227 1459133 2945137 3057343 1631260 1188816 2662309 3782270 2789694
41941 2789694 1290607 1774990 3943992 5266026 4366347 2441471 1564289 2413865 3627595
41932 3627595 3255894 1164966 -329178 917444 3959330 5771909 5056917 3460116
41924 3460116 2829808 3041581 3174080 3156094 3214931 3003989 2369161 1965400 2172483 2372583
41914 2372583 2186243 2413560 3771573 5598254 6767822 7064246 6781981 5885096 4503602
$$ packed form
41977a930768L95182K173834K352949M53609j283619r58302O41686J360517M66638
41968C671726o93953o49134L60491R91110P93520N31005M31134l86120j931258
41959C118521k401521p73530J059192Q60710l87908j64911J178998R81771q85233
41950B586089j442862L15906J486004J12206j426083m42444J473493J119961r92576
41941B789694j499087M84383K169002J322034q99679j924876q77182Q49576J213730
41932C627595l71701k090928j494144J246622L041886J812579p14992j596801
41924C460116o30308K11773J32499j7986N8837k10942o34828m03761K07083K00100
41914B372583j86340K27317J358013J826681J169568K96424k82265q96885j381494
$$ plain form
41905 4503602 3356466 2719509 1905056 737632 456767 1926643 3956245 4759069 4167998
41896 4167998 3048190 1643906 279363 601613 3719593 7569738 8660148 6556171
41888 6556171 4285612 3912722 4136460 3180535 1730169 1365888 1760636 1377839 65876
41879 65876 -823235 -542076 290946 979025 1619879 2489648 3319208 3477570 2612517 1092733
41869 1092733 -121718 -316638 215466 668262 919993 1477387 2168996 2030333 982603
41860 982603 433161 1283192 2374154 2155047 1094888 931777 1952146 2632441 1985080
41851 1985080 752236 -47658 -443763 -839753 -1041241 -581486 614325 2203298 3452999
41842 3452999 3341273 1680151 209714 1150118 4173131 6297235 5647068 3826501 3297436
$$ packed form
41905D503602j147136o36957q14453j167424k80865J469876K029602Q02824n91071
41896D167998j119808j404284j364543L22250L117980L850145J090410k103977
41888F556171k270559l72890K23738r55925j450366l64281L94748l82797j311963
41879F5876q89111K81159Q33022O88079O40854Q69769Q29560J58362q65053j519784
41869A092733j214451j94920N32104M52796K51731N57394O91609j38663j047730
41860I82603n49442Q50031J090962k19107j060159j63111J020369O80295o47361
41851A985080j232844p99894l96105l95990k01488M59755J195811J588973J249701
41842C452999j11726j661122j470437R40404L023013K124104o50167j820567n29065
$$ plain form
41833 3297436 3868492 3708701 2851029 3213007 5149827 6343838 5001740 2502120 1648439
41824 1648439 3179582 5106893 5180712 3254540 1156227 481859 790060 503746 -391489
41815 -391489 154010 3103613 6074722 6162317 4094483 3035872 3670139 3614176 2124769
41806 2124769 1823514 4097204 6082795 4948836 2631818 2973576 5843441 7719493
41798 7719493 7192108 6166183 5754048 4675074 2450366 944852 1429927 2637781 3058337
41789 3058337 3010610 3146996 2942331 2120285 1779769 2549860 3156055 2376683 1103209
41780 1103209 932616 1868705 2861018 3511236 3813905 3320739 2099390 1504704 2409506
41771 2409506 3603826 3567731 2886040 3098818 4003230 4139761 3395166 2995102 3190156
$$ packed form
41833C297436N71056j59791q57672L61978J936820J194011j342098k499620q53681
41824A648439J531143J927311P3819j926172k098313o74368L08201k86314q95235
41815c91489N45499K949603K971109Q7595k067834j058611O34267n5963j489407
41806B124769l01255K273690J985591j133959k317018L41758K869865J876052
41798G719493n27385j025925m12135j078974k224708j505514M85075J207854M20556
41789C058337m7727J36386k04665q22046l40516P70091O06195p79372j273474
41780A103209j70593R36089R92313O50218L02669m93166j221349n94686R04802
41771B409506J194320l6095o81691K12778R04412J36531p44595m00064J95054
$$ plain form
41762 3190156 3067865 2597368 2721384 3237070 2726386 1065648 -46061 245252 754828
41753 754828 689338 1263012 3386321 5393415 5038825 2812153 1301680 1677545 2654474
41744 2654474 2945478 2979361 3612279 4499110 4722377 4298999 4049568 4204387 4029884 3005726
41734 3005726 1707599 1069642 1148522 1225845 1025930 1102641 1781555 2429485 2382052 2130519
41724 2130519 2779609 4445408 5944952 6200821 5401174 4596167 4531536 5010816 5187443
41715 5187443 4544035 3730044 3993146 5334589 5873262 4047793 1060424 -220986 1181617
41706 1181617 3349249 4371281 4656333 5377970 6051084 5324343 3534896 2723656 3988207
41697 3988207 6081137 6979447 6018404 4218109 3114355 3373200 4057966 3453569 1312232
$$ packed form
41762C190156j22291m70497J24016N15686n10684j660738j111709K91313N09576
41753G54828o5490N73674K123309K007094l54590k226672j510473L75865R76929
41744B654474K91004L3883O32918Q86831K23267m23378k49431J54819j74503j024158
41734C005726j298127o37957P8880P7323j99915P6711O78914O47930m7433k51533
41724B130519O49090J665799J499544K55869p99647q05007o4631M79280J76627
41715E187443o43408q13991K63102J341443N38673j825469k987369j281410J402603
41706A181617K167632J022032K85052P21637O73114p26741j789447q11240J264551
41697C988207K092930Q98310r61043j800295j103754K58845O84766o04397k141337
$$ plain form
41688 1312232 -129761 1375116 4722343 6221016 4192926 1101960 75815 975381
41680 975381 1646856 1742558 2800574 4945326 6219458 5747793 5158116 5719565 6200555
41671 6200555 5250979 4129882 4818847 6595708 7059444 6060321 5876421 7269450 8107908
41662 8107908 6956797 5648411 6539390 8920933 10206160 9627868 8632030 8112830 7410222
41653 7410222 6171963 5299105 5399776 5715245 5375262 4686828 4374297 4358528 4160546
41644 4160546 3929084 4130885 4513694 4284727 3333527 2539924 2652918 3370687 3799107
41635 3799107 3477739 2687568 2014900 1932647 2646405 3960695 5241098 5769264 5269852
41626 5269852 4040901 2663369 1758979 1837298 2918504 4290465 5117792 5381558 5693691
$$ packed form
41688A312232j441993J504877L347227J498673k028090l090966j026145Q99566
41680I75381O71475R5702J058016K144752J274132m71665n89677N61449M80990
41671F200555r49576j121097O88965J776861M63736r99123j83900J393029Q38458
41662H107908j151111j308386Q90979K381543J285227n78292r95838n19200p02608
41653G410222j238259q72858J00671L15469l39983o88434l12531j5769j97982
41644D160546k31462K01801L82809k28967r51200p93603J12994P17769M28420
41635C799107l21368p90171o72668q2253P13758J314290J280403N28166m99412
41626E269852j228951j377532r04390P8319J081206J371961Q27327K63766L12133
$$ plain form
41617 5693691 6103902 5889610 4889825 4118532 4285772 4539792 3789275 2666447 2780596
41608 2780596 4233614 5313205 4815467 3444788 2639814 3056382 4382047 5584927 5296714
41599 5296714 3258471 1493068 2432619 5507565 7412773 6516511 5070618 5765251 7937925
41590 7937925 9085714 8748047 8631240 9606540 10812116 11544278 12078359 12516427 12505919
41581 12505919 12330238 12831598 14015090 15061342 15961704 17777240 20806196 23677834
41573 23677834 24911287 24513826 23403683 21888415 19435091 15822997 12085797 9957743
41565 9957743 10056110 10812444 10055277 7788464 6235414 6642536 7498386 6965401 5594014
41556 5594014 5040499 5373049 5611708 5905603 6913995 7780961 7208385 6070485 6311799
$$ packed form
41617E693691M10211k14292r99785p71293J67240K54020p50517j122828J14149
41608B780596J453018J079591m97738j370679q04974M16568J325665J202880k88213
41599E296714k038243j765403R39551L074946J905208q96262j445893O94633K172674
41590G937925J147789l37667j16807R75300J205576P32162N34081M38068j0508
41581A2505919j75681N01360J183492J046252R00362J815536L028956K871638
41573B3677834J233453l97461j110143j515268k453324l612094l737200k128054
41565I957743R8367P56334p57167k266813j553050M07122Q55850n32985j371387
41556E594014n53515L32550K38659K93895J008392Q66966n72576j137900K41314
$$ plain form
41547 6311799 7488264 7311299 5721164 5210611 6441612 6880912 5153587 3560714 4262346
41538 4262346 5804181 5971511 5698775 7141371 9606375 10635853 10108397 10067398 10905087
41529 10905087 10787103 9019968 7238761 6662742 6493126 5838240 5258891 5418483 5762975
41520 5762975 5562457 5083854 4853108 4755820 4640997 4881266 5561312 5958955 5636589 5312906
41510 5312906 5830818 6907685 7758189 8320721 8815717 8604545 6897154 4563403 3702935
41501 3702935 4817903 5779075 4729104 2918757 2966427 4887747 6039414 5225973 4492163
41492 4492163 5684142 7396886 7335265 6087478 6009552 7342117 8268661 8416175 9208129
41483 9208129 10481371 9952542 7114612 4753291 4982768 6310523 6532658 6177749 6735343
$$ packed form
41547F311799J176465j76965j590135n10553J231001M39300j727325j592873P01632
41538D262346J541835J67330k72736J442596K465004J029478n27456m0999Q37689
41529A0905087j17984j767135j781207n76019j69616o54886n79349J59592L44492
41520E762975k00518m78603k30746r7288j14823K40269O80046L97643l22366l23683
41510E312906N17912J076867Q50504N62532M94996k11172j707391k333751q60468
41501C702935J114968R61172j049971j810347M7670J921320J151667q13441p33810
41492D492163J191979J712744o1621j247787p7926J332565R26544J47514P91954
41483I208129J273242n28829k837930k361321K29477J327755K22135l54909N57594
$$ plain form
41474 6735343 7519081 7109722 6453561 7501022 9604948 10261725 9096229 8260886 8826816
41465 8826816 9487921 9278713 9087069 9680208 10348022 10453961 10550349 10959989 10797955 9507990
41455 9507990 8190431 8347517 10099195 12358523 14027860 14524062 13978355 13457413 14238896
41446 14238896 16417391 18860795 20707749 22056758 23061175 23468552 23439341 23753774 24667767
41437 24667767 25452684 25569551 25458855 25649251 25859414 25581974 25050508 25183500 26805791
41428 26805791 29850373 32894913 33912261 32335732 29917234 28424279 27143940 24385634
41420 24385634 20920148 19442723 20382702 20932489 19278048 17309686 17503721 19263540
41412 19263540 20464993 20973968 22213518 24285365 25967909 27097234 28730614 31064962
$$ packed form
41474F735343P83738m09359o56161J047461K103926O56777j165496q35343N65930
41465H826816O61105k09208j91644N93139O67814J05939R6388M09640j62034j289965
41455I507990j317559J57086J751678K259328J669337M96202n45707n20942P81483
41446A4238896K178495K443404J846954J349009J004417M07377k9211L14433R13993
41437B4667767P84917J16867j10696J90396K10163k77440n31466J32992J622291
41428B6805791L044582L044540J017348j576529k418498j492955j280339k758306
41420B4385634l465486j477425R39979N49787j654441j968362J94035J759819
41412A9263540J201453N08975J239550K071847J682544J129325J633380K334348
$$ plain form
41404 31064962 33088672 34248442 34716346 34078720 31633235 28170057 25588250 24241973
41396 24241973 22410262 19193301 16339511 15975354 17631860 18916821 18568048 17499935
41388 17499935 16931546 16717157 16009966 14794460 13899013 13592968 13031990 11610624 10284732
41379 10284732 10603622 12571079 14572724 15621920 16418825 17565208 18074683 16919848
41371 16919848 15108374 14621627 15691768 16646566 16323676 15214609 14206452 13613591 13665395
41362 13665395 14604922 15948608 16888502 17800822 20024961 23549505 26237819 26290308 24469353
41353 24469353 22887564 22401008 22240984 21603890 20539581 19635773 19711299 21454107 24504811
41344 24504811 27279476 28631713 29345621 30900120 32982874 33627204 32182479 30904498
$$ packed form
41404C1064962K023710J159770M67904o37626k445485l463178k581807j346277
41396B4241973j831711l216961k853790l64157J656506J284961l48773j068113
41388A7499935n68389k14389p07191j215506q95447l06045n60978j421366j325892
41379A0284732L18890J967457K001645J049196P96905J146383N09475j154835
41371A6919848j811474m86747J070141R54798l22890j109067j008157n92861N1804
41362A3665395R39527J343686R39894R12320K224139L524544K688314N2489j820955
41353B4469353j581789m86556j60024o37094j064309r03808P5526J742808L050704
41344B4504811K774665J352237P13908J554499K082754O44330j444725j277981
$$ plain form
41336 30904498 32619159 37329626 42097317 44308416 44372723 44850141 47310631 50739071
41328 50739071 53263324 54856589 57489928 62634508 69573654 76706939 83742403 91684121
41320 91684121 101098813 111590490 123122818 136803537 153776881 173937775 196281508
41313 196281508 220035901 244758800 269487048 292312798 310602431 321079139 320169641
41306 320169641 305879557 280317409 249534697 219461178 191965407 165853535 141324005
41299 141324005 121344019 107732536 97895261 87642447 76336924 66805129 60390428
41292 60390428 54917242 48376404 41977838 37766367 35236355 32643972 30299733 29803038
41284 29803038 30515979 29598821 25955398 21854424 19844734 19905412 20541012 20987658 21082250
$$ packed form
41336C0904498J714661M710467M767691K211099O4307M77418K460490L428440
41328E0739071K524253J593265K633339N144580O939146P133285P035464P941718
41320I1684121R414692J0491677J1532328J3680719J6973344K0160894K2343733
41313A96281508K3754393K4722899K4728248K2825750J8289633J0476708r09498
41306C20169641j4290084k5562148l0782712l0073519k7495771k6111872k4529530
41299A41324005j9979986j3611483r837275j0252814j1305523r531795o414701
41292F0390428n473186o540838o398566m211471k530012k592383k344239m96695
41284B9803038P12941r17158l643423m100974k009690O0678O35600M46646R4592
$$ plain form
41275 21082250 20269272 18275066 16153108 15378477 16078211 16960775 16864769 15885421 15127014
41266 15127014 15541752 16735247 17027732 15331621 12783735 11507615 11834123 12044980 10976484
41257 10976484 9365714 8309883 8080117 8924366 11028722 12859220 11906110 8607054
41249 8607054 7168373 10206825 14618227 15640225 13387093 11879243 12553487 12735507
41241 12735507 10724475 8528377 8352973 9520642 10457788 11201974 12252985 13026089 13077219
41232 13077219 13056628 13012188 11695065 9187751 8211314 10681547 14566428 16465189 16022482
41223 16022482 15361554 15204615 14345668 12568936 11322768 11236078 11329349 11212561 11921934
41214 11921934 13738103 15047844 14558370 13250890 12854020 13399666 13695086 13627539 14455362
$$ packed form
41275B1082250q12978j994206k121958p74631O99734Q82564r6006r79348p58407
41266A5127014M14738J193495K92485j696111k547886j276120L26508K10857j068496
41257A0976484j610770j055831k29766Q44249K104356J830498r53110l299056
41249H607054j438681L038452M411402J021998k253132j507850O74244J82020
41241A2735507k011032k196098j75404J167669R37146P44186J051011P73104N1130
41232A3077219k0591m4440j317123k507314r76437K470233L884881J898761m42707
41223A6022482o60928j56939q58947j776732j246168q6690R3271j16788P09373
41214A1921934J816169J309741m89474j307480l96870N45646K95420o7547Q27823
$$ plain form
41205 14455362 16646446 18623095 18406441 16043473 13626817 12890991 13478766 13921479 13637833
41196 13637833 13138400 12685361 11977148 11280776 11668503 13576424 16008015 17713690 18390625
41187 18390625 18301769 17712467 17326900 18181513 20148350 21486867 21019222 19982678 20441008
41178 20441008 22384043 23774697 23339634 22146837 22262932 24540397 27786641 29816124
41170 29816124 29648286 28841177 29873326 32925264 35508158 35974487 35881449 37545531 40632001
41161 40632001 43009428 43990322 44615204 45301668 45467169 45443428 46686573 49727103 53537447
41152 53537447 57216027 60811162 64274675 67177075 69893533 73695066 79138796 85454072
41144 85454072 91931267 99009353 107719983 118745745 131934237 146081086 159781063
$$ packed form
41205A4455362K191084J976649k16654k362968k416656p35826N87775M42713k83646
41196A3637833m99433m53039p08213o96372L87727J907921K431591J705675O76935
41187A8390625q8856n89302l85567Q54613J966837J338517m67645j036544M58330
41178B0441008J943035J390654m35063j192797J16095K277465L246244K029483
41170B9816124j67838q07109J032149L051938K582894M66329r3038J664082L086470
41161D0632001K377427R80894O24882O86464J65501k3741J243145L040530L810344
41152E3537447L678580L595135L463513K902400K716458L801533N443730O315276
41144H5454072O477195P078086Q710630J1025762J3188492J4146849J3699977
$$ plain form
41137 159781063 173497048 189904400 210664305 233694711 255412201 274544088 291095421
41130 291095421 302445568 304171822 295229942 279025150 258549275 233904510 206049145
41123 206049145 179330394 157506802 139687120 122984307 107266829 94431840 84543401
41116 84543401 75886595 68151188 62639590 59417126 56676627 53097143 48952793 44852387
41108 44852387 41097512 38259961 36685304 35342490 32796280 29522600 27700447 28273256
41100 28273256 29538142 29278847 27395312 25796719 26109996 27818742 28588264 26643327
41092 26643327 22929762 20238137 19799314 19727133 17674942 14064436 11438450 11331098 13172699
41083 13172699 15741160 18068951 19070801 17947257 15398515 13342389 13002532 13948533
$$ packed form
41137A59781063J3715985J6407352K0759905K3030406K1717490J9131887J6551333
41130B91095421J1350147J726254q941880j6204792k0475875k4644765k7855365
41123B06049145k6718751k1823592j7819682j6702813j5717478j2834989r888439
41116H4543401q656806p735407n511598l222464k740499l579484m144350m100406
41108D4852387l754875k837551j574657j342814k546210l273680j822153N72809
41100B8273256J264886k59295j883535j598593L13277J708746P69522j944937
41092B6643327l713565k691625m38823p2181k052191l610506k625986j07352J841601
41083A3172699K568461K327791J001850j123544k548742k056126l39857R46001
$$ plain form
41075 13948533 15106458 15962287 16628255 17301171 17756218 17146679 14718020 11136825 8450828
41066 8450828 8037966 9245771 10758596 12328429 14030886 14876235 13913539 12137440 11430040
41057 11430040 11850546 11852359 11128735 11161447 12524566 13676873 13412297 12906611 14055485
41048 14055485 16781649 19151746 19599013 18253707 16626229 16570639 18911493 22425077
41040 22425077 24689006 24516866 23114701 22440069 23064855 24234851 25438880 27092416
41032 27092416 29803220 33473759 37125724 39521679 40251405 40216173 40504079 40743834 39392777
41023 39392777 35971390 32090247 29593112 28483323 27584973 26527568 25772433 25036161
41015 25036161 23316398 20797317 19180540 19202631 19073715 16812414 13369229 11659371
$$ packed form
41075A3948533J157925Q55829O65968O72916M55047o09539k428659l581195k685997
41066H450828m12862J207805J512825J569833J702457Q45349r62696j776099p07400
41057A1430040M20506J813p23624L2712J363119J152307k64576n05686J148874
41048A4055485K726164K370097M47267j345306j627478n5590K340854L513584
41040B2425077K263929j72140j402165o74632O24786J169996J204029J653536
41032B7092416K710804L670539L651965K395955P29726l5232K87906K39755j351057
41023C9392777l421387l881143k497135j109789q98350j057405p55135p36272
41015B5036161j719763k519081j616777K2091j28916k261301l443185j709858
$$ plain form
41007 11659371 12653647 14319371 14833275 14866535 15590204 16261636 15680809 14789928 15501130
40998 15501130 17492252 18562607 18133172 17970758 18990944 19743646 19071883 18120958 18284365
40989 18284365 18927925 18802618 18308094 18583325 19397836 19732184 19741138 20418219 21670158
40980 21670158 22205168 21227398 19198398 17099713 15689769 15145649 14915215 14462839 14361977
40971 14361977 15561517 17387811 18003428 17360515 17469835 18734282 18705944 16319006 14546419
40962 14546419 16051291 18670322 18767709 17116438 17279745 19431485 20419494 19546046 19443060
40953 19443060 20684380 20286189 17044951 14122331 14196150 15582981 15504845 14136851 12959357
40944 12959357 11834247 10382977 9947512 11377067 12680426 11609845 9157298 7937330
$$ packed form
41007A1659371R94276J665724N13904L3260P23669O71432n80827q90881P11202
40998A5501130J991122J070355m29435j62414J020186P52702o71763r50925J63407
40989A8284365O43560j25307m94524K75231Q14511L34348Q954O77081J251939
40980B1670158N35010r77770k029000k098685j409944n44120k30434m52376j00862
40971A4361977J199540J826294O15617o42913J09320J264447k8338k386938j772587
40962A4546419J504872K619031R7387j651271J63307K151740R88009q73448j02986
40953A9443060J241320l98191l241238k922620P3819J386831p8136j367994j177494
40944A2959357j125110j451270m35465J429555J303359j070581k452547j219968
$$ plain form
40936 7937330 8349004 8873641 9157338 10203058 12027723 13403263 13702835 13269249 12345708
40927 12345708 11178015 10624719 11181953 12014963 12292573 12584654 13480026 13968927 13069441
40918 13069441 12014914 12638542 14361505 15116756 14714196 14802355 15769685 16381368 16706357
40909 16706357 18670678 22865577 27273076 30526171 34382019 41020808 49001662 53799604
40901 53799604 52192919 45072417 36226673 29326458 25868190 24927037 24397671 22823640
40893 22823640 20432772 18567879 18214520 19083887 20006712 20166073 19957787 20545623 22469221
40884 22469221 24828169 26115482 25941407 25673819 26934137 29375999 30690342 29654292
40876 29654292 28582316 31005790 36714617 41348799 42197604 42135240 45416915 51481932
$$ packed form
40936G937330M11674N24637K83697J045720J824665J375540K99572m33586r23541
40927A2345708j167693n53296N57234Q33010K77610K92081Q95372M88901q99486
40918A3069441j054527O23628J722963P55251m02560Q8159R67330O11683L24989
40909A6706357J964321M194899M407499L253095L855848O638789P980854M797942
40901E3799604j606685p120502q845744o900215l458268r41153n29366j574031
40893B2823640k390868j864893l53359Q69367R22825J59361k08286N87836J923598
40884B2469221K358948J287313j74075k67588J260318K441862J314343j036050
40876B9654292j071976K423474N708827M634182Q48805o2364L281675O065017
$$ plain form
40868 51481932 56396188 59392847 63754968 71039085 78842812 85667944 93833941 105218405
40860 105218405 117720138 128946389 140361883 154234292 168743976 179835503 186267542
40853 186267542 189164598 187950094 180768095 168419375 154156407 139652117 124461776
40846 124461776 109312167 96399946 86052170 76296139 66320438 57484816 50436090
40839 50436090 44173771 38566967 34803480 32539232 29590003 25512055 22591943 22002903
40831 22002903 21771274 20052246 17758987 16249969 14963142 13294660 12453300 13213374
40823 13213374 13847780 12643706 10762547 10203149 10401352 9406789 7377931 6348899 7089624
40814 7089624 8477402 9688951 11016573 12631838 14249179 15999371 18265910 20705400
$$ packed form
40868E1481932M914256K996659M362121P284117P803727O825132Q165997J1384464
40860A05218405J2501733J1226251J1415494J3872409J4509684J1091527O432039
40853A86267542K897056j214504p181999j2348720j4262968j4504290j5190341
40846A24461776j5149609j2912221j0347776r756031r975701q835622p048726
40839E0436090o262319n606804l763487k264248k949229m077948k920112n89040
40831B2002903k31629j719028k293259j509018j286827j668482q41360P60074
40823A3213374O34406j204074j881159n59398J98203r94563k028858j029032P40725
40814G089624J387778J211549J327622J615265J617341J750192K266539K439490
$$ plain form
40806 20705400 22491854 23343463 23556778 23605044 24434464 27208927 31808136 36618679 40728104
40797 40728104 44817636 48601305 49372513 45412435 39286602 34867209 32066987 27731926
40789 27731926 21312683 16073357 14138177 13657418 12143534 9819807 8040277 6750550
40781 6750550 5443622 4824132 5534423 6547531 6634422 6297307 6547332 6913892 6547897
40772 6547897 6246358 7161678 8193968 7154909 4419762 2946724 4228395 6535907
40764 6535907 8027796 9320339 11403027 12857893 11451427 7711988 4717861 4330755
40756 4330755 5403222 5981293 5660570 5090533 4484178 3714313 3183896 3540798 4716578
40747 4716578 5947984 6675620 6959410 7108961 7293593 7475012 7479248 7178608 6684518 6235841
$$ packed form
40806B0705400J786454Q51609K13315M8266Q29420K774463M599209M810543M109425
40797D0728104M089532L783669P71208l960078o125833m419393k800222m335061
40789B7731926o419243n239326j935180m80759j513884k323727j779530j289727
40781F750550j306928o19490P10291J013108Q6891l37115K50025L66560l65995
40772F547897l01539R15320J032290j039059k735147j473038J281671K307512
40764F535907J491889J292543K082688J454866j406466l739439k994127l87106
40756D330755J072467N78071l20723n70037o06355p69865n30417L56902J175780
40747D716578J231406P27636K83790J49551J84632J81419M236l00640m94090m48677
$$ plain form
40737 6235841 5965399 6057581 6919896 8588243 10129273 10571091 10474988 11404287 13487761
40728 13487761 14871126 14358996 13246668 13353878 14465075 15232637 15559368 16220563 16902752
40719 16902752 16773897 16572652 17731838 19415380 19025352 16301779 14399484 15633098
40711 15633098 18363524 19821862 20156496 21460931 24000753 25875873 26062538 25560589
40703 25560589 25313004 24890534 23933544 23439820 24463069 26174243 26383787 24186778 21391140
40694 21391140 20620573 22085794 23186996 21931313 19778202 19659681 21718854 23120120
40686 23120120 22373003 21461020 22359807 23567560 22408975 19562203 18537301 20752615
40678 20752615 23672431 24626914 24489041 26092205 30076694 34015830 35737976 36333711
$$ packed form
40737F235841k70442R2182Q62315J668347J541030M41818r6103R29299K083474
40728A3487761J383365n12130j112328J07210J111197P67562L26731O61195O82189
40719A6902752j28855k01245J159186J683542l90028k723573j902295J233614
40711A5633098K730426J458338L34634J304435K539822J875120J86665n01949
40703B5560589k47585m22470r56990m93724J023249J711174K09544k197009k795638
40694B1391140p70567J465221J101202j255683k153111j18521K059173J401266
40686B3120120p47117r11983Q98787J207753j158585k846772j024902K215314
40678B0752615K919816R54483j37873J603164L984489L939136J722146N95735
$$ plain form
40670 36333711 39022050 45176262 52218052 55969292 54741490 50419547 45840858 42360885
40662 42360885 40227182 39815679 41259099 43566559 45375050 46543766 48375756 52322169
40654 52322169 58524168 64946527 67857547 64496550 56078797 47071732 40620617 35850970
40646 35850970 30626862 25309399 21918336 20777459 20305223 19610894 19117793 18870576 18368601
40637 18368601 18030749 18709486 19645279 19065822 17133334 16084844 16830181 17582944 16814965
40628 16814965 15569975 15629420 17087950 19020901 20997714 22556427 22591306 20812569 18767649
40619 18767649 18050770 18469265 19128513 20014889 21013092 20741990 18440445 16102591 16459746
40610 16459746 19198994 21346439 21357318 20711841 21121984 22131172 22293726 21299791 20072665
$$ packed form
40670C6333711K688339O154212P041790L751240j227802m321943m578689l479973
40662D2360885k133703m11503J443420K307460J808491J168716J831990L946413
40654E2322169O201999O422359K911020l360997q417753r007065o451115m769647
40646C5850970n224108n317463l391063j140877m72236o94329m93101k47217n01975
40637A8368601l37852O78737R35793n79457j932488j048490P45337P52763p67979
40628A6814965j244990N9445J458530J932951J976813J558713L4879j778737k044920
40619A8767649p16879M18495O59248Q86376R98203k71102k301545k337854L57155
40610A6459746K739248K147445J0879o45477M10143J009188J62554r93935j227126
$$ plain form
40601 20072665 19703500 20812019 23059439 24960737 25194773 24420280 24693877 26761521 29191881
40592 29191881 30662307 31681442 33286932 35479414 37990943 41156189 44624127 46647044
40584 46647044 46632110 47305254 51840961 59307686 65697553 69594455 73803985 80387752
40576 80387752 87219349 91752773 95816571 103472240 115247383 127741491 138659034 148961688
40568 148961688 159445652 168298164 173657865 176289769 177678195 176981113 172030766 162647878
40560 162647878 151198130 140218081 130775842 122640204 114718976 105744031 95760254 86489135
40552 86489135 79057015 72088461 63604433 54192361 46391497 41228498 37438954 34133408
40544 34133408 31895717 30591392 28350587 24097791 19465703 16681205 15718928 15048825
$$ packed form
40601B0072665l69165J108519K247420J901298K34036p74493K73597K067644K430360
40592B9191881J470426J019135J605490K192482K511529L165246L467938K022917
40584D6647044j4934O73144M535707P466725O389867L896902M209530O583767
40576H0387752O831597M533424M063798P655669J1775143J2494108J0917543J0302654
40568A48961688J0483964Q852512N359701K631904J388426o97082m950347r382888
40560A62647878j1449748j0980049r442239q135638p921228q974945r983777r271119
40552H6489135p432120o968554q484028r412072p800864n162999l789544l305546
40544C4133408k237691j304325k240805m252796m632088k784498r62277o70103
$$ plain form
40536 15048825 14264479 14252163 15125268 15611808 14740311 13081472 11913782 11693805 11653190
40527 11653190 10735037 8830131 7022190 6466728 7241065 8678842 10420838 12261574
40519 12261574 13286431 12570897 10929539 10468137 11769868 12928727 12278345 10743605
40511 10743605 10265531 11070629 12053411 13015260 14723791 17079296 18967305 20063134 21309958
40502 21309958 23200918 24742953 24688404 23002877 20555391 17884292 14893494 11697738
40494 11697738 9275822 8724167 9605570 9694617 7444898 4501542 4197970 7136209 9987318
40485 9987318 9733521 7439502 6165303 6559872 6796415 6084814 5672845 6306190 6974437
40476 6974437 6734260 6017493 5555206 5477695 5927739 7108403 8278411 8192353 7103602
$$ packed form
40536A5048825p84346j2316Q73105M86540q71497j658839j167690k19977m0615
40527A1653190r18153j904906j807941n55462P74337J437777J741996J840736
40519A2261574J024857p15534j641358m61402J301731J158859o50382j534740
40511A0743605m78074Q05098R82782R61849J708531K355505J888009J095829J246824
40502B1309958J890960J542035n4549j685527k447486k671099k990798l195756
40494A1697738k421916n51655Q81403Q9047k249719k943356l03572K938239K851109
40485I987318k53797k294019j274199L94569K36543p11601m11969O33345O68247
40476F974437k40177p16767m62287p7511M50044J180664J170008q6058j088751
$$ plain form
40467 7103602 6932091 8858368 12062844 15284504 18073229 19926626 19972542 18518124 17322532
40458 17322532 17187225 16747489 14804204 12228493 10124458 7832503 4735710 2560946
40450 2560946 3371576 6110292 7708865 7281517 6721898 7208083 7728413 7541410 7598966
40441 7598966 8487921 8996430 8003874 6235754 4965683 4406515 4549801 6056553 8724944
40432 8724944 10333373 8952305 5776973 3884864 4508632 6126557 6965923 6757489 6113154
40423 6113154 5871796 7170882 10384587 13597604 13993209 11591901 9852821 11302556
40415 11302556 14136282 14861543 13039923 11170298 10517224 9666760 7575235 5653955
40407 5653955 5570567 6596216 6675676 5250057 3614705 2939122 3156041 3634995 3943288
$$ packed form
40467G103602j71511J926277L204476L221660K788725J853397M5916j454418j195592
40458A7322532j35307m39736j943285k575711k104035k291955l096793k174764
40450B560946Q10630K738716J598573m27348n59619M86185N20330j87003N7556
40441G598966Q88955N08509r92556j768120j270071n59168J43286J506752K668391
40432H724944J608429j381068l175332j892109O23768J617925Q39366k08434o44335
40423F113154k41358J299086L213705L213017L95605k401308j739080J449735
40415A1302556K833726P25261j821620j869625o53074q50464k091525j921280
40407E653955q3388J025649P9460j425619j635352o75583K16919M78954L08293
$$ plain form
40398 3943288 3907514 3603920 3298858 3026870 2539998 2071150 2512581 4059096 5255722
40389 5255722 4493065 2184988 366002 246709 1274700 2567538 3969975 5342775
40381 5342775 5991256 5530173 4632215 4310904 4854604 5757822 6250844 5737346 4266811
40372 4266811 2747125 2165700 2510975 2947738 2902241 2330008 1310264 405816 942092
40363 942092 3362933 5599414 5151551 2928583 2529805 4974610 7003066 6308349 5574832
40354 5574832 8323270 12809634 13954640 10656750 7237740 7108124 8533255 8102266
40346 8102266 5532398 3021626 1870161 1971239 3380058 6123183 8886206 9768504
40338 9768504 8494811 6711398 5970558 6258987 6577946 6272715 5617032 5479217 6498444
$$ packed form
40398C943288l5774l03594l05062k71988m86872m68848M41431J546515J196626
40389E255722p62657k308077j818986j19293J027991J292838J402437J372800
40381E342775O48481m61083q97958l21311N43700R03218M93022n13498j470535
40372D266811j519686n81425L45275M36763m5497n72233j019744r04448N36276
40363I42092K420841K236481m47863k222968l98778K444805K028456o94717p33517
40354E574832K748438M486364J145006l297890l419010j29616J425131m30989
40346H102266k569868k510772j151465J01078J408819K743125K763023Q82298
40338I768504j273693j783413p40840K88429L18959l05231o55683j37815J019227
$$ plain form
40329 6498444 8395099 10124098 10793041 10345857 9456593 9059102 9844647 11723337 13787153
40320 13787153 15248500 16348211 17920041 20314936 23267934 26299042 28367827 27779409
40312 27779409 23905728 18743214 15127347 13426661 11775497 9627195 8755245 9962103
40304 9962103 11155403 10232203 8009889 6512881 5934860 5369489 5340775 7281887 11066156
40295 11066156 15103019 18564482 21751970 24645521 26883475 28839328 30870618 31765570
40287 31765570 29877281 25684804 21270955 17353398 13042315 8678394 6359069 6788991
40279 6788991 7893087 7821470 7359303 7831647 8388134 7388125 5362734 4438117 5186953
40270 5186953 5938642 5323679 3951402 3093062 2885736 2668722 2460415 3032725 4373901
$$ packed form
40329F498444J896655J728999O68943m47184q89264l97491P85545J878690K063816
40320A3787153J461347J099711J571830K394895K952998L031108K068785n88418
40312B7779409l873681n162514l615867j700686j651164k148302q71950J206858
40304I962103J193300r23200k222314j497008n78021n65371k8714J941112L784269
40295A1066156M036863L461463L187488K893551K237954J955853K031290Q94952
40287C1765570j888289m192477m413849l917557m311083m363921k319325M29922
40279F788991J104096p1617m62167M72344N56487j000009k025391r24617P48836
40270E186953P51689o14963j372277q58340k07326k17014k08307N72310J341176
$$ plain form
40261 4373901 5016041 3833321 2131113 2517472 5363016 7991808 8382466 7962915 8959151
40252 8959151 10595853 10674427 9922984 11328374 15146142 18108734 18329680 17535146 17208517
40243 17208517 16128110 13681632 12032219 12171625 11079915 6406240 1271221 215429
40235 215429 2421167 3602266 3178293 4307600 7205091 8036645 5476976 3243391 4120125
40226 4120125 5869723 5603115 4406513 4687401 6086526 7156082 8439267 10604882
40218 10604882 11747792 9987648 7039634 5805502 5877131 4970150 3608787 4428159 7308735
40209 7308735 9211800 9119674 9407482 11525177 13776030 14631642 15148091 16476395 17682207
40200 17682207 17886836 18179595 19278233 19327792 16496531 12357218 10170165 10583942 11320705
$$ packed form
40261D373901O42140j182720j702208L86359K845544K628792L90658m19551R96236
40252H959151J636702P8574p51443J405390L817768K962592K20946p94534l26629
40243A7208517j080407k446478j649413J39406j091710m673675n135019j055792
40235B15429K205738J181099m23973J129307K897491Q31554k559669k233585Q76734
40226D120125J749598k66608j196602K80888J399125J069556J283185K165615
40218A0604882J142910j760144k948014j234132P1629r06981j361363Q19372K880576
40209G308735J903065r2126K87808K117695K250853Q55612N16449J328304J205812
40200A7682207K04629K92759J098638M9559k831261m139313k187053M13777P36763
$$ plain form
40191 11320705 10699741 9352078 8506229 8436164 8840081 9305942 9147750 7929267 6279497
40182 6279497 5182638 4540183 3581642 2578206 2707556 4024979 5081298 5136627 5344074
40173 5344074 6749846 8247192 7902183 5788782 4065050 4118086 4816540 4225508 2360113
40164 2360113 1264810 2275259 4014949 3889831 1403938 -979388 -765422 1543081
40156 1543081 3233590 2739931 1047768 -132917 -192691 769034 2668121 4672112 4864158
40147 4864158 2343877 -764213 -1176102 1457058 3903652 3423896 1046876 -260777
40139 -260777 570565 2303984 3985378 5771561 7052728 5986551 2166619 -1703499
40131 -1703499 -2482394 -265225 2170315 3171109 3688455 4889043 6220312 6727955 6775801
$$ packed form
40191A1320705o20964j347663q45849p0065M03917M65861j58192j218483j649770
40182F279497j096859o42455r58541j003436J29350J317423J056319N5329K07447
40173E344074J405772J497346l45009k113401j723732N3036O98454n91032j865395
40164B360113j095303J010449J739690j25118k485893k383326K13966K308503
40156A543081J690509m93659j692163j180685n9774R61725J899087K003991J92046
40147D864158k520281l108090m11889K633160K446594m79756k377020j307653
40139b60777Q31342J733419J681394J786183J281167j066177l819932l870118
40131a703499p78895K217169K435540J000794N17346J200588J331269N07643M7846
$$ plain form
40122 6775801 7126231 7311396 6396596 4767772 3635315 3063403 2117682 1006070 1301536
40113 1301536 3391897 5250780 4884186 2971172 1839807 2501011 3946932 4945423 5207911
40104 5207911 4898721 4245323 3791109 3965213 4184347 3424623 1996113 1608575 3017985
40095 3017985 4622049 4397931 2571931 1198864 1356469 1957712 1549696 288385 -494376
40086 -494376 -169133 472302 390201 -305814 -504294 430101 1754096 2240099 1675536 879954
40076 879954 350991 -210070 -732217 -160255 2055836 4453316 4757896 2598169 28414
40067 28414 -897655 -280998 247895 -331923 -1419331 -1619882 -234197 1977850 3451883
40058 3451883 3401251 2640530 2537546 3364262 4199214 4270335 3674142 2793326 1799924 913375
$$ packed form
40122F775801L50430J85165r14800j628824j132457n71912r45721j111612K95466
40113A301536K090361J858883l66594j913014j131365O61204J445921R98491K62488
40104E207911l09190o53398m54214J74104K19134p59724j428510l87538J409410
40095C017985J604064k24118j826000j373067J57605O01243m08016j261311p82761
40086d94376L25243O41435q2101o96015j98480R34395J323995M86003n64563p95582
40076H79954n28963n61061n22147N71962K216091K397480L04580k159727k569755
40067B8414r26069O16657N28893n79818j087408k00551J385685K212047J474033
40058C451883n0632p60721j02984Q26716Q34952P1121n96193q80816r93402q86549
$$ plain form
40048 913375 483970 649546 1454233 3174630 5636409 7341971 6648468 4155355 2515885
40039 2515885 3189035 4702460 5008163 4149726 3316016 2579049 1371569 356852 814233
40030 814233 2443442 3565747 3433979 2741289 1957995 908895 52009 330931 1431865
40021 1431865 1973927 1875961 2644327 4592949 5763873 4827022 3273307 3094643 3693006
40012 3693006 3035441 1011116 -389813 -7454 1094204 1292593 202454 -1348977 -2166668
40003 -2166668 -1416575 656387 2634863 3157653 2229823 907188 2716 -387574 -515579
39994 -515579 -738926 -1199413 -1267571 -69517 1835864 2455651 1134253 94561 1523843
39985 1523843 4128959 4803496 3196386 2086366 3102238 4642876 4774505 3814927 2839011
$$ packed form
40048I13375m29405J65576Q04687J720397K461779J705562o93503k493113j639470
40039B515885O73150J513425L05703q58437q33710p36967j207480j014717M57381
40030H14233J629209J122305j31768o92690p83294j049100q56886K78922J100934
40021A431865N42062r7966P68366J948622J170924r36851j553715j78664N98363
40012C693006o57565k024325j400929L82359J101658J98389j090139j551431q17691
40003b166668P50093K072962J978476N22790r27830j322635r04472l90290j28005
39994e15579k23347m60487o8158J198054J905381O19787j321398j039692J429282
39985A523843K605116O74537j607110j110020J015872J540638J31629r59578r75916
$$ plain form
39976 2839011 1724303 311640 -173344 1217609 3157869 3552073 2338198 1126332
39968 1126332 620676 126201 -629984 -844611 46245 1634790 3276101 4603414 5346897
39959 5346897 5577916 6006443 7031801 7660837 6521641 3903045 1576886 552772 305604
39950 305604 370344 1155080 2561736 3257503 2398483 1071798 866062 1705048 2272971
39941 2272971 2139455 2242409 3313299 4796788 5490750 4677521 2656276 682160 210887
39932 210887 1571361 3474638 4363165 4001597 3149328 2182908 1138004 785926 2133404
39923 2133404 4586281 6061310 5538297 4226348 3504803 3131148 2536551 2368439 3051144
39914 3051144 3047154 801155 -2216594 -2883834 -806529 1138087 1015733 66824 -112655
$$ packed form
39976B839011j114708j412663m84984J390953J940260L94204j213875j211866
39968A126332n05656m94475p56185k14627Q90856J588545J641311J327313P43483
39959E346897K31019M28527J025358O29036j139196k618596k326159j024114k47168
39950C05604O4740P84736J406656O95767q59020j326685k05736Q38986N67923
39941B272971j33516J02954J070890J483489O93962q13229k021245j974116m71273
39932B10887J360474J903277Q88527l61568q52269r66420j044904l52078J347478
39923B133404K452877J475029n23013j311949p21545l73655n94597j68112O82705
39914C051144l990k245999l017749o67240K077305J944616j22354r48909j79479
$$ plain form
39905 -112655 12872 -107300 856336 3751841 6341031 5751284 2601784 181669 120764
39896 120764 1268290 2350853 3126850 3081037 1720780 428401 1329908 3770171 4612137
39887 4612137 2905556 1477508 2524795 4362592 4509343 3520235 3200054 3018607 1430875
39878 1430875 -409630 396773 3959838 6924482 6839993 4911651 3665036 3741800 4000479
39869 4000479 3535382 2632321 2295671 3214972 4776850 5281121 3850384 1759098 910528
39860 910528 1463513 2218626 2868292 4152295 5857673 6502073 5440259 3802383 2862322
39851 2862322 2736178 3000404 3240502 2712789 997625 -636330 -239464 1853143 2934322
39842 2934322 1758358 540067 1655952 4053952 4909914 3692150 2451754 2673769
$$ packed form
39905a12655J25527j20172R63636K895505K589190n89747l149500k420115o0905
39896A20764J147526J082563P75997m5813j360257j292379R01507K440263Q41966
39887D612137j706581j428048J047287J837797J46751r89108l20181j81447j587732
39878A430875j840505Q06403L563065K964644q4489j928342j246615P6764K58679
39869D000479m65097r03061l36650R19301J561878N04271j430737k091286q48570
39860I10528N52985P55113O49666J284003J705378O44400j061814j637876r40061
39851B862322j26144K64226K40098n27713j715164j633955L96866K092607J081179
39842B934322j175964j218291J115885K398000Q55962j217764j240396K22015
$$ plain form
39834 2673769 3831180 4839572 5204380 4789980 3965141 3870861 5077932 6205219 5582216
39825 5582216 4133497 4483876 6864408 8262362 6717864 4258084 3743212 4549816 3868075
39816 3868075 1358644 -270763 618548 2503410 3495299 3942187 4835088 5463606 4629050
39807 4629050 3076557 2596164 3208532 3313885 2522178 2240416 3126573 3987379 3926217
39798 3926217 3696227 3886922 3573936 2204841 1220684 1966417 3216916 2847530 1137392
39789 1137392 269923 1070312 2423381 3621301 4929945 5772928 4840452 2605426 1448398
39780 1448398 2316267 3256035 2420188 747655 353997 1798586 4263610 6940066 8739456
39771 8739456 8065642 4763290 1370026 595631 2127663 3514497 3564382 3095610 2752043
$$ packed form
39834B673769J157411J008392L64808m14400q24839r4280J207071J127287o23003
39825E582216j448719L50379K380532J397954j544498k459780n14872Q06604o81741
39816C868075k509431j629407Q89311J884862R91889M46888Q92901O28518q34556
39807D629050j552493m80393O12368J05353p91707k81762Q86157Q60806o1162
39798C926217k29990J90695l12986j369095r84157P45733J250499l69386j710138
39789A137392q67469Q00389J353069J197920J308644Q42983r32476k235026j157028
39780A448398Q67869R39768q35847j672533l93658J444589K465024K676456J799390
39771H739456o73814l302352l393264p74395J532032J386834M9885m68772l43567
$$ plain form
39762 2752043 2083668 1012008 527736 1268623 2419212 2647116 1683539 708550 1297189
39753 1297189 3717999 6106470 6031344 3343851 595036 -66406 636048 729264 -101385
39744 -101385 -778745 -1114631 -1899744 -3053725 -3533843 -3124804 -2758979 -2961915 -3340464
39735 -3340464 -3586156 -3613193 -2833315 -860628 1089348 1181173 -494119 -1927238 -1849208
39726 -1849208 -718815 959190 3231362 5263905 5560925 4373471 3679582 3769229 2267523
39717 2267523 -1812113 -5339402 -4779061 -1052092 1899748 2398943 2207456 2890872 3771099
39708 3771099 3876130 3640861 3756195 3833471 3095321 1494244 -326418 -1430846 -850590
39699 -850590 1580046 4518831 6246468 6635015 6984216 7867024 8398267 7868828 6732238
$$ packed form
39762B752043o68375j071660m84272P40887J150589K27904r63577r74989N88639
39753A297189K420810K388471p5126k687493k748815o61442P02454R3216q30649
39744a01385o77360l35886p85113j153981m80118M09039L65825k02936l78549
39735c340464k45692k7037P79878J972687J949976R1825j675292j433119P8030
39726a849208J130393J678005K272172K032543K97020j187454o93889Q9647j501706
39717B267523m079636l527289N60341L726969K951840M99195j91487O83416Q80227
39708C771099J05031k35269J15334P7276p38150j601077j820662j104428N80256
39699h50590K430636K938785J727637L88547L49201Q82808N31243n29439j136590
$$ plain form
39690 6732238 5493355 4012079 2635048 2584906 4047725 5047007 3753183 1220122 222127
39681 222127 1652458 3639444 4302195 3871793 3577837 3677909 3471982 2599478 1518591
39672 1518591 954765 1324802 2480128 3783686 4734443 5568384 6717204 7664522 7242568
39663 7242568 5402788 3695394 3328157 3693340 3703054 3621272 4322207 5540931 6426066
39654 6426066 7249039 8705493 9792597 8548230 5185203 2353417 1613797 1720942 1337781
39645 1337781 1246698 2351227 3518856 3475797 3267464 4518146 6407974 6820024 5711090
39636 5711090 4919549 5165020 5620127 5989669 6513717 6294647 4360077 2179427 2111242
39627 2111242 3309768 2549342 -408041 -2008966 -629196 813566 -8977 -911388 629015
$$ packed form
39690F732238j238883j481276j377031n0142J462819R99282j293824k533061r97995
39681B22127J430331J986986O62751m30402k93956J00072k05927q72504j080887
39672A518591n63826L70037J155326J303558R50757Q33941J148820R47318m21954
39663G242568j839780j707394l67237L65183R714q1782P00935J218724Q85135
39654F426066Q22973J456454J087104j244367l363027k831786p39620J07145l83161
39645A337781r1083J104529J167629m3059k08333J250682J889828M12050j108934
39636E711090p91541K45471M55107L69542N24048k19070j934570k180650o8185
39627B111242J198526p60426k957383j600925J379770J442762q22543r02411J540403
$$ plain form
39618 629015 2747332 2454540 1007913 1647135 3714453 3753558 1688945 1099059 3109630
39609 3109630 4576390 3414714 1644299 1475476 1979208 1759354 1791248 3055030 3889114
39600 3889114 2522347 366587 -55268 918662 1046201 152284 156144 1428727 2049107
39591 2049107 1185865 741736 2517665 5457773 7041101 6473133 5329532 5386186 6619676
39582 6619676 7379172 6226922 3538415 1202434 687943 1725661 3091454 4131042
39574 4131042 4947031 5555993 5700341 5374636 4871740 4384883 4077129 4300192 5129161
39565 5129161 5941956 6141878 6013383 6097898 6071114 5239092 3897055 2986156 2461371 1389500
39555 1389500 -104198 -507265 803037 2371064 2774327 2688143 3474739 4684066 4708538
$$ packed form
39618F29015K118317k92792j446627O39222K067318L9105k064613n89886K010571
39609C109630J466760j161676j770415j68823N03732k19854L1894J263782Q34084
39600C889114j366767k155760m21855R73930J27539q93917L860J272583O20380
39591B049107q63242m44129J775929K940108J583328n67968j143601N6654J233490
39582F619676P59496j152250k688507k335981n14491J037718J365793J039588
39574D131042Q15989O08962J44348l25705n02896m86857l07754K23063Q28969
39565E129161Q12795J99922j28495Q4515k6784q32022j342037r10899n24785j071871
39555A389500j493698m03067J310302J568027M03263q6184P86596J209327K4472
$$ plain form
39546 4708538 3480598 2627079 2797310 2638562 1120728 -617105 -849849 304578 1252534
39537 1252534 1119515 394021 -277580 -753610 -933395 -753717 -772613 -1693801 -3012598
39528 -3012598 -3186187 -1702571 -26710 316858 -174901 152390 1677448 3109172 3353156
39519 3353156 2621213 1619856 769456 501173 1174832 2127418 1868488 95056 -1361602
39510 -1361602 -707500 1333269 2508041 2128163 1646521 2100307 2636166 2250594 1553793
39501 1553793 1623729 2109371 1933198 1368473 1833175 3566273 4952599 4657327 3305172
39492 3305172 2330704 2055394 1841366 1583824 1933831 3061458 4082222 4002016 2744408
39483 2744408 1040842 -266745 -562357 466245 2501690 4333571 4476942 2577930
$$ packed form
39546D708538j227940q53519J70231j58748j517834j737833k32744J154427R47956
39537A252534j33019p25494o71601m76030j79785J79678j8896r21188j318797
39528c012598j73589J483616J675861L43568m91759L27291J525058J431724K43984
39519C353156p31943j001357q50400k68283O73659R52586k58930j773432j456658
39510a361602O54102K040769J174772l79878m81642M53786N35859l85572o96801
39501A553793O9936M85642j76173n64725M64702J733098J386326k95272j352155
39492C305172r74468k75310k14028k57542L50007J127627J020764q0206j257608
39483B744408j703566j307587k95612J028602K035445J831881J43371j899012
$$ plain form
39475 2577930 135296 -729056 522622 2309344 2979093 2830022 3301906 4586966 5306018
39466 5306018 4645443 3454636 2654600 1820460 304780 -1256186 -1759900 -1238268 -449374
39457 -449374 458045 1548000 2010020 1104116 -172545 -145623 903883 1037676 -247268
39448 -247268 -1188071 -508083 955433 2156833 3429273 5009811 5740957 4691619 2659164
39439 2659164 718185 -1209075 -2861397 -2515226 463526 3361228 3012371 119075
39431 119075 -1892810 -1675143 -805456 -211096 1013885 2799369 3288202 2006053 1140581
39422 1140581 2179625 3638156 3800250 3510407 4188164 4956921 4174683 2494079 1877066
39413 1877066 2382856 2399930 1634322 1433494 2143864 2430451 1631238 828934 982878 1690568
$$ packed form
39475B577930k442634q64352J251678J786722O69749j49071M71884J285060P19052
39466E306018o60575j190807q00036q34140j515680j560966n03714N21632P88894
39457d49374R07419J089955M62020r05904j276661K6922J049506J33793j284944
39448b47268r40803O79988J463516J201400J272440J580538P31146j049338k032455
39439B659164j940979j927260j652322L46171K978752K897702l48857k893296
39431A19075k011885K17667Q69687N94360J224981J785484M88833j282149q65472
39422A140581J039044J458531J62094k89843O77757P68757p82238j680604o17013
39413A877066N05790J7074p65608k00828P10370K86587p99213q02304J53944P07690
$$ plain form
39403 1690568 2474254 3661467 5046946 5157046 3178525 622384 -379644 135948 378230
39394 378230 -156376 281768 2927865 6035958 6625749 4376703 2227138 2594314 4384300
39385 4384300 4944244 3896611 3143461 3509361 3737222 3245652 3447282 5013111 5957169
39376 5957169 4438577 1891253 1051098 1996601 2668177 2525837 2843036 3630208 3307716
39367 3307716 1830418 1191490 1941628 2052146 569211 -382975 821672 2262000 1603385
39358 1603385 342426 1770444 5677089 8289506 7473880 5231608 4437888 5303473 6011120
39349 6011120 5320768 3549606 1823447 1000367 916466 671217 78274 226583 1674641
39340 1674641 2911496 2183854 278556 -463225 351973 890216 457175 635149 2184628
$$ packed form
39403A690568P83686J187213J385479J10100j978521k556141j002028N15592K42282
39394C78230n34606M38144K646097L108093N89791k249046k149565L67176J789986
39385D384300N59944j047633p53150L65900K27861m91570K01630J565829R44058
39376E957169j518592k547324q40155R45503O71576j42340L17199P87172l22492
39367C307716j477298o38928P50138J10518j482935r52186J204647J440328o58615
39358A603385j260959J428018L906645K612417q15626k242272p93720Q65585P07647
39349F011120o90352j771162j726159q23080q3901k45249n92943J48309J448058
39340A674641J236855p27642j905298p41781Q15198N38243m33041J77974J549479
$$ plain form
39331 2184628 3170464 1752725 -878376 -2082916 -1073109 947468 2876608 4272178
39323 4272178 4615621 3735714 2588236 2204981 2192205 1495320 231025 -522226 -406715
39314 -406715 5841 401065 918226 1447591 1868072 2577273 3572393 3576801 1632814 -909825
39304 -909825 -1834307 -1219295 -1080957 -1851390 -1616535 524185 2724901 3206323 2689035
39295 2689035 2459077 1894844 -44511 -2271723 -2824470 -1871609 -1228157 -1310519 -827406
39286 -827406 555176 1482956 1235202 734106 547004 -208174 -1898274 -2974787 -1971751
39277 -1971751 259532 1757919 1993313 1745000 1269259 369135 -143639 951615 3070685
39268 3070685 4076080 3307739 2651633 3652737 5122502 5021446 3556588 2686083 3174009
$$ packed form
39331B184628R85836j417739k631101j204540J009807K020577J929140J395570
39323D272178L43443q79907j147478l83255j2776o96885j264295p53251J15511
39314d06715M12556L95224N17161N29365M20481P09201R95120M408j943987k542639
39304i09825r24482O15012J38338p70433K34855K140720K200716M81422n17288
39295B689035k29958n64233j939355k227212n52747R52861O43452q2362M83113
39286h27406J382582R27780k47754n01096j87102p55178j690100j076513J003036
39277a971751K231283J498387K35394k48313m75741r00124n12774J095254K119070
39268C070685J005395p68341o56106J001104J469765j01056j464858q70505M87926
$$ plain form
39259 3174009 3909734 3988852 3808519 3920917 4252586 4785165 5710362 6556196 6434570 5532431
39249 5532431 5013045 5042230 4534196 3521718 3858287 6241835 8314133 7610034 5074718
39240 5074718 3558548 3843781 4439128 4523497 4533124 4229146 2920807 1644175 2322870
39231 2322870 4340253 4793412 2981166 1734957 2964653 4775492 4930920 4414661 4903686
39222 4903686 5058808 2736311 -578813 -1282647 867423 2359258 1318834 -25626
39214 -25626 682053 2322091 2356067 525274 -1285582 -1658918 -610534 1179939 2768516
39205 2768516 3153630 2228155 1224105 1394266 2511712 3285958 2999325 2213217 1984558
39196 1984558 2614888 3056779 1787436 -1161921 -3376583 -2393109 1057300 3436184 2512171
$$ packed form
39259C174009P35725P9118j80333J12398L31669N32579R25197Q45834j21626r02139
39249E532431n19386K9185n08034j012478L36569K383548K072298p04099k535316
39240E074718j516170K85233N95347Q4369R627l03978j308339j276632O78695
39231B322870K017383M53159j812246j246209J229696J810839J55428n16259M89025
39222D903686J55122k322497l315124p03834K150070J491835j040424j344460
39214b5626P07679J640038L3976j830793j810856l73336J048384J790473J588577
39205B768516L85114r25475j004050J70161J117446P74246k86633p86108k28659
39196A984558O30330M41891j269343k949357k214662R83474L450409K378884r24013
$$ plain form
39187 2512171 -126563 -1404697 -441711 1187011 1999266 2065202 2209490 2873954 3827185
39178 3827185 4361414 3822746 2309275 563169 -1018725 -2529176 -3363889 -2165687 898972
39169 898972 2924467 1192309 -3054013 -5646361 -4402042 -1219898 1021947 1679281
39161 1679281 1608624 1191634 676638 1033747 2501166 3198436 1353591 -1516324 -1980164
39152 -1980164 583099 2948408 2497033 547809 -121713 729276 1199237 478103 -401503
39143 -401503 -556397 -122537 690382 1758119 2377428 2086576 2052888 3776079 6240136
39134 6240136 6431511 3417208 17638 -676464 1126618 3044469 3752772 3586552 3026550
39125 3026550 2258730 1683233 1527561 1375696 1042652 1192334 2061374 2510787 1688994
$$ packed form
39187B512171k638734j278134R62986J628722Q12255O5936J44288O64464R53231
39178C827185N34229n38668j513471j746106j581894j510451q34713J198202L064659
39169H98972K025495j732158m246322k592348J244319L182144K241845O57334
39161A679281p0657m16990n14996L57109J467419O97270j844845k869915m63840
39152a980164K563263K365309m51375j949224o69522Q50989M69961p21134q79606
39143d01503j54894M33860Q12919J067737O19309k90852l3688J723191K464057
39134F240136J91375l014303l399570o94102J803082J917851P08303j66220n60002
39125C026550p67820n75497j55672j51865l33044J49682Q69040M49413q21793
$$ plain form
39116 1688994 767383 1418506 3201783 4155082 3561939 2418849 1420603 264975 -1003500
39107 -1003500 -1591740 -1158764 -189588 847918 1569631 1202258 -486553 -2014209 -1566728
39098 -1566728 534923 2355412 3121709 3607991 3908207 3109439 1491711 745645 1330147
39089 1330147 1769070 1346811 1279086 2191099 2713493 1990084 1441139 2299077 3305216
39080 3305216 2875919 1964065 2533335 4325275 5332363 4697937 3166497 1378806 -293645
39071 -293645 -809920 595841 2792430 3850346 3519007 3005857 2740813 2229189 1816680
39062 1816680 2474626 3666116 3431768 1166843 -1288416 -1947414 -759520 1109534 2802807
39053 2802807 3943963 4345328 4237953 4101162 3867812 2975785 1440679 131077 -234551
$$ packed form
39116A688994r21611O51123J783277R53299n93143j143090r98246j155628j268475
39107a003500n88240M32976R69176J037506P21713l67373j688811j527656M47481
39098a566728K101651J820489P66297M86282L00216p98768j617728p46066N84502
39089A330147M38923m22259o7725R12013N22394p23409n48945Q57938J006139
39080C305216m29297r11854N69270J791940J007088o34426j531440j787691j672451
39071b93645n16275J405761K196589J057916l31339n13150k65044n11624m12509
39062A816680O57946J191490k34348k264925k455259o58998J187894J869054J693273
39053B802807J141156M01365j07375j36791k33350q92027j535106j309602l65628
$$ plain form
39044 -234551 328817 1524874 2943739 3734126 3159516 1752034 933086 1141599 1299032
39035 1299032 561420 -396509 -531680 -39793 101177 -248745 -159864 973926 2467095
39026 2467095 3025515 2125561 480046 -775515 -1079359 -545861 509890 1670620 2333183
39017 2333183 2285215 2260369 3006546 3848553 3424498 2039297 1695481 3137428 4611727
39008 4611727 4710120 4627398 5821253 7096222 6485751 4899091 4969094 6678686 7199448
38999 7199448 5437162 3847853 4705461 6958271 8162383 7702554 6707784 6192298 6531144
38990 6531144 7624225 8566654 8233401 6919047 6108898 6016493 5103096 3004601 1896913
38981 1896913 3283320 5221357 4957886 3025975 2205717 3155042 3803247 3090085 2627222
$$ packed form
39044b34551N63368J196057J418865P90387n74610j407482q18948K08513J57433
39035A299032p37612r57929j35171M91887J40970l49922Q8881J133790J493169
39026B467095N58420q99954j645515j255561l03844N33498J055751J160730O62563
39017B333183m7968k4846P46177Q42007m24055j385201l43816J441947J474299
39008D611727R8393q2722J193855J274969o10471j586660P0003J709592N20762
38999G199448j762286j589309Q57608K252810J204112m59829r94770n15486L38846
38990F531144J093081R42429l33253j314354q10149r2405r13397k098495j107688
38981A896913J386407J938037k63471j931911q20258R49325O48205p13162m62863
$$ plain form
38972 2627222 3743318 4981056 4085366 1400102 -259199 1041232 4127784 6114667
38964 6114667 5601946 4063613 3910905 5510685 6792499 5902104 3419305 1459910 1334211
38955 1334211 2813466 5009137 6940484 7645713 6899695 5808190 5747177 6643628 7101469
38946 7101469 6240647 4556143 2873904 1411414 219722 -312246 -21161 510841 648359
38937 648359 599996 1010209 1824811 2228044 1805071 1160884 1030818 1262507 1296089 1359169
38927 1359169 2260901 3862016 4752082 4048289 2681868 2045534 2096891 1937120 1678934
38918 1678934 2266110 3663484 4776955 5178426 5294447 4768540 2592505 -528854 -1987275
38909 -1987275 -655467 1255751 1188990 -418642 -1469148 -1504012 -1590640 -1847891 -1355623
$$ packed form
38972B627222J116096J237738q95690k685264j659301J300431L086552J986883
38964F114667n12721j538333j52708J599780J281814q90395k482799j959395j25699
38955A334211J479255K195671J931347P05229p46018j091505o1013Q96451M57841
38946G101469q60822j684504j682239j462490j191692n31968K91085N32002J37518
38937F48359m8363M10213Q14602M03233m22973o44187j30066K31689L3582O3080
38927A359169R01732J601115Q90066p03793j366421o36334N1357j59771k58186
38918A678934N87176J397374J113471M01471J16021n25907k176035l121359j458421
38909a987275J331808J911218o6761j607632j050506l4864q6628k57251M92268
$$ plain form
38900 -1355623 -164046 672982 943892 1285200 1466015 632018 -686255 -883328 28085
38891 28085 112243 -1296775 -1977363 341592 4794686 8245173 8516367 5900465 2311897
38882 2311897 -138846 -366518 1018080 2448973 2987017 2676138 1617642 -27116 -1102789
38873 -1102789 -250719 1834511 2707239 1601320 695881 1638013 2734839 1682355 -437931
38864 -437931 -595896 1459438 2775141 1637678 -219315 -691550 -368263 -1128763 -3164058
38855 -3164058 -4920765 -5254184 -4410012 -3253588 -2427003 -2072498 -1831233 -1291225 -645644
38846 -645644 -486342 -838044 -1091928 -1113820 -1560009 -2663742 -3567965 -3465449 -2639857 -1757310
38836 -1757310 -958113 -430109 -990593 -2943139 -4944201 -5266502 -3896752 -2227257 -974956
$$ packed form
38900a355623J191577Q37028K70910L41308J80815q33997j318273j97073R11413
38891B8085Q4158j409018o80588K318955M453094L450487K71194k615902l588568
38882B311897k450743k27672J384598J430893N38044l10879j058496j644758j075673
38873a102789Q52070K085230Q72728j105919r05439R42132J096826j052484k120286
38864d37931j57965K055334J315703j137463j856993m72235L23287p60500k035295
38855c164058j756707l33419Q44172J156424Q26585L54505K41265N40008O45581
38846f45644J59302l51702k53884k1892m46189j103733r04223J02516Q25592Q82547
38836a757310P99197N28004n60484j952546k001062l22301J369750J669495J252301
$$ plain form
38827 -974956 207598 1104305 537132 -1770212 -4096813 -4386160 -2441846 106402 1532096
38818 1532096 1259419 -104294 -1463458 -2196289 -2592676 -3012450 -2820795 -1099923 1518337
38809 1518337 3025935 2632294 1918316 2415146 3240954 2673685 1228411 1168492 3039392
38800 3039392 4670379 4253738 2859301 2869565 4918965 7419525 8509274 7590074 5416753
38791 5416753 3529355 3295431 4711393 6273894 6623170 6079128 5920493 6446559 6659207
38782 6659207 5856335 4594843 3749228 3403325 3225753 3353997 4119733 5078190 5086650 3603696
38772 3603696 1486604 154704 119830 663833 985130 1314966 2509263 4558545 6073781
38763 6073781 5790774 4312723 3515739 4089230 4666787 4039436 3201006 3825380 5316249
$$ packed form
38827i74956J182554Q96707n67173k307344k326601k89347J944314K548248J425694
38818A532096k72677j363713j359164p32831l96387m19774J91655J720872K618260
38809A518337J507598l93641p13978M96830Q25808n67269j445274n9919J870900
38800C039392J630987m16641j394437J0264K049400K500560J089749r19200k173321
38791E416753j887398k33924J415962J562501L49276n44042j58635N26066K12648
38782F659207q02872j261492q45615l45903j77572J28244P65736R58457Q460j482954
38772C603696k117092j331900l4874N44003L21297L29836J194297K049282J515236
38763F073781k83007j478051p96984N73491N77557o27351q38430O24374J490869
$$ plain form
38754 5316249 5329039 3419911 2023762 2746985 3744731 2753039 1122472 1996335 5120422
38745 5120422 6701999 4915437 2463559 2292126 3495399 3617568 2814513 2910651 3660086
38736 3660086 3046532 925383 -505272 -117990 760486 938333 1047192 1743890 2238971
38727 2238971 1837206 1347268 1640740 2064037 1600717 611360 116187 109080 -199259 -1040599
38717 -1040599 -2036070 -2892988 -3176997 -2102085 249672 2090151 1724313 -66195 -849653
38708 -849653 220528 1383908 877139 -658342 -1194261 -36694 1424521 1584571 506074
38699 506074 -386389 -119347 899441 1823914 2533582 3222742 3358837 2202753 370342
38690 370342 -398320 464115 1387472 773061 -853852 -1757849 -1318600 -344793 411264
$$ packed form
38754E316249J2790j909128j396149P23223R97746r91692j630567Q73863L124087
38745E120422J581577j786562k451878j71433J203273J22169q03055R6138P49435
38736C660086o13554k121149j430655L87282Q78476J77847J08859O96698M95081
38727B238971m01765m89938K93472M23297m63320r89357m95173p107l08339q41340
38717a040599r95471q56918k84009J074912K351757J840479l65838j790508p83458
38708h49653J070181J163380n06769j535481n35919J157567J461215J60050j078497
38699E06074q92463K67042J018788R24473P09668O89160J36095j156084j832411
38690C70342p68662Q62435R23357o14411j626913r03997M39249R73807P56057
$$ plain form
38681 411264 871778 1022909 807041 577512 715768 824914 187819 -988523 -1659014
$$ packed form
38681D11264M60514J51131k15868k29529J38256J09146o37095j176342o70491
$$ [...]
##END NTUPLES=NMR SPECTRUM
##END=
