##TITLE=31Pdec_SR114_LF
 , 24 sc
 1.4.2022
##JCAMPDX= 6.0         $$ Bruker NMR JCAMP-DX V2.0
##DATA TYPE= NMR SPECTRUM
##DATA CLASS= NTUPLES
##ORIGIN= UXNMR, Bruker Analytische Messtechnik GmbH
##OWNER= root
$$ XWIN-NMR		Version 3.5
$$ Fri Apr  1 11:53:27 2022 Russian Standard Time (UT+4h)  she@DPX200
##.OBSERVE FREQUENCY= 81.013821
##.OBSERVE NUCLEUS= ^31P
##.ACQUISITION MODE= SIMULTANEOUS
##.ACQUISITION SCHEME= undefined
##.AVERAGES= 24
##.DIGITISER RES= 16
##SPECTROMETER/DATA SYSTEM= spect
##.PULSE SEQUENCE= zgpg30
##.SOLVENT NAME= D2O
##.SHIFT REFERENCE= (INTERNAL, D2O, 0, 248.564)
##AUDIT TRAIL= $$ (NUMBER, WHEN, WHO, WHERE, WHAT)
$$ ##TITLE= Audit trail, XWIN-NMR		Version 3.5
$$ ##JCAMPDX= 5.01
$$ ##ORIGIN= Bruker BioSpin GmbH
$$ ##OWNER= she
$$ F:/spectra/data/she/nmr/P31/1/pdata/1/auditp.txt
$$ ##AUDIT TRAIL=  $$ (NUMBER, WHEN, WHO, WHERE, WHAT)
(   1,<2022-04-01 11:52:03.06 +0400>,<she>,<DPX200>,
      <created by zg, POWCHK disabled, PULCHK disabled
       configuration hash MD5:
       00 E9 B6 7A A2 85 ED C7 34 08 36 98 17 FE 4E 26
       data hash MD5: 32K
       F5 4B 67 40 E7 65 91 00 A1 6A 3D C3 35 2B 4C EF>)
(   2,<2022-04-01 11:52:19.62 +0400>,<she>,<DPX200>,
      <Start of raw data processing
       efp BC_mod = 2 LB = 1 FT_mod = 6 PKNL = 1 PHC0 = -9205.633 PHC1 = 136.8756 SI = 64K 
       data hash MD5: 64K
       79 54 AE CC 1E 25 96 E3 8F 9B D6 F9 EF EE 4D E5>)
(   3,<2022-04-01 11:52:38.85 +0400>,<she>,<DPX200>,
      <pk PHC0 = -165.0499 PHC1 = 0 
       data hash MD5: 64K
       93 22 59 73 2E D1 EB 5C 00 66 81 A3 22 36 95 CC>)
$$ ##END=
$$ 
$$ hash MD5
$$ 45 09 AE 84 FE BF E4 81 A4 8E 48 3A D8 4A 8C B7
##$RELAX= 
##$RELAX= 
##$RELAX= 
##$RELAX= 
##$RELAX= 
##$RELAX= 
##$RELAX= 
##$RELAX= 
$$ Bruker specific parameters
$$ --------------------------
##$DU= <F:/spectra>
##$EXPNO= 1
##$NAME= <P31>
##$PROCNO= 1
##$TYPE= <nmr>
##$USER= <she>
##$AMP= (0..31)
100 100 100 100 100 100 100 100 100 100 100 100 100 100 100 100 100 100 
100 100 100 100 100 100 100 100 100 100 100 100 100 100 
##$AQSEQ= 0
##$AQ_mod= 1
##$AUNM= <au_zg>
##$AUTOPOS= <>
##$BF1= 81.014009
##$BF2= 200.13
##$BF3= 200.13
##$BF4= 200.13
##$BF5= 200.13
##$BF6= 200.13
##$BF7= 200.13
##$BF8= 200.13
##$BYTORDA= 1
##$CFDGTYP= 0
##$CFRGTYP= 5
##$CHEMSTR= <none>
##$CNST= (0..31)
1 1 145 1 1 1 1 1 1 1 1 1 1 1 1 1 1 1 1 1 1 1 1 1 1 1 1 1 1 1 1 1 
##$CPDPRG= <waltz16>
##$CPDPRG1= <>
##$CPDPRG2= <waltz16>
##$CPDPRG3= <>
##$CPDPRG4= <mlev>
##$CPDPRG5= <mlev>
##$CPDPRG6= <mlev>
##$CPDPRG7= <mlev>
##$CPDPRG8= <mlev>
##$CPDPRGB= <>
##$CPDPRGT= <>
##$D= (0..31)
0 1 0 0 0 0 0 0 0 0 0 0.03 2e-05 3e-06 0 0 0 0 0 0 0 0 0 0 0 0 0 0 0 0 
0 0 
##$DATE= 1648799522
##$DBL= (0..7)
120 120 120 11 120 120 24 19 
##$DBP= (0..7)
150 150 150 150 150 150 150 150 
##$DBP07= 0
##$DBPNAM0= <>
##$DBPNAM1= <>
##$DBPNAM2= <>
##$DBPNAM3= <>
##$DBPNAM4= <>
##$DBPNAM5= <>
##$DBPNAM6= <>
##$DBPNAM7= <>
##$DBPOAL= (0..7)
0.5 0.5 0.5 0.5 0.5 0.5 0.5 0.5 
##$DBPOFFS= (0..7)
0 0 0 0 0 0 0 0 
##$DE= 6
$$ [...]
##$SUBNAM2= <"">
##$SUBNAM3= <"">
##$SUBNAM4= <"">
##$SUBNAM5= <"">
##$SUBNAM6= <"">
##$SUBNAM7= <"">
##$SUBNAM8= <"">
##$SUBNAM9= <"">
##$SW= 501.771253377433
##$SWIBOX= (0..15)
0 1 3 0 0 0 0 0 0 0 0 0 0 0 0 0 
##$SW_h= 40650.406504065
##$TD= 32768
##$TD0= 1
##$TE= 0
##$TE2= 300
##$TE3= 300
##$TEG= 300
##$TL= (0..7)
0 120 53 12 22 120 120 120 
##$TP= (0..7)
150 150 150 150 150 150 150 150 
##$TP07= 0
##$TPNAME0= <>
##$TPNAME1= <>
##$TPNAME2= <>
##$TPNAME3= <>
##$TPNAME4= <>
##$TPNAME5= <>
##$TPNAME6= <>
##$TPNAME7= <>
##$TPOAL= (0..7)
0.5 0.5 0.5 0.5 0.5 0.5 0.5 0.5 
##$TPOFFS= (0..7)
0 0 0 0 0 0 0 0 
##$TUNHIN= 0
##$TUNHOUT= 0
##$TUNXOUT= 0
##$USERA1= <user>
##$USERA2= <user>
##$USERA3= <user>
##$USERA4= <user>
##$USERA5= <user>
##$V9= 5
##$VALIST= <valist>
##$VCLIST= <CCCCCCCCCCCCCCC>
##$VD= 0
##$VDLIST= <DDDDDDDDDDDDDDD>
##$VPLIST= <PPPPPPPPPPPPPPP>
##$VTLIST= <TTTTTTTTTTTTTTT>
##$WBST= 1024
##$WBSW= 4
##$XGAIN= (0..3)
0 0 0 0 
##$XL= 0
##$YL= 0
##$YMAX_a= 3437
##$YMIN_a= -2028
##$ZGOPTNS= <>
##$ZL1= 120
##$ZL2= 120
##$ZL3= 120
##$ZL4= 120
##$ABSF1= 0
##$ABSF2= 0
##$ABSG= 0
##$ABSL= 0
##$ALPHA= 0
##$AQORDER= 0
##$ASSFAC= 0
##$ASSFACI= 0
##$ASSFACX= 0
##$ASSWID= 0
##$AUNMP= <proc_1d>
##$AZFE= 0.1
##$AZFW= 0.5
##$BCFW= 0
##$BC_mod= 2
##$BYTORDP= 0
##$COROFFS= 0
##$CY= -3
##$DATMOD= 1
##$DC= 0
##$DFILT= <>
##$DTYPP= 0
##$F1P= 0
##$F2P= 0
##$FCOR= 1
##$FTSIZE= 65536
##$FT_mod= 6
##$GAMMA= 0
##$GB= 0
##$INTBC= 1
##$INTSCL= 5.30512e-09
##$ISEN= 30
##$LB= 1
##$LEV0= 0
##$LPBIN= 0
##$MAXI= 10000
##$MC2= 0
##$MEAN= 0
##$ME_mod= 0
##$MI= 50
##$NCOEF= 0
##$NC_proc= -9
##$NLEV= 6
##$NOISF1= 182.463
##$NOISF2= 159.3651
##$NSP= 0
##$NTH_PI= 0
##$NZP= 0
##$OFFSET= 248.5645
##$PC= 4
##$PHC0= -9370.683
##$PHC1= 136.8756
##$PH_mod= 1
##$PKNL= yes
##$PPARMOD= 0
##$PSCAL= 0
##$PSIGN= 0
##$REVERSE= no
##$SF= 81.014009
##$SI= 65536
##$SIGF1= 159.3651
##$SIGF2= -187.1042
##$SINO= 113.3802
##$SIOLD= 16384
##$SREGLST= <1H.CDCl3>
##$SSB= 0
##$STSI= 65536
##$STSR= 0
##$SW_p= 40650.406504065
##$SYMM= 0
##$S_DEV= 0
##$TDeff= 32768
##$TDoff= 0
##$TI= <>
##$TILT= no
##$TM1= 0
##$TM2= 0
##$TOPLEV= 0
##$USERP1= <user>
##$USERP2= <user>
##$USERP3= <user>
##$USERP4= <user>
##$USERP5= <user>
##$WDW= 1
##$XDIM= 65536
##$YMAX_p= 421787194
##$YMIN_p= -110559181
$$ End of Bruker specific parameters
$$ ---------------------------------
##NTUPLES= NMR SPECTRUM
##VAR_NAME=  FREQUENCY,     SPECTRUM/REAL,   SPECTRUM/IMAG
##SYMBOL=    X,             R,               I
##VAR_TYPE=  INDEPENDENT,   DEPENDENT,       DEPENDENT
##VAR_FORM=  AFFN,          ASDF,            ASDF
##VAR_DIM=   65536,         65536,           65536
##UNITS=     HZ,            ARBITRARY UNITS, ARBITRARY UNITS
##FACTOR=    0.620285442955139, 1,           1
##FIRST=     20137.2065510759, 0,            0
##LAST=      -20513.1999529892, 0,           0
##MIN=       -20513.1999529892, -110559181,  0
##MAX=       20137.2065510759, 421787194,    0
$$ Real data points
##PAGE= N=1
##DATA TABLE= (X++(R..R)), XYDATA
$$ [...]
$$ plain form
44316 -250882 2292676 3582957 2757085 1422532 726384 8872 -1142240 -1717244 -1139336
44307 -1139336 -523021 -913023 -1619139 -1508718 -902954 -891426 -1418588 -1370149 -440145 168080
44297 168080 -713716 -2497814 -3263111 -2050475 -294143 -276344 -2191766 -3688537 -2730189
44288 -2730189 22940 2357714 3108310 2691824 1879979 1173353 812717 390127 -894931
44279 -894931 -2606510 -2695485 -195893 2619275 2618866 -210949 -3038213 -3960411 -3470634
44270 -3470634 -2509331 -1446965 -1147556 -2600656 -4805781 -5150898 -2811425 37598 1252946
44261 1252946 1127064 758052 -49930 -1689819 -3029693 -2645937 -1041699 -69792 -513893
44252 -513893 -1452842 -1767753 -1286928 -571592 -283758 -655104 -1166006 -1021576 -211315 387513
$$ packed form
44316b50882K543558J290281q25872j334553o96148p17512j151112n75004N77908
44307a139336O16315l90002p06116J10421O05764J1528n27162M8439R30004O08225
44297A68080q81796j784098p65297J212636J756332J7799j915422j496771R58348
44288b730189K753129K334774P50596m16486q11845p06626l60636m22590j285058
44279h94931j711579q8975K499592K815168m09k829815k827264r22198M89777
44270c470634R61303J062366K99409j453100k205125l45117K339473K849023J215348
44261A252946j25882l69012q07982j639889j339874L83756J604238R71907m44101
44252e13893r38949l14911M80825P15336K87834l71346n10902J44430Q10261N98828
$$ plain form
44242 387513 254701 -38040 234427 861243 1109126 842214 665773 1045248 1612302 1465331
44232 1465331 274572 -962155 -808347 695275 1759185 1117646 -250222 -624754 52692
44223 52692 572384 536465 452523 219097 -733813 -2006202 -2661689 -2958916 -3863147 -4953509
44213 -4953509 -4815765 -3571356 -2852970 -2967271 -2348417 -429975 1210582 1467302 1307335
44204 1307335 1662121 1770810 948945 163814 404878 1076726 1359660 1595626 1999449
44195 1999449 1687170 508496 136403 1505594 2701554 1493780 -1218299 -2652013
44187 -2652013 -1961970 -697181 -81015 39275 -163876 -886472 -1657141 -1564039 -745433
44178 -745433 -437195 -1389580 -3109073 -4545140 -4781497 -3486733 -1562453 -794060 -1824925
$$ packed form
44242C87513j32812k92741K72467O26816K47883k66912j76441L79475N67054j46971
44232A465331j190759j236727J53808J503622J063910o41539j367868l74532O77446
44223E2692N19692l5919q3942k33426r52910j272389o55487k97227r04231j090362
44213d953509J37744J244409P18386j14301O18854J918442J640557K56720j59967
44204A307335L54786J08689q21865p85131K41064O71848K82934K35966M03823
44195A999449l12279j178674l72093J369191J195960j207774k712079j433714
44187b652013O90043J264789O16166J20290k03151p22596p70669R3102Q18606
44178g45433L08238r52385j719493j436067k36357J294764J924280P68393j030865
$$ plain form
44169 -1824925 -3005460 -2358397 -163444 1648293 2239549 2569327 3374250 3773213 2401281
44160 2401281 -658181 -3507703 -4110798 -2533098 -1220569 -2241892 -4473284 -4896040
44152 -4896040 -2801965 -893734 -1483167 -3454195 -4268569 -3355702 -1914853 -692884 251405
44143 251405 548954 39291 -404108 -69239 274025 -381183 -1532755 -2074074 -2083367 -2261628
44133 -2261628 -2464182 -2254320 -1960546 -1675173 -349109 2327124 4309630 3611931 1417114
44124 1417114 524378 1395219 2042604 1284939 -243160 -1879955 -3325647 -3545468 -1726481
44115 -1726481 783083 1800362 1388881 1260756 1480688 626202 -844986 -651482 1309750
44106 1309750 2214481 642496 -1335049 -1804947 -1845010 -2805995 -3404188 -2033645 -20550
$$ packed form
44169a824925j180535O47063K194953J811737N91256L29778Q04923L98963j371932
44160B401281l059462k849522o03095J577700J312529j021323k231392m22756
44152d896040K094075J908231n89433j971028q14374R12867J440849J221969R44289
44143B51405K97549n09663m43399L34869L43264o55208j151572n41319r293j78261
44133b261628k02554K09862K93774K85373J326064K676233J982506o97699k194817
44124A417114q92736Q70841O47385p57665j528099j636795j445692k19821J818987
44115a726481K509564J017279m11481j28125K19932q54486j471188J93504J961232
44106A309750R04731j571985j977545m69898m0063r60985n98193J370543K013095
$$ plain form
44097 -20550 211313 -931140 -814073 1324348 3242136 2825558 593026 -1339313 -1608645
44088 -1608645 -505211 740187 1202691 1055553 1155048 1785526 2159209 1373173 -462386
44079 -462386 -2241321 -2780193 -1782921 -229406 431583 -48635 -287705 770183 2070847
44070 2070847 1813545 157388 -959553 -611354 105977 35670 -643389 -1370624 -2048243
44061 -2048243 -2367977 -1682688 -253763 571466 157921 -458801 -67147 1183528 2319674
44052 2319674 2782160 2637240 2278427 2217128 2482796 2235250 825541 -1003068 -2103296
44043 -2103296 -2669164 -3415483 -3511887 -1589172 1256664 2122615 512740 -808321 -188138
44034 -188138 447302 -901608 -2947300 -3453356 -2760161 -2437682 -2164111 -778031 773470
$$ packed form
44097b0550K31863j142453J17067K138421J917788m16578k232532j932339k69332
44088a608645J103434J245398M62504j47138R9495O30478L73683p86036j835559
44079d62386j778935n38872R97272J553515O60989m80218k39070J057888J300664
44070B070847k57302j656157j116941L48199P17331p0307o79059p27235o77619
44061b048243l19734O85289J428925Q25229m13545o16722L91654J250675J136146
44052B319674M62486j44920l58813o1299K65668k47546j409709j828609j100228
44043b103296n65868p46319r6404J922715K845836Q65951j609875j321061O20183
44034a88138O35440j348910k045692n06056O93195L22479K73571J386080J551501
$$ plain form
44025 773470 532133 -1016460 -1471657 -411452 -56695 -1691250 -3844541 -4765482 -4626104
44016 -4626104 -4268949 -3497482 -1912389 -294672 171643 -497518 -1243130 -1371552 -1040703
44007 -1040703 -619899 -320616 -405796 -1075876 -1947417 -2194257 -1628418 -1223555 -1851546 -2693716
43997 -2693716 -1975559 439164 2405177 2231400 840271 -67264 -751280 -2325641 -3806965
43988 -3806965 -3038987 -612217 36741 -2614204 -5846720 -6543827 -5148421 -4032824 -3815298
43979 -3815298 -3425531 -2503881 -1572083 -633057 527636 1311252 1202516 934874 1171954
43970 1171954 976261 -511984 -1765589 -585471 2270950 3634151 2259829 332420
43962 332420 44475 749375 614251 -465541 -1054215 -527954 61605 -513720 -1962105
$$ packed form
44025G73470k41337j548593m55197J060205L54757j634555k153291r20941J39378
44016d626104L57155P71467J585093J617717M66315o69161p45612j28422L30849
44007a040703M20804K99283q5180o70080q71541k46840N65839M04863o27991q42170
43997b693716P18157K414723J966013j73777j391129r07535o84016j574361j481324
43988c806965P67978K426770O48958k650945l232516o97107J395406J115597K17526
43979c815298L89767R21650R31798R39026J160693P83616j08736k67642K37080
43970A171954j95693j488245j253605J180118K856421J363201j374322j927409
43962C32420k87945P04900j35124j079792n88674N26261N89559n75325j448385
$$ plain form
43953 -1962105 -2567826 -1037025 1830719 3754609 3490564 2160648 1580680 1914597 1847780
43944 1847780 697230 -647066 -941560 -123204 549416 -189394 -1977444 -2755388 -1140171
43935 -1140171 1314494 1650341 -467232 -2053891 -944995 1320990 2195245 1809706 1843569
43926 1843569 2164778 1294529 -419107 -798722 856713 2635125 2562799 681686 -1587547
43917 -1587547 -2743577 -1938976 188695 1692569 1688809 1787198 3302430 4159285 1556340
43908 1556340 -2802988 -3911497 -565562 2494504 1253495 -2191609 -3481797 -2339962
43900 -2339962 -1616282 -1895188 -1083847 1086538 1978417 208751 -2195338 -3166003 -3622818
43891 -3622818 -5178987 -6631829 -5356724 -1669395 748351 -583568 -3802723 -5286423
$$ packed form
43953a962105o05721J530801K867744J923890k64045j329916n79968L33917o6817
43944A847780j150550j344296k94494Q18356O72620p38810j788050p77944J615217
43935a140171K454665L35847k117573j586659J108896K265985Q74255l85539L3863
43926A843569L21209q70249j713636l79615J655435J778412p2326j881113k269233
43917a587547j156030Q04601K127671J503874l760R8389J515232Q56855k602945
43908A556340m359328j108509L345935L060066j241009l445104j290188J141835
43900b339962P23680k78906Q11341K170385Q91879j769666k404089r70665m56815
43891c622818j556169j452842J275105L687329K417746j331919l219155j483700
$$ plain form
43883 -5286423 -4060813 -2079933 -913290 -166666 720764 1089079 363595 -712534 -1308475
43874 -1308475 -1850005 -2865070 -3470833 -2605419 -1196034 -1400993 -3763333 -6522470 -7779886
43865 -7779886 -7098348 -4965384 -2052847 667588 2192733 2324357 1595632 379811 -1118254
43856 -1118254 -2154075 -1841258 -349763 1258210 2430718 3409688 4145990 4034940 2903042
43847 2903042 1332918 -115026 -1211586 -1683642 -1421323 -931114 -735240 -641364 -487045
43838 -487045 -901808 -2013871 -2231569 -219410 2468461 2999300 1318360 127745 650350
43829 650350 1094860 53888 -1225403 -1253109 -674101 -645274 -767401 -374431 -284124 -1407608
43819 -1407608 -2795432 -2842588 -1621478 -511955 -200003 -348703 -639413 -978818 -1139337
$$ packed form
43883e286423J225610J980880J166643P46624Q87430L68315p25484j076129n95941
43874a308475n41530j015065o05763Q65414J409385k04959k362340k759137j257416
43865g779886O81538K132964K912537K720435J525145J31624p28725j215821j498065
43856a118254j035821L12817J491495J607973J172508R78970P36302j11050j131898
43847B903042j570124j447944j096560m72056K62319M90209J95874R3876J54319
43838d87045m14763j112063k17698K012159K687871N30839j680940j190615N22605
43829F50350M44510j040972j279291k7706N79008K8827j22127L92970R0307j123484
43819a407608j387824m7156J221110J109523L11952j48700k90710l39405j60519
$$ plain form
43810 -1139337 -1020581 -774294 -267795 696708 1365234 570755 -1277091 -2309463 -1898541
43801 -1898541 -1493791 -2024149 -2432756 -1794541 -801164 71722 1581578 3358074 3037455
43792 3037455 -54921 -2695311 -1947471 405296 627785 -1406168 -2762080 -2400734 -2039195
43783 -2039195 -2539931 -2803679 -2305039 -1840022 -1599019 -986388 -303953 -238817 120 1493239
43773 1493239 3041027 2662975 1245811 1463780 3239112 3792901 2365606 1152366 1014936
43764 1014936 216856 -1509032 -1667207 513622 2103926 1168859 -95059 524568 1349151
43755 1349151 110736 -1729686 -1470463 267061 1047547 921058 1563787 2477875 1842447
43746 1842447 407983 803084 3065353 4272071 2958137 901399 -77206 -412803 -1010326
$$ packed form
43810a139337J18756K46287N06499R64503O68526p94479j847846j032372M10922
43801a898541M04750n30358m08607O38215R93377Q72886J509856J776496l20619
43792C037455l092376k640390P47840K352767K22489k033953j355912L61346L61539
43783b039195n00736k63748M98640M65017K41003O12631O82435O5136K38937J493119
43773A493239J547788l78052j417164K17969J775332N53789j427295j213240j37430
43764A014936p98080j725888j58175K180829J590304r35067j263918O19627Q24583
43755A349151j238415j840422K59223J737524P80486j26489O42729R14088o35428
43746A842447j434464L95101K262269J206718j313934k056738r78605l35597n97523
$$ plain form
43737 -1010326 -1334475 -360696 1939222 4679132 6598814 6520033 4488982 2270797 1400778
43728 1400778 1205773 320116 -553727 374395 2576641 3335615 1589136 -681946 -1507567
43719 -1507567 -1266738 -1223198 -1645327 -2289127 -3112034 -3606474 -2834061 -914597 768343
43710 768343 1407020 1518120 1477561 861768 -241599 -889844 -892286 -1182720 -1949575 -2059281
43700 -2059281 -1087832 -217175 -216987 -203886 617879 1615503 2110421 2415552 2488804 1431762
43690 1431762 -434834 -1001378 504345 1710868 336312 -2452637 -3978196 -3785264
43682 -3785264 -3168862 -2388901 -925316 517048 862137 780578 1470855 2095009 1127384
43673 1127384 -402754 -104921 1555731 1564172 -677176 -1983487 -195612 2488481 2720076
$$ packed form
43737a010326l24149R73779K299918K739910J919682p8781k031051k218185q70019
43728A400778j95005q85657q73843R28122K202246P58974j746479k271082q25621
43719a507567K40829M3540m22129o43800q22907m94440P72413J919464J682940
43710G68343O38677J11100m0559o15793j103367o48245k442k90434p66855j09706
43700b059281R71449Q70657J88J3101Q21765R97624M94918L05131P3252j057042
43690A431762j866596n66544J505723J206523j374556k788949j525559J92932
43682c785264O16402P79961J463585J442364L45089q1559O90277O24154r67625
43673A127384j530138K97833J660652Q441k241348j306311J787875K684093K31595
$$ plain form
43664 2720076 400146 -1957398 -2702678 -2118722 -1069930 -170525 246990 396802 829355
43655 829355 1408178 1256715 220894 -543163 -59949 1183982 1958850 1576832 208679
43646 208679 -1214900 -1316990 379706 2277048 2176461 151293 -1495432 -1440233 -865653
43637 -865653 -1230795 -2188799 -2557818 -1916399 -435273 1480237 2680347 1953067 -3518
43628 -3518 -897835 73256 1228229 1334305 1420445 2382790 2974252 1972837 446282 -87109
43618 -87109 16348 26491 716188 2316033 2521546 -374723 -3779890 -3664081 -345865
43609 -345865 2028134 1435804 -74759 -490793 -351484 -405047 10901 973564 1054086 -192831
43599 -192831 -1087753 -546183 142211 -325089 -1060306 -718622 242005 698423 872519 1501662
$$ packed form
43664B720076k319930k357544p45280N83956J048792Q99405M17515J49812M32553
43655H29355N78823j51463j035821p64057M83214J243931P74868l82018j368153
43646B08679j423579j02090J696696J897342j00587k025168j646725N5199N74580
43637h65653l65142r58004l69019O41419J481126J915510J200110p27280j956585
43628c518q94317R71091J154973J06076Q6140R62345N91462j001415j526555n33391
43618h7109J03457J0143O89697J599845K05513k896269l405167J15809L318216
43609c45865K373999n92330j510563m16034J39309n3563M15948R62663Q0522j246917
43599a92831q94922N41570O88394m67300p35217L41684R60627M56418J74096O29143
$$ plain form
43589 1501662 2061587 1484020 -29427 -1317672 -1902955 -2210650 -2598048 -3077840 -3568293
43580 -3568293 -3690043 -2817744 -966329 885153 1829393 1813761 1127261 -8975 -978599
43571 -978599 -922460 126126 1186588 1763336 2169247 2071676 309981 -2986073 -5631328
43562 -5631328 -5927632 -4670248 -3390267 -1989806 249812 2515074 3364515 3128151 3328931
43553 3328931 3936409 3254074 811126 -1496235 -1906292 -1033424 -612186 -934542 -722917
43544 -722917 721823 2307299 2433778 928264 -898142 -1973916 -2490257 -2907390 -2773984
43535 -2773984 -1442263 505630 1674502 1581323 900317 87899 -998102 -2047779 -2232972
43526 -2232972 -1517992 -821269 -598237 -518181 -689766 -1617758 -2654108 -2345149 -859624
$$ packed form
43589A501662N59925n77567j513447j288245n85283l07695l87398m79792m90453
43580c568293j21750Q72299J851415J851482R44240j5632o86500j136236r69624
43571i78599N6139J048586J060462N76748M05911r7571j761695l296054k645255
43562e631328k96304J257384J279981J400461K239618K265262Q49441k36364K00780
43553C328931O07478o82335k442948k307361m10057Q72868M21238l22356K11625
43544g22917J444740J585476J26479j505514j826406j075774n16341m17133J33406
43535b773984J331721J947893J168872r3179o81006q12418j086001j049677j85193
43526b232972P14980O96723K23032Q0056j71585r27992j036350L08959J485525
$$ plain form
43517 -859624 -62772 -441526 -239119 1259371 2138208 1218662 381921 1195590 1781953
43508 1781953 154934 -1570551 -234258 2679516 2988393 791894 429105 2874260
43500 2874260 3427589 -766950 -5462180 -5164882 -1079943 980811 -1140287 -4032785
43492 -4032785 -4546204 -3461466 -2584952 -1632088 79107 1085352 -595346 -4116554 -6278174
43483 -6278174 -5465540 -3409624 -2399820 -2226586 -1276955 220399 111463 -2249868 -4437099
43474 -4437099 -4037419 -1944063 -943670 -1867165 -2998717 -2957624 -2209392 -1532884 -818131
43465 -818131 -14835 209548 -439476 -1259772 -1696775 -2046421 -2382882 -1954620 -514630
43456 -514630 801394 967091 593589 864860 1616010 1662795 653620 -549008 -1192315
$$ packed form
43517h59624P96852l78754K02407J498490Q78837r19546q36741Q13669N86363
43508A781953j627019j725485J336293K913774L08877k196499l62789K445155
43500B874260N53329m194539m695230K97298M084939K060754k121098k892498
43492d032785n13419J084738Q76514R52864J711195J006245j680698l521208k161620
43483f278174Q12634K055916J009804J73234R49631J497354j08936k361331k187231
43474d437099L99680K093356J000393r23495j131552M1093P48232O76508P14753
43465h18131Q03296K24383o49024q20296m37003l49646l36461M28262J439990
43456e14630J316024J65697l73502K71271P51150M6785j009175j202628o43307
$$ plain form
43447 -1192315 -1363081 -1406020 -1420116 -1392110 -1191631 -402031 1246606 3163655 4091613 3217716
43437 3217716 934734 -1452903 -2629364 -2136738 -749110 83029 -523005 -2162772 -3733136
43428 -3733136 -4510528 -4471184 -3866413 -2906084 -1817823 -927505 -587105 -973200 -1773940
43419 -1773940 -2138529 -1366671 206015 1428682 1659541 1433248 1519496 1818769 1667740
43410 1667740 801494 -594110 -2399228 -4318083 -5336133 -4444222 -2115950 -174469
43402 -174469 234903 -210750 -361990 -212571 -324751 -449296 -40829 279585 -593265 -2051386
43392 -2051386 -2049912 -177464 1348694 891554 -107483 476859 2068992 2680394 2468450
43383 2468450 3178482 4533164 4411693 2904077 2768136 4711811 5582185 3273726 419321
$$ packed form
43447a192315j70766m2939j4096K8006K00479P89600J648637J917049R27958q73897
43437C217716k282982k387637j176461M92626J387628Q32139o06034j639767j570364
43428c733136p77392L9344O04771R60329J088261Q90318L40400l86095q00740
43419a773940l64589P71858J572686J222667K30859k26293Q6248K99273j51029
43410A667740q66246j395604j805118j918855j018050Q91911K328272J941481
43402a74469M09372m45653j51240J49419j12180j24545M08467L20414q72850j458121
43392b051386J474J872448J526158m57140r99037N84342J592133O11402k11944
43383B468450P10032J354682j21471j507616j35941J943675Q70374k308459k854405
$$ plain form
43374 419321 382346 2013240 1844716 -131691 -726779 1050324 2628434 2161381 859715
43365 859715 268457 72259 -292868 -236521 525119 1043376 859214 977699 2008428 2864766
43355 2864766 2452354 1330190 621767 448932 418194 552031 818648 774815 506591 883324
43345 883324 2070371 2823869 2089625 378930 -1120862 -1814441 -1503545 -128966 1549726
43336 1549726 2208750 1724152 1531398 2383753 2984312 1892645 -325414 -2010756 -2550001
43327 -2550001 -2468446 -2159632 -1601294 -765887 482231 2254955 3807836 3716005 1550778
43318 1550778 -1461092 -3907917 -5245254 -5108404 -3281085 -1056884 -661070 -2062086
43310 -2062086 -2289836 393193 3500774 3692759 1601551 649324 1984545 3430322 3252665
$$ packed form
43374D19321l6975J630894j68524j976407n95088J777103J578110m67053j301666
43365H59715n91258j96198l65127N6347P61640N18257j84162J18485J030729Q56338
43355B864766m12412j122164p08423j72835l0738J33837K66617m3833k68224L76733
43345H83324J187047P53498p34244j710695j499792o93579L10896J374579J678692
43336A549726O59024m84598j92754Q52355O00559j091667k218059j685342n39245
43327b550001Q1555L08814N58338Q35407J248118J772724J552881r1831k165227
43318A550778l011870k446825j337337J36850J827319K224201L95814j401016
43310b062086k27750K683029L107581J91985k091208r52227J335221J445777j77657
$$ plain form
43301 3252665 2276058 1780806 1480422 488913 -1079917 -2245615 -2140404 -624363 1434447
43292 1434447 2623984 2400374 1665152 1279687 789937 -379105 -1421936 -1289619 -525447
43283 -525447 -286375 -186328 952107 2574712 2775536 1349516 462061 1645326 3647224
43274 3647224 4041473 2008100 -1031689 -2886321 -2438849 -503442 1170924 1934260 2569640
43265 2569640 3247677 2611389 128576 -2108881 -1891753 -178158 339804 -737616 -1320289
43256 -1320289 -340827 977509 1465961 1409910 1312998 1165246 1160167 1465732 1390889 519666
43246 519666 157026 1398956 2369245 341799 -3517317 -4854085 -2057093 1782761 3613816
43237 3613816 3715004 3056811 1000485 -2263100 -4089115 -2793413 -374518 527567 227814
$$ packed form
43301C252665r76607m95252l00384r91509j568830j165698J05211J516041K058810
43292A434447J189537k23610p35222l85465m89750j169042j042831J32317P64172
43283e25447K39072J00047J138435J622605K00824j426020q87455J183265K001898
43274C647224L94249k033373l039789j854632M47472J935407J674366P63336O35380
43265B569640O78037o36288k482813k237457K17128J713595N17962j077420n82673
43256a320289R79462J318336M88452n6051r6912j47752n079L05565p4843q71223
43246E19666l62640J241930R70289k027446l859116j336768K796992L839854J831055
43237C613816J01188o58193k056326l263585j826015J295702K418895R02085k99753
$$ plain form
43228 227814 276226 410748 -136863 -302494 975944 2218420 1557883 16107 -224726
43219 -224726 538413 653916 626954 2071456 3920253 3331061 318140 -1939168 -1791584
43210 -1791584 -983247 -1173442 -1562072 -1037150 -143198 317828 536604 427659 -879974
43201 -879974 -3057708 -3947858 -2386922 -210859 11394 -1849283 -3859665 -4609289 -4135486
43192 -4135486 -3002155 -1756587 -1013318 -1098104 -1631094 -1937495 -1741999 -1285276 -1071927
43183 -1071927 -1520383 -2367408 -2499549 -1090268 1117889 2469573 2354228 1684835 1459782
43174 1459782 1805875 2445111 3013193 2801464 1340913 -512356 -1186132 -347454 827638
43165 827638 1458870 1709760 1562630 534609 -817829 -915489 308993 652393 -1101027
$$ packed form
43228B27814M8412J34522n47611j65631J278438J242476o60537j541776k40833
43219b24726P63139J15503k6962J444502J848797n89192l012921k257308J47584
43210a791584Q08337j90195l88630N24922Q93952M61026K18776j08945j307633
43201h79974k177734q90150J560936K176063K22253j860677k010382p49624M73803
43192d135486J133331J245568P43269q4786n32990l06401J95496M56723K13349
43183a071927m48456q47025j32141J409281K208157J351684j15345o69393k25053
43174A459782L46093O39236N68082k11729j460551j853269o73776Q38678J175092
43165H27638O31232K50890j47130j028021j352438r7660J224482L43400j753420
$$ plain form
43156 -1101027 -2752545 -1578479 1417350 2605213 837201 -1027634 -330670 1733788
43148 1733788 2018343 -305259 -2974404 -3695723 -2540088 -1107717 -443276 -479624 -934056
43139 -934056 -1750849 -2537762 -2362409 -727064 1517636 2811035 2485591 1409252 991738
43130 991738 1752690 2848545 2914625 1545057 -35305 -248473 730794 979900 -439102
43121 -439102 -1715523 -600403 2039104 2757403 -92760 -4096245 -5683643 -4164436
43113 -4164436 -1888030 -1154767 -2043734 -3049442 -3013353 -2255964 -2033542 -2908325 -3878468
43104 -3878468 -3595531 -2254371 -1429080 -1930599 -2741147 -2424266 -805922 1112786 2147175
43095 2147175 1476943 -910669 -3753094 -5212969 -4630273 -3022557 -1533098 -225900
$$ packed form
43156a101027j651518J174066K995829J187863j768012j864835O96964K064458
43148A733788K84555k323602k669145p21319J155635J432371O64441l6348m54432
43139i34056q16793p86913J75353J635345K244700J293399l25444j076339m17514
43130I91738P60952J095855O6080j369568j580362k13168R79267K49106j419002
43121d39102j276421J115120K639507P18299k850163m003485j587398J519207
43113d164436K276406P33263q88967j005708L6089P57389K22422q74783r70143
43104c878468K82937J341160Q25291n01519q10548L16881J618344J918708J034389
43095B147175o70232k387612k842425j459875N82696J607716J489459J307198
$$ plain form
43087 -225900 1152698 2246247 2683624 2778897 2878807 2760284 2344070 2113830 2072755 1326170
43077 1326170 -313460 -1404644 -856900 169794 -49584 -992427 -625151 1426135 3349458
43068 3349458 3762639 3025916 1752746 -114893 -2117592 -2830297 -1650007 51043 528984
43059 528984 -301084 -1179166 -1190218 -435541 493949 1090203 1228048 1202013 1219472 910253
43049 910253 -98185 -1243028 -1574288 -1319381 -1821741 -3530018 -5074462 -4993507 -3585290
43040 -3585290 -2329277 -2036266 -2218591 -1892058 -519841 1478787 2855253 2620225 1241261
43031 1241261 234161 404866 1123733 1410524 885204 -444728 -2200259 -3138833 -1989685
43022 -1989685 552827 1937527 730513 -1678476 -3245931 -3814320 -4218778 -4188197 -2958792
$$ packed form
43087b25900J378598J093549M37377R5273R9910j18523m16214k30240m1075p46585
43077A326170j639630j091184N47744J026694k19378r42843L67276K051286J923323
43068C349458M13181p36723j273170j867639k002699p12705J180290J701050M77941
43059E28984q30068q78082j1052P54677R29490N96254J37845k6035J7459l09219
43049I10253j008438j144843l31260K54907n02360j708277j544444Q0955J408217
43040c585290J256013K93011j82325L26533J372217J998628J376466k35028j378964
43031A241261j007100J70705P18867K86791n25320j329932j755531r38574J149148
43022a989685K542512J384700j207014k408989j567455n68389m04458L0581J229405
$$ plain form
43013 -2958792 -1165637 -187804 47539 840033 2422057 3503112 3128306 1601375 -387679
43004 -387679 -2199762 -2964664 -2337538 -1443081 -1586895 -2224177 -1896583 -936746 -1095877
42995 -1095877 -2399081 -2794296 -1502372 -271464 -337515 -594992 -187409 -496896 -2587899
42986 -2587899 -4758806 -4999981 -4207333 -4342472 -4738020 -3193701 -22954 2042423 1930268
42977 1930268 1416827 1876882 2364659 1667729 198611 -989975 -1431326 -900809 561717
42968 561717 1844089 1669159 732935 1078561 2823338 3628735 2328699 907058 1448099
42959 1448099 3009660 3276422 1891860 377547 -204700 57543 636259 614350 -923562
42950 -923562 -3275088 -4175998 -2888215 -1698122 -2520591 -3674142 -2516726 104305 1115493
$$ packed form
43013b958792J793155R77833K35343P92494J582024J081055l74806j526931j989054
43004c87679j812083p64902O27126Q94457j43814o37282L27594R59837j59131
42995a095877j303204l95215J291924J230908o6051k57477M07583l09487k091003
42986b587899k170907k41175P92648j35139l95548J544319L170747K065377j12155
42977A930268n13441M60055M87777o96930j469118j188586m41351N30517J462526
42968E61717J282372j74930r36224L45626J744777Q05397j300036j421641N41041
42959A448099J561561K66762j384562j514313n82247K62243N78716k1909j537912
42950i23562k351526r00910J287783J190093q22469j153551J157416K621031J011188
$$ plain form
42941 1115493 132506 -277806 855726 1575028 805476 148225 593064 478936 -1413833
42932 -1413833 -3270772 -2982070 -1549023 -1374147 -2512385 -2990725 -1983234 -432377 977483
42923 977483 2372725 3382930 3132077 1698936 242341 -385797 -109199 976870 2421816
42914 2421816 2959572 1730124 -102641 -446273 891311 1955643 1540078 804676 1276938
42905 1276938 2483605 2624954 928232 -1580766 -3290211 -3312228 -1873218 -27445 1087626
42896 1087626 1147410 878428 1292215 2707167 4497625 5662303 5695354 5069113 4735732
42887 4735732 4953484 4861225 3590645 1560028 121444 -7900 561669 803406 431644
42878 431644 30997 288907 1143979 1630183 831156 -850075 -1863242 -1365550 -383028
$$ packed form
42941A115493r82987m10312J133532P19302p69552o57251M44839j14128j892769
42932a413833j856939K88702J433047J74876j138238m78340J007491J550857J409860
42923I77483J395242J010205k50853j433141j456595o28138K76598J086069J444946
42914B421816N37756j229448j832765l43632J337584J064332m15565p35402M72262
42905A276938J206667J41349j696722k508998j709445k2017J439010J845773J115071
42896A087626N9784k68982M13787J414952J790458J164678L3051o26241l33381
42887D735732K17752r2259j270580k030617j438584j29344N69569K41737l71762
42878D31644m00647K57910Q55072M86204p99027j681231j013167M97692R82522
$$ plain form
42869 -383028 -482244 -1739960 -2849398 -2914042 -2199478 -1273923 -411652 97863 -664 -327710
42859 -327710 -76438 888514 1675839 1294981 -421631 -2710236 -4235280 -3885367 -1931831
42850 -1931831 -115808 213648 -294476 -160455 668076 1075587 957943 1423838 2693272
42841 2693272 3518927 3184352 2521657 2323558 2206237 1738513 1243979 694683 -681933
42832 -681933 -2691523 -3548423 -2230321 -187261 679230 633892 1224703 2710622 3955592
42823 3955592 4290888 4041261 3602312 3196548 3153573 3441506 3411143 2800718 2228012 1924114
42813 1924114 1101108 -463328 -1572483 -1538465 -1389377 -1654520 -814262 1911642 4108977
42804 4108977 3350135 1292766 1237315 2746573 2598614 523377 -383019 768983 1229390
$$ packed form
42869c83028r9216j257716j109438o4644P14564R25555Q62271N09515r8527l27046
42859c27710K51272R64952P87325l80858j716612k288605j525044L49913J953536
42850a931831J816023L29456n08124J34021Q28531M07511j17644M65895J269434
42841B693272Q25655l34575o62695j98099j17321m67724m94534n49296j376616
42832f81933k009590q56900J318102K043060Q66491m5338N90811J485919J244970
42823C955592L35296k49627m38949m05764m2975K87933l0363o10425n72706l03898
42813A924114q23006j564436j109155L4018J49088k65143Q40258K725904K197335
42804D108977p58842k057369n5451J509258j47959k075237r06396J152002M60407
$$ plain form
42795 1229390 -59792 -151733 2678758 5252405 3960013 40585 -2532570 -2159132 62384
42786 62384 2915739 5191448 5203820 3029119 1495895 2251701 2815353 596473 -2263151
42777 -2263151 -1951045 674571 1244926 -1294159 -3545753 -3448426 -2749049 -2830841 -2239634
42768 -2239634 9414 2132401 2468888 1855045 1397717 543256 -890212 -1351812 -163651
42759 -163651 929440 826497 1234947 3400823 5049738 3578151 489475 -644680 518769
42750 518769 1187328 183103 -824876 -875211 -1198614 -2379489 -2886509 -1742852 -453396
42741 -453396 -749493 -2027549 -2550788 -2016792 -1420954 -1144207 -677418 -13099 -76448 -1503911
42731 -1503911 -3575156 -4633245 -3554542 -944362 1193385 1370669 165331 -672139
$$ packed form
42795A229390j289182r1941K830491K573647j292392l919428k573155L73438K221516
42786F2384K853355K275709J2372k174701j533224P55806N63652k218880k859624
42777b263151L12106K625616N70355k539085k251594R7327O99377q1792N91207
42768b239634K249048K122987L36487o13843m57328q54461j433468m61600J188161
42759a63651J093091j02943M08450K165876J648915j471587l088676j134155J163449
42750E18769O68559j004225j007979n0335l23403j180875n07020J143657J289456
42741d53396k96097j278056n23239N33996N95838K76747M66789O64319o3349j427463
42731a503911k071245j058089J078703K610180K137747J77284j205338q37470
$$ plain form
42723 -672139 -556255 -557892 -1290615 -1486301 296630 3238498 4887355 4200468 2734348
42714 2734348 2375569 2904898 2658830 990133 -995782 -2009077 -1852917 -971014 291766
42705 291766 1468610 1807209 1061495 -29703 -669961 -927023 -1154185 -1181228 -907673
42696 -907673 -951658 -1574842 -1696522 -476687 763492 178029 -1381863 -1234843 777483
42687 777483 1566490 -442799 -2481306 -1371099 1776687 3290481 2005402 -788
42679 -788 -947333 -1039011 -867448 -486807 -231495 -524340 -726828 113104 1369383 1442913
42669 1442913 252116 -663850 -511081 144952 1021655 2217501 2683386 1147585 -1070499
42660 -1070499 -954850 1686292 3493016 2604257 1364417 2042728 2940077 1660747 -350361
$$ packed form
42723f72139J15884j637p32723j95686J782931K941868J648857o86887j466120
42714B734348l58779N29329k46068j668697j985915j013295J56160Q81903J262780
42705B91766J176844L38599p45714j091198o40258k57062k27162k7043K73555
42696i07673m3985o23184j21680J219835J240179n85463j559892J47020K012326
42687G77483P89007k009289k038507J110207L147786J513794j285079k006190
42679g88r46545r1678J71563L80641K55312k92845k02488Q39932J256279P3530
42669A442913j190797r15966J52769O56033Q76703J195846M65885j535801k218084
42660a070499J15649K641142J806724q88759j239840O78311Q97349j279330k011108
$$ plain form
42651 -350361 -235443 1122135 554961 -1653532 -1917280 596512 2371648 1153558 -737461
42642 -737461 -597158 558444 618591 301717 1314868 2554353 1645696 -657502 -1033212
42633 -1033212 1495459 4217621 4815061 4159835 4075598 4522239 4426870 3788137 3428195
42624 3428195 3441535 3041780 1549643 -1007638 -3683612 -4774749 -3262724 -513465 702020
42615 702020 -512002 -2203258 -2555327 -2137200 -1996496 -1413258 407348 1876156 860906
42606 860906 -1725750 -2758463 -1055233 1694225 3895258 5275284 5153580 2550033
42598 2550033 -1234644 -3014962 -1883370 -455718 -765305 -1553008 -1153319 -362265 -386083
42589 -386083 -352876 818985 2163601 2561457 2834897 3684337 3830765 2747103 2653776
$$ packed form
42651c50361J14918J357578n67174k208493k63748K513792J775136j218090j891019
42642g37461J40303J155602O0147l16874J013151J239485r08657k303198l75710
42633a033212K528671K722162N97440o55226q4237M46641r5369o38733l59942
42624C428195J3340l99755j492137k557281k675974j091137J512025K749259J215485
42615G02020j214022j691256l52069M18127J40704N83238J820606J468808j015250
42606H60906k586656j032713J703230K749458K201033J380026j21704k603547
42598B550033l784677j780318J131592J427652l09587p87703L99689P91054k3818
42589c86083L3207J171861J344616L97856K73440Q49440J46428j083662r3327
$$ plain form
42580 2653776 4721730 6064701 4348047 2609730 4703297 8410525 8846770 6849354
42572 6849354 7342924 10469644 11865408 11681680 15024745 22289322 28260292 33657134
42564 33657134 47275100 70466351 88926750 89242886 76846411 67002899 62817363 54313424
42556 54313424 37512169 21552663 14517215 12949085 9978041 5537940 3181280 3004908
42548 3004908 3187499 4072883 5944061 6361013 3917052 1390729 1309546 1576446 -567788
42539 -567788 -3302564 -3244047 -1178872 -338458 -824207 -137157 2011408 3563460 3943579
42530 3943579 4208222 3997917 2012055 -771546 -1736533 -416830 1289751 2385421 3244703
42521 3244703 3189590 983029 -2060607 -2756770 -571664 1390206 834097 -800430 -941739
$$ packed form
42580B653776K067954J342971j716654j738317K093567L707228M36245j997416
42572F849354M93570L126720J395764j83728L343065P264577N970970N396842
42564C3657134J3617966K3191251J8460399L16136j2396475r843512m185536q503939
42556E4313424j6801255j5959506p035448j568130k971044m440101k356660j76372
42548C004908J82591Q85384J871178M16952k443961k526323q1183K66900k144234
42539e67788k734776N8517K065175Q40414m85749O87050K148565J552052L80119
42530C943579K64643k10305j985862k783601r64987J319703J706581J095670Q59282
42521C244703n5113k206561l043636o96163K185106J961870n56109j634527j41309
$$ plain form
42512 -941739 699269 2497594 3139948 2504491 1410635 1017120 1606185 2030715 1321804
42503 1321804 202637 -370277 -1124243 -2843228 -3889444 -2224642 670608 1207963 -951977
42494 -951977 -2386054 -1263350 307013 342018 -70451 459790 1057034 782951 620708
42485 620708 1116971 664308 -1503435 -3076016 -2085810 -331867 -447041 -1489039 -737746
42476 -737746 1574430 2817931 2381536 2076026 2452596 2016337 310153 -1125600 -1356459
42467 -1356459 -1176625 -1196181 -1031499 -783326 -1162695 -1735492 -1162180 326640 771093
42458 771093 -585544 -2128933 -2282670 -1297272 -71575 992513 1380777 565688 -656650
42449 -656650 -753940 92593 166345 -622632 -239689 1829184 3138189 2102497 652526
$$ packed form
42512i41739J641008J798325O42354o35457j093856l93515N89065M24530p08911
42503A321804j119167n72914p53966j718985j046216J664802K895250N37355k159940
42494i51977j434077J122704J570363L5005m12469N30241N97244k74083j62243
42485F20708M96263m52663k167743j572581R90206J753943j15174j041998P51293
42476g37746K312176J243501m36395l05510L76570m36259j706184j435753k30859
42467a356459J79834j9556J64682K48173l79369n72797N73312J488820M44453
42458G71093j356637j543389j53737R85398J225697J064088L88264q15089j222338
42449f56650r7290Q46533P3752p88977L82943K068873J309005j035692j449971
$$ plain form
42440 652526 884902 1429540 -63288 -2668992 -3590671 -2586360 -1703968 -1329153 23786
42431 23786 2072430 2471889 865896 -44764 1150732 2028842 108592 -3066516 -4050645
42422 -4050645 -2360873 -795610 -1422964 -3348683 -4505408 -4013987 -2405120 -646032
42414 -646032 535538 921839 719559 87263 -988629 -2070048 -2118900 -737109 821972
42405 821972 831378 -789642 -2414889 -2810513 -2338968 -1771726 -915385 725103 2461600
42396 2461600 2700960 865917 -1686977 -3042699 -2618095 -1364074 -483329 -447957 -1063398
42387 -1063398 -1866517 -2340554 -2157351 -1383612 -300839 793415 1291129 290525 -2175722
42378 -2175722 -4262180 -4080627 -2456409 -2180097 -3864561 -4557800 -1979651 1734831 2870492
$$ packed form
42440F52526K32376N44638j492828k605704r21679J004311Q82392L74815J352939
42431B3786K048644L99459j605993r10660J195496Q78110j920250l175108r84129
42422d050645J689772J565263o27354j925719j156725M91421J608867J759088
42414f46032J181570L86301k02280o32296j075892j081419m8852J381791J559081
42405H21972R406j621020j625247l95624M71545N67242Q56341J640488J736497
42396B461600K39360j835043k552894j355722M24604J254021Q80745L5372o15441
42387a063398q03119m74037J83203P73739J082773J094254M97714j000604k466247
42378b175722k086458J81553J624218K76312j684464o93239K578149L714482J135661
$$ plain form
42369 2870492 1366250 273023 669663 582328 -753359 -1213959 211607 1041407 -735659
42360 -735659 -2900371 -2104431 1043261 3089330 2860075 2318874 2722487 3032062 2477360
42351 2477360 1988106 2245431 2419602 1761422 799184 165834 -342778 -895247 -1148055
42342 -1148055 -1194166 -1699836 -2641522 -3208707 -3285272 -3550166 -3834407 -3192326 -2082196 -2358086
42332 -2358086 -4160458 -4997555 -3344638 -1094892 -561952 -911566 36628 1863878 2216101
42323 2216101 778353 -208788 487636 1438937 1050128 -199427 -819601 -285858 759730
42314 759730 1413886 1244639 773181 1130326 2435493 2964107 1170162 -1870960 -3608985
42305 -3608985 -3364720 -2732196 -2720463 -2651495 -2289617 -2721571 -4047137 -4319960 -2398778
$$ packed form
42369B870492j504242j093227L96640q7335j335687m60600J425566Q29800j777066
42360g35659k164712P95940L147692K046069k29255n41201M03613L09575n54702
42351B477360m89254K57325J74171o58180r62238o33350n08612n52469k52808
42342a148055m6111n05670r41686n67185p6565k64894k84241O42081J110130k75890
42332b358086j802372q37097J652917K249746N32940l49614R48194J827250L52223
42323B216101j437748r87141O96424R51301l88809j249555o20174N33743J045588
42314G59730O54156j69247m71458L57145J305167N28614j793945l041122j738025
42305c608985K44265O32524J1733O8968L61878m31954j325566k72823J921182
$$ plain form
42296 -2398778 -177018 -73327 -1525483 -2053646 -1042268 -250678 -719985 -1287001 -667518
42287 -667518 615880 1198619 692290 -252571 -979689 -1197886 -801302 -13878 504985
42278 504985 285587 -232010 -46066 1197397 2630114 3036059 2147145 743424 -470994
42269 -470994 -1554723 -2676665 -3433311 -3489218 -3441812 -4078552 -4923559 -4647117 -3126756
42260 -3126756 -1975747 -2454920 -3789555 -4339365 -3750956 -3059557 -3058338 -3445390 -3514073 -3069290
42250 -3069290 -2567183 -2528526 -2701130 -1941280 408894 2976233 3245618 583080 -2568961
42241 -2568961 -3398062 -1880026 -221402 215161 135287 669463 1750458 2378372 1762608
42232 1762608 54757 -1594270 -1863806 -654907 667711 1009724 1008548 1887004 3353593
$$ packed form
42296b398778K221760J03691j452156n28163J011378P91590m69307n67016O19483
42287f67518J283398N82739n06329r44861p27118k18197L96584P87424N18863
42278E04985k19398n17597J85944J243463J432717M05945q88914j403721j214418
42269d70994j083729j121942p56646n5907M7406o36740q45007K76442J520361
42260c126756J151009m79173j334635n49810N88409O91399J219l87052o8683M44783
42250c069290N02107L8657j72604P59850K350174K567339K69385k662538l152041
42241b568961q29101J518036J658624M36563p9874N34176J080995O27914o15764
42232A762608j707851j649027k69536J208899J322618L42013j176Q78456J466589
$$ plain form
42223 3353593 3878266 2901422 1513929 847207 949898 1468946 2285612 3043020 3038042 2161355
42213 2161355 1238298 962865 1089178 1054096 820654 727914 968591 1489189 2027610 2170954
42203 2170954 1793721 1321278 1010997 313274 -1141423 -2268323 -1590297 457432 1818556
42194 1818556 1684170 1407684 1925569 2033884 478715 -1659803 -2277386 -1049456 627238
42185 627238 1856599 2809988 3410025 3077742 1959953 1159073 1378969 2141191 2567145
42176 2567145 2339240 1792154 1510249 1787274 2160822 1803562 745543 128646 664620
42167 664620 1541134 1695659 1438050 1641316 1905805 995748 -1051685 -2623491 -2442844
42158 -2442844 -742693 1368669 2605165 1818183 -912657 -3467503 -3489503 -1266226 617836
$$ packed form
42223C353593N24673r76844j387493o66722J02691N19048Q16666P57408m978q76687
42213B161355r23057k75433J26313l5082k33442r2740K40677N20598N38421J43344
42203B170954l77233m72443l10281o97723j454697j126900O78026K047729J361124
42194A818556j34386k76486N17885J08315j555169k138518o17583J227930J676694
42185F27238J229361R53389O00037l32283j117789q00880K19896P62222M25954
42176B567145k27905n47086k81905K77025L73548l57260j058019o16897N35974
42167F64620Q76514J54525k57609K03266K64489r10057k047433j571806J80647
42158b442844J700151K111362J236496p86982k730840k554846k2000K223277J884062
$$ plain form
42149 617836 728217 214416 382682 817619 960841 1664640 3476093 4759439 3584971
42140 3584971 793101 -828425 -251042 687592 43321 -1897786 -3457613 -3519088 -2132454
42131 -2132454 -169990 1028725 449675 -1468662 -2958722 -2746804 -1455769 -714730 -1127365
42122 -1127365 -1715653 -1423719 -618631 -625087 -1928283 -3488960 -4171626 -4272743 -4851079
42113 -4851079 -5835012 -5895546 -4381839 -2295088 -838499 -8955 663580 985820 737804
42104 737804 594691 1154850 1677754 1176685 247040 147689 351597 -954084 -3606673
42095 -3606673 -4796950 -2721572 710287 2191605 868308 -1537784 -3439327 -4479814
42087 -4479814 -4491124 -3283333 -1601727 -707714 -614243 -54926 1359593 2341831 2056080
$$ packed form
42149F17836J10381n13801J68266M34937J43222P03799J811453J283346j174468
42140C584971k791870j621526N77383R38634o44271j941107j559827o1475J386634
42131b132454J962464J198715n79050j918337j490060K11918J291035P41039m12635
42122a127365n88288K91934Q05088o456j303196j560677o82666j01117n78336
42113d851079r83933o0534J513707K086751J456589Q29544O72535L22240k48016
42104G37804j43113N60159N22904n01069r29645r9351K03908j305681k652589
42095c606673j190277K075378L431859J481318j323297k406092j901543j040487
42087d479814j1310J207791J681606Q94013R3471N59317J414519R82238k85751
$$ plain form
42078 2056080 1705079 2651410 3865659 3059050 276779 -1458003 114153 3388220 4815160
42069 4815160 3279057 1038339 234151 46626 -1604946 -4464626 -5739040 -3738405
42061 -3738405 -341538 1177368 74125 -1358383 -1061722 364879 1035584 440520 -357618
42052 -357618 -623417 -783483 -1383753 -2310584 -3285052 -4197737 -4658231 -4146234 -2958098
42043 -2958098 -1951757 -934933 1245381 4094139 4685499 1404926 -2789006 -3429992
42035 -3429992 -344606 2461948 2735890 2462957 3398904 3608491 983901 -2395086 -2790053
42026 -2790053 -342166 1292907 348374 -1226795 -1490813 -1049714 -1052010 -1109630 -418615
42017 -418615 752198 1629573 1640013 148126 -2807552 -5178288 -4465482 -1365383 427303
$$ packed form
42078B056080l51001R46331J214249q06609k782271j734782J572156L274067J426940
42069D815160j536103k240718q04188j87525j651572k859680j274414K000635
42061c738405L396867J518906j103243j432508K96661J426601O70705n95064p98138
42052c57618k65799j60066o00270r26831r74468r12685m60494N11997J188136
42043b958098J006341J016824K180314K848758N91360l280573m193932o40986
42035c429992L085386K806554K73942k72933R35947K09587k624590l378987l94967
42026b790053K447887J635073r44533j575169k64018M41099k296n7620O91015
42017d18615J170813Q77375J0440j491887k955678k370736P12806L100099J792686
$$ plain form
42008 427303 -813098 -2437265 -1609709 434822 675542 -971823 -2012213 -1389850 -380819
41999 -380819 33365 132857 -22591 -705286 -1162010 -350385 899661 699137 -669517
41990 -669517 -672315 1625698 3797655 3284496 707988 -1280824 -1221558 208959 1495989
41981 1495989 1523931 187922 -1522800 -2528838 -2868157 -3100686 -2786661 -1117357 969857
41972 969857 1407363 240857 -54336 1450204 2305798 633328 -1409283 -747448 1685690
41963 1685690 2302869 330331 -1367080 -937980 133839 104085 -431066 -333503 -66764
41954 -66764 -393363 -629063 51988 825185 504856 -259923 140869 1718699 2887243
41945 2887243 2808372 2185757 1737976 1367956 1049136 1118925 1262059 529128 -965423 -1584701
$$ packed form
42008D27303j240401j624167Q27556K044531K40720j647365j040390O22363J009031
41999c80819M14184R9492j55448o82695m56724Q11625J250046k00524j368654
41990f69517k798K298013K171957n13159k576508j988812N9266J430517J287030
41981A495989K7942j336009j710722j006038l39319k32529L14025J669304K087214
41972I69857M37506j166506k95193J504540Q55594j672470k042611O61835K433138
41963A685690O17179j972538j697411M29100J071819k9754n35151R7563K66739
41954f6764l26599k35700O81051P73197l20329p64779M00792J577830J168544
41945B887243p8871o22615m47781l70020l18820O9789J43134p32931j494551o19278
$$ plain form
41935 -1584701 -377773 1223849 1122340 -665541 -2245763 -2523311 -2229486 -2229619 -2220924 -1659002
41925 -1659002 -904011 -689021 -1115355 -1776196 -2290313 -2229667 -1232345 229932 974816
41916 974816 710228 644878 1552515 2192468 1116964 -657415 -681586 1362187 3108285
41907 3108285 2924537 2034578 2360419 3783450 4737123 4442171 3347305 2090272 1113031
41898 1113031 774210 908360 698671 -283200 -1397502 -1890765 -1855218 -1589889 -843779
41889 -843779 435930 1412411 1452163 1218710 1603672 2231858 2187349 1594281 1208510 1016717
41879 1016717 623792 498102 1248594 2029914 1419736 -198132 -900855 -34162 993931
41870 993931 1104187 1007817 1595922 2397219 2547295 2096842 1479778 689655 -227141 -809361
$$ packed form
41935a584701J206928J601622j01509j787881j580222k77548K93825j33Q695N61922
41925a659002P54991K14990m26334o60841n14117O0646R97322J462277P44884
41916I74816k64588o5350R07637O39953j075504j774379k4171K043773J746098
41907C108285j83748q89959L25841J423031R53673k94952j094866j257033r77241
41898A113031l38821J34150k09689r81871j114302m93263L5547K65329P46110
41889h43779J279709R76481L9752k33453L84962O28186m4509n93068l85771j91793
41879A016717l92925j25690P50492P81320o10178j617868p02723Q66693J028093
41870I93931J10256r6370N88105Q01297J50076m50453o17064p90123r16796n82220
$$ plain form
41860 -809361 -1041025 -1597441 -2489859 -2543021 -1201950 145882 -73074 -1210436 -1139156
41851 -1139156 802909 2870783 3135103 1780361 721470 1255859 2551582 2759094 1547047
41842 1547047 757683 1844864 3425251 2887502 236511 -1594339 -837715 573638 -180102
41833 -180102 -2893640 -4851685 -4399331 -2415201 -663643 -66515 -429578 -803667 -253562
41824 -253562 1009998 1714747 1390892 1234930 2053011 2431623 678178 -2139850 -3219588
41815 -3219588 -1983133 -895405 -1904639 -3986326 -5055726 -4699472 -3872806 -3104487 -2306211
41806 -2306211 -1643780 -1397803 -1312484 -1021140 -852350 -1349020 -2126411 -2083892 -930956 185839
41796 185839 52746 -936351 -1113109 299518 1976758 2145577 1087478 775127 1792721
$$ packed form
41860h09361k31664n56416q92418n3162J341071J347832k18956j137362P1280
41851a139156J942065K067874K64320j354742j058891N34389J295723K07512j212047
41842A547047p89364J087181J580387n37749k650991j830850P56624J411353p53740
41833a80102k713538j958045M52354J984130J751558N97128l63063l74089N50105
41824b53562J263560P04749l23855j55962Q18081L78612j753445k818028j079738
41815c219588J236455J087728j009234k081687j069400L56254Q26666P68319P98276
41806b306211O62431K45977Q5319K91344J68790m96670p77391M2519J152936J116795
41796A85839j33093r89097j76758J412627J677240J68819j058099l12351J017594
$$ plain form
41787 1792721 2129486 130491 -2621450 -3187886 -1417030 -75393 -772605 -1957453 -1769325
41778 -1769325 -844992 -709251 -820368 630801 3402898 4774588 2975731 -367482 -2157038
41769 -2157038 -1428190 23264 407089 197016 1032402 3056622 4515343 4164416 2979124
41760 2979124 2672185 3255208 3241902 2006028 650071 291577 588584 542701 12000
41751 12000 -246084 344061 1551157 2607555 2891931 2559409 2481213 3162602 3832774 3271011
41741 3271011 1525904 -32715 -561499 -705570 -1242885 -1631144 -699361 1672052 4280988
41732 4280988 5818143 5901193 5131138 4507834 4610468 5103708 5224976 4787992 4308553
41723 4308553 4123663 3990314 3724418 3616849 3963940 4729135 5795559 6865920 7046394
$$ packed form
41787A792721L36765j998995k751941n66436J770856J341637o97212j184848J88128
41778a769325R24333J35741j11117J451169K772097J371690j798857l343213j789556
41769b157038P28848J451454L83825k10073Q35386K024220J458721l50927j185292
41760B979124l06939N83023j3306j235874j355957l58494K97007m5883n30701
41751A2000k58084N90145J207096J056398K84376l32522p8196O81389O70172n61763
41741C271011j745107j558619n28784j44071n37315l88259R31783K371413K608936
41732D280988J537155Q3050p70055o23304J02634M93240J21268m36984m79439
41723D308553j84890j33349k65896j07569L47091P65195J066424J070361J80474
$$ plain form
41714 7046394 5556573 3211308 2082689 3026381 4568089 5038856 4714044 4689846 4664214
41705 4664214 3491978 1464557 263410 565608 1277865 1564102 2198797 4074546 6418578
41696 6418578 7597485 7210594 6381482 6107864 6208296 6071112 5728522 5725169 6273717 6979011
41686 6979011 7224194 6532708 4923309 3434764 3748863 6131568 8024567 6495546 2561038
41677 2561038 938037 4053370 8351346 8971907 6419888 5136606 6277799 6297179 3476338
41668 3476338 1419367 3606502 7980531 10279373 10238443 10670760 11961120 11680504 9401247
41659 9401247 7990325 9299995 11614956 12588224 12386732 12602574 13795078 15424400 17018450
41650 17018450 18350288 19361189 20673003 23346893 27476430 31716750 34776944 36918448
$$ packed form
41714G046394j489821k345265j128619R43692J541708M70767l24812k4198k5632
41705D664214j172236k027421j201147L02198P12257K86237O34695J875749K344032
41696F418578J178907l86891q29112k73618J00432j37184l42590l353N48548P05294
41686F979011K45183o91486j609399j488545L14099K382705J892999j529021l934508
41677B561038j623001L115333M297976O20561k552019j283282J141193J9380k820841
41668C476338k056971K187135M374029K298842m0930M32317J290360k80616k279257
41659I401247j410922J309670K314961R73268k01492K15842J192504J629322J594050
41650A7018450J331838J010901J311814K673890M129537M240320L060194K141504
$$ plain form
41642 36918448 39672425 44415583 51228569 58887670 66386460 74826098 86913824 103822971
41634 103822971 123715154 144734720 168469323 198841104 238367896 286620568 339950148
41627 339950148 389408694 420698137 421787194 392806533 346064003 295532329 248706095
41620 248706095 208163870 175550322 150726445 130363474 111356879 94444333 81996037
41613 81996037 73772686 67355903 61369875 55754487 50040235 43901199 38554492 35277005
41605 35277005 33268789 31018810 28753445 27304078 25705397 22603385 19208973 17946869
41597 17946869 18591758 18641572 17380589 16623394 17196299 17576390 16683036 15422934 14622421
41588 14622421 13799229 12934389 13199880 14742699 15731195 14899830 13406190 13019444 14007919
$$ packed form
41642C6918448K753977M743158O812986P659101P498790Q439638J2087726J6909147
41634A03822971J9892183K1019566K3734603L0371781L9526792M8252672N3329580
41627C39950148M9458546L1289443J089057k8980661m6742530n0531674m6826234
41620B48706095m0542225l2613548k4823877k0362971j9006595j6912546j2448296
41613H1996037q223351o416783n986028n615388n714252o139036n346707l277487
41605C5277005k008216k249979k265365j449367j598681l102012l394412j262104
41597A7946869O44889M9814j260983p57195N72905L80091q93354j260102q00513
41588A4622421q23192q64840K65491J542819R88496q31365j493640l86746R88475
$$ plain form
41579 14007919 15815698 18105368 19950767 19798105 17780282 16492237 17722184 19793226
41571 19793226 20083390 18961512 18905569 20473596 21729679 21613747 21368157 22005378 22586364
41562 22586364 22216150 21994723 23319725 25356761 26086702 25438248 25457331 27139921 28909286
41553 28909286 29113318 28526899 28936343 30258043 30880945 30427365 30194779 30770264 31206950
41544 31206950 31059718 31158111 31387987 29847936 25868962 22021519 20935542 21522859 20811830
41535 20811830 18442201 16510903 15605254 14198916 12068700 11048838 11575427 11485935 9559154
41526 9559154 7532789 6966728 6668264 5349266 4542159 6160086 8783710 9324171 7447216
41517 7447216 5497457 4618190 3929624 3433317 4510084 6765386 7346440 4955544 2186267
$$ packed form
41579A4007919J807779K289670J845399j52662k017823j288045J229947K071042
41571A9793226K90164j121878n5943J568027J256083j15932k45590O37221N80986
41562B2586364l70214k21427J325002K037036P29941o48454J9083J682590J769365
41553B8909286K04032n86419M09444J321700O22902m53580k32586N75485M36686
41544C1206950j47232R8393K29876j540051l978974l847443j085977N87317p11029
41535B0811830k369629j931298r05649j406338k130216j019862N26589q9492j926781
41526I559154k026365n66061k98464j318998q07107J617927K623624N40461j876955
41517G447216j949759q79267o88566m96307J076767K255302N81054k390896k769277
$$ plain form
41508 2186267 1901196 3155093 3115799 1737492 1611433 3450174 4683945 3353925 927884
41499 927884 -230150 -214701 -399552 -362810 1420877 4349019 5834601 4987959 3763049
41490 3763049 3706962 3870413 3147809 2478983 2903076 3257023 2102944 657867 1273010
41481 1273010 3689806 5293476 4821065 3493481 2528300 1805016 1166911 891648 582541
41472 582541 -367273 -1003447 250452 2529574 2882598 458129 -2108861 -2591556 -2064934
41463 -2064934 -2432893 -3269369 -3024273 -1691594 -344480 733141 1765496 2480663 2867171
41454 2867171 3717425 5024214 5272260 3902316 2916375 4091061 6040809 6299039 5101440
41445 5101440 4592878 5148529 5161504 4076188 3019035 2469579 1786321 1263558 2275199
$$ packed form
41508B186267k85071J253897l9294j378307j26059J838741J233771j330020k426041
41499I27884j158034J5449j84851L6742J783687K928142J485582q46642j224910
41490C763049n6087J63451p22604o68826M24093L53947j154079j445077O15143
41481A273010K416796J603670m72411j327584r65181p23284o38105k75263l09107
41472E82541r49814o36174J253899K279122L53024k424469k566990m82695N26622
41463b064934l67959q36476K45096J332679J347114J077621J032355P15167L86508
41454B867171Q50254J306789K48046j369944r85941J174686J949748K58230j197599
41445E101440n08562N55651J2975j085316j057153n49456o83258n22763J011641
$$ plain form
41436 2275199 4782553 6752639 6829228 5901083 5301200 5037735 4691587 4693769 5571439 6717685
41426 6717685 6908795 5780802 4269957 3655958 4235900 4932550 4617718 3892276 4543878
41417 4543878 6705757 7953481 6531439 4232259 4186973 6612433 8888211 9410623 9035527
41408 9035527 8650295 7694080 5821356 4179407 4042891 5324445 7036905 8270931 8468498
41399 8468498 7760231 7111602 7099171 6792606 5182766 3283699 2987480 4109722 4772175
41390 4772175 4701184 5581974 7661649 8741212 7675909 6349335 6618827 7610272 7984725
41381 7984725 8806271 11650945 15273378 16873047 16085429 15292230 16127996 17862507 19438486
41372 19438486 21102569 23280387 25285221 26164208 26121882 26238061 26939580 27312778 26147429
$$ packed form
41436B275199K507354J970086P6589r28145n99883k63465l46148K182Q77670J146246
41426F717685J91110j127993j510845o13999N79942O96650l14832p25442O51602
41417D543878K161879J247724j422042k299180m5286K425460K275778N22412l75096
41408I035527l85232r56215j872724j641949j36516J281554J712460J234026J97567
41399H468498p08267o48629j2431l06565j609840j899067k96219J122242O62453
41390D772175p0991Q80790K079675J079563j065303j326574K69492R91445L74453
41381G984725Q21546K844674L622433J599669p87618p93199Q35766J734511J575979
41372A9438486J664083K177818K004834Q78987m2326J16179P01519L73198j165349
$$ plain form
41363 26147429 23506158 20821321 19132420 17732048 15380797 12532305 11047582 11514938
41355 11514938 12246711 11608373 10140310 9387000 9515899 9241779 7688172 5427276 3892696
41346 3892696 4269929 6551322 9227169 10409969 9712349 8511799 8055452 8026917 7388703
41337 7388703 5839681 3927671 2475605 2339950 3838292 5893487 6744755 6158820 5890337
41328 5890337 7190886 9018333 9742087 9488885 9441020 9701798 9428070 8578331 8011728
41319 8011728 8072614 8414205 9065772 10329850 11593755 11567114 10073029 8609378 8634053
41310 8634053 9913426 10992621 10942808 10318450 10471762 12042801 14281347 16065345 17258166
41301 17258166 18302132 18652686 16969658 13372986 10147755 9103950 9243132 8401004
$$ packed form
41363B6147429k641271k684837j688901j400372k351251k848492j484723M67356
41355A1514938P31773o38338j468063p53310J28899k74120j553607k260896j534580
41346C892696L77233K281393K675847J182800o97620j200550m56347k8535o38214
41337G388703j549022j912010j452066j35655J498342K055195Q51268n85935k68483
41328E890337J300549J827447P23754k53202m7865K60778k73728q49739n66603
41319H011728O0886L41591O51567J264078J263905k6641j494085j463651K4675
41310H634053J279373J079195m9813o24358J53312J571039K238546J783998J192821
41301A7258166J043966L50554j683028l596672l225231j043805J39182q42128
$$ plain form
41293 8401004 6482678 5445499 6296077 7754193 8242492 7854338 7599101 7575042 6892036
41284 6892036 5221611 3590893 3247993 4102152 4931909 5217620 5942438 7884941 9790179
41275 9790179 9479157 6660229 3409495 1726625 1794845 2831836 4240141 5343858 5315466
41266 5315466 4274061 3544373 4059670 5267711 6142984 6394514 6210942 5828233 5812717
41257 5812717 6659599 7683121 7577242 6488846 6025668 6742528 7419356 7421338 7568208
41248 7568208 7725305 6182194 3137339 2112361 5284964 9568880 10435994 8082430
41240 8082430 6478013 7354371 8719030 9010527 9194954 10279084 11759102 13373759 15916801
41231 15916801 19332532 22005103 22963923 23388414 25213540 29280923 35108934 41536525
$$ packed form
41293H401004j918326j037179Q50578J458116M88299l88154k55237k4059o83006
41284F892036j670425j630718l42900Q54159Q29757K85711P24818J942503J905238
41275I790179l11022k818928l250734j682870O8220J036991J408305J103717k8392
41266E315466j041405p29688N15297J208041Q75273K51530j83572l82709j5516
41257E812717Q46882J023522j05879j088396m63178P16860O76828J982J46870
41248G568208J57097j543111l044855j024978L172603M283916Q67114k353564
41240H082430j604417Q76358J364659K91497J84427J084130J480018J614657K543042
41231A5916801L415731K672571R58820M24491J825126M067383N828011O427591
$$ plain form
41223 41536525 47778129 54851218 65402490 81030540 100782784 123370156 148476804
41216 148476804 172991853 188187526 185624701 166192784 139522440 114173328 92173142
41209 92173142 73171782 58476132 48568939 41008366 34101291 29618847 28836866 28747726
41201 28747726 25725360 20813306 17731110 17103894 16296596 14111649 12071091 11126599
41193 11126599 10249842 8770085 7613904 7509945 7791437 7602598 6945614 6159991 5472433
41184 5472433 5212571 5482656 5636506 5009622 3968250 3305836 2976548 2503332 2194726
41175 2194726 2641292 3331677 3299086 3114874 4576227 7876473 10491721 9945323 6966563
41166 6966563 4763256 5214948 6778562 6738368 4879275 3686084 4755635 6558885 6929833
$$ packed form
41223D1536525O241604P073089J0551272J5628050J9752244K2587372K5106648
41216A48476804K4515049J5195673k562825j9431917k6670344k5349112k2000186
41209I2173142j9001360j4695650r907193p560573o907075m482444p81981q9140
41201B8747726l022366m912054l082196o27216q07298k184947k040558r44492
41193A1126599q76757j479757j156181j03959K81492j88839o56984p85623o87558
41184E472433k59862K70085J53850o26884j041372o62414l29288m73216l08606
41175B194726M46566O90385l2591j84212J461353L300246K615248n46398k978760
41166F966563k203307M51692J563614m0194j859093j193191J069551J803250L70948
$$ plain form
41157 6929833 6465875 7391100 9642432 10605801 8991391 6515866 4979628 4099283 3488625
41148 3488625 4383759 7399482 10409133 10986758 9764690 9116018 9414885 9019407 7652402
41139 7652402 7519702 10616783 16223725 21313293 22829020 20159870 16233005 15227131
41131 15227131 18068662 21437837 22858967 25184672 32986205 44819653 52498430 49553801
41123 49553801 38449445 27724435 23074371 23022834 23273599 23488155 27793888 38046795
41115 38046795 48461379 49858001 39750807 25579414 16401338 13776126 13176347 11975818
41107 11975818 11956340 14490902 17463390 18205998 16664463 14251510 11639697 8978985
41099 8978985 6647341 4658051 2668424 1289465 1773951 3646718 4518610 3394437
$$ packed form
41157F929833m63958R25225K251332R63369j614410k475525j536238q80345o10658
41148C488625Q95134L015723L009651N77625j222068o48672K98867l95478j367005
41139G652402j32700L097081N606942N089568J515727k669150l926865j005874
41131A5227131K841531L369175J421130K325705P801533J1833448P678777k944629
41123D9553801j1104356j0725010m650064n1537K50765K14556M305733J0252907
41115C8046795J0414584J396622j0107194j4171393r178076k625212n99779j200529
41107A1975818j9478K534562K972488P42608j541535k412953k611813k660712
41099H978985k331644j989290j989627j378959M84486J872767Q71892j124173
$$ plain form
41091 3394437 2298755 3049885 4158490 3118048 627239 -95787 1910350 3686858
41083 3686858 2287622 -1309870 -3499482 -2391728 472634 2579090 3312684 3759932
41075 3759932 4509557 4904499 4470550 3824840 3531777 3049647 1793095 519014 447982
41066 447982 1405597 2063183 1804682 1122714 328957 -702428 -1426729 -820394 807306
41057 807306 1576437 428759 -1308887 -1677025 -595622 366435 227616 -394101 -389595
41048 -389595 480407 1492804 1872203 1606353 1327670 1370401 1187580 46381 -1818816
41039 -1818816 -3169833 -2927465 -1180262 828647 1596126 666995 -663505 -515208 1300077
41030 1300077 2903896 2852836 2047424 2093035 2715719 2409261 1102298 319524 701176
$$ packed form
41091C394437j095682P51130J108605j040442k490809p23026K006137J776508
41083C686858j399236l597492k189612J107754K864362K106456P33594M47248
41075C759932P49625L94942m33949o45710k93063m82130j256552j274081p1032
41066D47982R57615O57586k58501o81968p93757j031385p24301O06335J627700
41057H07306P69131j147678j737646l68138J081403R62057j38819o21717M506
41048c89595Q70002J012397L79399k65850k78683M2731j82821j141199j865197
41039a818816j351017K42368J747203K008909P67479r29131j330500J48297J815285
41030A300077J603819n1060q05412M5611O22684l06458j306963p82774L81652
$$ plain form
41021 701176 1118296 616088 -244571 -506973 -133961 229517 -81772 -1436679 -3298451
41012 -3298451 -4103214 -3015373 -1583976 -2023686 -3933613 -4698996 -3397107 -2083284 -2420168
41003 -2420168 -3212925 -2629910 -1086368 -304919 -766591 -1616641 -2194495 -2390528 -2250651
40994 -2250651 -2178522 -2664609 -3127145 -2271025 -346301 585107 -259357 -824236 706043
40985 706043 3045860 4009401 3939316 4474595 5177325 4273757 2101106 844795 926158
40976 926158 508048 -1059679 -2039347 -1347547 -359623 -525106 -1188567 -1053915 -176211
40967 -176211 739900 1592868 2239998 1933458 637829 -294347 -20965 361107 -375974
40958 -375974 -1478814 -1501575 -786176 -811709 -1594962 -1672660 -602654 337485 223549 -381807
$$ packed form
41021G01176M17120n02208q60659k62402L73012L63478l11289j354907j861772
41012c298451q04763J087841J431397m39710j909927p65383J301889J313823l36884
41003b420168p92757N83015J543542P81449m61672q50050n77854j96033J39877
40994b250651P2129m86087m62536Q56120J924724R31408q44464n64879J530279
40985G06043K339817R63541p0085N35279P02730r03568k172651j256311Q1363
40976I26158m18110j567727r79668O91800R87924j65483o63461J34652Q77704
40967a76211R16111Q52968O47130l06540j295629r32176K73382L82072p37081
40958c75974j102840k2761P15399k5533p83253p7698J070006R40139j13936o05356
$$ plain form
40948 -381807 -885737 -1741323 -3198209 -4179130 -3536722 -1733160 -240876 264997 176826
40939 176826 -186269 -904493 -1703828 -1899121 -1340790 -650006 -218727 315523 1200519 1878684
40929 1878684 1828354 1587257 2052914 2925541 2797163 1039176 -1173318 -2231824 -1966465
40920 -1966465 -1517631 -1650700 -1968349 -1825669 -1283978 -788152 -417817 8635 378365
40911 378365 422039 288824 356409 434375 -136972 -1309682 -1935921 -1112604 584537 1881666
40901 1881666 2417193 2753012 3061428 2837853 1964761 1037014 353749 -459201 -1417637
40892 -1417637 -1736863 -1051490 -211997 -54044 -101748 549387 1635676 2111254 1783628
40883 1783628 1384861 1068430 14952 -2128964 -4319450 -5174852 -4495661 -3286155 -2525034
$$ packed form
40948c81807n03930q55586j456886r80921O42408J803562J492284N05873q8171
40939A76826l63095p18224p99335j95293N58331O90784M31279N34250Q84996O78165
40929A878684n0330k41097M65657Q72627j28378j757987k212494j058506K65359
40920a966465M48834j33069l17649J42680N41691M95826L70335M26452L69730
40911C78365M3674j33215O7585P7966n71347j172710o26239Q23317J697141J297129
40901A881666N35527L35819L08416k23575q73092r27747o83265q12950r58436
40892a417637l19226O85373Q39493J57953m7704O51135J086289M75578l27626
40883A783628l98767l16431j053478k143916k190486q55402O79191J209506P61121
$$ plain form
40874 -2525034 -2298506 -2130998 -1898275 -2095837 -3057198 -4245340 -4803696 -4567339 -3850732
40865 -3850732 -2522074 -363532 1809216 2881601 3415126 5003408 7136139 7074083 4224549
40856 4224549 2210418 4281817 8728667 11791485 13371913 16027879 19249660 19280594
40848 19280594 15123930 10498954 8476772 8007825 7627582 8750070 12263217 14919546
40840 14919546 13004779 8011179 5025919 6174344 8820611 9975925 9527262 8812634
40832 8812634 8457425 8293880 7775712 6097129 3193602 564810 -287358 17513 -213047
40823 -213047 -870389 -220748 1951897 3495262 2834842 1016743 -19528 262973 1300107
40814 1300107 2683598 4056762 4762835 4651002 4506277 4772908 4544725 2823673 291491
$$ packed form
40874b525034K26528J67508K32723j97562r61361j188142n58356K36357P16607
40865c850732J328658K158542K172748J072385N33525J588282K132731o2056k849534
40856D224549k014131K071399M446850L062818J580428K655966L221781L0934
40848A9280594m156664m624976k022182m68947l80243J122488L513147K656329
40840A4919546j914767m993600k985260J148425K646267J155314m48663p14628
40832H812634l55209j63545n18168j678583k903527k628792q52168L04871k30560
40823b13047o57342O49641K172645J543365o60420j818099j036271K82501J037134
40814A300107J383491J373164P06073j11833j44725K66631k28183j721052k532182
$$ plain form
40805 291491 -1237317 -1003263 -65640 209669 -260444 -507030 43379 780665 657790
40796 657790 -492678 -1731121 -2177534 -1987865 -1806451 -1638996 -967799 113279 714680
40787 714680 407768 -6298 436438 1423837 1743193 1060359 514126 1086463 2012670 1738086
40777 1738086 287319 -497025 498077 2003955 2198337 1246935 642552 614326 -54177
40768 -54177 -1669768 -2863043 -2584366 -1337551 52129 1339191 1939622 879019 -1309778
40759 -1309778 -2301117 -968100 779186 706782 -524215 -724610 309262 834118 156909
40750 156909 -599410 -650631 -500840 -525703 -323105 109062 -52422 -1204817 -2629087 -3325431
40740 -3325431 -2761516 -880030 1692615 3590757 3869182 3070470 2270190 1598336 882432
$$ packed form
40805B91491j528808K34054R37623K75309m70113k46586N50409P37286j22875
40796F57790j150468j238443m46413J89669J81414J67455O71197J081078O01401
40787G14680l06912m14066M42736R87399L19356o82834n46233N72337R26207k74584
40777A738086j450767p84344R95102J505878J94382r51402o04383k8226o68503
40768e4177j615591j193275K78677J246815J389680J287062O00431j060603k188797
40759a309778r91339J333017J747286p2404j230997k00395J033872N24856o77209
40750A56909p56319n1221J49791k4863K02598M32167j61484j152395j424270o96344
40740c325431N63915J881486K572645J898142K78425p98712q00280o71854p15904
$$ plain form
40731 882432 979917 2641888 4486138 4267084 2222892 993245 1839671 3134099 3287977
40722 3287977 2953876 3144723 3206850 2308404 1341066 1434210 1683191 381613 -2035057
40713 -2035057 -3232464 -2182032 -512689 -272120 -1532625 -2835641 -3243952 -3155236 -3244151
40704 -3244151 -3303740 -2616923 -1291580 -485332 -919930 -1824124 -2059989 -1723237 -1637696 -1772498
40694 -1772498 -1512863 -1219206 -1845564 -2903483 -2658175 -945490 46156 -1095115 -2701673
40685 -2701673 -2357114 -300439 1274747 1542349 1705304 2506152 2959969 2068144 406895
40676 406895 -798575 -1325694 -1813375 -2393621 -2344425 -1213932 318761 1146562 1055726
40667 1055726 798824 855503 826754 396882 137134 620278 1339203 1464735 1206829 1271767
$$ packed form
40731H82432R7485J661971J844250k19054k044192j229647Q46426J294428J53878
40722C287977l34101J90847O2127q98446r67338R3144K48981j301578k416670
40713b035057j197407J050432J669343K40569j260505j303016m08311Q8716q8915
40704c244151n9589O86817J325343Q06248m34598r04194k35865L36752Q5541j34802
40694a772498K59635K93657o26358j057919K45308J712685R91646j141271j606558
40685b701673L44559K056675J575186K67602J62955Q00848M53817q91825j661249
40676D06895j205470n27119m87681n80246M9196J130493J532693Q27801r0836
40667A055726k56902N6679k8749m29872k59748M83144P18925J25532k57906O4938
$$ plain form
40657 1271767 1340839 538278 -662677 -617567 1076981 2853506 3381212 3071160 2715731
40648 2715731 2075145 772769 -629671 -1483253 -1953576 -2199645 -1835742 -1184030 -1676496
40639 -1676496 -3628803 -4908659 -3579245 -855795 553387 305394 388208 1578367 2379683
40630 2379683 1797212 851910 464516 -177422 -1836725 -3345190 -3105149 -1552838 -545576
40621 -545576 -748555 -1101546 -791345 -389591 -714552 -1629477 -2505457 -3085602 -3250005 -2570034
40611 -2570034 -974445 495190 624733 -287205 -755772 -374685 -512555 -1981903 -3258425
40602 -3258425 -2505051 -592919 -154581 -1701248 -2748270 -1452826 746382 1376450 423708
40593 423708 -32125 1064874 2565351 2841117 1482398 -667276 -2230972 -2139258 -580923
$$ packed form
40657A271767O9072q02561j200955M5110J694548J776525N27706l10052l55429
40648B715731o40586j302376j402440q53582m70323k46069L63903O51712m92466
40639a676496j952307j279856J329414K723450J409182k47993Q2814J190159Q01316
40630B379683n82471r45302l87394o41938j659303j508465K40041J552311J007262
40621e45576k02979l52991L10201M01754l24961r14925q75980n80145j64403O79971
40611b570034J595589J469635J29543r11938m68567L81087j37870j469348j276522
40602c258425P53374J912132M38338j546667j047022J295444K199208O30068r52742
40593D23708m55833J096999J500477K75766j358719k149674j563696R1714J558335
$$ plain form
40584 -580923 955377 1253622 763371 736474 1340090 1578777 921987 -10396 -470633 -422551
40574 -422551 -170419 155945 545159 1052225 1871046 2967055 3697424 3426901 2536110
40565 2536110 2134915 2609119 3059280 2469050 990344 -274217 -571285 -300047 -413456
40556 -413456 -1021466 -940193 787717 3104505 3777837 2385013 1136082 1731678 2687822
40547 2687822 1504511 -1343471 -2827330 -1677052 101763 653389 913464 2403992
40539 2403992 4246975 4449211 3123860 2219947 2398440 2319972 1225034 187935 77480
40530 77480 67131 -615950 -932902 300060 1966296 1905018 301382 -323402 1141169
40521 1141169 2744590 2554639 1495689 1473144 2104190 1476389 -575673 -2238731 -2593325
$$ packed form
40584e80923J536300K98245m90251k6897O03616K38687o56790r32383m60237M8082
40574d22551K52132L26364L89214N07066Q18821J096009P30369k70523q90791
40565B536110m01195M74204M50161n90230j478706j264561k97068K71238j13409
40556d13456o08010Q1273J727910K316788O73332j392824j248931N95596R56144
40547B687822j183311k847982j483859J150278J778815N51626K60075J490528
40539B403992J842983K02236j325351r03913J78493p8468j094938j037099j10455
40530G7480j0349o83081l16952J232962J666236o1278j603636o24784J464571
40521A141169J603421j89951j058950k2545O31046o27801k052062j663058l54594
$$ plain form
40512 -2593325 -2482875 -2323558 -1358496 238193 823441 50824 4157 1828320 3161194
40503 3161194 1337982 -2124621 -3061346 -311394 2832167 3147804 1137121 -626114
40495 -626114 -845682 -3329 1132140 2123753 2590329 2328522 1552546 597764 -350163
40486 -350163 -1099718 -1464826 -1498301 -1293259 -732960 -18708 -21776 -1136673 -2200723 -1883124
40476 -1883124 -830308 -716937 -1275825 -485034 1817152 2986596 1525142 -344817 -53358
40467 -53358 1308047 959732 -922946 -1607880 -335288 742259 460874 428228 1827696
40458 1827696 3130145 2712856 1656504 1860251 2912695 3133137 2741344 3539565 5723916
40449 5723916 7283048 6826899 5155585 3633658 2724572 2672178 3896982 5746821 6294554
$$ packed form
40512b593325J10450J59317R65062J596689N85248p72617m6667J824163J332874
40503C161194j823212l462603r36725K749952L143561L15637k010683j763235
40495f26114k19568Q42353J135469R91613M66576k61807p75976r54782r47927
40486c50163p49555l65108l3475K05042N60299P14252l068j114897j064050L17599
40476a883124J052816J13371n58888P90791K302186J169444j461454j869959K91459
40467e3358J361405l48315j882678o84934J272592J077547k81385l2646J399468
40458A827696J302449m17289j056352K03747J052444K20442l91793P98221K184351
40449E723916J559132m56149j671314j521927r09086n2394J224804J849839N47733
$$ plain form
40440 6294554 4632406 2397084 1835995 3116674 4653979 5371283 5400903 5092968 4641453
40431 4641453 4414870 4508882 4251133 3273574 2691846 3835815 6013235 7067454 6209538
40422 6209538 4757791 3873500 3231818 2429697 2009028 2200615 2139678 1370603 777911
40413 777911 892442 688888 -450412 -901867 1089546 4317035 5845292 5061459 4303383
40404 4303383 5238414 6711172 6934372 6051257 5362715 5235751 5057629 4566392 4068271
40395 4068271 3647173 3075903 2422138 2084186 2210626 2494882 2566010 2380190 2273948 2688424
40385 2688424 3668041 4597746 4656294 3550859 1651780 -369592 -1668332 -1359610 673142
40376 673142 3168378 4571655 4888582 5565625 7233426 8589683 8218104 6676514 5782941
$$ packed form
40440F294554j662148k235322n61089J280679J537305P17304K9620l07935m51515
40431D641453k26583R4012k57749r77559n81728J143969K177420J054219q57916
40422F209538j451747q84291o41682q02121m20669J91587o0937p69075n92692
40413G77911J14531k03554j139300m51455J991413L227489J528257p83833p58076
40404D303383R35031J472758K23200q83115o88542j26964j78122m91237m98121
40395D068271m21098n71270o53765l37952J26440K84256P1128j85820j06242M14476
40385B688424R79617R29705N8548j105435j899079k021372j298740L08722K032752
40376F73142K495236J403277L16927O77043J667801J356257l71579j541590q93573
$$ plain form
40367 5782941 6291679 7317506 7902237 8100111 8277461 8183775 7303443 5781713 4431200
40358 4431200 3725953 3105028 1662559 -366444 -1283215 261396 3296604 5351021 5508564
40349 5508564 5492663 6869521 8338843 7489772 4735811 3358998 5174071 8085156 9086854
40340 9086854 8127488 7363895 7681937 8000613 7649054 7354504 7565861 7549419 6820735 6121186
40330 6121186 6253810 7082712 8329791 10178671 12347704 13838761 14632842 16446641 20520796
40321 20520796 25637335 29701001 32340663 34307201 35095506 33227117 28755841 23661423
40313 23661423 19614468 16860958 15307094 14993474 15212107 14760792 13563739 12737272 12718392
40304 12718392 12626107 11731447 10230210 8414203 6559165 5701289 6728427 8491810 8836451
$$ packed form
40367E782941N08738J025827N84731J97874J77350r3686q80332j521730j350513
40358D431200p05247o20925j442469k029003r16771J544611L035208K054417J57543
40349E508564j5901J376858J469322q49071k753961j376813J815073K911085J001698
40340I086854r59366p63593L18042L18676l51559k94550K11357j6442p28684o99549
40330F121186J32624Q28902J247079J848880K169033J491057P94081J813799M074155
40321B0520796N116539M063666K639662J966538P88305j868389m471276n094418
40313B3661423m046955k753510j553864l13620K18633m51315j197053q26467j8880
40304A2718392r2285q94660j501237j816007j855038q57876J027138J763383L44641
$$ plain form
40295 8836451 7853661 7788863 9105706 9371113 7344045 5399482 5832284 7149180 6601466
40286 6601466 4513180 3215069 2995975 2130271 290414 -841889 -199868 1679410 4080433
40277 4080433 6541579 8220261 8731208 9116840 10113210 10320737 8399714 6119862 6271082
40268 6271082 8113891 8287440 6214839 4935344 5856171 6406775 4517216 2098383 1750295
40259 1750295 2639746 2336981 878413 235306 903739 1627061 1906742 2477782 3492460
40250 3492460 4190758 4400366 4724297 5110052 4688242 3344929 2232122 2216419 2727464
40241 2727464 2752700 2368167 2535091 3543368 4435214 4373948 4036031 4735198 6258558
40232 6258558 6823260 5708179 4624142 5353789 7166232 8143358 8164147 8559460 9308564
$$ packed form
40295H836451r82790o4798J316843K65407k027068j944563M32802J316896n47714
40286F601466k088286j298111k19094q65704j839857j132303O42021J879278K401023
40277D080433K461146J678682N10947L85632R96370K07527j921023k279852J51220
40268F271082J842809J73549k072601j279495R20827N50604j889559k418833l48088
40259A750295Q89451l02765j458568o43107O68433P23322K79681N71040J014678
40250C492460O98298K09608L23931L85755m21810j343313j112807j5703N11045
40241B727464K5236l84533J66924J008277Q91846o1266l37917O99167J523360
40232F258558N64702j115081j084037P29647J812443R77126K0789L95313P49104
$$ plain form
40223 9308564 8940158 7367027 6502480 7358540 8544199 8645900 8373850 9066218 10324494
40214 10324494 10517350 9049864 7188835 6851150 8797136 11624826 12806365 11471369
40206 11471369 9617878 9442694 10336500 10310116 9488444 9582178 10372173 9905847 8369884
40197 8369884 8328481 10267058 11362471 10082923 8597729 8723108 8866952 7555501 6867859
40188 6867859 9135560 12675534 14231948 13759950 13368849 13156811 11755489 9906605 9821734
40179 9821734 11492524 12916754 13610451 14773562 16253041 16454719 15282681 14352269 14284331
40170 14284331 14425032 15049518 16992845 19166812 19415411 18037294 17636460 19247605 21357657
40161 21357657 22831169 23753581 23238205 19938732 15488349 13867124 16019668 18335490
$$ packed form
40223I308564l68406j573131q64547Q56060J185659J01701k72050O92368J258276
40214A0324494J92856j467486j861029l37685J945986K827690J181539j334996
40206A1471369j853491j75184Q93806k6384q21672R3734P89995m66326j535963
40197H369884m1403J938577J095413j279548j485194J25379J43844j311451o87642
40188F867859K267701L539974J556414m71998l91101k12038j401322j848884q4871
40179I821734J670790J424230O93697J163111J479479K01678j172038r30412o7938
40170A4284331J40701O24486J943327K173967K48599j378117m00834J611145K110052
40161B1357657J473512R22412n15376l299473m450383j621225K152544K315822
$$ plain form
40153 18335490 17986705 16590097 16711320 17826905 18146520 17803319 17586520 16705860 14607025
40144 14607025 13203958 14358942 16438410 16342943 14210003 13253401 15126892 17960564
40136 17960564 19231238 18522899 16937467 15347607 13995734 13020734 12766264 13549448 14958633
40127 14958633 15582448 14355348 12269792 11484492 12380380 13054612 12411974 11943775 13154468
40118 13154468 14857705 14789757 12828427 10900965 10400354 11074574 11798963 11370376 9462545
40109 9462545 7723564 8519912 11465672 13110688 11819396 10773933 13368653 17439995
40101 17439995 17786235 13632054 9569732 8826409 9549101 9048388 8129268 8823031 10366937
40092 10366937 10366199 8716535 7641839 8094827 8419898 7135919 5426970 5715751 8352827
$$ packed form
40153A8335490l48785j396608J21223J115585L19615l43201k16799q80660k098835
40144A4607025j403067J154984K079468r5467k132940r56602J873491K833672
40136A7960564J270674p08339j585432j589860j351873r75000k54470P83184J409185
40127A4958633O23815j227100k085556p85300Q95888O74232o42638m68199J210693
40118A3154468J703237o7948j961330j927462n00611O74220P24389m28587j907831
40109I462545j738981P96348K945760J645016j291292j045463K594720M071342
40101A7439995L46240m154181m062322p43323P22692n00713r19120O93763J543906
40092A0366937p38j649664j074696M52988L25071j283979j708949K88781K637076
$$ plain form
40083 8352827 10891159 10919005 8776034 6717550 6063951 6505213 7783249 9886610 11199339
40074 11199339 9164822 4399401 1637965 4019149 8428459 9698050 7838628 7177856
40066 7177856 9189426 10753677 9857018 8415170 8052148 7335087 5392265 4504788 6286663
40057 6286663 8419587 8284124 7167512 7511200 8301634 7015948 4509784 3923923 5549032
40048 5549032 6658282 6202804 6001742 7013295 7822826 7554887 7366887 8136468 9103644
40039 9103644 9624444 10078407 10396702 9903757 9214459 9939485 11770564 12305149 10764032
40030 10764032 9433783 10099844 11378234 11211449 9911058 8893026 8280777 7805443 8442082
40021 8442082 10821059 13134386 12944263 10484383 8221764 7637509 8194788 8981979 9560503
$$ packed form
40083H352827K538332K7846k142971k058484o53599M41262J278036K103361J312729
40074A1199339k034517m765421k761436K381184M409310J269591j859422o60772
40066G177856K011570J564251q96659j441848l63022p17061j942822q87477J781875
40057F286663K132924j35463j116612L43688P90434j285686k506164n85861J625109
40048E549032J109250m55478k01062J011553Q09531k67939j88000P69581R67176
40039I103644N20800M53963L18295m92945o89298P25026J831079N34585j541117
40030A0764032j330249O66061J278390j66785j300391j018032o12249m75334O36639
40021H442082K378977K313327j90123k459880k262619n84255N57279P87191N78524
$$ plain form
40012 9560503 9456619 8487568 7502384 7439289 7886026 7881104 7744534 8581468 10189235 11061085
40002 11061085 10556655 9681001 9508807 9984071 10467688 10534206 10128707 9651802 9714722 10180616
39992 10180616 10048240 9144633 8989805 10591495 12328564 11986258 10297888 10141428 12287921
39983 12287921 14333542 14243135 12662618 10993550 9406427 7929640 7557865 8747273
39975 8747273 10193646 10507695 9973762 9453533 8786431 7636735 6768300 6940773 7498972
39966 7498972 7650201 8246727 10435252 13133271 13940611 12498315 10933260 10620088 10419941
39957 10419941 8981899 7156688 6768951 8009349 9528575 10610166 11707114 12808166
39949 12808166 12816780 11278063 9612309 9486783 10517198 10838447 9805596 8802192 9111891
$$ packed form
40012I560503j03884r69051r85184o3095M46737m922j36570Q36934J607767Q71850
40002A1061085n04430q75654j72194M75264M83617O6518m05499m76905O2920M65894
39992A0180616j32376r03607j54828J601690J737069l42306j688370j56460K146493
39983A2287921K045621r0407j580517j669068j587123j476787l71775J189408
39975H747273J446373L14049n33933n20229o67102j149696q68435J72473N58199
39966G498972J51229N96526K188525K698019Q07340j442296j565055l13172k00147
39957A0419941j438042j825211l87737J240398J519226J081591J096948J101052
39949A2808166Q614j538717j665754j25526J030415L21249j032851j003404L09699
$$ plain form
39940 9111891 10290188 11276694 11929202 12523324 12795407 12700199 13239515 15075410 16967987
39931 16967987 17252371 16482111 16758761 18463602 19630216 19089940 18472702 20049684 23714417
39922 23714417 27120908 28285833 27522690 27143327 29164777 32709782 34227324 31505524
39914 31505524 26851203 24463991 25126198 25984991 25562005 25763571 27866247 29788019 29568912
39905 29568912 28899191 30255277 32405942 32108853 29315215 27310747 27775746 28779129
39897 28779129 28196230 26401892 24552566 22526115 20138804 18742598 19663611 21775506
39889 21775506 22474738 21148890 20157003 21618318 24306235 25188957 23842044 23490981 26710913
39880 26710913 31615745 34106860 32953165 30437300 28579171 27587292 28174765 31972260
$$ packed form
39940I111891J178297R86506O52508N94122K72083r5208N39316J835895J892577
39931A6967987K84384p70260K76650J704841J166614n40276o17238J576982L664733
39922B3714417L406491J164925p63143l79363K021450L545005J517542k721800
39914C1505524m654321k387212O62207Q58793m22986K01566K102676J921772k19107
39905B9568912o69721J356086K150665k97089k793638k004468M64999J003383
39897B8779129n82899j794338j849326k026451k387311j396206R21013K111895
39889B1775506O99232j325848r91887J461315K687917Q82722j346913l51063L219932
39880B6710913M904832K491115j153695k515865j858129r91879N87473L797495
$$ plain form
39872 31972260 38081899 42046754 40577858 35546413 31365892 30174581 31495089 34525509
39864 34525509 38027375 39478562 37379236 33694718 31545105 31319592 31470439 31910049
39856 31910049 33453781 34643745 32781051 28435375 25744587 27322836 31205161 33558976
39848 33558976 32520288 29045910 25900113 25887186 29054606 31682563 30162187 25609662
39840 25609662 22250546 21799346 22604736 23984177 27220407 31437007 32768324 29698268
39832 29698268 25795770 24826165 26125770 27226377 28056274 29424569 29806013 27373954
39824 27373954 23917331 23206774 25927563 29138539 30511573 30468565 30119557 29615502 29154433
39815 29154433 29731111 31955399 34996007 37113284 36833435 33916498 29859048 27027800
$$ packed form
39872C1972260O109639L964855j468896n031445m180521j191311J320508L030420
39864C4525509L501866J451187k099326l684518k149613k25513J50847M39610
39856C1910049J543732J189964j862694m345676k690788J578249L882325K353815
39848C3558976j038688l474378l145797j2927L167420K627957j520376m552525
39840B5609662l359116m51200Q05390J379441L236230M216600J331317l070056
39832B9698268l902498r69605J299605J100607Q29897J368295L81444k432059
39824B7373954l456623p10557K720789L210976J373034m3008l49008n04055m61069
39815B9154433N76678K224288L040608K117277k79849k916937m057450k831248
$$ plain form
39807 27027800 26471876 26833303 25935167 23001307 18977430 15493119 13992036 14907327 17040267
39798 17040267 18606706 19278860 20040991 20824371 20170907 17998538 16565403 17266708 18377665
39789 18377665 17679763 15557413 13564650 11679839 9352597 7785116 8410518 10054557
39781 10054557 10396159 9661678 10071326 11871528 12772725 11617500 10024545 9696565 10210110
39772 10210110 10325538 9886852 9654888 10339857 12079530 13907453 13993055 11688625 8876247
39763 8876247 7695109 7536422 6342899 4347071 3885399 5525145 7221649 7814496 8479278
39754 8479278 9755600 10060317 8780267 8210949 10183304 12752734 12727631 10172986 7987081
39745 7987081 7848143 8874673 9854420 10628981 11230906 11384599 11122041 10729555 10095311
$$ packed form
39807B7027800n55924L61427q98136k933860m023877l484311j501083R15291K132940
39798A7040267J566439O72154P62131P83380o53464k172369j433135P01305J110957
39789A8377665o97902k122350j992763j884811k327242j567481O25402J644039
39781A0054557L41602p34481M09648J800202R01197j155225j592955l27980N13545
39772A0210110J15428m38686k31964O84969J739673J827923Q5602k304430k812378
39763H876247j181138j58687j193523j995828m61672J639746J696504N92847O64782
39754H479278J276322L04717j280050n69318J972355K569430k5103k554645k185905
39745G987081j38938J026530R79747P74561O01925J53693k62558l92486o34244
$$ plain form
39736 10095311 9105893 8396009 8574915 9059457 8936000 8625423 9233178 10515139 11233851
39727 11233851 11571315 13196842 16307936 18522004 18004571 16304288 16477753 19185356
39719 19185356 22187217 23264104 22128768 19627282 16661712 14280587 13532763 14494691
39711 14494691 16107648 17325607 17731116 16975612 14913367 12837866 13120013 16369987
39703 16369987 20015193 21169483 20064913 18903824 18073088 15959400 12587778 10734578
39695 10734578 12228755 15209909 16631143 15898293 14340363 12546650 10424275 8925555
39687 8925555 9173181 10072916 9230446 6573691 4813924 5552293 6999602 6769601 5159091
39678 5159091 4028601 3783214 3459196 3080497 3794488 5643425 7060710 7099530 6720649
$$ packed form
39736A0095311r89418p09884J78906M84542j23457l10577O07755J281961P18712
39727A1233851L37464J625527L111094K214068n17433j700283J73465K707603
39719A9185356L001861J076887j135336k501486k965570k381125p47824R61928
39711A4494691J612957J217959M05509p55504k062245k075501K82147L249974
39703A6369987L645206J154290j104570j161089q30736k113688l371622j853200
39695A0734578J494177K981154J421234p32850j557930j793713k122375j498720
39687H925555K47626Q99735q42470k656755j759767P38369J447309k30001j610510
39678E159091j130490k45387l24018l78699P13991J848937J417285L8820l78881
$$ plain form
39669 6720649 7147627 8068874 8306399 7434846 5935068 4449139 3636964 3973187 4745451
39660 4745451 4122387 1573251 -488228 701590 4281068 6521965 5894133 5035258 6483155
39651 6483155 8590748 7830767 3956896 507532 440127 3185202 6120360 7408776 7104386
39642 7104386 6586349 7137177 8438950 8830634 7760123 7004653 8067770 9397897 8330867
39633 8330867 5271078 3497696 4756823 7390407 9157196 9563057 8838315 7041357
39625 7041357 5188217 5050369 6539010 7197918 5619987 3588665 3394742 4640645 5244502
39616 5244502 4281469 2391813 536220 -408069 26845 914502 570981 -881546 -1188599
39607 -1188599 704106 2799311 2944470 1801321 1263610 1580033 1919786 2340385 3201251
$$ packed form
39669F720649M26978R21247K37525q71553j499778j485929q12175L36223P72264
39660D745451o23064k549136k061479J189818L579478K240897o27832q58875J447897
39651F483155K107593p59981l873871l449364o7405K745075K935158J288416l04390
39642G104386n18037N50828J301773L91684j070511p55470J063117J330127j067030
39633H330867l059789j773382J259127K633584J766789M05861p24742j796958
39625G041357j853140j37848J488641O58908j577931k031322j93923J245903O03857
39616E244502r63033j889656j855593r44289M34914Q87657l43521j452527l07053
39607a188599J892705K095205J45159j143149n37711L16423L39753M20599Q60866
$$ plain form
39598 3201251 3738943 3049811 1606936 436995 -109418 284390 2145118 4656600 5846981
39589 5846981 5648628 6454179 9090986 11003221 10467577 9596356 10568079 12088625 12893942
39580 12893942 15547659 22553839 31270936 37064875 39263588 39869807 39545227 40242593
39572 40242593 48320153 67163542 87870470 95378534 84903531 66226582 51902281
39565 51902281 48149637 56525054 74339121 90431709 90278682 71608269 48837761 36854151
39557 36854151 36029694 37798795 37922001 37062809 33876445 26379378 17669175 12697964
39549 12697964 10786594 7740804 3792655 2864510 4981602 6044393 5010625 5153337
39541 5153337 7767144 10333490 11832549 14666290 19932602 25158538 28107255 29346423
$$ packed form
39598C201251N37692o89132j442875j169941n46413L93808J860728K511482J190381
39589E846981j98353Q05551K636807J912235n35644q71221R71723J520546Q05317
39580A2893942K653717P006180Q717097N793939K198713O06219l24580O97366
39572D0242593Q077560J8843389K0706928P508064j0475003j8676949j4324301
39565E1902281l752644Q375417J7814067J6092588j53027j8670413k2770508j1983610
39557C6854151q24457J769101J23206q59192l186364p497067q710203m971211
39549A2697964j911370l045790l948149r28145K117092J062791j033768J42712
39541E153337K613807K566346J499059K833741N266312N225936K948717J239168
$$ plain form
39533 29346423 30397178 32713247 38273784 46850058 52763973 49781377 40522072 35724989
39525 35724989 41590595 52004875 56081746 50016537 38819570 29453158 25316524 25305419
39517 25305419 25386752 22145023 16362329 11873908 10353275 9627700 7911660 6524865
39509 6524865 6768004 7180520 6150746 4680637 4287856 4520216 4732688 5808001 7670603
39500 7670603 7743794 4897505 2482196 3803233 6500929 5570760 891377 -2567714 -1908338
39491 -1908338 429059 1270288 947942 1437532 2974916 4325431 4699266 3936491 2071480
39482 2071480 -47047 -695342 1011816 3850187 5630703 5255367 3367472 1520288
39474 1520288 968522 1784503 2919578 3359310 3086859 2670536 2403458 2326653 2426955
$$ packed form
39533B9346423J050755K316069N560537Q576274N913915k982596r259305m797083
39525C5724989N865606J0414280M076871o065209j1196967r366412m136634j1105
39517B5305419Q1333l241729n782694m488421j520633p25575j716040j386795
39509F524865K43139M12516j029774j470109l92781K32360K12472J075313J862602
39500G670603P3191k846289k415309J321037K697696r30169m679383l459091O59376
39491a908338K337397Q41229l22346M89590J537384J350515L73835p62775j865011
39482B071480k118527o48295J707158K838371J780516l75336j887895j847184
39474A520288n51766Q15981J135075M39732k72451m16323k67078p6805J00302
$$ plain form
39465 2426955 2152585 650164 -1497900 -1863808 849373 4249559 4796521 2562348 1109395
39456 1109395 2458936 4658437 5112229 3886358 2275604 263059 -2452576 -4371193
39448 -4371193 -3654948 -1186438 49207 -1323046 -3750418 -5209496 -5141618 -3576733 -328027
39439 -328027 3759146 6225125 5341070 2460662 594017 862632 1682391 1430687 466861
39430 466861 2009 261601 800781 1781635 3573849 5350612 5481297 3656161 1545153
39421 1545153 777790 1129681 1425789 1437449 1772525 2305377 2078597 975398 329196
39412 329196 1232324 2971253 3827465 2969076 968493 -1079119 -2270868 -2189991 -1369187
39403 -1369187 -1145976 -2010007 -2306799 -33647 3793472 5256774 2172222 -2665733 -4563069
$$ packed form
39465B426955k74370j502421k148064l65908K713181L400186N46962k234173j452953
39456A109395J349541K199501M53792j225871j610754k012545k715635j918617
39448d371193P16245K468510J235645j372253k427372j459078O7878J564885L248706
39439c28027M087173K465979q84055k880408j866645K68615Q19759k51704r63826
39430D66861m64852K59592N39180R80854J792214J776763J30685j825136k111008
39421A545153p67363L51891K96108J1660L35076N32852k26780j103199o46202
39412C29196R03128J738929Q56212q58389k000583k047612j191749Q0877Q20804
39403a369187K23211q64031k96792K273152L827119J463302l084552m837955j897336
$$ plain form
39394 -4563069 -2565887 -87178 -28860 -1446742 -1818012 -722380 236936 16802 -1022389
39385 -1022389 -2266129 -3252635 -3158215 -1410619 1022840 2251902 1686772 554537 -77872
39376 -77872 -545946 -1272017 -1462617 -217456 1830999 3157744 3230630 2728738 2222830
39367 2222830 1794246 1811849 2747590 3958502 3954630 2517722 1374441 1761515 2350772
39358 2350772 1115770 -1282612 -1886324 489144 3333903 3582145 1404055 -448559
39350 -448559 -292361 956422 1610233 1173139 308067 -129991 260315 1112963 1586984
39341 1586984 1499981 1844000 3384026 5226050 5928567 5551334 5053999 4084979 1548516
39332 1548516 -1508892 -2142660 390465 3106231 3261335 1675731 399226 -649040
$$ packed form
39394d563069J997182K478709N8318j417882l71270J095632R59316k20134j039191
39385a022389j243740r86506R4420J747596K433459J229062n65130j132235o32409
39376g7872m68074p26071j90600J245161K048455J326745P2886n01892n05908
39367B222830m28584J7603R35741J210912l872j436908j143281L87074N89257
39358B350772j235002k398382o03712K375468K844759K48242k178090j852614
39350d48559J56198J248783O53811m37094q65072m38058L90306Q52648M74021
39341A586984q7003L44019J540026J842024P02517l77233m97335r69020k536463
39332A548516l057408o33768K533125K715766J55104j585604j276505j048266
$$ plain form
39324 -649040 -2266451 -3162656 -1733910 524246 700592 -990942 -1656476 -505245 287226
39315 287226 -219572 -312626 634832 632421 -1015949 -1647596 490078 2792210 2109058 -230430
39305 -230430 -581749 1321332 2397676 1268347 -193023 -433508 -230633 -531121 -934881
39296 -934881 -1195942 -1934633 -2820148 -2114029 664334 3323327 3718074 2551729 1937431
39287 1937431 2249229 2167552 1270095 686029 1021113 1228043 304117 -894276 -628172
39278 -628172 1209783 2638279 2048486 335405 -344438 400420 710606 -670432 -2434757
39269 -2434757 -2657593 -1690510 -1569464 -2956073 -4284969 -4023661 -2326456 -164168 1765174
39260 1765174 2715090 1869338 -378281 -2081779 -1748730 -131728 852558 491980 -307344
$$ packed form
39324f49040j617411q96205J428746K258156J76346j691534o65534J151231P92471
39315B87226n06798r3054R47458k411j648370o31647K137674K302132o83152k339488
39305b30430l51319J903081J076344j129329j461370k40485K02875l00488m03760
39296i34881k61061p38691q85515P06119K778363K658993L94747j166345o14298
39287A937431L11798q1677q97457n84066L35084K06930r23926j198393K66104
39278f28172J837955J428496n89793j713081o79843P44858L10186j381038j764325
39269b434757k22836R67083J21046j386609j328896K61308J697205K162288J929342
39260A765174R49916q45752k247619j703498L33049J617002R84286l60578p99324
$$ plain form
39251 -307344 -566434 -209541 413775 1109455 1718847 1927950 1483509 502658 -467702 -774006
39241 -774006 -324455 65752 -509198 -1703514 -1968303 -369739 2085100 3484695 3128297
39232 3128297 2076141 1655437 1885617 1629716 272730 -1007025 -224064 2788127 5401099
39223 5401099 4877506 1789005 -524639 -26352 1896027 2844529 2412651 1727027 1287689
39214 1287689 799112 451973 798207 1509835 1516954 443562 -952484 -1728305 -1506240
39205 -1506240 -548402 291153 124041 -800107 -1085849 -114698 853682 551286 -253124
39196 -253124 -40818 902177 1025703 176415 -218651 457674 1307986 1694633 1884764 1703276
39186 1703276 411621 -1570727 -2485051 -1376777 869485 2833730 3474029 1899376
$$ packed form
39251c07344k59090L56893O23316O95680O09392K09103m44441r80851r70360l06304
39241g74006M49551L90207n74950j194316k64789J598564K454839J399595l56398
39232C128297j052156m20704K30180k55901j356986j279755P82961L012191K612972
39223E401099n23593l088501k313644M98287J922379R48502m31878o85624m39338
39214A287689m88577l47139L46234P11628P119j073392j396046p75821K22065
39205a506240R57838Q39555j67112r24148k85742R71151R68380l02396q04410
39196b53124K12306R42995J23526q49288l95066O76325Q50312L86647J90131j81488
39186A703276j291655j982348r14324J108274K246262J964245O40299j574653
$$ plain form
39178 1899376 -1721512 -4907389 -4846697 -2067684 208643 706429 1152816 2036541 1020787
39169 1020787 -2516782 -4948487 -3370448 -233137 446539 -829431 -633755 1377049
39161 1377049 2295802 1106392 -49466 239450 1026419 1509017 1983961 2029449 771096
39152 771096 -733905 -399533 1236505 1362352 -583922 -1966486 -1355116 -581994 -1129275
39143 -1129275 -1650950 -851024 4561 -473492 -1201717 -619825 604494 891396 223795
39134 223795 -446845 -861935 -1059221 -765300 -398699 -1008562 -2139564 -1851928 -101536
39125 -101536 428109 -1400791 -2793766 -1295510 1168015 1584671 962983 2431437 5659884
39116 5659884 7145281 5598152 3371279 2359275 1753823 534004 -549152 -482336 391906
$$ packed form
39178A899376l620888l185877O0692K779013K276327M97786M46387Q83725j015754
39169A020787l537569k431705J578039L137311O79676j275970J95676K010804
39161A377049R18753j189410j155858K88916P86969M82598M74944M5488j258353
39152G71096j505001L34372J636038J25847j946274j382564O11370P73122n47281
39143a129275n21675P99926Q55585m78053p28225N81892J224319K86902o67601
39134B23795o70640m15090j97286K93921L66601o09863j131002K87636J750392
39125a01536N29645j828900j392975J498256K463525M16656o21688J468454L228447
39116E659884J485397j547129k226873j012004o05452j219819j083156O6816Q74242
$$ plain form
39107 391906 1006298 564765 -1126440 -3035473 -3084171 -600607 2022240 2079687 296842
39098 296842 -487620 309385 857847 806006 1829640 3654927 3100122 -1062923 -5048708
39089 -5048708 -4381924 262047 3919487 3364783 277369 -1587274 -847958 577559 440818
39080 440818 -903255 -1265580 36187 1187307 874030 479612 1674837 3359087 3317777
39071 3317777 1859750 1080017 1077969 -76950 -2537782 -3779958 -2146734 1136898 4087532
39062 4087532 5889286 6346090 5767321 5701678 7343543 9242109 9678163 11167782 18106210
39053 18106210 28716814 34277295 29384835 19052599 11954148 9967880 8748447 5966532
39045 5966532 3637047 3179479 3187440 2619800 2396644 3033679 3643689 3907003 4471086 4947096
$$ packed form
39107C91906O14392m41533j691205j909033m8698K483564K622847N7447j782845
39098B96842p84462P97005N48462n1841J023634J825287n54805m163045l985785
39089e048708O66784M643971L657440n54704l087414j864643P39316J425517j36741
39080D40818j344073l62325J301767J151120l13277l94418J195225J684250m1310
39071C317777j458027p79733k048j154919k460832j242176J633224L283632K950634
39062D087532J801754M56804n78769o5643J641865J898566M36054J489619O938428
39053A8106210J0610604N560481m892460j0332236p098451j986268j219433k781915
39045E966532k329485m57568P961n67640k23156O37035O10010K63314N64083M76010
$$ plain form
39035 4947096 3957115 1638087 -150192 -487167 -138471 487243 1748705 2912431 2491931
39026 2491931 1017911 880663 2559441 3541575 2134910 -39368 -712863 139754 1601714
39017 1601714 3723698 6124316 6664220 4026193 415717 -695270 1185617 3581139
39009 3581139 4553531 4144716 2963128 1630346 1413271 3125141 5199637 4931787 2063229
39000 2063229 -757116 -1596250 -1378577 -1604057 -1905167 -1278458 -179306 378167 789729
38991 789729 2082732 3753008 4261487 3566383 3354676 4443041 5571280 5460285 4716643
$$ packed form
39035D947096r89981k319028j788279l36975L48696O25714J261462J163726m20500
39026B491931j474020j37248J678778R82134j406665k174278o73495Q52617J461960
39017A601714K121984K400618N39904k638027l610476j110987J880887K395522
39009C581139R72392m08815j181588j332782k17075J711870K074496k67850k868558
39000B063229k820345q39134K17673k25480l01110O26709J099152N57473M11562
38991G89729J293003J670276N08479o95104k11707J088365J128239j10995p43642
$$ [...]
##END NTUPLES=NMR SPECTRUM
##END=
