##TITLE=31Pdec_SR114_5
 , 24 sc
 5.4.2022
##JCAMPDX= 6.0         $$ Bruker NMR JCAMP-DX V2.0
##DATA TYPE= NMR SPECTRUM
##DATA CLASS= NTUPLES
##ORIGIN= UXNMR, Bruker Analytische Messtechnik GmbH
##OWNER= root
$$ XWIN-NMR		Version 3.5
$$ Tue Apr  5 11:00:14 2022 Russian Standard Time (UT+4h)  she@DPX200
##.OBSERVE FREQUENCY= 81.013821
##.OBSERVE NUCLEUS= ^31P
##.ACQUISITION MODE= SIMULTANEOUS
##.ACQUISITION SCHEME= undefined
##.AVERAGES= 24
##.DIGITISER RES= 16
##SPECTROMETER/DATA SYSTEM= spect
##.PULSE SEQUENCE= zgpg30
##.SOLVENT NAME= CDCl3
##.SHIFT REFERENCE= (INTERNAL, CDCl3, 0, 248.564)
##AUDIT TRAIL= $$ (NUMBER, WHEN, WHO, WHERE, WHAT)
$$ ##TITLE= Audit trail, XWIN-NMR		Version 3.5
$$ ##JCAMPDX= 5.01
$$ ##ORIGIN= Bruker BioSpin GmbH
$$ ##OWNER= she
$$ F:/spectra/data/she/nmr/P31/1/pdata/1/auditp.txt
$$ ##AUDIT TRAIL=  $$ (NUMBER, WHEN, WHO, WHERE, WHAT)
(   1,<2022-04-05 10:59:19.89 +0400>,<she>,<DPX200>,
      <created by zg, POWCHK disabled, PULCHK disabled
       configuration hash MD5:
       00 E9 B6 7A A2 85 ED C7 34 08 36 98 17 FE 4E 26
       data hash MD5: 32K
       65 24 B5 33 FD CB A2 DF 28 B3 46 C2 A5 E5 1A 1C>)
(   2,<2022-04-05 10:59:22.06 +0400>,<she>,<DPX200>,
      <Start of raw data processing
       efp BC_mod = 2 LB = 1 FT_mod = 6 PKNL = 1 PHC0 = -9572.284 PHC1 = 153.2756 SI = 64K 
       data hash MD5: 64K
       73 60 78 71 D2 17 3D 3F 06 AB 8C 4E C7 84 D4 F9>)
(   3,<2022-04-05 10:59:41.95 +0400>,<she>,<DPX200>,
      <pk PHC0 = 46.53413 PHC1 = -124.2 
       data hash MD5: 64K
       6F F5 6B 11 66 F6 B2 8F 6B 25 06 E4 7B BC D6 BF>)
(   4,<2022-04-05 10:59:44.46 +0400>,<she>,<DPX200>,
      <abs ABSG = 5 
       data hash MD5: 64K
       ED 1C 1D 11 AD AA FE 06 A7 57 61 CB 0F 15 3D C1>)
$$ ##END=
$$ 
$$ hash MD5
$$ BE D7 74 52 F6 85 CC B3 80 D2 DB E3 C0 90 BD 26
##$RELAX= 
##$RELAX= 
##$RELAX= 
##$RELAX= 
##$RELAX= 
##$RELAX= 
##$RELAX= 
##$RELAX= 
$$ Bruker specific parameters
$$ --------------------------
##$DU= <F:/spectra>
##$EXPNO= 1
##$NAME= <P31>
##$PROCNO= 1
##$TYPE= <nmr>
##$USER= <she>
##$AMP= (0..31)
100 100 100 100 100 100 100 100 100 100 100 100 100 100 100 100 100 100 
100 100 100 100 100 100 100 100 100 100 100 100 100 100 
##$AQSEQ= 0
##$AQ_mod= 1
##$AUNM= <au_zg>
##$AUTOPOS= <>
##$BF1= 81.014009
##$BF2= 200.13
##$BF3= 200.13
##$BF4= 200.13
##$BF5= 200.13
##$BF6= 200.13
##$BF7= 200.13
##$BF8= 200.13
##$BYTORDA= 1
##$CFDGTYP= 0
##$CFRGTYP= 5
##$CHEMSTR= <none>
##$CNST= (0..31)
1 1 145 1 1 1 1 1 1 1 1 1 1 1 1 1 1 1 1 1 1 1 1 1 1 1 1 1 1 1 1 1 
##$CPDPRG= <waltz16>
##$CPDPRG1= <>
##$CPDPRG2= <waltz16>
##$CPDPRG3= <>
##$CPDPRG4= <mlev>
##$CPDPRG5= <mlev>
##$CPDPRG6= <mlev>
##$CPDPRG7= <mlev>
##$CPDPRG8= <mlev>
##$CPDPRGB= <>
##$CPDPRGT= <>
##$D= (0..31)
0 1 0 0 0 0 0 0 0 0 0 0.03 2e-05 3e-06 0 0 0 0 0 0 0 0 0 0 0 0 0 0 0 0 
0 0 
##$DATE= 1649141959
##$DBL= (0..7)
120 120 120 11 120 120 24 19 
##$DBP= (0..7)
150 150 150 150 150 150 150 150 
##$DBP07= 0
##$DBPNAM0= <>
##$DBPNAM1= <>
##$DBPNAM2= <>
$$ [...]
##$SUBNAM3= <"">
##$SUBNAM4= <"">
##$SUBNAM5= <"">
##$SUBNAM6= <"">
##$SUBNAM7= <"">
##$SUBNAM8= <"">
##$SUBNAM9= <"">
##$SW= 501.771253377433
##$SWIBOX= (0..15)
0 1 3 0 0 0 0 0 0 0 0 0 0 0 0 0 
##$SW_h= 40650.406504065
##$TD= 32768
##$TD0= 1
##$TE= 0
##$TE2= 300
##$TE3= 300
##$TEG= 300
##$TL= (0..7)
0 120 53 12 22 120 120 120 
##$TP= (0..7)
150 150 150 150 150 150 150 150 
##$TP07= 0
##$TPNAME0= <>
##$TPNAME1= <>
##$TPNAME2= <>
##$TPNAME3= <>
##$TPNAME4= <>
##$TPNAME5= <>
##$TPNAME6= <>
##$TPNAME7= <>
##$TPOAL= (0..7)
0.5 0.5 0.5 0.5 0.5 0.5 0.5 0.5 
##$TPOFFS= (0..7)
0 0 0 0 0 0 0 0 
##$TUNHIN= 0
##$TUNHOUT= 0
##$TUNXOUT= 0
##$USERA1= <user>
##$USERA2= <user>
##$USERA3= <user>
##$USERA4= <user>
##$USERA5= <user>
##$V9= 5
##$VALIST= <valist>
##$VCLIST= <CCCCCCCCCCCCCCC>
##$VD= 0
##$VDLIST= <DDDDDDDDDDDDDDD>
##$VPLIST= <PPPPPPPPPPPPPPP>
##$VTLIST= <TTTTTTTTTTTTTTT>
##$WBST= 1024
##$WBSW= 4
##$XGAIN= (0..3)
0 0 0 0 
##$XL= 0
##$YL= 0
##$YMAX_a= 11109
##$YMIN_a= -18583
##$ZGOPTNS= <>
##$ZL1= 120
##$ZL2= 120
##$ZL3= 120
##$ZL4= 120
##$ABSF1= 248.5645
##$ABSF2= -253.2056
##$ABSG= 5
##$ABSL= 3
##$ALPHA= 0
##$AQORDER= 0
##$ASSFAC= 0
##$ASSFACI= 0
##$ASSFACX= 0
##$ASSWID= 0
##$AUNMP= <proc_1d>
##$AZFE= 0.1
##$AZFW= 0.5
##$BCFW= 0
##$BC_mod= 2
##$BYTORDP= 0
##$COROFFS= 0
##$CY= -3
##$DATMOD= 1
##$DC= 0
##$DFILT= <>
##$DTYPP= 0
##$F1P= 0
##$F2P= 0
##$FCOR= 1
##$FTSIZE= 65536
##$FT_mod= 6
##$GAMMA= 0
##$GB= 0
##$INTBC= 1
##$INTSCL= 5.30512e-09
##$ISEN= 30
##$LB= 1
##$LEV0= 0
##$LPBIN= 0
##$MAXI= 10000
##$MC2= 0
##$MEAN= 0
##$ME_mod= 0
##$MI= 50
##$NCOEF= 0
##$NC_proc= -6
##$NLEV= 6
##$NOISF1= 182.463
##$NOISF2= 159.3651
##$NSP= 0
##$NTH_PI= 0
##$NZP= 0
##$OFFSET= 248.5645
##$PC= 4
##$PHC0= -9525.75
##$PHC1= 29.07561
##$PH_mod= 1
##$PKNL= yes
##$PPARMOD= 0
##$PSCAL= 0
##$PSIGN= 0
##$REVERSE= no
##$SF= 81.014009
##$SI= 65536
##$SIGF1= 159.3651
##$SIGF2= -187.1042
##$SINO= 113.3802
##$SIOLD= 16384
##$SREGLST= <1H.CDCl3>
##$SSB= 0
##$STSI= 65536
##$STSR= 0
##$SW_p= 40650.406504065
##$SYMM= 0
##$S_DEV= 0
##$TDeff= 32768
##$TDoff= 0
##$TI= <>
##$TILT= no
##$TM1= 0
##$TM2= 0
##$TOPLEV= 0
##$USERP1= <user>
##$USERP2= <user>
##$USERP3= <user>
##$USERP4= <user>
##$USERP5= <user>
##$WDW= 1
##$XDIM= 65536
##$YMAX_p= 389955903
##$YMIN_p= -15145490
$$ End of Bruker specific parameters
$$ ---------------------------------
##NTUPLES= NMR SPECTRUM
##VAR_NAME=  FREQUENCY,     SPECTRUM/REAL,   SPECTRUM/IMAG
##SYMBOL=    X,             R,               I
##VAR_TYPE=  INDEPENDENT,   DEPENDENT,       DEPENDENT
##VAR_FORM=  AFFN,          ASDF,            ASDF
##VAR_DIM=   65536,         65536,           65536
##UNITS=     HZ,            ARBITRARY UNITS, ARBITRARY UNITS
##FACTOR=    0.620285442955139, 1,           1
##FIRST=     20137.2065510759, 0,            0
##LAST=      -20513.1999529892, 0,           0
##MIN=       -20513.1999529892, -15145490,   0
##MAX=       20137.2065510759, 389955903,    0
$$ Real data points
##PAGE= N=1
##DATA TABLE= (X++(R..R)), XYDATA
$$ [...]
43784b226264M31203L04918p9347j62917L12677Q01187N32449l58609p96532j58161
$$ -2226264 -1795061 -1490143 -1569490 -1732407 -1419730 -618543 -86094 -444703 -1241235 -1399396
43774a399396Q14176J006350L89578j91513l13882k21376k3189L67617N42134
$$ -1399396 -585220 421130 810708 619195 305313 83937 60748 428365 970499
43765I70499r5313j128635j274849j56785R74380Q77315n6222n07073k9137N80879
$$ 970499 875186 -253449 -1528298 -1685083 -710703 166612 110390 -396683 -425820 155059
43755A55059M57377l68472j104331j003465j30903O35734O33899L00927M54741
$$ 155059 612436 243964 -860367 -1863832 -1994735 -1359001 -725102 -424175 30566
43746C0566Q56775M85557o32803j105901k59426O63510L40625o20228p53329m3464
$$ 30566 887341 1372898 740095 -365806 -625232 38278 378903 -241325 -994654 -1038118
43736a038118K90089j21202m47078k80430j35002j96238K6888M90023L94396l22724
$$ -1038118 -748029 -869231 -1316309 -1596739 -1731741 -1927979 -1901091 -1411068 -1016672 -1339396
43726a339396n54792K20758R42256O20259p5158k4790M24802J62442o14830o08064
$$ -1339396 -1894188 -1673430 -731174 -110915 -186073 -210863 213939 376381 -238449 -846513
43716h46513L80041R85075L80045n08385n63964j60744k99024q02758n81444N11331
$$ -846513 -466472 518603 898648 390263 -173701 -334445 -633469 -1436227 -2017671 -1506340
43706a506340J220852N94021o58318j072109l18299M60063K25136n88828p14947
$$ -1506340 -285488 308533 -349785 -1421894 -1740193 -1280130 -1054994 -1643822 -2358769
43697b358769J58358R07055N54776k87190l24846L89492M62761n68740j198876
$$ -2358769 -2200411 -1293356 -738580 -1025770 -1350616 -961124 -498363 -1067103 -2265979
43688b265979q9118J667359J828365K10442r89459l72244P02743K64475j319254
$$ -2265979 -2355097 -687738 1140627 1351069 361610 -10634 692109 956584 -362670
43679c62670j925989o97985R71512J520462J013102L94467m0234o14809j230356
$$ -362670 -2288659 -2986644 -2015132 -494670 518432 912899 872665 257856 -972500
43670i72500j231841l19278R41354J639577J305665K02945q82894j163502m98901
$$ -972500 -2204341 -2523619 -1582265 57312 1362977 1565922 683028 -480474 -979375
43661i79375L55563M45330k49343o68044j8144R66895P70861p91566j972690j208804
$$ -979375 -623812 -178482 -427825 -1095869 -1114013 -147118 623743 -167823 -2140513 -3349317
43651c349317P23159J632792P83813l62151m83326j53413m57713j017898p59578
$$ -3349317 -2626158 -993366 -209553 -571704 -1055030 -1208443 -1666156 -2684054 -3443632
43642c443632M0559J24012m91610l50385R73159J872819J053770m42051p47350
$$ -3443632 -3403073 -3279061 -3770671 -4121056 -3147897 -1275078 -221308 -663359 -1410709
43633a410709K36745J086765J058486O16707J00658o43113j265200r82626P240
$$ -1410709 -1173964 -87199 971287 1587994 1688652 1045539 -219661 -1202287 -1195047
43624a195047M40956j45951o07016K7723R65681Q52532j62667p11611k09439N28575
$$ -1195047 -754091 -900042 -1507058 -1479335 -513654 338878 176211 -535400 -744839 -216264
43614b16264O26518J53932l54301o19325o02642l22868N0976K81094L65141M54974
$$ -216264 410254 564186 209885 -409440 -1012082 -1334950 -1283974 -1002880 -637739 -182765
43604a82765M82815K54910j18553l42145m49903o77658q43119m97514K14161N51601
$$ -182765 300050 554960 436407 94262 -355641 -1033299 -1876418 -2373932 -2159771 -1608170
43594a608170K70844J3511K54080N60372M02797M1283n1558q4662m50991p40553
$$ -1608170 -1337326 -1323815 -1069735 -509363 -106566 -65283 -116841 -201503 -652494 -1393047
43584a393047k06919Q87837J316673M56051q73990j392412p12760M55962J071743
$$ -1393047 -1599966 -712129 604544 1060595 186605 -1205807 -1918567 -1462605 -390862
43575c90862O25352l68550o97504K93767J716291J916501M14763j425434j945420
$$ -390862 234490 -134060 -831564 -537797 1178494 3094995 3509758 2084324 138904
43566A38904j001198J23695L11864l06838p80417m81647K99854Q05624O92189
$$ 138904 -862294 -738599 -426735 -733573 -1513990 -1995637 -1695783 -890159 -197970
43557a97970L13338J20523O4100j83919o35202r50370q84891m64825J59155P17897
$$ -197970 115368 235891 299991 116072 -519130 -1469500 -2354391 -2819216 -2660061 -1942164
43547a942164Q40945M46798j6957j09056O55r9867l14306k38527N5672J22406
$$ -1942164 -1101219 -654421 -671378 -780434 -779779 -879646 -1193952 -1432479 -1376807 -1254401
43537a254401m6508m8031R4583p4551m97057m90250J40499O67551N02936l463
$$ -1254401 -1300909 -1348940 -1254357 -1328908 -1825965 -2316215 -2175716 -1508165 -1005229 -1008692
43527a008692k50410k24860j81887n4890L02575P14165R31266R04239N59346j68582
$$ -1008692 -1259102 -1483962 -1665849 -1720739 -1418164 -703999 227267 1131506 1690852 1522270
43517A522270q54512q16421j52292K09222j06614l42215L9397L71080l0500n71155
$$ 1522270 667758 -148663 -300955 -91733 -198347 -540562 -501165 -130085 -160585 -731740
43507g31740l38563L23454L93707j40376m17117k33498j69115k82438Q436N99925
$$ -731740 -1070303 -746849 -353142 -493518 -910635 -1144133 -1313248 -1595686 -1587250 -987325
43497i87325N24594m69707j232861p41297M70587J109390Q28364M15564N15890
$$ -987325 -462731 -932438 -2165299 -2906596 -2436009 -1326619 -498255 -82691 433199
43488D33199Q21631O29749j85187j021194j304451j115407q52797n15817J59336
$$ 433199 1254830 1884579 1699392 678198 -626253 -1741660 -2594457 -3110274 -2950938
43479b950938Q93382R43940K76942j08740M13791J064174Q01785o3842l94716
$$ -2950938 -2057556 -1113616 -836674 -945414 -531623 532551 1334336 1270494 875778
43470H75778k2721P2645o05329j260493r41545J73189J004693P78066k08361r21886
$$ 875778 853057 925702 320373 -940120 -1881665 -1708476 -703783 74283 -134078 -1055964
43460a055964p18830o4836K05466J96782O73207J390136J016184o24091j643640
$$ -1055964 -1774794 -1839630 -1634164 -1437382 -764175 625961 1642145 1018054 -625586
43451f25586o63018R56120J096872P7879j97024M05600J79408j214841j975791
$$ -625586 -1288604 -332484 764388 842267 645243 1050843 1230251 15410 -1960381
43442a960381j123681K7584K42678J75817O54547R60308K71255n91525l99598
$$ -1960381 -3084062 -3056478 -2813800 -2637983 -1983436 -1023128 -751873 -1343398 -1742996
43433a742996N26900J025675R25997Q25470P20316J87699n28049p81582n41534
$$ -1742996 -1216096 -190421 735576 1561046 2281362 2469061 1941012 1159430 617896
43424F17896k07932J59844N68782N56086j58057r44606j059554o83171l48468
$$ 617896 409964 569808 1138590 1694676 1536619 592013 -467541 -1150712 -1499180
43415a499180N6259P54240J160458O30584l04603n89584k03155L5183p5888j1857
$$ -1499180 -1442921 -688681 471777 1102361 797758 208174 5019 40202 -35686 -47543
43405d7543K94399L23143L2860J9086M87512Q99851P43601K6506r08491j484781
$$ -47543 246856 569999 602859 621945 1109457 2009308 2752909 2779415 1870924 386143
43395C86143j120262m1636N68830O8557n57626j64838O08056K99295q84270j266489
$$ 386143 -734119 -775755 -206925 -138368 -695994 -860832 -252776 46519 -837751 -2104240
43385b104240l59476M79274L66173J00151L98550N66979q2900q25179o64739J08653
$$ -2104240 -2463716 -1984442 -1618269 -1518118 -1119568 -552589 -635489 -1460668 -2125407 -2016754
43375b016754N77147N77008M53409K30238k2111J99036Q42518Q01556l98731j265798
$$ -2016754 -1439607 -862599 -409190 -178952 -201063 -2027 840491 1642047 1243316 -22482
43365b2482k39203J657033J871394q5778j951999j938691q90733m30505m72094
$$ -22482 -261685 1395348 3266742 3180964 1228965 -709726 -1600459 -2030964 -2503058
43356b503058J07242J245498J637259P05206n33459p85724K1490Q25323O59922
$$ -2503058 -2395816 -1150318 486941 1192147 658688 -127036 -105546 719777 1379699
43347A379699l63343j193759r64747K8291P01096N22998K3249j84213k48088n16064
$$ 1379699 1016356 -177403 -1142150 -1113859 -412763 110235 133484 -50729 -298817 -814881
43337h14881p15632l91842K09224M35319J87221j07180k64558l64629k20761L24727
$$ -814881 -1530513 -1922355 -1713131 -1277812 -1090591 -1197771 -1462329 -1826958 -2047719 -1722992
43327a722992P50839M63244o7872J09840P36185N69589m73768r35601j48014O06643
$$ -1722992 -972153 -508909 -576781 -466941 269244 838833 365065 -570536 -718550 -111907
43317a11907K11543n05545l97638j6656l43086o61196K62931J641945J545164
$$ -111907 99636 -405909 -803547 -820203 -1163289 -1824485 -1561554 80391 1625555
43308A625555O864r95837o92434l57952o43573m25109P85443J433928L18870j272160
$$ 1625555 1632419 636582 -55852 -413804 -1057377 -1482486 -697043 736885 1055755 -216405
43298b16405j378244j29438P85336N40989k58789p54014m43513P17779J876766
$$ -216405 -1594649 -1724087 -938751 -397762 -656551 -1410565 -1854078 -1136299 740467
43289G40467J696818J48468r96462m74613O58049P28690q1225m85676m17525p82839
$$ 740467 2437285 2585753 1589291 1114678 1772727 2501417 2420192 1934516 1516991 734152
43279G34152j420770j206704o8826Q11806Q63953O48326M57501o3901p26833p48505
$$ 734152 -686618 -1893322 -1962148 -1150342 -286389 361937 819438 755537 28704 -719801
43269g19801k06937q6583m71410j82306J137483J977502R70972j065242k119665
$$ -719801 -926738 -1013321 -1484731 -1667037 -529554 1447948 2418920 1353678 -765987
43260g65987j372157K48969J393163J417995N45384m38319p54529l02856K86149
$$ -765987 -2138144 -1889175 -496012 921983 1467367 1029048 274519 -28337 257812
43251B57812L52083k11158r74297j249816n43413P99271J633271J269778L68791
$$ 257812 609895 398737 -575560 -1825376 -2368789 -1569518 63753 1333531 1702322
43242A702322j08524l30220r23919j378079o41704Q06443J218737J91302o98949
$$ 1702322 1593798 1263578 339659 -1038420 -1680124 -873681 345056 536358 -162591
43233a62591m15816J21090m765r4668N24949Q29679k21584j518833j257736J88059
$$ -162591 -578407 -457317 -462082 -556750 -31801 797878 576294 -942539 -2200275 -2012216
43223b012216Q63974L15013j0063N31743P51202j09604r32401n91387J42917r6797
$$ -2012216 -1148242 -833229 -843292 -311549 439653 330049 -602352 -1193739 -1050822 -1147619
43213a147619r85696r96261J75140J088375O58218l53820n19870L05521R84284
$$ -1147619 -2133315 -3129576 -2954436 -1866061 -1207843 -1561663 -2081533 -1776012 -791728
43204g91728P42861K9740l49802k64593n7584J71376N19382P92144O69682K69419
$$ -791728 -48867 -19127 -368929 -633522 -691106 -519730 -348 791796 1461478 1730897
43194A730897P22p3135j72966k12254L1882K15554k17408q83363p18209K60192
$$ 1730897 1731619 1658484 1485518 1273264 1305146 1520700 1303292 419929 -298280 -38088
43184c8088O18195l48842j280951o95539O54904Q55788k58755r46703k74730O68009
$$ -38088 580107 231265 -1049686 -1745225 -1090321 -234533 -493288 -1439991 -1714721 -1046712
43174a046712O92879J71748N06R9430l4928j47536K51363O94848K75713p99230
$$ -1046712 -353833 -182085 -181579 -82149 -117077 -264613 -13250 681598 957311 158081
43164A58081j249305m56861O98264J037588M62112k36510m58052k57959p83N1477
$$ 158081 -1091224 -1548085 -849821 187767 649879 413369 -44683 -302642 -303425 -251948
43154b51948j35480m18504o18457o40129m41895l1213L49494K73246k53122m49843
$$ -251948 -387428 -805932 -1424389 -2064518 -2506413 -2537626 -2188132 -1914886 -2168008 -2617851
43144b617851L18300J366381J296516j8121j041058p06692P3419K799m26804J49600
$$ -2617851 -2299551 -933170 363346 345225 -695833 -1402525 -1329106 -1326307 -1753111 -1603511
43134a603511J381677J406827j58677j296022n05102R15113Q45176n02038j063167
$$ -1603511 -221834 1184993 1026316 -269706 -774808 140305 985481 483443 -579724
43125e79724o8578R82146O40094n56205j027823k09731R64771J279318N16201
$$ -579724 -648302 333844 973938 417733 -610090 -819821 144950 1424268 1940469
43116A940469m08308m92376J76992N32079p1075j001239j266192q01348k86313
$$ 1940469 1532161 1039785 1216777 1748856 1677781 676542 -589650 -1390998 -1677311
43107a677311j00915j66013m80295r89698j125653l51750Q65688J441896J051942
$$ -1677311 -1778226 -1944239 -2424534 -3414232 -4539885 -4891635 -4025947 -2584051 -1532109
43098a532109L83716K3699j05319j35834O7121M09095M78639J93487q6526k32406
$$ -1532109 -1148393 -1124694 -1230013 -1365847 -1298726 -889631 -410992 -217505 -304031 -536437
43088e36437m61876o52802l02547N59019J113968P72761p8261o22304m74321J24415
$$ -536437 -998313 -1651115 -1953662 -1394643 -280675 492086 413825 -208479 -682800 -558385
43078e58385N33267J71799p15740r69127L5602J125979O75099r16141j548899
$$ -558385 -25118 146681 -569059 -1538186 -1502584 -376605 298494 -617647 -2166546
43069b166546m74402O21543K80899n74882l48972O64060R58787K70249k71623
$$ -2166546 -2640948 -2019405 -1738506 -2313388 -2662360 -1998300 -1039513 -769264 -1040887
43060a040887j19894L6612l37853p70068o06315Q4111P08684Q01653L87560q871
$$ -1040887 -1160781 -1124169 -1462022 -2232090 -2838405 -2754294 -2045610 -1243957 -856397 -865268
43050h65268J65347P62048R89437M87606j33195k38871p9077j72052l63332k38368
$$ -865268 -699921 62127 1051564 1539170 1405975 1167104 1088027 915975 552643 314275
43040C14275J0651o2633l33207m22709m41847n93271m97453J02209M18917l47062
$$ 314275 324926 262293 -70914 -493623 -935470 -1528741 -2026194 -1923985 -1505068 -1852130
43030a852130j314470p23308J410312K859552J953279l61872j916881j838879
$$ -1852130 -3166600 -3889908 -2479596 379956 2333235 1971363 54482 -1784397
43022a784397q49273K11256J098320J652207J525197O55166m38021j059899r27054
$$ -1784397 -2633670 -2422414 -1324094 328113 1853310 2508476 2070455 1010556 83502
43013H3502l19061K48937M64915L48640L8702l16826m05683J02563R16778J033175
$$ 83502 -235559 13378 478293 826933 865635 548809 143126 245689 1162467 2195642
43003B195642q5764j454934j498797j17378J009364N55960p34573j129294k32926
$$ 2195642 2109878 654944 -843853 -961231 48133 604093 -130480 -1259774 -1492700
42994a492700O24166K90190p37741j139025n21337L09953O63708P64895R68533
$$ -1492700 -868534 -578344 -1316085 -2455110 -2976447 -2666494 -2002786 -1237891 -269358
42985b69358Q84850L1126j009264j064339o9654P07000N13196J91857O61764J202121
$$ -269358 615492 646618 -362646 -1426985 -1496639 -789639 -276443 -84586 577178 1779299
42975A779299M84945j097553j588780j66025J564386J614700R6730j157638r59619
$$ 1779299 2264244 1166691 -422089 -588114 976272 2590972 2687702 1530064 570445
42966E70445R5260P02975L50303l96054o82038k77992J75319r5220q96598j059120
$$ 570445 665705 1368680 1718983 1322929 640891 362899 538218 442998 -453600 -1512720
42956a512720M3895J321907J142445l71159j292402n43395N65318M10813l72674
$$ -1512720 -1468825 -146918 995527 624368 -668034 -1211429 -646111 -235298 -607972
42947f07972l6782J124473R36098j038144k309503j090090Q62550R10524m25978
$$ -607972 -644754 479719 1415817 377673 -1931830 -3021920 -2159370 -1248846 -1674824
42938a674824n16205J067781J987747R52590m79881o45663r7054k1575j65461
$$ -1674824 -2191029 -1123248 864499 1817089 1337208 691545 594491 572916 407455
42929D07455J98574N76857J05312p52255q00381P4141Q46265P86568P8757o64286
$$ 407455 606029 1182886 1288198 535943 -264438 -190297 655968 1442536 1521293 857007
42919H57007q50458k97606L55521K36717m13037m29414K93745L25616r47070j904302
$$ 857007 6549 -291057 64464 301181 -111856 -541270 -247525 78091 -868979 -2773281
42909b773281r85648P93217J292045L65952k80173J41062P14439O78514L90720
$$ -2773281 -3758929 -2965712 -1673667 -1307715 -1587888 -1446826 -732387 -53873 336847
42900C36847K86445K46053K08412L04174K59362l49998j216090j557779j169810
$$ 336847 623292 869345 1077757 1381931 1641293 1291295 75205 -1482574 -2652384
42891b652384l97857O11269J668513J971032R61591n27311j167753q77545m92610
$$ -2652384 -3050241 -2438972 -770459 1200573 2162164 1634853 467100 -410445 -903055
42882i03055j64640M67572R15930L67280n86868n24608M65808Q22007P2893m90781
$$ -903055 -1067695 -600123 315807 683087 96219 -428389 37419 859426 932319 441538
42872D41538j27254K22187j96143o25762k41967M76048O99352M14391p5252o70553
$$ 441538 314284 536471 340328 -285434 -527401 -51353 647999 1062390 987138 316585
42862C16585r22098k09589R37661J061360k2454o95472j3476Q19719M94155l81012
$$ 316585 -605513 -815102 122559 1183919 1161465 465993 452517 1272236 1766391 1385379
42852A385379n91069l39629m85896q27703o76892l07249l29271l35037L20402
$$ 1385379 794310 454681 -31215 -858918 -1535810 -1843059 -2172330 -2507367 -2186965
42843b186965R81236N27403o06941q36747K14013J184077R61236o418o65277o47089
$$ -2186965 -1205729 -678326 -1285267 -2122014 -1908001 -723924 237312 230894 -434383 -1081472
42833a081472k37581K38404N98438P21327N27122j5466p38030j094903n66300
$$ -1081472 -1319053 -1080649 -482211 239116 766238 750772 12742 -1082161 -1648461
42824a648461N43175J192529P96793j25068p34042p45915l04787L17135O13540
$$ -1648461 -1105286 87243 884036 758968 24926 -720989 -1025776 -708641 -95101
42815i5101K04695m20269l97083O8185o6591o75880k85195J323935K079047N79387
$$ -95101 109594 -310675 -707758 -639573 -706164 -1382044 -1667239 -343304 1735743 2315130
42805B315130j461573j586407j96030L86943l34176o30767K83279J032980M50269
$$ 2315130 853557 -732850 -928880 -541937 -876113 -1506880 -1223601 -190621 259648
42796B59648p57704j362080j143207m51988M83736J217201J141049M27118k9609
$$ 259648 -498056 -1860136 -3003343 -3455331 -2971595 -1754394 -613345 -186227 -215836
42787b15836K8798p5820n61706o33252J35373R15530Q13229R3400m57791o47398
$$ -215836 -187038 -262858 -824564 -1457816 -1322443 -406913 406316 499716 41925 -605473
42777f05473o72965m60627O4787N05648M38161L1208k54394k83247j82668N029
$$ -605473 -1278438 -1739065 -1674278 -1168630 -730469 -699261 -953655 -1236902 -1419570 -1414541
42767a414541K33695K98922J04318j25230j13780J70009N67616Q41234P51397
$$ -1414541 -1180846 -881924 -777606 -902836 -1016616 -846607 -278991 562243 1313640
42758A313640L36561M117n0153k49024q32086r92986J21798J642827J588783l23159
$$ 1313640 1650201 1654318 1604165 1355141 523055 -469931 -348133 1294694 2883477 2560318
42748B560318j847660j115999P52575J249614m3854j156605p42602K23151K63382
$$ 2560318 712658 -403341 349234 1598848 1554994 398389 -344213 -121062 142320
42739A42320l96508m70313K49344O11060q6046j059143j226311o54706j40674
$$ 142320 -254188 -724501 -475157 135903 49857 -1009286 -2235597 -2890303 -3030977
42730c030977J51054O85602J331436J228754K28597n24850j60204N46514L17771
$$ -3030977 -2879923 -2194321 -862885 365869 594466 69616 -90588 455926 773697
42721G73697o34476r08942j5354R92718J099687M91042j48103n44696o36014l05165
$$ 773697 139221 -769721 -785075 207643 1307330 1798372 1650269 1105573 469559 164394
42711A64394J71627J35055m81173q59575n05511j2952J5163K4675N83202J086140
$$ 164394 336021 471076 -10097 -869672 -1375183 -1388135 -1372972 -1348297 -765095 321045
42701C21045N92078m39973o02565L05785R36697M84385j81173o4948M41055M65035
$$ 321045 913123 473150 -129415 176370 1113067 1597452 1416279 1351331 1792386 2257421
42691B257421J07530p9803k99312r41366j361418o62751N38247O70358l89807
$$ 2257421 2364951 2285148 1985836 1044470 -316948 -979699 -441452 228906 -160901
42682a60901j046633m88045J50361j49724o30533k89605L05887J68128k61499
$$ -160901 -1207534 -1695579 -1545218 -1694942 -2325475 -2615080 -2309193 -2141065 -2402564
42673b402564k7388M66356K55472k23752J06900P87991N17667l10369j20568Q41018
$$ -2402564 -2429952 -1963596 -1708124 -1931876 -1824976 -1036985 -519318 -829687 -950255 -109237
42663a09237O27913q96712j445406j20647R48281K55502m94574M77747J732654
$$ -109237 518676 -378036 -1823442 -1944089 -995808 -740306 -1234880 -757133 975521
42654I75521J096271m91238o44165L22859J97187r53071q32784Q89876J753262
$$ 975521 2071792 1580554 936389 1259248 1456435 503364 -329420 560456 2313718
42645B313718M95295j040085j050037l27870l20103p01422m67386R3011J15282
$$ 2313718 2809013 1768928 718891 391021 70918 -630504 -1097890 -1004879 -889597
42636h89597j81795K4442O59269Q56530K12257p69762j190923m56879J033429
$$ -889597 -1071392 -1046950 -387681 468849 681106 -88656 -1279579 -1736458 -703029
42627g03029J890590J207506p3103l30704L40345L66794o32531j187013m29478
$$ -703029 1187561 2395067 2321964 1991260 2331605 2698399 2065868 878855 449377
42618D49377O11261R44206J051405J328360Q37087r19147k424090k045144m51318
$$ 449377 1060638 2004844 3056249 4384609 5221696 4302549 1878459 -166685 -618003
42609f18003N16316N15420N38865P73492M76785k77513m82064O5668L58027j86210
$$ -618003 -101687 413733 952598 1726090 2202875 1925362 1443298 1508966 1866993 1680783
42599A680783q23047o41242J63202N91512N4155r26013j183156k69938P55559
$$ 1680783 857736 216494 379696 971208 1025363 99350 -1083806 -1353744 -598185
42590e98185N79433l58230k86103J122637J930872Q30090p19116p73817L0652
$$ -598185 -18752 -376982 -663085 459552 2390424 3220514 2501398 1727581 1758233
42581A758233k14595j259730j081780N15139J282894O8562j319667r10106N58260
$$ 1758233 1543638 283908 -797872 -282733 1000161 1068723 -250944 -1161050 -602790
42572f02790J032170K25624l09153L01304J092487P51970o09302j565671j018023
$$ -602790 429380 655004 345851 647155 1739642 2491612 1882310 316639 -701384
42563g01384N07551J377387P51394l84023n04950M68728J198222P85451k40928
$$ -701384 -193833 1183554 1934948 1550925 1045975 1514703 2712925 3498376 3257448
42554C257448r07870r72495q00271o50002m49684j6353O27216J015041N89938
$$ 3257448 2349578 1377083 576812 -73190 -522874 -539227 87989 1103030 1692968
42545A692968l56449o17693L22571J170251M54128j079328j222681M70166J885074
$$ 1692968 1336519 718826 1041397 2211648 2665776 1586448 363767 833933 2719007
42536B719007J366719j0892k55268O75643J206455O56446k5779Q9147O81399Q10209
$$ 2719007 4085726 4074834 3819566 4495209 5701664 6358110 6332331 6421478 7102877 7913086
42526G913086Q9102r64558j440343r28016o6019R9454n19687q84015l85038J51009
$$ 7913086 8002188 7037630 5597287 4669271 4603252 4702706 4183019 3299004 2913966 3064975
42516C064975k67130j162572j255291m03019K93137K85454K69658P44230R89891
$$ 3064975 2797845 1635273 379982 -23037 270100 555554 825212 1569442 2559333
42507B559333K30481r27072j148605j95732P46195O09973l30093j002748q50373
$$ 2559333 2789814 1862742 714137 518405 1264600 1874573 1544480 541732 -308641
42498c08641k49731J37044N8380k50443l99197j69166L14444O44040M90442j3367
$$ -308641 -558372 -421328 -362948 -613391 -1012588 -1181754 -867310 -223270 267172 253805
42488B53805l63651k41125J51567L95877L38379J17947j24757l30922l92908j87014
$$ 253805 -109846 -350971 -199404 196473 534852 652799 528042 197120 -195788 -382802
42478c82802K22255N47199N10407J28251k06277m5822N00601O46920j26476j105872
$$ -382802 -160547 386652 897059 1025310 819033 773211 1273812 1920732 1794256 688384
42468F88384j048189K2525O65816J45435l66841L26263J325732Q89364p41147
$$ 688384 -359805 -337280 328536 473971 107130 433393 1759125 2648489 1907342
42459A907342j552846p71119J80497J46859j37012K32615O11937J18292o02422
$$ 1907342 354496 -416623 -236126 -89267 -226279 6336 618273 736565 134143
42450A34143m42912K09322J82358l88360l27638M80545Q88691M20204j09860j61175
$$ 134143 -308769 -99447 82911 -305449 -633087 -152542 736149 1156353 1046493 885318
42440H85318k29188n72747m96724L71294J148963Q94147l3266n98864m70879m5393
$$ 885318 656130 83383 -413341 -42047 1106916 2001063 1967797 1368933 898054 852661
42430H52661L27315L92894j85837j211658j603254o16319Q61478J245896L83567
$$ 852661 1179976 1572870 1387033 175375 -1427879 -2044198 -1182720 63176 446743
42421D46743l28234p3764K73263k86508j175957j048257J88081J167572Q81466
$$ 446743 118509 44745 318008 31500 -1144457 -2192714 -2004633 -837061 44405
42412D4405j23944o24579k35690L45527L52582j67052n01126j73792M03445L68171
$$ 44405 -79539 -704118 -939808 -594281 -241699 -408751 -909877 -1083669 -680224 -312053
42402c12053m08862r30048l05684Q90096J240808M35348l23378j21471M65129
$$ -312053 -720915 -1650963 -1956647 -1066551 174257 609605 286227 164756 629885
42393F29885N70063M04806M40685J61740r55205j888027j256142K27948M77264
$$ 629885 1199948 1604754 2045439 2207179 1251974 -636053 -1892195 -1664247 -1186983
42384a186983o77282j081154K26740J342195N98749p40998p07038K22790M18342
$$ -1186983 -1864265 -2945419 -2718679 -1376484 -777735 -1518733 -2225771 -2002981 -1584639
42375a584639J52312P37128J514763O33389j427179k055127n36947R16912Q50228
$$ -1584639 -1432327 -695199 819564 1452953 25774 -2029353 -2566300 -1649388 -799160
42366g99160M94451Q97498Q20627p31476k134402j467485M22150J350652J027969
$$ -799160 -304709 592789 1413416 681940 -1452462 -2919947 -2497797 -1147145 -119176
42357a19176P09568O43333J00159o83247p28387j59440L5956k00437j62916K4352
$$ -119176 590392 1233725 1333884 650637 -77750 -237190 -201234 -401671 -564587 -540235
42347e40235k52503n23839J18524J086586R96475J26625L9784P53126O01976p41838
$$ -540235 -792738 -1316577 -1198053 -111467 885008 1011633 1051417 1804543 2406519 1664681
42337A664681j486065o73973L09273J86871l21188k77222k72428r17968j245902
$$ 1664681 178616 -495357 -186084 787 -320401 -597623 -870051 -1788019 -3033921
42328c033921k75779J115398J512419J080108Q15784O78379R2388m74913j16956
$$ -3033921 -3309700 -2194302 -681883 398225 1214009 1892388 1984776 1509863 1392907
42319A392907Q01496J024989K21820p65859j171447q45954l6726N22594K2946
$$ 1392907 2194403 3219392 3441212 2675353 1503906 657952 621226 1143820 1166766
42310A166766j049692r75878O68186J803721P19406j110243j126096L99267J010105
$$ 1166766 117074 -858804 -190618 1613103 2332509 1222266 96170 495437 1505542
42301A505542O6984o30280k18687J2279o18556q11391K13008J085355O05772j69855
$$ 1505542 1572526 942246 723559 735838 117282 -694109 -481101 604254 1210026 1040171
42291A040171J78126R33938M87077r18559j544542p78825K79565O99913P03873
$$ 1040171 1218297 2152235 2639312 1720753 176211 -602614 -323049 376864 1080737
42282A080737O52295L31624l18601o98539l68372J70415J38590l18425k57148
$$ 1080737 1733032 2064656 1746055 1047516 679144 849559 988149 669724 412576
42273D12576O15299J264754O71942n74752r65022k47958K78388o0369k88967K78372
$$ 412576 1027875 2292629 2964571 2389819 1424797 1176839 1455227 1394858 1105891 1384263
42263A384263N91378k51901j036086k68687J039844P55517q32666j418350m36467
$$ 1384263 1975641 1723740 687654 418967 1458811 2214328 1381662 -36688 -473155
42254d73155L32792J42709L49389J356584J449609J8867q51271J45823J038824
$$ -473155 -140363 2346 351735 1708319 3157928 3176795 2325524 2471347 3510171
42245C510171j47708j840973j381998O49875J535327P02105o0861K5065Q3100
$$ 3510171 3362463 1521490 139492 789367 2324694 3026799 2965938 2991003 3074103
42236C074103j8905N00682J100836L15295j297515j348565N55786J810383P14658
$$ 3074103 3055198 3555880 4656716 4972011 3674496 2325931 2881717 4692100 5406758
42227E406758j034594j238071m89026o57472j594143j528837p2279J158732R02339
$$ 5406758 4372164 3134093 2645067 1987595 393452 -1135385 -1207664 -48932 853407
42218H53407k14191p97639m17347J92384K29434k18887l66946J60971P49013O91928
$$ 853407 639216 -158423 -575770 -383386 -153952 -372839 -739785 -578814 170199 862127
42208H62127L10330M17005Q82403P31102k60489j103363j044715n35696l16486
$$ 862127 1172457 1589462 2471865 3202967 2942478 1839115 794400 258704 -57782
42199e7782l71191l07012p2463K14234N69703Q45672O68269M0681n12413o60529
$$ -57782 -428973 -735985 -808448 -594214 -24511 821161 1489430 1530111 1017698 357169
42189C57169n66021l30089J26848M90799K76344j31008K81697J435030J828688
$$ 357169 -208852 -538941 -412093 78706 355050 224042 505739 1940769 3769457
42180C769457O37753r30065j266348m12294N14010J056730J405995J356743O31274
$$ 3769457 4407210 3477145 2210797 1798503 2312513 3369243 4775238 6131981 6763255
42171F763255j57723j49723L78539M38991o8395m03499m84382r55352j651775
$$ 6763255 6605532 6455809 6834348 7273339 7204944 6801445 6317063 5361711 3709936
42162C709936j459432k07604O28208k2889j112624r35849L33024Q55671k20471
$$ 3709936 2250504 2042900 2671108 2648219 1535595 599746 932770 1788441 1567970
42153A567970j542377j429525j23415O59560J21106n95848q0589J329465J945004
$$ 1567970 25593 -1403932 -1527347 -867787 -746681 -1342529 -1423118 -93653 1851351
42144A851351R38525o47126j298555p53565R5609M64740K42876l50751r87502
$$ 1851351 2789876 2142750 844195 90630 186239 650979 893855 543104 -444398
42135d44398j202811p28238J21662P87196J100992J176948Q69169J1532q19013
$$ -444398 -1647209 -2375447 -2253785 -1466589 -365597 811351 1680520 1692052 873039
42126H73039n86612P87150J890686J289415p13563k288877k033889l77656J011644
$$ 873039 286427 1073577 2964263 4253678 3540115 1251238 -782651 -1160307 -148663
42117a48663R78264j00686r50038q40285k01689J71215J50753J74013L47822K45822
$$ -148663 829601 728915 -221123 -1061408 -1263097 -1091882 -941129 -767116 -419294 -173472
42107a73472l00688p72925o77089k62555l9896R9179N97593J163691Q40689n10570
$$ -173472 -474160 -1247085 -1924174 -2186729 -2226625 -2127446 -1529853 -366162 474527 -36043
42097c6043j531234q87689Q92345J916566J190935l81897j356895j304866p04993
$$ -36043 -1567277 -2454966 -1562621 353945 1544880 1162983 -193912 -1498778 -2203771
42088b203771m0048M25879N02369L27015L74744O71903M95901m53939j136276
$$ -2203771 -2243819 -1817940 -1315571 -988556 -613812 58091 553992 100053 -1036223
42079a036223m20700J084941J642572P44584l53101n79938k63072m6387J06164
$$ -1036223 -1456923 -371982 1270590 2015174 1662073 1082135 819063 772676 878840
42070H78840K06270k37370j133614j337100l03507P47277N31869k80910j88372
$$ 878840 1085110 847740 -285874 -1622974 -1926481 -1179204 -647335 -928245 -1116617
42061a116617O57499P55032k20367r39119o07962r967P1365p997J71108J92505
$$ -1116617 -459118 295914 75547 -863572 -1471534 -1481501 -1410136 -1418133 -1247025 -1054520
42051a054520j90179k72548M17052J061882P04582k61381p59688n94845l28356
$$ -1054520 -1244699 -1517247 -1100195 -38313 666269 404888 -354800 -949645 -1278001
42042a278001j21415J91115K72670k77317q78966n77501L74263P71870L65511
$$ -1278001 -1399416 -1208301 -935631 -1212948 -2091914 -2669415 -2295152 -1523282 -1157771
42033a157771J89171O72838Q09364p9843r63518n48323P31444J331926O95795
$$ -1157771 -968600 -295762 513602 433759 -529759 -1078082 -346638 985288 1681083
42024A681083l70729j060048j194769p19693K65558R74160N91667l64666m88829
$$ 1681083 1310354 250306 -944463 -1664156 -1398598 -424438 167229 -197437 -686266
42015f86266M07603Q59999J1642r47550o31982L12198K83728o11878p09121M64280
$$ -686266 -278663 581336 592978 -354572 -986554 -674356 -390628 -1002506 -1711627 -1247347
42005a247347J325199O56575o05555r49724m84366l18236n50357l52892K58384
$$ -1247347 77852 734427 128872 -820852 -1305218 -1623454 -2173811 -2526703 -2268319
41996b268319K64068n67262j085801m89533M81347Q21489P70878J064503J409771
$$ -2268319 -2004251 -2571513 -3657314 -4146847 -3665500 -2844011 -2073133 -1008630 401141
41987D01141R50035r8801n65687r8282L57036P5442n24652q32628q79353p50885
$$ 401141 1351176 1252375 686688 588406 945442 1020884 496232 -336396 -1215749 -1966634
41977a966634k13139M67810M12383l64254m73126P19723J642714P26249r33737
$$ -1966634 -2179773 -1711963 -1299580 -1663834 -2136960 -1417237 225477 951726 17989
41968A7989j085310J66005O85342m6900k40801Q13044J353462K87076p72228l09262
$$ 17989 -1067321 -901316 -215974 -262874 -503675 309369 1662831 1949907 1177679 868417
41958H68417M01336m22900j810653j555442J62761J241305J013367O13838M47698
$$ 868417 1269753 846853 -963800 -2519242 -2356481 -1115176 -101809 512029 959727
41949I59727j24072p18739j65916J000924Q41598p31275j486718m07551P48138
$$ 959727 835655 116916 -49000 951924 1793522 1062247 -424471 -832022 -83884
41940h3884M39719m37716o25172n76601q76425o19746P20337J536382L36245j549670
$$ -83884 355835 -81881 -707053 -1283654 -2160079 -2779825 -2059488 -523106 -186861 -1736531
41930a736531j658956J35850J824285K122535J285635j37792j455988j478765
$$ -1736531 -3395487 -3259637 -1435352 687183 1972818 1835026 379038 -1099727
41922a099727L4231J244778N33441q27136n34750R25098J021955n70847j456698
$$ -1099727 -1065496 179282 712723 -114413 -649163 275935 1297890 727043 -729655
41913g29655n40703M00183K6211m69226R9402P30477K73251l93485n3180O45277
$$ -729655 -1270358 -870175 -843964 -1313190 -1213788 -483311 -210060 -603545 -656725 -11448
41903a1448N43523J17064L37162N87174k40412j445617j400960k04721N18530
$$ -11448 532075 649139 986301 1573475 1333063 -112554 -1513514 -1718235 -1199705
41894a199705J95253j73966R645K00086R0051J70087N88986P60254M31690M6188
$$ -1199705 -1004452 -1178418 -1168773 -968687 -878636 -708549 -119563 640691 1072381 1118569
41884A118569j84942n08249p68933m36989K83405M64014j38278p08878o77579
$$ 1118569 933627 425378 -343555 -780544 -497139 -33125 -171403 -880281 -1557860
41875a557860l37394J01546Q74992J633418J311101k17286j443834j125071O658
$$ -1557860 -1895254 -1793708 -918716 714702 2025803 1808517 364683 -760388 -753730
41866g53730M22040n2292l58714K4084N73540P57502N85939K06781k31159l67790
$$ -753730 -331690 -383982 -742696 -718612 -145072 612430 1198369 1405150 1173991 806201
41856H06201K228M24705K97701k34918n53921n36626m98745l59155J89986P21830
$$ 806201 808429 1233134 1530835 1295917 741996 205370 -293375 -652530 -462544 259286
41846B59286L73164o65775j050853j82373P85826N93642k87175m55472L09320
$$ 259286 632450 -33325 -1084178 -1266551 -480725 112917 -174258 -629730 -320410
41837c20410Q78663N67893j6642j44378m2830l07363q45676j019828n50350K29014
$$ -320410 558253 1126146 1109504 965126 922296 614933 -230743 -1250571 -1800921 -1571907
41827a571907Q64497J089427P43514j10117q97183q24891K30658J388667J648484
$$ -1571907 -707410 382017 1125531 1015414 118231 -706660 -476002 912665 2561149
41818B561149R59640P1867n23588r69376j328954j183128l66089M19599L97514
$$ 2561149 3520789 3592656 3069068 2099692 770738 -412390 -778479 -358880 38634
41809C8634j35026k01914L65807O43170J7357q50513r06243l8139R29054J217782
$$ 38634 -96392 -298306 67501 710671 728028 -122485 -1028728 -1066867 -137813 1079969
41799A079969O77582k82153r39000p36184J03178P15430O54278M11646N22340
$$ 1079969 1757551 1475398 536398 -199786 -96608 618822 1273100 1684746 2207086
41790B207086O80863L33148l33230p28110q07498q64572p05327q880O78742M17390
$$ 2207086 2887949 3221097 2887867 2159757 1352259 487687 -217640 -226520 452222 869612
41780H69612o12222j160508o89769k9224R6374Q4538M12780O15725J68019l93347
$$ 869612 257390 -903118 -1592887 -1622111 -1525737 -1441199 -1028419 -412694 -244675 -638022
41770f38022k13740N08018Q37799M86620q384l00549n71958q46352p15822K4496
$$ -638022 -851762 -343744 494055 980675 972291 671742 99784 -746568 -1462390 -1437894
41760a437894R16849J231980O72732k97407p62019k17694P51239J008005K29537
$$ -1437894 -521045 710935 1383667 1086260 324241 106547 857786 1865791 2095328
41751B095328p11729r33864n31448o2660K56164L48458q402n98967o03487J75942
$$ 2095328 1383599 449735 -81713 -144373 111791 460249 451847 -147120 -750607 -574665
41741e74665O38980n0882r24266n39937O55485R02441q9630o66747J58993J246823
$$ -574665 64315 13433 -910833 -1450770 -795285 107156 17526 -649221 -490228 756595
41731G56595J155988R5996p95372j034840p61174m5661Q05437R88987J95742o93913
$$ 756595 1912583 2008579 1213207 178367 -582807 -628468 176969 1165956 1361698 667785
41721F67785p33506j60097K81249N75066R85455J015961J21221r13543p53905
$$ 667785 -65721 -225818 55431 630497 1615952 2631913 2753134 1839591 1085686
41712A085686L49504O70712m35475j487244j060565J92328P15433L42050J59856
$$ 1085686 1435190 2105902 1670427 183183 -877382 -685054 30379 372429 532285
41703E32285N45553O78827O1183o51251p20041l39536n6096J30089M54186P08125
$$ 532285 1077838 1756665 1817848 1166597 446556 107020 50924 181013 635199 1343324
41693A343324N82772L21182K92329K06852l88880j020954p27641L31892Q23656
$$ 1343324 1926096 2247278 2539607 2746459 2357579 1336625 608984 940876 1764532
41684A764532J72233n42790k83443L67269K78727m00373o79560m28804l13014
$$ 1764532 1936765 1393975 1110532 1477801 1756528 1356155 676595 247791 -65223
41675f5223l17058K26955J083265J011956l15954j477818j063832N44484J837999
$$ -65223 -382281 -155326 927939 1939895 1623941 146123 -917709 -373225 1464774
41666A464774K001648J414266P64330L15806o2453m96138p44544l06363Q74920
$$ 1464774 3466422 4880688 5645018 5960824 5898371 5402233 4657689 4351326 5226246
41657E226246K013462K254824J666166R41401M48109K68933P22611J786502K420452
$$ 5226246 7239708 9494532 11160698 12102099 12550208 12819141 13541752 15328254 17748706
41648A7748706J842314J161506K011328L673659L731281J923845Q75287J956931
$$ 17748706 19591020 20752526 22763854 26437513 30168794 32092639 32967926 34924857
41640C4924857K929464J466471j163492k249725j767249j708173k476439k770704
$$ 34924857 37854321 39320792 38157300 35907575 34140326 32432153 29955714 27185010
41632B7185010k407783k447961k734897k042216p58567p42963k077378k540060
$$ 27185010 24777227 22329266 19594369 17552153 16793586 16050623 13973245 11433185
41624A1433185j080347N44389N98239k93171p69432p94068q54159p82815n99535
$$ 11433185 10352838 10897227 11495466 11202295 10432863 9638795 8784636 8001821 7402286
41615G402286r84053j769495j548628J3049J113920M34340q10164r67525m56192
$$ 7402286 6418233 4648738 3100110 3113159 4227079 4661419 3851255 2883730 2427538
41606B427538l65406j56558R99236J897069R04908r07791r62788P82285J649582
$$ 2427538 2062132 1905574 2904810 4801879 5706787 4798996 3836208 4618493 6268075
41597F268075L26525j335868j293967L560Q70068P19610J24369l31783l87895
$$ 6268075 6594600 5258732 3964765 3968325 4838393 5558003 5682372 5350589 4962694
41588D962694q6731M6156m68472j116725q67283K16882Q60988L46482n98095r72682
$$ 4962694 4875963 4922119 4453647 3336922 2469639 2686521 3547509 3893991 3295896 2323214
41578B323214o29011M5434O44850P28398J82760k93556n768N06260K04159o32283
$$ 2323214 1694203 1739637 2384487 3112885 3295645 3002089 2996321 3502581 3706740 3074457
41568C074457q04785l50485m70506j105606p07996R03691J689836N80011n91353
$$ 3074457 2269672 1919187 1448681 343075 -364921 538770 2228606 2808617 2217264
41559B217264P76J177094P55679q76492j545269p62690l9723j09549r2050N04944
$$ 2217264 2218040 3395134 4150813 3274321 1729052 966362 926639 817090 725040 1229984
41549A229984Q99799N06693k09537o76189q21376n98554n066M14472J68907j90646
$$ 1229984 2129783 2636476 2426939 1750750 929374 330820 325754 740226 909133 718487
41539G18487J67894Q27042O77490j92610o72360n89879q07336j260751p66765
$$ 718487 886381 1713423 2390913 2198303 1525943 936064 128728 -1132023 -1898788
41530a898788P48991J645125R75547j02907k75267N9199k6435k57139N6037N16697
$$ -1898788 -1149797 495328 1470875 1367968 1092701 1151900 1125465 868326 924363 1441060
41520A441060L19417k72483l99397l6857J86413J49165J47174O4219l05878m83085
$$ 1441060 1760477 1487994 1088597 1051740 1238153 1387318 1534492 1598711 1292833 809748
41510H09748O4812P95752P09280p7270m80726j48752J05752k76782p88961q15557
$$ 809748 874560 1670312 2379592 2302322 1821596 1672844 1778596 1501814 712853 -102704
41500a02704n28718l31419r0806M69182J032585R75236K72156l48545k41213M19660
$$ -102704 -631422 -962841 -1053647 -584465 448120 1423356 1695512 1346967 1105754 1525414
41490A525414Q70519O29370k3455m67515m63017k53596q3950L9098R9868k3094
$$ 1525414 2395933 3025303 3001848 2534333 2071316 1817720 1733770 1772868 1872736 1849642
41480A849642k66110l22242o4499K39174L11346K13407J25961J6695k51225o06924
$$ 1849642 1583532 1261290 1196791 1435965 1747311 1960718 2086679 2103374 1852149 1245225
41470A245225p42442m13318J99056M82412P0753m25982n109J086010J211050k90387
$$ 1245225 502783 89465 288521 770933 841686 415704 410595 1496605 2707655 2417268
41460B417268j575582o61621J366468J606962l01070j502639k48731J560827J532868
$$ 2417268 841686 180065 1546533 3153495 2852425 1349786 1101055 2661882 4194750
41451D194750K77940k43128j04731o56340j500676r73502P19419J448215M46478
$$ 4194750 4472690 4229562 4124831 3468491 1967815 994313 1713732 3161947 3608425
41442C608425o23929m02787L79607N76244L49520L19044L97166L93359O01850
$$ 3608425 2984496 2581709 2961316 3537560 3887080 4206124 4603290 4996649 5598499
41433E598499R30200N36694p71615j773015j413460l04246L22039L72897N33108
$$ 5598499 6528699 7065393 6293778 4520763 3107303 2803057 3125096 3497993 4031101
41424D031101P54484L57585n62574r95016m58140K70613K44944l77913o48845
$$ 4031101 4785585 5143170 4580596 3585580 3127440 3398053 3642997 3265084 2616239
41415B616239k07693K00051j67414q32497o66071L80189J046170O59873K03419
$$ 2616239 2408546 2608597 2441183 1608686 942615 1322804 2368974 3028847 3232266
41406C232266N83965Q68848k51487j913339j941574j84066J059348L93015q49159
$$ 3232266 3816231 4685079 4433592 2520253 578679 394613 1453961 1846976 997817
41397I97817r99364m38324k79727k31101N46800J501697J389960L40623l82167
$$ 997817 -1547 -439871 -719598 -950699 -403899 1097798 2487758 2828381 2446214
41388B446214l34740j65601j87934r4103J8493l02041p64962n69985J60818M25572
$$ 2446214 2111474 1945873 1757939 1663836 1682329 1380288 615326 45341 206159 631731
41378F31731K11k02124K31294M67609r5141p32977n88378n2286J8122j80651K23686
$$ 631731 631942 429818 661112 1128721 1033580 300603 -287775 -340061 -321939 -502590 -278904
41367b78904J134966J338437K23387j157312j273672O953J275755J290873L70044
$$ -278904 856062 2194499 2417886 1260574 -13098 -6145 1269610 2560483 2930527
41358B930527j97761J50237O59271M09344m84002j157928j085464m07971N03114
$$ 2930527 2732766 2883003 3542274 3951618 3467616 2309688 1224224 816253 1319367
41349A319367J231602J243516L19852q74869j256731n41630M48762Q29854N35625
$$ 1319367 2550969 3794485 4114337 3239468 1982737 1441107 1889869 2719723 3255348
41340C255348J9395l81682m92945j96749L16474N28900K07558k31336k98128p8439
$$ 3255348 3274743 2893061 2400116 2203367 2519841 3048741 3256299 3024963 2726835 2648396
41330B648396M2298j2477r4970k17957l56975j64600M90653R34232M26556n65174
$$ 2648396 2690694 2678217 2583247 2365290 2008315 1843715 2334368 3268600 3695156 3129982
41320C129982p31859K59180J201498J003569P9112m85760l94840k6701M69926
$$ 3129982 2398123 2657303 3858801 4862370 4941482 4455722 4060882 4034181 4504107
41311D504107J019267J046916J45619r41627j080662l64138J01225o6329k00516
$$ 4504107 5523374 6570290 6715909 5774282 4693620 4329482 4430707 4364378 4163862
41302D163862l1659q4604l51987j4452R41359J249446L52237m80774j02395O82534
$$ 4163862 4132203 4047599 3695612 3681160 4622519 5871965 6224202 5743428 5641033 6323567
41292F323567N51985j58503k63870J42999P9852l83524l30980J79366K38892j16084
$$ 6323567 6875552 6717049 6453179 6596178 6676030 6292506 5961526 6140892 6379784 6263700
41282F263700N2432P60213J028517P27033P41713J088992P18826l31738m75247
$$ 6263700 6316132 7076345 8104862 8831895 9573608 10662600 11381426 11049688 10574441
41273A0574441R30265K346209K338768J570238J351522J580239J431434R53834
$$ 10574441 11504706 13850915 16189683 17759921 19111443 20691682 22123116 23076950
41265B3076950N90619K8180j090405k037019j947276j325365j278929j704938
$$ 23076950 23667569 23695749 22605344 20568325 18621049 17295684 16016755 14311817
41257A4311817j586046q49630n89865j332034k149321j849711m23770R74059J240988
$$ 14311817 12725771 11876141 11286276 9954242 7804921 5955210 5531440 6505499 7746487
41248G746487M39270l29916l37121k04144q14324j602782j205414J88615P56447
$$ 7746487 8185757 7855841 7518720 7314576 6500252 4897470 3692056 3880671 4637118
41239D637118k08111j161049p91435N3616J46217n7429K79820M74428l55014j237297
$$ 4637118 4429007 3267958 2476523 2530139 2676356 2618927 2898747 3373175 3018161 1780864
41229A780864p41006M42690N10663m61118p93004j07659L33690J00064J17733
$$ 1780864 1039858 1482548 1993211 1532093 739089 631430 965120 1065184 1182917
41220A182917N80833N35749j02701k20394L44518L73349m11577o38150L06591
$$ 1182917 1763750 2299499 2196798 1976404 2320922 2694271 2282694 1644544 1951135
41211A951135J121297Q18344K51842L05601L39930k44453n58730J41758Q43749
$$ 1951135 3072432 3890776 4142618 4448219 4788149 4543696 3984966 4126724 4970473
41202D970473M44825k52538j3443M70321k75211j747038k006172p06056M73422
$$ 4970473 5415298 5162760 5149317 5619638 5344427 3597389 1591217 885161 1358583
41193A358583N03048J95192L14748K82944m15399r64088m66983M72843N83622
$$ 1358583 1861631 2056823 2371571 2654515 2239116 1275028 808045 1280888 1864510
41184A864510j90962p34071m69751P897J32509K41002P58414J206530Q30130q8814
$$ 1864510 1673548 939477 469726 477623 610132 851134 1609548 2816078 3646208 3557394
41174C557394m59210O500L23433k20526r01180o72371K05524O05535K18812k27347
$$ 3557394 3098184 3104684 3428117 3207591 2306411 1634040 1839564 2445099 2663911 2436564
41164B436564k69064j90225k01581j25720j9301j81670l99177j19274M47130L99178
$$ 2436564 2167500 1977275 1775694 1649974 1630673 1449003 1049826 930552 1377682 1776860
41154A776860m01245r65176o41408M5233M35571N86452O00474K16235l10703q4652
$$ 1776860 1375615 410439 -230969 -185736 249835 836287 1436761 1652996 1342293 1257641
41144A257641Q62881J083867j33996j282307p02235Q08724J135080l0209j013232
$$ 1257641 2120522 3204389 3070393 1788086 1085851 1894575 3029655 2999446 1986214
41135A986214q39994k18035K22149P58717J191941M81856j303357k278635j256853
$$ 1986214 1146220 928185 1150334 1909051 3100992 3582848 2279491 856 -1255997
41126a255997L07018M04938n00255m07953Q15218J163162j46065j184370k19768
$$ -1255997 -948979 -544041 -1044296 -1452249 -637031 526131 380066 -804304 -1024072
41117a024072J593223J959615P26137l63978n23987n56806p75587l36147Q86657
$$ -1024072 569151 2528766 3254903 2890925 2366938 1810132 1034545 698398 1585055
41108A585055J580605J002174J52086m5695k39061j053081j444485l63952J046986
$$ 1585055 3165660 4167834 4319920 4274225 4035164 2982083 1537598 1173646 2220632
41099B220632R14500m09407r33786k03375K87132j53045m39201Q8645N32570K58077
$$ 2220632 3135132 2725725 1791939 1588564 1875696 1722651 1283450 1372095 1904665 2162742
41089B162742Q6093P19339J418939J216926K94316o38566j247437j250938m16558
$$ 2162742 2248835 2968174 4387113 5604039 5898355 5259789 4012352 2761414 2344856
41080B344856N21899L07554q05686r75600M25013J563114Q57828o52075j081808
$$ 2344856 2866755 3174309 2368623 1393023 1818036 3381150 4238978 3586903 2505095
41071B505095l93853K93520P53860J178856Q33626p30313j979227j120966R87939
$$ 2505095 2111242 2404762 3158622 4337478 5171104 4440791 2461564 1340598 2328537
41062B328537J834291Q59039j13993L625K94370K7576o3223N12014Q55434K77250
$$ 2328537 4162828 5021867 4907874 4911499 5205869 5233445 5170222 5682236 6537670 6814920
41052F814920m16970l20994P0531r8789m28959O0128J149959J545146P39752j72042
$$ 6814920 6397950 6076956 6147487 6048698 5619739 5679867 6829826 8374972 9114724 8942682
41042H942682J44810J600834K797205K690073J684560P89061J14865r57979k183212
$$ 8942682 9087492 10688326 13485531 16175604 17860164 18649225 18764090 17806111 15622899
41033A5622899k214885n80967J144419J173991j49229r34552k39750J082754J772823
$$ 15622899 13408014 12827047 13971466 15145457 14996228 14061676 13821926 14904680 16677503
41024A6677503J431149N70535J69582R24295K337174L045839K635817K300102
$$ 16677503 18108652 18679187 18848769 19773064 22110238 25156077 27791894 30091996
41016C0091996K979627M042690M892387O399697R076085J1391124J2260884J3811513
$$ 30091996 33071623 37114313 42006700 48406397 57482482 68873606 81134490 94946003
41008I4946003J8684880K5784766L2452698L9803091N0171643N8058296N0173854
$$ 94946003 113630883 139415649 171868347 211671438 261843081 319901377 370075231
41001C70075231J9880672k1320468n2104950o0707053n2599347m0306077l0828928
$$ 370075231 389955903 368635435 316530485 255823432 203224085 162918008 132089080
40994A32089080k4100443j8684485j4652125j2035969r831778p335625n091714
$$ 132089080 107988637 89304152 74652027 62616058 52784280 45448655 40356941
40987D0356941l896476l587402l385929l059747l033496l284869k939915j604524
$$ 40356941 36460465 32873063 29487134 26427387 23393891 20109022 17169107 15564583
40979A5564583m45001p88854j929162j802485l4046J316648P06122p89754j396926
$$ 15564583 15119582 14330728 12401566 10599081 10565035 11881683 12587805 11798051 10401125
40970A0401125j202209j302736j567912j057959J0019N19905L40935K88159M03333
$$ 10401125 9198916 7896180 6328268 5270309 5280328 5800233 6141168 6429327 6832660
40961F832660o6628r79543j195866l85803M77549O90335N65738L63976j68994
$$ 6832660 6766032 5786489 4590623 4204820 4682369 5372704 5938442 6302418 6133424
40952F133424q32683q75516l35102j81155n83614m04097Q10671J674542R27421
$$ 6133424 5300741 4425225 4090123 3908968 3325354 2921257 3731928 5406470 6333891
40943F333891n21389q65313j4899M78956j85354j091485j123405l90430J98159
$$ 6333891 5812502 4947189 4932290 5411246 5225892 4134407 3011002 2620572 2818731
40934B818731J04896m15649o96681l06826M35579O49291r0312j045414j079655
$$ 2818731 2923627 2507978 1811297 1504471 1940050 2589341 2499029 1453615 373960
40925C73960q0878Q90631R64811M65178K82071O41428R36432O41965m8034n90474
$$ 373960 293082 1183713 2148524 2613702 2895773 3537201 4473633 5115598 5067564 4477090
40915D477090p71931p76314p46118n87253k19624K30389N71406P03426N78684
$$ 4477090 3705159 2928845 2182727 1595474 1375850 1606239 2177645 2881071 3459755
40906C459755K04452k48793n41375o09365m99459j23558N08225Q49766K87472
$$ 3459755 3664207 3415414 2874039 2264674 1765215 1641657 2149882 2999648 3287120
40897C287120p65989j052541k15081M81684k7981q60384m50944R17979J338554
$$ 3287120 2521131 1468590 1253509 1735193 1707212 846828 395884 1313863 2652417
40888B652417L7522j524614j732673p83871O0843K23201M8195j2573K56088Q24243
$$ 2652417 2689939 1165325 -567348 -1351219 -1290376 -1067175 -1018980 -1031553 -775465 48778
40878D8778J216637Q13451k06224q12946m95846r148j59181n67689m50082O583
$$ 48778 1265415 2078866 1872642 1059696 563850 554702 395521 -172168 -622250 -615667
40868f15667N3732k32980p0622O41545J061324O48419j37532n69744m55278l7103
$$ -615667 -561935 -794915 -865537 -223992 837332 1485751 1348219 778475 323197 286094
40858B86094L84055N81541N40239M82664M28288o1557j148573j955343j372094
$$ 286094 670149 1251690 1791929 2274593 2702881 2641324 1492751 -462592 -1834686
40849a834686L15384J451806R91105k49415p81129l32637J01477j58593n69851
$$ -1834686 -1519302 -67496 923609 674194 -106935 -439572 -338095 -496688 -1066539
40840a066539k47348O88967J150853M99134n47736q27975k52583K57308K41714
$$ -1066539 -1313887 -624920 525933 1025067 477331 -350644 -603227 -345919 -104205
40831a04205K14678N03027N70789N4487m53278m21639l19996o10395o64542J33233
$$ -104205 110473 613500 1184289 1238776 785498 363859 43863 -566532 -1231074 -1097841
40821a097841R79404P64678l5997j68501K46841J80395j19353M35871J294027
$$ -1097841 -118437 646241 610244 441743 688584 868979 749626 1185497 2479524
40812B479524P09000j009745j368116L07123J431673K10457j439795j086320L42317
$$ 2479524 3188524 2178779 810663 1117786 2549459 2759916 1320121 233801 576118
40803E76118M79144m14416l01990P63712P59481o54971j521003q09725K75113
$$ 576118 1055262 640846 338856 1102568 1862049 1207078 -313925 -1123650 -848537
40794h48537O39207O87795Q35876O57192J34595l1593J15406k47052q92432n77006
$$ -848537 -209330 478465 1314341 1971533 2106128 2074535 2189941 1942889 1050457 473451
40784D73451O08794R79144N7866n09827J39949M94250n74007j545878p13808Q00061
$$ 473451 1082245 2061389 2119255 1609428 1749377 2243627 1669620 123742 -590066 209995
40774B09995P70085n50840r82431M9712Q72618M09102l95234l72880K35684N51775
$$ 209995 980080 429240 -553191 -503479 369139 778241 383007 10127 245811 797586
40764G97586L72236J16480O0625K7859l33368r35921r46223K96554J893008J958656
$$ 797586 1169822 1286302 1346927 1374786 1041418 105497 -840726 -544172 1348836 3307492
40754C307492J70588j434232j167795K819K05046m24513l99512L46259N10549
$$ 3307492 3478080 2043848 876053 878872 1083918 659405 259893 606152 1116701
40745A116701l3543K9242R45735J199889j8373j428360j618541r13851l20855
$$ 1116701 1083158 1112400 2058135 3258024 3239651 1811291 192750 -721101 -1041956
40736a041956J06303P25204J130855P39702n2253l67765j50816r3012m95158r36952
$$ -1041956 -935653 -210449 920406 1660108 1607855 1240090 1089274 996262 501104 -435848
40726d35848r52892m83808K28252P71035P37405J55054l71142k68555L10539O32852
$$ -435848 -1388740 -1872548 -1644296 -873261 -135856 19198 -351944 -620499 -309960 322892
40716C22892K07267o40918j044608n21665L69638N88947m5977n58854k17431L57124
$$ 322892 530159 -110759 -1155367 -1677032 -1307394 -718447 -764424 -1323278 -1540709 -1183585
40706a183585J84151m86160n68032J45327P64200P54085N04982L56068J53649
$$ -1183585 -999434 -1485594 -2053626 -1908299 -1144099 -390014 114968 471036 624685
40697F24685o119K99952Q32818P24670q6965n87213l63351l41553j086011j574682
$$ 624685 618566 918518 1751336 2476006 2389041 1801828 1438477 1096924 10913 -1563769
40687a563769p64474O18305J137896P58415N25563O73984N15117n7322m24972
$$ -1563769 -2328243 -1709938 -572042 186373 711936 1385920 1901037 1843715 1418743
40678A418743n56361r84134j331392m37088J522120K554621J460073l27658p46134
$$ 1418743 862382 -121752 -1453144 -1890232 -368112 2186509 3646582 3318924 2572790
40669B572790J8906K06083n71077q98885j32038M81003m0072o94743j71193R02885
$$ 2572790 2591696 2797779 2226702 1327817 1195779 1676782 1636710 941967 770774 1673659
40659A673659R07245k01924r04503n23818m481p1185j51535K69807N53903L5782
$$ 1673659 2580904 2378980 1474477 950659 946178 874993 723458 993265 1547168 1582950
40649A582950p61637r65424o19806k57798N2431L61069K81369k51336l79214M38196
$$ 1582950 821313 -144111 -763917 -1021715 -969284 -608215 -326846 -578182 -957396 -519200
40639e19200J256772R50115P2706j4138N67685M65162m73506p99935J33232R90009
$$ -519200 737572 1687687 1760393 1746255 2313940 2779102 2305596 1505661 1638893 2628902
40629B628902M41211q85171j372906n50136O02897J027348N91678q4769m18521
$$ 2628902 3070113 2184942 812036 261900 864797 1892145 2483823 2399054 1980533
40620A980533m71989p03910j015323n93513P21791J585652P60790q43730j139932
$$ 1980533 1508544 804634 -210689 -804202 -82411 1503241 2264031 1420301 280369
40611B80369K23808J401817J015860k06094r54634j094887j089675q19850l937
$$ 280369 504177 1905994 2921854 2715760 1761126 666239 -423436 -1243286 -1247223
40602a247223R07069J155144O21679j96201p70294p67409j79389M86587O23184
$$ -1247223 -340154 814990 1436669 1240468 470174 -297235 -476624 9963 633147
40593F33147K84477K3145q765j03969k24608o6523J30227j66680o90621o11155
$$ 633147 917624 940769 932004 828035 603427 536904 667131 500451 -190170 -801325
40583h01325O0292M24015J59558j23061r2393j8706J67642P56653J136858L71111
$$ -801325 -741033 -317018 -157460 -280521 -372914 -391620 -223978 532675 1669533 2040644
40573B040644r57239j216317k97913J96325k76304l91994M15540Q17684J17410
$$ 2040644 1083405 -132912 -430825 -234500 -510804 -902798 -487258 330426 447836
40564D47836l47247L28316Q93917K53165n51552l92594j22249o73303r96625k4454
$$ 447836 100589 428905 1322822 1575987 1024435 631841 509592 -163711 -1160336 -1184790
40554a184790J064029Q12312P1912K24714M60086m93483j439521n57313J029210
$$ -1184790 -120761 691551 763463 988177 1448263 954780 -484741 -1042054 -12844
40545a2844Q20029p22673q48459Q08644J709401P26418l48533k12803Q7954l67414
$$ -12844 807185 84512 -763947 44697 1754098 2480516 2131983 1919180 2007134 1639720
40535A639720p36254l45639K5442j35895r6962M25392N00183j70635m70319J49526
$$ 1639720 903466 557827 583269 447374 350412 775804 1275987 1105352 635033 784559
40525G84559O46341K74641j59357J05579M52456J22733n22667q19242p12623k68851
$$ 784559 1430900 1705541 1546184 1651763 2104219 2226952 1704285 885043 172420 -96431
40515i6431N12833R90781L60635p98189r67168j8880N66442J74437j42852J34584
$$ -96431 416402 1407183 1767818 969629 2461 -16419 550023 724460 581608 716192
40505G16192O3288o59534p36963M10779J271152N75818o35596p75493j11496J32555
$$ 716192 779480 119946 -617017 -206238 1064914 1640732 1005136 229643 118147 250702
40495B50702r9532m3018K58708J17400m96848q98918o23333J76668Q65646P16638
$$ 250702 151170 108152 366860 484260 -12588 -911506 -1534839 -1358171 -492525 224113
40485B24113j50799m30547O35222J598436O45014j246183j386678L29666J101558
$$ 224113 73314 -357233 277989 1876425 2521439 1275256 -111422 218244 1319802
40476A319802j67738j071917J02861J440170P19567r57032j311337m95673K437
$$ 1319802 1152064 80147 183008 1623178 2342745 1385713 74376 -421297 -418860
40467d18860K25678Q85145J166962N7724j344969j350183m29635j14096k76454
$$ -418860 -193182 691963 1858925 1916649 571680 -778503 -1208138 -1322234 -1598688
40458a598688Q6030N19040J25456j53878R99467K418896J889373j80698j354138
$$ -1598688 -1512658 -993618 -868162 -1022040 -22573 2396323 4285696 4104998 2750860
40449B750860r74166n37016n63999n1797R03222P92905n61585j433067q64215
$$ 2750860 1776694 1239678 675679 623882 1527104 2320009 1758424 325357 -538858
40440e38858J73390O29826M81059j04083q25074o53257Q22861J864770P01303
$$ -538858 -365468 264358 745417 641334 -183740 -836997 -14136 1850634 2551937
40431B551937j329365j463034J05424O78251k75833m98617O54928J000533k83456
$$ 2551937 1222572 -240462 -135038 543213 267380 -231237 423691 1424224 1140768
40422A140768r87128N5925P66458l04472j195246p2405J375464Q71885n62038
$$ 1140768 153640 209565 976023 671551 -523695 -596100 779364 1651249 1089211
40413A089211o12323M10968O46218R2496J2819J97851k96048p14990K14471J475757
$$ 1089211 476888 887856 1534074 1626570 1639389 1837240 1541192 826202 1040673 2516430
40403B516430J017484o95770j267811l08681Q2332r86355j732350o84188J100019
$$ 2516430 3533914 2838144 1570333 1261652 1343984 357629 -1374721 -2058909 -958890
40394i58890J806222J201986K62706k83516k52359J89803M43251j9296p65309
$$ -958890 847332 2049318 2312024 2028508 1776149 1965952 2409203 2389907 1624598
40385A624598q19992j15130L82577J58784j61795J02449P11182R35968M39908
$$ 1624598 804606 689476 1072053 1230837 1069042 1171491 1882673 2818641 3258549
40376C258549m57034j042911q29329j97350m0197m06929k52384Q02791J445049
$$ 3258549 2801515 1758604 929275 731925 691728 284799 32415 835206 2280255
40367B280255N53039p91755p61410L66041O64846l67423j175172p56432K4089
$$ 2280255 2833294 2041539 1280129 1646170 2311016 1943593 768421 11989 36078
40358C6078K66266L84067P95086Q58552K01487k32219K90897P86834k3585j517610
$$ 36078 302344 686411 1481497 2340049 2541536 2309317 2600214 3387048 3363463 1845853
40348A845853j885930p36764M25683M00374k62384m25601j9677J94040p019m0199
$$ 1845853 -40077 -776841 -351158 49216 -213168 -638769 -658446 -464406 -471425 -511624
40338e11624L89536P13088M39221J06398N14326J253225J048343k37354j090438
$$ -511624 -122088 591000 1030221 1136619 1650945 2904170 3952513 3715159 2624721
40329B624721m99780M42733K05404p39604o47237O61437J352921K34236j554367
$$ 2624721 2124941 2567674 2773078 2033474 1386237 2047674 3400595 3634831 2080464
40320B080464k100429r76376O58846J461670R15092m09592j195485n80995P02837
$$ 2080464 -19965 -996341 -337495 1124175 2039267 1629675 434190 -146805 556032
40311E56032J061671J11286q26184o16150K66949P49600O33660K95442k49515
$$ 556032 1617703 1728989 902805 286655 553604 1303204 1936864 2232306 1982791
40302A982791j003250j292247m81620Q75585J528883J084373L18498m881O0610
$$ 1982791 979541 -312706 -794326 81259 1610142 2694515 3013013 3008132 3068742
40293C068742P0263j47599m02275m02764n9389L29687L36592k8826l15441l46030
$$ 3068742 3139005 2991406 2589131 2186367 2126978 2456665 2793257 2764431 2448990 2102960
40283B102960m55150p30714o36449P0469O37261L19169l34090j41475R27396J620241
$$ 2102960 1647810 917096 280647 351116 988377 1307546 973456 831981 1759377 3379618
40273C379618J160902K36609j31321J0531j56818q91971j455081j068512Q655
$$ 3379618 4540520 4777129 4645808 4656339 4499521 3607550 2152469 1083957 1092612
40264A092612O78636L65118j53614K12013J117231R88351o59296k098171j517129
$$ 1092612 1771248 2136366 1982752 2194765 3311996 4300347 3641051 1542880 25751
40255B5751M23134J417591N91820o28971q03516k39786L6271q0654j507M00889
$$ 25751 448885 1866476 2458296 1829325 1025809 786023 822294 741640 740133 1141022
40245A141022O72104M78145p9678n79978m98025K34991P92538K94149p68444r32866
$$ 1141022 1813126 2291271 2211593 1631615 1133590 1368581 2161119 2455268 1686824 753958
40235G53958O9591P62519K07483m98034j34761N05432L9661r27644o90697N78563
$$ 753958 823549 1586068 1793551 1295517 1160756 1666188 1705849 778205 87508 666071
40225F66071R72792O195o20500P3862Q26894M53071k61771k63435j13079o15367
$$ 666071 1638863 1645058 1024558 1098420 1925314 2378385 2116614 1853179 1740100 1124733
40215A124733j018957l73163M85463K57941m06614M3166J199841J201767o3972
$$ 1124733 105776 -267387 218076 476017 69403 112569 1312410 2514177 2450205
40206B450205o53247K12684R15047K18120p81599o56115J11430K78098q5668j35703
$$ 2450205 1796958 2009642 2924689 3142809 2361210 1705095 1816525 2094623 2008955 1873252
40196A873252J14983J22364L0476K43472L87387l9939n14876k38340M11574M34734
$$ 1873252 1988235 2110599 2141075 2384547 2771934 2731995 2217119 1978779 2390353 2825087
40186B825087j62593n67503o50624q85977j015084l07474Q25197J022764Q1349
$$ 2825087 2662494 2094991 1444367 558390 -456694 -764168 61029 1083793 1165142
40177A165142n99538j79746M07063J60620l23609L2976R24527J110907K66448
$$ 1165142 565604 385858 792921 953541 629932 662908 1587435 2698342 2964790
40168B964790o98629r75980o41982j61101J71852K43171J05900K4133J76416L36624
$$ 2964790 2266161 1290181 648199 487098 658950 902121 1008021 1032154 1208570 1545194
40158A545194J70075k13778l45807m1405L16744K19526l51592p76629l31003R46154
$$ 1545194 1715269 1501491 1155684 1114279 1431023 1650549 1298957 522328 191325 1137479
40148A137479J971218J587627n9242j515368j617302p16991n12J1523k19550j76225
$$ 1137479 3108697 4696324 4637082 3121714 1504412 787421 786909 798432 578882 402657
40138D02657R4124L06471L85059M15519M56077N24726N52825L20807k54280p18101
$$ 402657 496781 803252 1188311 1603830 2059907 2584633 3137458 3458265 3203985 2485884
40128B485884m16694N03515R07930N3256j157921j143388J39652R74387L20725
$$ 2485884 2069190 2572705 3480635 3533891 2375970 1232582 1372234 2346621 2667346
40119B667346o21227k81971P55446O71339n85331j147033k96495L59814l36848
$$ 2667346 2046119 1764148 2519594 3190933 2605602 1458569 1162074 1521888 1185040
40110A185040j075924l20745R95669R56705k32889p58969j78241K85248J15619
$$ 1185040 109116 -211629 784040 1740745 1507856 748887 570646 855894 971513
40101I71513N384M8888l69208p51102J58184J803126J981649K86962j016451n78725
$$ 971513 976897 1025785 656577 -94525 63659 1866785 3848434 4135396 3118945 2540220
40091B540220M0493n79765j137888j43284J094677N74819q68751r17873L86730
$$ 2540220 2580713 2000948 863060 719776 1814453 2389272 1520521 602648 989378
40082I89378R59107K51483k31085J43813K88640l05360p19127m54756j44596m3949
$$ 989378 1948485 2199968 1968883 2112696 2401336 2095976 1376849 922093 777497 733548
40072G33548L35616P81350M20012m75548n89683J81197N11452P1460O6066P57288
$$ 733548 1069164 1850514 2270526 1794978 1205295 1386492 1897944 1969404 2035470 2792758
40062B792758O87142o67501j628653r69923J46882L30058J87110P25770J216982
$$ 2792758 3479900 2812399 1183746 213823 360705 690763 877873 1603643 2820625
40053B820625N75110m81775o21495j54151j68252l90347Q9235P69533N03338k91570
$$ 2820625 3395735 2913960 2292465 2138314 1970062 1579715 1668950 2438483 2941821 2650251
40043B650251k81734L56116L03865l48902j59562R90130J469889N64982m37322
$$ 2650251 2368517 2724633 3028498 2679596 2520034 3510164 4980053 5545035 5107713
40034E107713m33221K4050J36197P8003K2526m65370j170906q97036N39945J403063
$$ 5107713 4674492 4698542 4834739 4912742 4935268 4469898 3298992 2401956 2941901 4344964
40024D344964L95056j296789j721577q79001j40822J82687Q43202J623165J276726
$$ 4344964 4740020 3443231 1721654 842653 701831 884518 1727720 3350885 4627611
40015D627611k63267j311195p15897N40652Q22323l2382r26454j150485q54564
$$ 4627611 4364344 3053149 2337252 2877904 3700227 3667845 2741391 1590906 736342
40006G36342k78762M87939J030602P82752p7910n66557r5765P10608Q16410P3027
$$ 736342 457580 945519 1976121 2758873 2680963 2114406 2018641 2729249 3545659 3618686
39996C618686p07174p85184j89218N21822Q10579N27887L7121j11601J09191O6470
$$ 3618686 2911512 2126328 1937110 2458932 3269511 3797398 3834519 3722918 3832109 3898579
39986C898579n68270j076045n96429M90237R97988O55038L02818K78055j10967
$$ 3898579 3330309 2254264 1657835 2148072 3146060 3801098 4103916 4381971 4271004
39977D271004j021389j331963l80524O84753M87775m94890p58854n4471N59952
$$ 4271004 3249615 1917652 1537128 2221881 2709656 2214766 1455912 1401441 1961393
39968A961393N50521L61742K26686p4985l02980M1149N31552J95424p54324r50973
$$ 1961393 2511914 2873656 3100342 3025357 2722377 2763526 3295078 3490502 2736178 1785205
39958A785205J6434Q86297O42626j19654m05691k25409j2373L01259P42254P33264
$$ 1785205 1801639 2687936 3330562 3210908 2805217 2579808 2567435 2868694 3610948 4344212
39948D344212J6519n97610l41389K70743K42531l74466o85055l36592J56021K79416
$$ 4344212 4360731 3763121 3421732 3692475 3935006 3560540 2875485 2538893 2694914 2974330
39938B974330M7069j97226o4934N26617J017940P17477r7615l39391K53917N94618
$$ 2974330 3021399 2824173 2759239 3285856 4303796 5021273 4923658 4584267 4838184 5432802
39928E432802k3054p29648n40975J8180m6331m44515l23872N604k77040o57421
$$ 5432802 5409748 4680100 4139125 4157305 4110974 3666459 3342587 3348191 3071151 2413730
39918B413730N1050J403759J644670M94205l18877J87075Q18922L81424m10881
$$ 2413730 2464780 3868539 5513209 6007414 5688537 5875612 6694534 7075958 6665077
39909F665077l73582J66158K07576j08482L4538M99461M26310k48080p28446o58447
$$ 6665077 6291495 6457653 6665229 6556747 6591285 7090746 7517056 7268976 6540530 5882083
39899E882083m30921k87124m0362L03544M31882K48513q0782m65725p12259l59392
$$ 5882083 5451162 5164038 5123676 5427220 5859102 6107615 6026833 5561108 4848849 4489457
39889D489457N39321Q88417j15308j380619j021062Q30047J794961M65802j494841
$$ 4489457 5028778 5917195 5801887 4421268 3400206 4230253 6025214 6491016 4996175
39880D996175j554787L25620J880105J640416M54087j62565O1657M06650M65519
$$ 4996175 3441388 3767008 5647113 7287529 7741616 7579051 7640708 8047358 8512877
39871H512877M35249M70115M25168K24932M5506M1481J62767L38300O27435J032900
$$ 8512877 8948126 9418241 9843409 10068341 10113847 10155328 10318095 10656395 11283830 12316730
39861A2316730J312821J227788R66060J037821J584224K033062J756406R38978
$$ 12316730 13629551 14857339 15823399 16861220 18445444 20478506 22234912 23173890
39853B3173890L81230M41460O44477M81944R4856j66021l91328q09055j151662
$$ 23173890 23555120 23996580 24641057 25123001 25217857 25051836 24660508 23851453 22699791
39844B2699791r44070k83677K60595M67041N97442P64973Q31100R45275J386046
$$ 22699791 21755721 21472044 21732639 22199680 22797122 23562095 24393195 25338470 26724516
39835B6724516J685355Q46487j044066k292328j559417K12941Q47899l58413j997615
$$ 26724516 28409871 29256358 28212292 25919964 24360547 24573488 25421387 25062974 23065359
39826B3065359k591755k226358j829409j722996j535798j059531n26914j75042
$$ 23065359 20473604 18247246 16417837 14694841 13159043 12099512 11572598 11397556
39818A1397556J1270J22685J47988r047m15566r41411j206366r00697k15130K82333
$$ 11397556 11408826 11531511 11679499 11670452 11254886 10313475 9107109 8206412 7991282 8273615
39808H273615K92854O7951o6155j62920l93935n81975l61990K55861Q25508J031987
$$ 8273615 8566469 8634420 8568265 8405345 8011410 7429435 7067445 7323306 8148814 9180801
39798I180801J030505J045531Q85545K47352n32582n61301M34735J423708J168261
$$ 9180801 10211306 11256837 12142382 12389734 11857152 11295851 11730586 13154294 14322555
39789A4322555j70431j260221j395882j142388r64669l62974Q90678J710033J093646
$$ 14322555 14152124 12891903 11496021 10353633 9388964 9025990 9916668 11626701 12720347
39780A2720347j45356m54882J10631K29449k09856J15442J397107J927594Q43988
$$ 12720347 12574991 12120109 12230740 12460189 12250333 12365775 13762882 15690476 16534464
39771A6534464j88693M84924J776342J575433K09005p0202J274327K234149J432563
$$ 16534464 16345771 16830695 18607037 20182470 20391475 20321273 21595600 23829749 25262312
39762B5262312N8430k70010J55584K49218K80718J201054K446147K232812K21874
$$ 25262312 25320742 25050732 25206316 25455534 25736252 26937306 29383453 31616265 31838139
39753C1838139j563902j165259Q51486K178805J613612L15748J71096J484496
$$ 31838139 30274237 29108978 29960464 32139269 33752881 34068629 34239725 35724221
39745C5724221K708789K333926O23136p86583q05112O2569O71846O71467M90475
$$ 35724221 38433010 40766936 41390072 40603489 39798377 39860946 40532792 41204259 41694734
39736D1694734K96012k19244j015480j511707j493489j432350j446994p97519
$$ 41694734 41990746 41771502 40756022 39244315 37750826 36318476 34871482 34073963
39728C4073963P71496J946349J334692l64866j109177l51587M30248L07257K45370
$$ 34073963 34845459 36791808 38126500 37761634 36652457 36300870 36731118 37038375 37283745
39719C7283745J039559J557621M82518j380834k195376j702905j070448p18820
$$ 37283745 38323304 39880925 40363443 38982609 36787233 35084328 34013880 33295060
39711C3295060j28525M86113K28607o86209j002058n34085m36261r66539q61045
$$ 33295060 33166535 33652648 33881255 33195046 32192988 31658903 31222642 30256103 29395058
39702B9395058L16251J004582l7066j710946k145579j140656J27323P99221N90361
$$ 29395058 29711309 30715891 30678825 28967879 26822300 25681644 25808967 26608188 27198549
39693B7198549o00609k097656k423515j176302m2095n74105j847326j882019o42707
$$ 27198549 26597940 24500284 22076769 20900467 20858372 20284267 18436941 16554922 15912215
39684A5912215J62391j72941o44034m84650j40681j28579l22152n79935r15133
$$ 15912215 16074606 15901665 15257631 14772981 14632300 14503721 14181569 13601634 12686501
39675A2686501r68022m13756J74101L5545l81381r2223N42182K41808q51711j093017
$$ 12686501 11718479 11304723 11478824 11514369 11132988 11040765 11582947 11824755 10973044 9880027
39665I880027l178P99372J19656j010130j110799m42465j36541k12257J35560
$$ 9880027 9876849 10676221 10795877 9785747 8674948 8232483 8095942 7883685 8019245
39656H019245Q85695J113278L51545q43221j539716j153600R7427J073337O50846
$$ 8019245 8904940 10018218 10369763 9526542 7986826 6833226 6930653 8003990 8654836
39647H654836p73897j468772n98097O10739O87271n5404m10306l35109o37133
$$ 8654836 7880939 6412167 5814070 6424809 7112080 7056676 6646370 6311261 5674128
39638E674128j097863o50917N15995P70398m45367j410891n44824J085316J179279
$$ 5674128 4576265 3925348 4441343 5211741 4766374 3355483 2810659 3895975 5075254
39629E075254l95265j359054l83057J015025R09207q8884r682J095419J133635
$$ 5075254 4679989 3320935 2937878 3952903 4862110 4773226 4763544 5858963 6992598
39620F992598n12926j697391p78327P70568P34264l67411m11557O53835Q67424
$$ 6992598 6479672 4782281 4003954 4774522 5508786 5141375 4729818 5383653 6251077
39611F251077k23637p76476J13760Q84239K60586o44222m54787P4874l99208j263867
$$ 6251077 6027440 5250964 5364724 6248963 6509549 5865327 5410540 5485414 5086206 3822339
39601C822339r62127K93770Q33098J78697m44720k11797L12520M86272N17067
$$ 3822339 2860212 3153982 3987080 4165777 3721057 3509260 3821780 4308052 4825119
39592D825119O78033O61136J91309m12381o40702l23594L11308O95957K11910
$$ 4825119 5503152 6164288 6355597 5943216 5302514 4978920 5290228 5986185 6198095
39583F198095r96074j723557r84654N34390J139856K79730q04307p68561K31199
$$ 6198095 5202021 3478464 2493810 3028200 4168056 4447786 3643479 2874918 3106117
39574C106117R83757P43515r5206o09833l73032J27549J43145k76003k70668N48334
$$ 3106117 4089874 4833389 4738183 4128350 3755318 3882867 4026012 3750009 3479341 4027675
39564D027675J350698J158918K18979m31632m61399m66837q07896j085481r03079
$$ 4027675 5378373 6537291 6756270 6324638 5863239 5396402 4588506 3503025 2599946
39555B599946m37809l2506K60102N41484Q52304J148336J169555M83050q47905
$$ 2599946 2162137 2129631 2389733 2931217 3783521 4931857 6101412 6584462 5736557
39546E736557j807229j350400J52086J077878M15082j037047j627004o87881Q57766
$$ 5736557 3929328 2578928 2731014 3808892 4223974 3186927 1559923 872042 1729808
39537A729808J584756J060756J78316l8301L00273L39363m6088q3236M19818N85252
$$ 1729808 3314564 4375320 4553636 4515335 4815608 5154971 5108883 5025647 5445465 6030717
39527F030717O3244j18796O45654J106795N9453j331692j101642K60246M72447
$$ 6030717 6093961 5975165 6620819 7727614 7787067 6455375 5353733 5613979 6086426
39518F086426p56192j163929L54598J991977K043294J393948J498073J873872
$$ 6086426 5330234 4166305 4520903 6512880 8556174 9950122 11448195 13322067
39510A3322067J508187J180535K254872M212406N426467N585541N429315M965859
$$ 13322067 14830254 16010789 18265661 22478067 27904534 33490075 38919390 43885249
39502D3885249M162414M600639P603068J0769892R475484K931659l638397m585412
$$ 43885249 48047663 52648302 60251370 71021262 80496746 83428405 79790008 75204596
39494G5204596k39087L689787K256616m158428j0626129j2162771q162079k976848
$$ 75204596 74965509 78655296 80911912 76753484 66127355 53964584 45802505 42825657
39486D2825657j476843l937601o472279o386258m908864l970476l026171j097050
$$ 42825657 41348814 37411213 30938934 24552676 19643812 15673336 12647165 11550115
39478A1550115L19218o26333k399640j796490R78294K248506L16971k110165k090564
$$ 11550115 11869333 11243000 8843360 7046870 8025164 10273670 10590641 8480476 6389912
39469F389912l66337N68788K13090j77209j45816k59380n28220m24724j02553
$$ 6389912 6023575 6592363 6805453 6628244 6482428 6223048 5694828 5270104 5167551
39460E167551j50642m41380m43923l05156m24854l71961M59890J402076J116228
$$ 5167551 5016909 4575529 4131606 3826450 3401596 3029635 3489525 4891601 6007829
39451F007829l77411j577694j539114q41492l02069J14186O38019R24013N86905
$$ 6007829 5630418 4052724 2513610 1672118 1370049 1484235 2122254 3046267 3633172
39442C633172q6845n24981n97821n41728m26452r1605M36552P24750L36152m64091
$$ 3633172 3546327 3021346 2423525 1881797 1455345 1363740 1800292 2525042 2861194 2397103
39432B397103p05364R7514R59500N04834r31433j459674l09331R91824R55697
$$ 2397103 1691739 1789253 2748753 3253587 2322154 862480 553149 1544973 2500670
39423B500670K81780L59978Q57199N46651l26830m75186J34768L76902P8579P9344
$$ 2500670 2782450 3142428 3999627 4546278 4219448 3744262 3879030 4255932 4334511 4413855
39413D413855L55548J38651j47652P12812K219129K396124J028633K59837J175428
$$ 4413855 4769403 4908054 4760402 5473214 7692343 10088467 11117100 11376937 12552365
39404A2552365K210805K123522K197297L858347O068458O886685O061393M495666
$$ 12552365 14763170 16886692 19083989 22942336 29010794 35897479 41958872 46454538
39396D6454538K819643K175472M485105R511935J3009526J0516973K642046n274238
$$ 46454538 49274181 51449653 55934758 65446693 78456219 88973192 91615238 86341000
39388H6341000q181230m698965K795632Q968569P931509j459499j2615159j6663354
$$ 86341000 78159770 73460805 76256437 85225006 93156515 91697016 79081857 62418503
39380F2418503j1663539m114015r48078k703385n426179o396960n864596m892525
$$ 62418503 50754964 46640949 45692871 42989486 37563307 31166347 25301751 20409226
39372B0409226l902969l003042k263637j639516j208337j197929j456104j427587
$$ 20409226 16506257 13503215 11239578 9600062 8391725 7193796 5737692 4310105
39364D310105r38832m21402j75765p2941p9631l08485m78604j81580K58985J16770
$$ 4310105 3371273 2949871 2774106 2701165 2621534 2313049 1834445 1652865 1911850 2028620
39354B028620n16704q47814p15997o54434n92461J29841J236129J478360N84204
$$ 2028620 1511916 664102 -51895 -706329 -1298790 -1168949 67180 1545540 2129744
39345B129744j90270n1468K06990j76494n97343l63379m2152l50937p36976l26644
$$ 2129744 1939474 1888006 2094996 1918502 1321159 957780 915628 564691 -172285 -498929
39335d98929N05775P61905M05275J50969J52168J3620k43376k60043j16929j35943
$$ -498929 6846 768751 1174026 1324995 1477163 1490783 1247407 987364 870435 734492
39325G34492j88596l1472J7159l70647o42379m5253R79666J145436J30701r01141
$$ 734492 545896 514424 531583 160936 -481443 -526696 452970 1598406 1729107 827966
39315H27966q45113K9151O43514M57420j22080l78836l5145N56603Q45258O71453
$$ 827966 -17147 12004 655518 1112938 990858 612022 576877 1133480 1978738 2650191
39305B650191L25005K1075l87154j011494j538373j513237q56201Q6972Q31945
$$ 2650191 2975196 2996271 2609117 1597623 59250 -1453987 -2310188 -2223216 -1391271
39296a391271R93835N40208k1245k7418N38672R25626N45292k51797o33103l08661
$$ -1391271 -397436 142772 121527 94109 632781 1558407 2103699 1851902 1218799 910138
39286I10138K24819L80388J34231j02079j30785k46116o60866q78719k42164Q38963
$$ 910138 1134957 1515345 1649576 1547497 1416712 1170596 509730 -368989 -611153 227810
39276B27810J064760J00588o76804j30632Q32574O45889m61512r66364n41099
$$ 227810 1292570 1393158 716354 585722 1418296 2064185 1602673 636309 95210
39267I5210k05812j60487M59207J413853J157714m34037j258981j18271J252672
$$ 95210 -110602 -271089 188118 1601971 2759685 2325648 1066667 948396 2201068
39258B201068Q36616o30817j132268n66718l85432q67897q93777r2227O80078
$$ 2201068 3037684 2406867 1274599 707881 322449 -545448 -1439225 -1531452 -851374
39249h51374R17555Q94777N96553k23171r41615n94145L82477M73350n59922j139049
$$ -851374 66181 960958 1557511 1334340 392725 -201420 181057 654407 94485 -1044564
39239a044564k14164J172075J419076M57709n22346p44530m32699p4329K25070
$$ -1044564 -1258728 -86653 1332423 1790132 1267786 523256 90557 16228 241298
39230B41298O27923J090571J174337N36008l94625p37702l97275k62330o85950
$$ 241298 869221 1959792 3134129 3670137 3275512 2537810 2140535 1878205 1192255
39221A192255o75174M65282J561357J046276n58814j294647o76839j74149o11851
$$ 1192255 517081 982363 2543720 3589996 3031182 1736535 1059696 885547 273696
39212B73696r23347j41963R45827J113898M81153l6653j71609k22458j95443P3980
$$ 273696 -649651 -791614 154213 1268111 1749264 1712611 1541002 1318544 1123101 1197081
39202A197081L95727N07711M69871L02553k00841q37071q54791j8875Q54732J009176
$$ 1197081 1592808 2100519 2570390 2872943 2672102 1835031 980240 961365 1816097 2825273
39192B825273O85357L39494k41384j198567j764730j238089k17201K39083J90012
$$ 2825273 3510630 3850124 3608740 2410173 645443 -592646 -809847 -570764 -380752
39183c80752L57727N41997l4776r20770o15729J032537K098038J106906q02062
$$ -380752 -23025 518972 484196 -436574 -1052303 -19766 2078272 3185178 2383116
39174B383116j357287j39471J109559R72216Q607l90123L3029L00283j97009p71473
$$ 2383116 1025829 886358 1995917 2968133 2976740 2586617 2619646 2919929 2722920 1951447
39164A951447m57074N04889Q69556O7777j018961j285362p78378k76656k0061
$$ 1951447 1494373 1999262 2868818 2936595 1917634 632272 -146106 -422762 -442823
39155d42823L12976O53330N39631P0625p3542K58327M24441R9609k25126k21778
$$ -442823 -129847 523483 1063114 1133739 1060197 1318524 1742965 1842574 1617448 1395670
39145A395670k95448o36096o04128J86693R77465R54423N30155N18176O66284
$$ 1395670 1100222 464126 -140002 46691 1024156 1978579 2508734 3026910 3693194
39136C693194K28750m79367m91936Q3832K13247k32835l18248J17444P9632o47813
$$ 3693194 3921944 3442577 2950641 3034473 3247720 3014885 2696637 2814081 2893713 2245900
39126B245900q18284K02418J155174P69034l43487q89384q38890p70999l37276
$$ 2245900 1427616 1630034 2785208 3554242 3210755 2321371 1482481 711482 374206
39117C74206Q93938J791609Q27954j306037k134397o87218J240748J570808L34829
$$ 374206 1268144 3059753 3887707 2581670 447273 -239945 1000803 2571611 2906440
39108B906440r70008j292956o38858L87887J004949P54294N544m33261l24120
$$ 2906440 1936432 643476 4618 392505 1397454 2151748 2157292 1724031 1399911
39099A399911j26180j57651k84209l86189m09877o5876O87395J040229K70410
$$ 1399911 1273731 1116080 831871 445682 35805 -30071 657324 1697553 1967963
39090A967963q33144p67940L85479Q86853r4630j269299j215128k62806M38066
$$ 1967963 1134819 366879 752358 1639211 1544581 275282 -939846 -1202652 -764586
39081g64586N98299N63243L20981k23144n88448k55777N05079R73230Q00231J49611
$$ -764586 -166287 396956 717937 494793 -93655 -349432 155647 1128877 1929108 2078719
39071B078719m98107n01726K87695R42174M65428n35208m32689R27956J807104
$$ 2078719 1580612 1078886 1366581 2308755 2774183 2238975 1806286 2734242 4541346
39062D541346J150397K5458k65230Q5888M94296J199812K212069K604468K173293
$$ 4541346 5691743 5717201 5451971 5537859 6032155 7231967 9444036 12048504 14221797
39053A4221797K273551L659310N220192O374293Q490315J1544063J1569321N059592
$$ 14221797 16495348 20154658 25374850 31749143 40239458 51783521 63352842 68412434
39045F8412434n117800j1955780j2325399r372133o886933n110506l141267j821162
$$ 68412434 63294634 51338854 39013455 29641322 22754389 17643883 14502616 12681454
39037A2681454k009337k475863j800539p02576n34271q79137n45738J92155K19161
$$ 12681454 10672117 8196254 6395715 5693139 5158868 4279731 3733993 3926148 4145309
39028D145309l66872n49650k03521p8167l39083m59844l23481k76610k67255O6482
$$ 4145309 3778437 3228787 3025266 2947099 2608016 2148172 1824691 1548081 1280826 1347308
39018A347308N65041O39867J21979n82269j013871r04704k52768M28370M13203
$$ 1347308 1912349 2552216 2674195 2091926 1078055 173351 -79417 348953 762156
39009G62156k52850o52402l14231J12610N7901M861M39262P17220J09751p32475
$$ 762156 509306 -143096 -457327 -344717 -286816 -281955 157307 874527 984278 251803
38999B51803o79879q956O8944m51212k83006Q85832J576060O66437q17959j056239
$$ 251803 -428076 -437032 -368088 -819300 -1102306 -216474 1359586 2026023 1208064 151825
38989A51825J37730J263313J193810L18671l95623o27041o10060m34158o4139
$$ 151825 289555 1552868 2746678 3065349 2669726 2042685 1432625 998467 934328
38980I34328J74589j57777p78183p64548J39322R03750N44940m00253o39806q8265
$$ 934328 1108917 951140 172957 -591591 -452269 451481 996421 596168 -43638 -131903
38970a31903J16809l57562l49275Q32689J968711J567279J14271o71147l94560
$$ -131903 -15094 -372656 -721931 110758 2079469 3646748 3761019 3089872 2695312
38961B695312k87699r26232j221965l37123P12409N29234l97964l45362R26260
$$ 2695312 2407613 1481381 259416 -77707 634702 1163936 765972 420610 1346870
38952A346870J613369M96981j151751j313569m7385P78202K97915l08350Q3492
$$ 1346870 2960239 3457220 2305469 991900 944515 1722717 2020632 1712282 1795774
38943A795774P97113O15701k23369n24982r2070J31672k43266m86454j27550K11700
$$ 1795774 2592887 3208588 2985219 2460237 2368167 2499839 2256573 1770119 1642569 1854269
38933A854269p6303m84234j44470P91237J280424P53039k49123q28732o89178
$$ 1854269 1777966 1293732 1149262 1940499 3220923 3973962 3724839 2896107 2206929
38924B206929j96396J87827K56404k903m20217n16169J78899J316070J692012
$$ 2206929 2010533 2198360 2454764 2451861 2031644 1515475 1694374 3010444 4702456
38915D702456P12280m57291k41005R80445J287860L08843J17951J997877M052203
$$ 4702456 5414736 4957445 4716440 5696885 6984745 7293588 7411539 9409416 13461619
38906A3461619L973318K904849L859973O607527P096671K904477l130251o332413
$$ 13461619 17434937 20339786 24199759 30807286 37903957 40808434 37678183 31345770
38898C1345770n636260l774397l062818l108574k610568j554563q18235o06409
$$ 31345770 25709510 21935113 18872295 15763721 13153153 11598590 10780355 10173946
38890A0173946k75953N35596J446842K249093L606934N963787P858640O595523
$$ 10173946 9897993 10433589 11880431 14129524 17736458 23700245 31558885 38154408
38882C8154408J448274m599532p547098o534839m165094k879470k494696j679632
$$ 38154408 39602682 35003150 27456052 20921213 16756119 13876649 11381953 9702321
38874I702321m13559J13668o12941j687898j906381j099103j97774o8105m42510
$$ 9702321 9288762 9402430 8789489 7101591 5195210 4096107 3898333 3830228 3387718
38865C387718l58215L39089O81995J67765l01357P4014N18164K0816p13755l79568
$$ 3387718 3029503 3368592 4050587 4218352 3916995 3991009 4509173 4529989 3816234 3436666
38855C436666M90616K73405q15954q67173M52587J181897L01701o36269k14303
$$ 3436666 3927282 4200687 3384733 2517560 2970147 4152044 4453745 3817476 3603173
38846C603173O31915N07597j47226k35236M3981J1744l0337K89269K71064n32986
$$ 3603173 4235088 4742685 4595459 4360223 4404204 4415948 4385611 4674880 4945944 4412958
38836D412958j051289l58234N56432L89712k45860p4306M25549k5066r48699p82043
$$ 4412958 3361669 3003435 3559867 3949579 3703719 3629413 4054962 4029896 3081197 2299154
38826B299154L80711R67186O19920N13100R92705J036294K99740k48459q7943
$$ 2299154 2679865 3647051 4266971 4780071 5772776 6809070 7108810 6860351 6772408
38817F772408K09216M07205R78497J744968J867192J535496J926900L109336L861889
$$ 6772408 6981624 7388829 8367326 10112294 11979486 13514982 15441882 18551218 22413107
38808B2413107M032871M907110O342249N831052K016423k699422m968578m524649
$$ 22413107 26445978 31353088 37695337 43526389 45542812 42843390 37874812 33350163
38800C3350163l383712k219232m9402K858677M335034L111362M30696j864578
$$ 33350163 29966451 27747219 27697817 30556494 34891528 38002890 38433586 36569008
38792C6569008l351041m289198m250576k810103q66530J16724L9288K20398J466038
$$ 36569008 33217967 28928769 24678193 21868090 21001560 21118284 21157572 21377970 22844008
38783B2844008L095701M168389M633772M566475L171025j51469m003103n702291
$$ 22844008 25939709 30108098 34741870 39308345 42479370 42327901 38324798 32622507
38775C2622507m263343j570870J29554R11645K179776L700430L372176K81561
$$ 32622507 28359164 26788294 26917848 27829493 30009269 33709699 37081875 37363436
38767C7363436l479298n065896m150330k776648k340054k122447j124746M7068
$$ 37363436 33884138 28818242 24667912 21891264 19551210 17428763 16304017 16351085
38759A6351085K50427q3985N18577K117615L152326L091127L423488M845722N186516
$$ 16351085 16601512 16517527 17036104 19153719 22306045 25397172 28820660 33666382 38852898
38750C8852898K169634k789944n922133n831008m470491l485546k363589q45385
$$ 38852898 41022532 38232588 32310455 26479447 22008956 18523410 16159821 15314436
38742A5314436k75174j036851j120757P62564K735661K749368K158934L368407
$$ 15314436 15039262 14002411 12881654 13644218 16379879 19129247 21288181 24656588
38734B4656588N159349L848605j012088n374135n914184l862960k421227k521177
$$ 24656588 29815937 33664542 32652454 27278319 21364135 17501175 15079948 12558771
38726A2558771k770441k160447j082816k50186O5974j20419o09958j008652j034779
$$ 12558771 9788330 7627883 6545067 6294881 6360855 6240436 5630478 4621826 3587047
38717C587047p54071l95961j61122j84579l59626l09555Q1368L43717J16312j78370
$$ 3587047 2832976 2437015 2275893 2091314 1731688 1422133 1503501 1847218 1963530 1785160
38707A785160n880L05293R9415l99000l87416J72467N25215L86266K47844L82640
$$ 1785160 1779280 2084573 2183988 1784988 1397572 1570039 2095254 2481520 2729364 3112004
38697C112004M68698K90555j2328m09864q83619r52838k16302O99735P26095j19890
$$ 3112004 3580702 3871257 3858929 3449065 2565446 1612608 1396306 2096041 2822136 2702246
38687B702246p84742p56589n21840l82640J2861O76699Q91828K72541n87630r13840
$$ 2702246 1917504 1160915 639075 256435 269296 945995 1837823 2110364 1522734 608894
38677F08894n77002Q0554O52807Q08810N73709M25428O10214O70175K66127p4984
$$ 608894 31892 112446 765253 1574063 2147772 2573200 3183414 3853589 4119716 4044732
38667D044732J11372K33549k89436p19264k10208M17739o7374r31289n55942N26337
$$ 4044732 4156104 4389653 4100217 3380953 3170745 3588484 3521110 2589821 2033879 2560216
38657B560216K93196j091751j202727M66361J307508j28048j580716p68854R00142
$$ 2560216 2853412 1761661 558934 1025295 2332803 2204755 624039 -144815 755327
38648G55327Q21531n29667o95167N48910J018391j72646j359579j050278J76908
$$ 755327 1576858 1047191 352024 900934 1919325 1746679 387100 -663178 -486270
38639d86270J027628J158311Q66984K97215l71674o65313l22904K47718L38539
$$ -486270 541358 1699669 2566653 2863868 2492194 1826881 1503977 1751695 2090234
38630B090234k87595j014900q76622K57361J180492O97613o40696j118997k38670
$$ 2090234 1802639 787739 -88883 168478 1348970 2046583 1405887 286890 48220
38621D8220O62311M83141k17734m28187p2295M89522J133761J389249M49330j317969
$$ 48220 710531 1193672 975938 547751 475456 964978 2098739 3487988 3937318 2619349
38611B619349k122702j059392N22638J013797O40775L76613J27218m72637o89291
$$ 2619349 496647 -562745 -40107 973690 1614465 1991078 2118296 1645659 956368
38602I56368J19458R21775M37768o52031p53630Q7401N70589M76447O13972Q52063
$$ 956368 1075826 1997601 2435369 1783338 1029708 1117109 1687698 2164145 2778117 3630180
38592C630180K93968p25477q51909K642M81174O7122k63729M8874L34097J74325
$$ 3630180 3924148 3198671 2346762 2349404 2830578 2897700 2633971 2682845 3016942 3191267
38582C191267P4582J86359j11178q40457j057682l99147L09127M82875N31482
$$ 3191267 3265849 3452208 3341030 2500573 1442891 1043744 1352871 1835746 2367228
38573B367228O88779M28831l20362o27309L5461Q74086R45220L31191l97850r46586
$$ 2367228 3056007 3484838 3164476 2537167 2572628 3446714 4391934 4723125 4325275 3378689
38563C378689j016545k76005Q24296J172354M97490j95476k15544j48755n78181
$$ 3378689 2362144 2086139 2910435 4082789 4580279 4384803 4169259 4020504 3442323
38554C442323r15486l87568O54274J277415J156431N27162l20238q35352l18637
$$ 3442323 2526837 2139269 2793543 4070958 5227389 5754551 5434313 4598961 4280324
38545D280324R61205J535345N13433j079584j655835j106308m77737j82657K51492
$$ 4280324 5241529 6776874 7290307 6210723 4554888 3448580 2970843 2788186 3039678
38536C039678Q85088J017743K92841o91542j110516p41275K0189N69004N17783
$$ 3039678 3924766 4942509 5235350 4543808 3433292 2692017 2712206 3281210 3798993
38527C798993L5566k99300j84820R8603K49254L70992N17221L52964j96155m65771
$$ 3798993 3834559 3535259 3350439 3449042 3698296 4069288 4586509 4939473 4743318 4277547
38517D277547P4177Q52376Q91813K20193k45261q3765K42551M02505O69050J120917
$$ 4277547 4351724 5204100 6095913 6316106 6070845 5987080 6229631 6632136 7301186 8422103
38507H422103J218105O69533R4592K20558Q37716J176693J063478J017859J243613
$$ 8422103 9640208 10309741 10404333 10624891 11462607 12639300 13702778 14720637 15964250
38498A5964250J202723M38580o78655j414759j569229j486827j366935j068471
$$ 15964250 17166973 17605553 16926898 15512139 13942910 12456083 11089148 10020677
38490A0020677o02174l20655m26913o47281o21646l65905j59974k12941n76356
$$ 10020677 9418503 9097848 8670935 8023654 7402008 7036103 6876129 6663188 6086832
38481F086832j088818j269603o82003L55846Q90979N30011J7480J08640L85954
$$ 6086832 4998014 3728411 3046408 3402254 4293233 4823244 4840724 4949364 5335318
38472E335318j0602q18529q33731K96158J401133J275221J64371o80877n01713
$$ 5335318 5324716 4506187 3672456 3968614 5369747 6644968 6809339 6128462 5626749
38463E626749L59547J084068J188805P56967J69229j97301k5417Q73079K150624
$$ 5626749 5986296 7070364 8259169 9016136 9185365 8988064 8962647 9835726 11986350
38454A1986350K762808J971269O74113P86252K683920M194677L163930L09270
$$ 11986350 14749158 16720427 17394540 18180792 20864712 25059389 28223319 28532589
38446B8532589j792005k071806j759846j972165k305213k218520k129338k300177
$$ 28532589 26740584 24668778 22908932 20936767 18631554 16413034 14283696 11983519
38438A1983519k021362r42373r8596m46852j261918j241952n39950l47934q63915
$$ 11983519 9962157 9019784 8921188 8474336 7212418 5970466 5430516 5082582 4218667
38429D218667j081483n54969o1507k29699n87918m56687J1878K48210J73611J13197
$$ 4218667 3137184 2582215 2520708 2291009 1703091 1246404 1258282 1506492 1680103 1793300
38419A793300J09058j11296n24511o30242q8179O73929Q08601Q2659p08286o45256
$$ 1793300 1902358 1791062 1266551 636309 548130 1222059 2030660 2113319 1405033 759777
38409G59777J59111P44713O10327K68062K93460M12498L1688p06214j031684o21303
$$ 759777 918888 1663601 2273928 2541990 2835450 3247948 3279636 2573422 1541738 920435
38399I20435j0799J44977j81363n26638n25923j84921K44246M55963K43854l24596
$$ 920435 909636 1054613 873250 346612 -179311 -364232 -119986 335977 579831 255235
38389B55235q38054q23015k55617L26179M63053M17630P58061J316066J225242
$$ 255235 -582819 -1405834 -1661451 -1335272 -872219 -454589 303472 1619538 2844780
38380B844780K89268m43021j39619M40721N5606r73641j138952j35945N60752
$$ 2844780 3134048 2691027 2551408 2992129 3047735 2074094 935142 799197 1359949
38371A359949m3915r46433p19869M12496J131408R67003N71107M11410K76104
$$ 1359949 1316034 369601 -350268 62228 1193636 2160639 2731746 3143156 3419260
38362C419260J1006j61866j66494k22058l44948k61841N2291K32421Q5742q7487
$$ 3419260 3430266 3268400 3101906 2879848 2534900 2273059 2325350 2557771 2643513 2556026
38352B556026N5779L68149L52896j83461p38345n61927L55375R96897M81443o35591
$$ 2556026 2611805 2979954 3332850 3149389 2411044 1849117 2204492 3201389 3682832 3047241
38342C047241r45804j54335M42929j16462r75859p37204M37173J079853N07459
$$ 3047241 2101437 1947102 2390031 2273569 1297710 560506 997679 2077532 2584991
38333B584991m00822n70802j9819M58507L08607l21073p85723n47275K07968P12226
$$ 2584991 2184169 1613367 1593548 2052055 2360662 2039589 1253866 706591 914559 1626785
38323A626785O15722M39285O02512N77664j98437j068116r10748P8309N98651
$$ 1626785 2242507 2681792 3284304 3861968 3663531 2595415 1684667 1762976 2361627
38314B361627K47379K478M18025O70944N7138p13274n98874K68776J058273J451480
$$ 2361627 2609006 2611484 3029509 3700453 3757591 3044317 2445443 2714219 3772492 5223972
38304E223972J442933O74009q57881j956648j431305N4697O44685j69503r53908
$$ 5223972 6666905 7340914 6483033 4526385 3095080 3149777 3794462 3624959 2671051
38295B671051n50232L74536O08156J83881K7154M79346J049290J265958J027529
$$ 2671051 2120819 2495355 3103511 3287392 3314546 3793892 4843182 6109140 7136669
38286G136669L40097o20522j316938j286451o99519o3837M54902R65379J321064
$$ 7136669 7476766 6856244 5539306 4252855 3553336 3489499 3944401 4909780 6230844
38277F230844J230895Q14833N17682M89444M89699L31944Q169m52166p83287m61039
$$ 6230844 7461739 8276572 8794254 9283698 9773397 10105341 10113510 9661344 8878057 8417018
38267H417018M58966Q63879q1891j408268j435800l42147j4517r71080j305541
$$ 8417018 8875984 9739863 9657972 8249704 6813904 6471757 6457240 5486160 4180619
38258D180619K16313J778990J065507j044162j605602N0900J484317Q55022p01443
$$ 4180619 4396932 6175922 7241429 6197267 4591665 4642565 6126882 6981904 6280461
$$ [...]
##END NTUPLES=NMR SPECTRUM
##END=
