##TITLE=31Pdec_SR114_0
 D2O, 24 sc
 15.4.2022
##JCAMPDX= 6.0         $$ Bruker NMR JCAMP-DX V2.0
##DATA TYPE= NMR SPECTRUM
##DATA CLASS= NTUPLES
##ORIGIN= UXNMR, Bruker Analytische Messtechnik GmbH
##OWNER= root
$$ XWIN-NMR		Version 3.5
$$ Fri Apr 15 14:12:42 2022 Russian Standard Time (UT+4h)  she@DPX200
##.OBSERVE FREQUENCY= 81.013821
##.OBSERVE NUCLEUS= ^31P
##.ACQUISITION MODE= SIMULTANEOUS
##.ACQUISITION SCHEME= undefined
##.AVERAGES= 24
##.DIGITISER RES= 16
##SPECTROMETER/DATA SYSTEM= spect
##.PULSE SEQUENCE= zgpg30
##.SOLVENT NAME= D2O
##.SHIFT REFERENCE= (INTERNAL, D2O, 0, 248.564)
##AUDIT TRAIL= $$ (NUMBER, WHEN, WHO, WHERE, WHAT)
$$ ##TITLE= Audit trail, XWIN-NMR		Version 3.5
$$ ##JCAMPDX= 5.01
$$ ##ORIGIN= Bruker BioSpin GmbH
$$ ##OWNER= she
$$ F:/spectra/data/she/nmr/P31/1/pdata/1/auditp.txt
$$ ##AUDIT TRAIL=  $$ (NUMBER, WHEN, WHO, WHERE, WHAT)
(   1,<2022-04-15 14:11:51.56 +0400>,<she>,<DPX200>,
      <created by zg, POWCHK disabled, PULCHK disabled
       configuration hash MD5:
       00 E9 B6 7A A2 85 ED C7 34 08 36 98 17 FE 4E 26
       data hash MD5: 32K
       2D 02 EC 3B E7 39 0C F0 C5 B2 F1 D5 C2 11 FF 45>)
(   2,<2022-04-15 14:11:55.04 +0400>,<she>,<DPX200>,
      <Start of raw data processing
       efp BC_mod = 2 LB = 1 FT_mod = 6 PKNL = 1 PHC0 = -9430.361 PHC1 = -144.9246 SI = 64K 
       data hash MD5: 64K
       C9 27 B0 A4 13 85 82 4A 81 A2 C8 EB 54 05 0E D6>)
(   3,<2022-04-15 14:12:06.21 +0400>,<she>,<DPX200>,
      <pk PHC0 = -39.27178 PHC1 = 0 
       data hash MD5: 64K
       F7 99 0D D4 6C 0D DF 85 26 43 02 31 AE 24 C4 14>)
(   4,<2022-04-15 14:12:12.51 +0400>,<she>,<DPX200>,
      <abs ABSG = 5 
       data hash MD5: 64K
       FF 95 8E 1B B0 E2 BB 71 A4 59 2C CA B4 14 4D 2E>)
$$ ##END=
$$ 
$$ hash MD5
$$ 18 47 90 ED D0 16 80 06 FA 97 EC B2 20 E5 5D EA
##$RELAX= 
##$RELAX= 
##$RELAX= 
##$RELAX= 
##$RELAX= 
##$RELAX= 
##$RELAX= 
##$RELAX= 
$$ Bruker specific parameters
$$ --------------------------
##$DU= <F:/spectra>
##$EXPNO= 1
##$NAME= <P31>
##$PROCNO= 1
##$TYPE= <nmr>
##$USER= <she>
##$AMP= (0..31)
100 100 100 100 100 100 100 100 100 100 100 100 100 100 100 100 100 100 
100 100 100 100 100 100 100 100 100 100 100 100 100 100 
##$AQSEQ= 0
##$AQ_mod= 1
##$AUNM= <au_zg>
##$AUTOPOS= <>
##$BF1= 81.014009
##$BF2= 200.13
##$BF3= 200.13
##$BF4= 200.13
##$BF5= 200.13
##$BF6= 200.13
##$BF7= 200.13
##$BF8= 200.13
##$BYTORDA= 1
##$CFDGTYP= 0
##$CFRGTYP= 5
##$CHEMSTR= <none>
##$CNST= (0..31)
1 1 145 1 1 1 1 1 1 1 1 1 1 1 1 1 1 1 1 1 1 1 1 1 1 1 1 1 1 1 1 1 
##$CPDPRG= <waltz16>
##$CPDPRG1= <>
##$CPDPRG2= <waltz16>
##$CPDPRG3= <>
##$CPDPRG4= <mlev>
##$CPDPRG5= <mlev>
##$CPDPRG6= <mlev>
##$CPDPRG7= <mlev>
##$CPDPRG8= <mlev>
##$CPDPRGB= <>
##$CPDPRGT= <>
##$D= (0..31)
0 1 0 0 0 0 0 0 0 0 0 0.03 2e-05 3e-06 0 0 0 0 0 0 0 0 0 0 0 0 0 0 0 0 
0 0 
##$DATE= 1650017510
##$DBL= (0..7)
120 120 120 11 120 120 24 19 
##$DBP= (0..7)
150 150 150 150 150 150 150 150 
##$DBP07= 0
##$DBPNAM0= <>
##$DBPNAM1= <>
##$DBPNAM2= <>
$$ [...]
##$SUBNAM3= <"">
##$SUBNAM4= <"">
##$SUBNAM5= <"">
##$SUBNAM6= <"">
##$SUBNAM7= <"">
##$SUBNAM8= <"">
##$SUBNAM9= <"">
##$SW= 501.771253377433
##$SWIBOX= (0..15)
0 1 3 0 0 0 0 0 0 0 0 0 0 0 0 0 
##$SW_h= 40650.406504065
##$TD= 32768
##$TD0= 1
##$TE= 0
##$TE2= 300
##$TE3= 300
##$TEG= 300
##$TL= (0..7)
0 120 53 12 22 120 120 120 
##$TP= (0..7)
150 150 150 150 150 150 150 150 
##$TP07= 0
##$TPNAME0= <>
##$TPNAME1= <>
##$TPNAME2= <>
##$TPNAME3= <>
##$TPNAME4= <>
##$TPNAME5= <>
##$TPNAME6= <>
##$TPNAME7= <>
##$TPOAL= (0..7)
0.5 0.5 0.5 0.5 0.5 0.5 0.5 0.5 
##$TPOFFS= (0..7)
0 0 0 0 0 0 0 0 
##$TUNHIN= 0
##$TUNHOUT= 0
##$TUNXOUT= 0
##$USERA1= <user>
##$USERA2= <user>
##$USERA3= <user>
##$USERA4= <user>
##$USERA5= <user>
##$V9= 5
##$VALIST= <valist>
##$VCLIST= <CCCCCCCCCCCCCCC>
##$VD= 0
##$VDLIST= <DDDDDDDDDDDDDDD>
##$VPLIST= <PPPPPPPPPPPPPPP>
##$VTLIST= <TTTTTTTTTTTTTTT>
##$WBST= 1024
##$WBSW= 4
##$XGAIN= (0..3)
0 0 0 0 
##$XL= 0
##$YL= 0
##$YMAX_a= 1713
##$YMIN_a= -1022
##$ZGOPTNS= <>
##$ZL1= 120
##$ZL2= 120
##$ZL3= 120
##$ZL4= 120
##$ABSF1= 248.5645
##$ABSF2= -253.2056
##$ABSG= 5
##$ABSL= 3
##$ALPHA= 0
##$AQORDER= 0
##$ASSFAC= 0
##$ASSFACI= 0
##$ASSFACX= 0
##$ASSWID= 0
##$AUNMP= <proc_1d>
##$AZFE= 0.1
##$AZFW= 0.5
##$BCFW= 0
##$BC_mod= 2
##$BYTORDP= 0
##$COROFFS= 0
##$CY= -3
##$DATMOD= 1
##$DC= 0
##$DFILT= <>
##$DTYPP= 0
##$F1P= 0
##$F2P= 0
##$FCOR= 1
##$FTSIZE= 65536
##$FT_mod= 6
##$GAMMA= 0
##$GB= 0
##$INTBC= 1
##$INTSCL= 5.30512e-09
##$ISEN= 30
##$LB= 1
##$LEV0= 0
##$LPBIN= 0
##$MAXI= 10000
##$MC2= 0
##$MEAN= 0
##$ME_mod= 0
##$MI= 50
##$NCOEF= 0
##$NC_proc= -9
##$NLEV= 6
##$NOISF1= 182.463
##$NOISF2= 159.3651
##$NSP= 0
##$NTH_PI= 0
##$NZP= 0
##$OFFSET= 248.5645
##$PC= 4
##$PHC0= -9469.633
##$PHC1= -144.9246
##$PH_mod= 1
##$PKNL= yes
##$PPARMOD= 0
##$PSCAL= 0
##$PSIGN= 0
##$REVERSE= no
##$SF= 81.014009
##$SI= 65536
##$SIGF1= 159.3651
##$SIGF2= -187.1042
##$SINO= 113.3802
##$SIOLD= 16384
##$SREGLST= <1H.CDCl3>
##$SSB= 0
##$STSI= 65536
##$STSR= 0
##$SW_p= 40650.406504065
##$SYMM= 0
##$S_DEV= 0
##$TDeff= 32768
##$TDoff= 0
##$TI= <>
##$TILT= no
##$TM1= 0
##$TM2= 0
##$TOPLEV= 0
##$USERP1= <user>
##$USERP2= <user>
##$USERP3= <user>
##$USERP4= <user>
##$USERP5= <user>
##$WDW= 1
##$XDIM= 65536
##$YMAX_p= 286184668
##$YMIN_p= -69721436
$$ End of Bruker specific parameters
$$ ---------------------------------
##NTUPLES= NMR SPECTRUM
##VAR_NAME=  FREQUENCY,     SPECTRUM/REAL,   SPECTRUM/IMAG
##SYMBOL=    X,             R,               I
##VAR_TYPE=  INDEPENDENT,   DEPENDENT,       DEPENDENT
##VAR_FORM=  AFFN,          ASDF,            ASDF
##VAR_DIM=   65536,         65536,           65536
##UNITS=     HZ,            ARBITRARY UNITS, ARBITRARY UNITS
##FACTOR=    0.620285442955139, 1,           1
##FIRST=     20137.2065510759, 0,            0
##LAST=      -20513.1999529892, 0,           0
##MIN=       -20513.1999529892, -69721436,   0
##MAX=       20137.2065510759, 286184668,    0
$$ Real data points
##PAGE= N=1
##DATA TABLE= (X++(R..R)), XYDATA
$$ [...]
14939 -3342978 -2945917 -2536259 -4990320 -5496535 -818923 3707714 2620154 -1112063 -2751499
14930 -2751499 -4197863 -7796871 -8326523 -731168 9326177 12651994 9976386 8171540
14922 8171540 7446417 3724745 237070 3950111 11989958 14286313 9409260 5588911
14914 5588911 6189789 6936699 7703685 12801636 17788364 11373124 -5154315 -15602470
14906 -15602470 -12643069 -9226100 -17140863 -27814845 -26569952 -15252727 -7096390 -6530048
14898 -6530048 -7675994 -8084783 -10742370 -14469851 -13863384 -8475851 -3002715 897904
14890 897904 4639296 5830927 593454 -6855944 -5830934 6895964 21214861 24872245
14882 24872245 16464204 4967653 -732355 97926 1015889 -3561049 -11577264 -16169072
14874 -16169072 -15169034 -13885284 -16656656 -20157588 -18650654 -12061981 -4599424 1395627
14866 1395627 5660445 6925915 4503726 985809 -896135 -2070126 -3902249 -3951501
14858 -3951501 245564 5367932 5432269 -491326 -7930437 -12905185 -14177678 -11405986
14850 -11405986 -5328002 1397304 6666893 10232941 10314327 3512218 -7920306 -14467436
14842 -14467436 -11405316 -7020940 -10518398 -16869103 -14710490 -5937521 -3776951 -10977254
14834 -10977254 -14294811 -5419903 5484815 5313760 -2770067 -5635958 658952 8140425
14826 8140425 9953217 6935442 2456050 -1540429 -3267956 -1760356 1051210 3099970
14818 3099970 5642883 9536314 10756964 6104638 1245970 4662817 13690849 15880413
14810 15880413 6612810 -3829408 -5374320 -1659263 -1390126 -3637321 -1377371 4915491
14802 4915491 7875180 5644070 3404808 2826054 397043 -2561576 721571 9583493
14794 9583493 13240262 6796312 -23362 2085647 7264182 4829444 -2733133 -3915740
14786 -3915740 3786635 11645009 13281807 9445516 840773 -11892878 -20748597 -15037566
14778 -15037566 3355048 19223845 21954852 15846500 10188584 8209888 9106425 11841263
14770 11841263 12625958 7030638 -1102836 -1399235 7624049 13737102 7747085 -3168864
14762 -3168864 -6179267 43037 6510468 6744147 1184943 -6624901 -11861727 -10557155
14754 -10557155 -5043845 -2515095 -4120503 -2328089 6082914 13050776 12226005 9963087
14746 9963087 14073859 19900201 18842481 13866902 13793260 17172572 15434113 9207318
14738 9207318 7851820 13447549 17958753 16870758 13966037 11472122 6756050 815390
14730 815390 -481868 3555609 6331099 4430435 1641905 386101 -2061376 -6157134
14722 -6157134 -7540987 -5277543 -4860012 -9323172 -14083914 -13954857 -9415954 -3571722
14714 -3571722 1208074 2070660 -2318597 -7168770 -6001385 -894470 -363678 -5569563
14706 -5569563 -7867317 -3048400 1650796 -300420 -4396198 -3335558 1577645 4268413
14698 4268413 3813406 3968952 6577712 10691877 14881366 16383935 11851582 2680950
14690 2680950 -4437503 -5601299 -3956415 -3113741 -1908444 711700 1689174 -488337
14682 -488337 -1826137 86320 361632 -5567612 -13065185 -13888081 -7790071 -2135727 -1646872
14673 -1646872 -3976959 -4458879 -1062826 4424768 7414895 4584154 -1074977 -2458191
14665 -2458191 2345683 7282794 7376590 4985968 3197846 -686249 -8815804 -15186602
14657 -15186602 -12290217 -2548101 4356757 4016748 484382 -1786186 -2304671 -1021180
14649 -1021180 3034786 8286593 10629237 8411167 4213472 1244111 866834 3442387
14641 3442387 8299427 12709729 13748364 11506776 8519571 6318772 4271374 1206051
14633 1206051 -3120831 -7167545 -7703231 -3141127 2667322 3817991 890275 1002672
14625 1002672 6520800 9688181 3747695 -5992717 -9491805 -6480720 -5095490 -8188744
14617 -8188744 -10619298 -10459691 -12938956 -19793473 -23355663 -17321950 -7341872 -3548894
14609 -3548894 -5979395 -5376808 2094358 8922233 7792565 2588827 2164709 6760060
14601 6760060 7997092 2208296 -3853887 -3688976 -817519 -2172998 -6458673 -6531887 -1038784
14592 -1038784 4243148 6206973 7668098 9755583 8769178 3439947 -1207509 -905732
14584 -905732 1944256 2614084 -21199 -4332695 -8332666 -9466899 -7042951 -6150217 -12764361
14575 -12764361 -23236353 -26461090 -19492769 -12218643 -11748942 -11628028 -4128754 5315349
14567 5315349 6219782 -268524 -3904970 -1549726 -246036 -4769038 -11178831 -13698058
14559 -13698058 -11337660 -6933645 -4498476 -7179759 -13530364 -16889449 -12437531 -3360282
14551 -3360282 3087803 2899132 -3800320 -14183105 -21475827 -18625623 -8187004 -1629831
14543 -1629831 -3182249 -3161530 4829686 10714842 4202950 -5521804 -2899528 7860214
14535 7860214 8907187 -1840215 -8045918 -3101971 -59510 -7365192 -13884124 -8254991
14527 -8254991 2628597 6649437 5526400 7773135 11906678 10047437 2427803 -3686070
14519 -3686070 -5820994 -6781624 -6272232 -1604554 4742152 6502344 2318117 -2778261
14511 -2778261 -3934271 -467637 4709251 6118964 -474317 -11250364 -15407195 -8137447
14503 -8137447 1328245 573184 -10175740 -19385143 -19323508 -13379626 -8890694 -8576911 -10279102
14494 -10279102 -11215560 -10357508 -7523100 -1304686 10127550 24053812 31435730 25453782
14486 25453782 11269543 1153378 -205378 1547438 2384541 4739256 7886351 4844736
14478 4844736 -4955078 -10418599 -4669021 3278034 2980645 -63661 5448190 15674356
14470 15674356 16222288 5125585 -4230207 -3920142 -684159 -973617 -374367 5542755
14462 5542755 10783949 7953052 521117 -2370893 1010554 4599817 4578984 2973313
14454 2973313 1905749 -7862 -4142189 -8029354 -7216384 -547029 7528613 11019560
14446 11019560 8821682 5253107 3413343 1042648 -4474249 -10160333 -10941787 -7256003
14438 -7256003 -4370111 -5049211 -7568794 -10390205 -13996212 -18070241 -21048895 -22281374
14430 -22281374 -21059462 -15258685 -5826420 -201611 -4160345 -11661040 -11431088 -3803932
14422 -3803932 -1206633 -9418048 -18394346 -17062547 -8637598 -4089585 -6860124 -11712865
14414 -11712865 -14044963 -12839281 -7818201 -697112 3370558 1804654 -834539 -238524
14406 -238524 -265038 -5760084 -11387887 -7993235 1311439 3036434 -6749442 -15353542 -11096593
14397 -11096593 1346872 9946330 12054294 13631551 16761277 17625718 15566157 15409840
14389 15409840 19355816 23037476 22022181 17499142 12904522 8462035 2107415 -6036558
14381 -6036558 -12599772 -13925043 -9385502 -2625097 769770 -1138525 -3480057 50001
14373 50001 8079777 11575141 5160184 -4988893 -8187681 -1968944 6328062 9289359
14365 9289359 6056583 -346618 -6816960 -9768359 -6172966 1504932 5292912 972870
14357 972870 -5482412 -5857875 -2140733 -4431796 -15948186 -26956214 -27050024 -18174254
14349 -18174254 -10345149 -7975075 -6806280 -3176958 594412 1795358 2636004 6243609
14341 6243609 10801846 12003279 9841155 8878341 11678464 15215660 14992657 10831307
14333 10831307 7099306 7566098 10744927 10947559 4900026 -2844240 -3299321 6606252
14325 6606252 18750426 21176718 10066624 -7178713 -19396521 -20172086 -11003587 264940
14317 264940 4983297 1460393 -3078357 -1620499 3019402 2968569 -1479127 -1425281 6015658
14308 6015658 11520741 7562129 1184062 4315320 15794486 22692704 18330091 9927512
14300 9927512 7182869 10900926 15498098 16690161 13561204 7651106 3154942 4647297
14292 4647297 11876434 19085253 20967659 17112813 10431471 4647173 3480250 7771866
14284 7771866 12379574 10507856 2552321 -3861039 -3855989 -78894 3904663 8333338 12269926
14275 12269926 10928553 3263027 -3604894 -3655300 -652461 -999386 -2913715 -868125
14267 -868125 3205590 2915924 -383490 1148958 8100814 11698842 7921796 4101145
14259 4101145 7047706 12941799 14925974 14046395 15727636 19989418 22082610 20000193
14251 20000193 15313487 8817177 1048441 -4725210 -5673041 -4153324 -3844889 -2660360
14243 -2660360 4005677 13489233 16785061 11073873 4479895 4556116 7506782 4316302
14235 4316302 -5471534 -12133624 -8060236 2511483 7839698 1329795 -11376636 -18148916
14227 -18148916 -13035609 -2067198 4621644 4440067 2732233 2929619 2204111 -1598571
14219 -1598571 -4886199 -4356629 -3171190 -5396754 -7900486 -4727206 2338364 5268837
14211 5268837 2052847 -100549 3972397 9562760 9312604 3218577 -2956677 -5658793
14203 -5658793 -5509886 -3779930 -1230115 593350 218275 -1946089 -4227254 -4796502 -1304386
14194 -1304386 7499051 17651019 20955026 13850905 3131823 -1126533 2845159 7437141
14186 7437141 5352858 -2707132 -9608694 -8724543 -20635 9002239 9696082 1166130
14178 1166130 -8997136 -14009648 -14534944 -13965935 -11785602 -6254952 -64126 2535422
14170 2535422 2075797 1696762 575737 -4082535 -9593232 -9499360 -3618713 -60440 -5019862
14161 -5019862 -15147393 -22096687 -21243793 -14665630 -8500790 -7938068 -12085667 -14221098
14153 -14221098 -10004826 -3568161 -1033490 -468131 4793915 13791657 17200281 10584770
14145 10584770 920144 -3127235 -1248319 1341227 1197882 -2224812 -7644311 -10649585
14137 -10649585 -5963110 5415397 15374117 18257362 17305106 18328032 21011194 20425498
14129 20425498 14282577 5209934 -2260590 -4942342 -3402462 -1965858 -3423324 -4142421
14121 -4142421 736351 7814571 8460519 2396948 -494484 4556328 9192382 5277934
14113 5277934 -2009666 -3107456 -5617 -2815380 -12943626 -19860973 -15617586 -4899511
14105 -4899511 1930421 926930 -3010776 -3358875 547735 3333644 733794 -4541227
14097 -4541227 -6716275 -5672855 -7046258 -13210142 -19647640 -21992487 -21218262 -19540765
14089 -19540765 -16714721 -13193539 -11496441 -11493135 -9789378 -6321978 -5149617 -6039305 -3152517
14080 -3152517 3968567 6842478 1115859 -5577195 -5998091 -4967880 -9695899 -16095033
14072 -16095033 -15334087 -8410292 -3437147 -2548005 -1768548 -394704 -343023 831938 6066542
14063 6066542 10264036 5863520 -4186200 -8328126 -1009291 11857727 20645797 19074263
14055 19074263 7113245 -6196144 -7663169 4180573 13750562 8181926 -4435719
14048 -4435719 -8224413 -3591112 -2917241 -7638065 -7556013 -1107005 1992258 -773964 -1141191
14039 -1141191 2656094 2259738 -3402175 -4195096 2385628 5307361 45707 -1775264
14031 -1775264 8020239 19791541 21966465 18140649 16779106 15513254 8278498 -1402628
14023 -1402628 -6976106 -11061861 -18749880 -24935142 -20760491 -8695342 21758 526614
14015 526614 -2466915 -4412008 -5409564 -6292644 -7123891 -8673674 -10671627 -10488975 -7074118
14006 -7074118 -3221681 -1243907 -514577 -1292603 -5222837 -10053723 -11108155 -10210397 -14155583
13997 -14155583 -21308126 -20780715 -10196949 -2272893 -5712643 -11246439 -7289989 922007
13989 922007 759762 -7034042 -10727315 -6058183 199378 2162886 -310511 -5896531
13981 -5896531 -11521597 -11051662 -3069103 3730460 1240758 -6445510 -10244569 -8996229
13973 -8996229 -6182804 -914207 6645035 7857019 -3080245 -15985261 -17049100 -9773920
13965 -9773920 -8484091 -14560082 -15687514 -7315328 2098366 7813485 13981268 19876374
13957 19876374 17778294 9232989 7631866 17743150 26396303 21394424 7977161 -1548421
13949 -1548421 -4141310 -3663272 -1254963 3159160 6537975 7530607 10050151 16005527
13941 16005527 20272819 18470108 13741983 10246152 5927042 -2244140 -11281802 -16486894
13933 -16486894 -18029441 -17667381 -13633858 -4858320 3581190 5451003 1500000 -2388058
13925 -2388058 -3247462 -2971658 -3675470 -4777129 -4486954 -2744171 -2827685 -8547798 -17459000
13916 -17459000 -19938915 -10699523 1226759 2087368 -7915532 -15091407 -12101864 -6473273
13908 -6473273 -6110344 -7533831 -4882524 -1190338 -2700985 -8808236 -14983695 -19634910
13900 -19634910 -21306995 -15716213 -3435642 5596320 4093128 -1200732 411778 6596215
13892 6596215 6058958 -2652693 -8196770 -3531568 4286791 5233025 -235432 -3793500
13884 -3793500 -912315 4775757 7225272 4992986 2163404 3028273 6787651 9080892
13876 9080892 8216397 6358398 3927205 -2091351 -11520377 -17975863 -17201346 -13917996
13868 -13917996 -14390677 -15938565 -11389659 -1994452 2507114 -2657374 -11210715 -15322380
13860 -15322380 -14795154 -13477285 -11831423 -7933038 -3061019 -1380202 -4267710 -8205826
13852 -8205826 -9060781 -6582066 -3590276 -1723220 292313 3666668 6501528 5791585
13844 5791585 2026767 -778514 -359723 814190 -781861 -4784257 -7183884 -4518297
13836 -4518297 2923270 10906741 14113763 11066861 6290456 5201292 7053466 6472410
13828 6472410 2084156 -1412490 -1363686 -1547013 -4735106 -6392083 -1741352 4908140 5424525
13819 5424525 560330 -931954 3481493 5362180 -1275609 -9064046 -7231409 1273315
13811 1273315 1961016 -10567977 -22729148 -18799958 -2511503 7132895 932939 -9276405
13803 -9276405 -8224105 2713103 10961106 12187060 13029437 15930986 13601192 2661630
13795 2661630 -6965848 -3855235 8894750 16707587 10574253 -4419112 -16524970 -18764307
13787 -18764307 -13037024 -6218619 -3123294 -2446082 247051 6066321 11312529 12160289
13779 12160289 8019552 353040 -8247311 -13514472 -12239329 -6630590 -2260199 -1255107
13771 -1255107 -1787549 -3856588 -9041340 -13811724 -11149298 -1684216 4871761 3699852
13763 3699852 2153209 7236157 13813517 13199861 6736040 1636492 -1145294 -4592106
13755 -4592106 -5377910 2272743 13856976 17290139 9527385 555979 -1298209 1095368
13747 1095368 1936836 1830809 3955040 6965939 6866013 2515747 -3900227 -8776349 -7719289
13738 -7719289 1389962 13546109 19032977 13720105 3638360 -3310118 -6564610 -10319035
13730 -10319035 -14638899 -13928320 -4421074 9534423 17942102 14071754 1390902 -8833661
13722 -8833661 -8114322 1262254 9704385 10497336 4696534 -2415792 -6326673 -5181618
13714 -5181618 -136888 5494197 9520073 13042869 17249254 19262235 14803721 4894544
13706 4894544 -3602692 -4912153 326359 6341182 6593859 -1789913 -14408508 -21429420
13698 -21429420 -17359559 -8543485 -6132811 -11419792 -13722697 -4754502 9929854 17341441
13690 17341441 11964322 996857 -3850871 2452957 14392546 21707520 19158484 10475928
13682 10475928 2565322 -1914819 -4183298 -4595957 -2885871 -1536467 -3406215 -6278591
13674 -6278591 -5363198 -1468051 -456762 -3284899 -3347920 3184393 10651184 12025494 8694920
13665 8694920 6947152 8707320 11413410 14104442 17560884 20017410 18556709 14225649
13657 14225649 10717866 8465925 5212505 2132364 3218500 7370214 7566020 1240957
13649 1240957 -4281089 -2043762 3232639 1420408 -7251181 -11230876 -4167457 5646811
13641 5646811 7365974 2871731 2429795 8670038 14015370 13732764 12079134 12494030 10252064
13632 10252064 767347 -11161703 -17738896 -19455658 -21829397 -23551154 -17526143 -4441344
13624 -4441344 4014725 -254525 -10628000 -14985689 -11727531 -9699052 -13475974 -16034691
13616 -16034691 -9007831 4521080 12945697 10975636 6076510 8085731 17178826 26483676
13608 26483676 32676462 36888203 36880960 27632102 11768136 539731 -375612 1464743
13600 1464743 -2341496 -8337686 -8903443 -6385938 -9206537 -17325465 -22299781 -20637684
13592 -20637684 -16957006 -13851617 -8637322 -1641719 1675094 -432474 -3101577 -3400433
13584 -3400433 -4061581 -6234649 -6677775 -5321276 -7127880 -12063618 -11695851 -1818370 9025869
13575 9025869 10884769 6122098 3731663 4631935 1809760 -6698391 -13620459 -12380436
13567 -12380436 -5290984 235871 464020 -1336458 538461 6573219 9877101 4159715
13559 4159715 -6869508 -12710572 -9176744 -2482427 1432088 4517014 9495177 12284624
13551 12284624 8340860 1480140 -1231094 20716 19633 -1367923 342648 4643835
13543 4643835 5432698 1132643 -2212845 -516042 2242383 1271695 -933859 1020030
13535 1020030 5858226 6207761 -1079153 -9610602 -10789969 -4204610 2413534 3065129
13527 3065129 -349968 -2980878 -3990523 -4792382 -3731492 1348030 6679779 6004750
13519 6004750 974003 404887 6782557 11449159 7740482 1453912 1641243 7068200
13511 7068200 9915698 8670196 8359173 10054557 9092078 3839486 -1448570 -3611845
13503 -3611845 -3992511 -3667749 -1180676 3383909 7217833 9160303 10487049 10429157 6669098
13494 6669098 2051109 4095360 13639119 19806529 12809503 -1695032 -8677408 -3476454
13486 -3476454 2614742 -700540 -7501545 -4365661 9461716 19955433 17454604 8909488
13478 8909488 5922796 8118335 7088694 2222242 1422591 6543516 9334044 4957343
13470 4957343 -86897 1519915 7325368 10514548 9249939 5315910 26387 -3070828
13462 -3070828 1437942 11375894 15445090 8756600 1771339 4158349 8410034 2779046
13454 2779046 -6790159 -4866539 6786495 10131368 -61866 -7642216 -1874483 5601324
13446 5601324 1613786 -6267602 -3286588 7463820 10351780 2002474 -5341531 -3699546
13438 -3699546 1735574 4515839 5173131 4708268 625821 -6328142 -10111040 -8368148
13430 -8368148 -6037242 -6008704 -3977978 2188025 5666958 616364 -7256912 -8714548
13422 -8714548 -4981079 -3821002 -4490884 1709326 15148949 23664446 18811528 6923200
13414 6923200 -1345792 -4020854 -3992843 -646760 5741727 7882373 367048 -9600466
13406 -9600466 -11183867 -6255675 -4879955 -6906695 -2414637 8597671 12282832 1982042
13398 1982042 -10255224 -11068854 -3732303 147714 -2305781 -5955548 -8045617 -8615831
13390 -8615831 -6724557 -4619821 -8991589 -19360089 -22701419 -10303946 6716690 10911475
13382 10911475 2226421 -4781464 -3485117 -883900 -2548892 -5914186 -8930829 -12576275
13374 -12576275 -13740412 -7871666 29708 -424143 -7772818 -8469716 2525148 13488065
13366 13488065 13588946 7269506 4252423 5217800 5310941 4222488 4810908 6655602 7107888
13357 7107888 5170644 902066 -4750014 -7792671 -4636812 1198872 2900732 1507298
13349 1507298 4327716 11236449 13497737 8808861 5372329 6674667 5225887 -2081808
13341 -2081808 -5843671 -490788 4114657 -928617 -7230653 -3259678 4797695 2650947
13333 2650947 -7899980 -11536402 -3546978 5077425 6968025 7598443 12189078 16373050
13325 16373050 14969974 10485808 7908959 8050470 9857027 13457109 17758700 19831577
13317 19831577 18974543 17450640 16227343 14120147 11496558 10397831 10655263 9979980
13309 9979980 7827050 5409515 2854190 390243 555996 4228032 6386337 1824332
13301 1824332 -6215805 -9355148 -5201937 935959 4414916 4604579 829431 -6979913
13293 -6979913 -12943001 -8903675 3791464 13230692 11340917 3636762 520783 3675765
13285 3675765 6179089 3353958 -1827262 -4181535 -3317284 -3000733 -4631985 -4428700 728940
13276 728940 6790226 6433012 -710244 -7081207 -7466111 -4199907 -363419 4650709 9126817
13267 9126817 7035133 -1764327 -7318532 -3521459 1185478 -3489797 -13180222 -16146573
13259 -16146573 -11207309 -6076037 -2837453 1146283 1886445 -5963447 -14475052 -10067927
13251 -10067927 3694098 8415586 -1168649 -9576058 -6653091 -3014830 -9549741 -17835134
13243 -17835134 -14554883 -3231818 2987068 1652759 118275 607307 -246086 -941709
13235 -941709 3160612 9628965 11292953 7595404 4298659 3059825 119358 -5202722
13227 -5202722 -8719974 -8133790 -5073983 -875446 3852905 6504693 5135071 2906852
13219 2906852 4723882 10737151 17588264 23256678 25531513 19792716 5861365 -6046919
13211 -6046919 -5271108 4384036 8585347 1699032 -6607456 -5869970 2128794 8429011
13203 8429011 8721415 5654183 3315254 3432884 5043021 5497198 3162828 -110922 -1245606
13194 -1245606 -838517 -2907318 -8870864 -14468465 -14203883 -7510598 325143 2861784
13186 2861784 -1263278 -5904037 -2754442 9071541 20361205 21000391 10585259 -2302631
13178 -2302631 -9727920 -10504212 -8029083 -5355760 -2607333 2193062 9258456 13982485
13170 13982485 10692825 688225 -7272626 -6990272 -1600205 2495179 3957283 4573859
13162 4573859 3587734 19136 -2437318 681435 7492355 12247955 13145202 11957206
13154 11957206 8117513 308998 -7009573 -6380786 2190232 9816738 9449875 3110099
13146 3110099 -2719867 -4225977 -1506961 3240663 7370930 10084247 12697454 14326549
13138 14326549 10082082 -1802942 -13827669 -16558906 -10449384 -3851957 -1131521 -443190
13130 -443190 -1731078 -7259584 -13554626 -12703168 -4416517 1834890 -83109 -5704259
13122 -5704259 -8858669 -9489193 -8803059 -5138916 460301 2638317 1102109 3567330
13114 3567330 13166307 21113829 19540444 13830427 12947254 14373817 9788899 936771
13106 936771 -2328306 2135215 6433063 6036379 4865028 5790202 5992704 4398927 5031307
13097 5031307 9425378 13002729 12676430 11614938 12579029 12506382 8337528 3353574 2682107
13088 2682107 5850411 8294336 7650559 4515475 -663961 -7112523 -11502906 -10325288
13080 -10325288 -4386054 1915444 5779068 8250475 11264483 14360541 14929589 10976280
13072 10976280 3436541 -4181124 -8814307 -10203944 -9438158 -6180641 186127 6794840
13064 6794840 8124697 2480485 -4644665 -6104290 -1003582 4711662 4880464 -999281
13056 -999281 -7871235 -9977700 -6038577 -68037 3506609 4927943 7285317 10139099
13048 10139099 8863394 1731051 -6438284 -10656160 -12055500 -13625072 -13186583 -6952940
13040 -6952940 1628009 4242399 -49412 -2216646 4044121 13433949 17417822 15886484
13032 15886484 14299323 13378878 9397858 3114573 557754 4032153 8762032 10161928
13024 10161928 8974178 7318421 5020224 2540312 2638990 5660338 7112409 3515962
13016 3515962 -2544180 -6356968 -6804574 -5062400 -1281244 3590393 6040108 4260997
13008 4260997 1249955 -302158 -2675213 -8103880 -13102207 -13630383 -12123829 -12420364
13000 -12420364 -11360545 -4213986 4118901 3860091 -4077960 -8414448 -5063820 -2855747
12992 -2855747 -7561842 -11531823 -6485038 2710047 6046114 3083826 -198096 -4073193
12984 -4073193 -13549301 -26048466 -31044605 -23538189 -10684027 -3094549 -4402708 -10351232
12976 -10351232 -13997470 -11061002 -3286808 3291901 5192860 4530358 3026000 -2599194
12968 -2599194 -14031538 -23968212 -22631513 -10174401 4085620 13385909 17351418 15666062
12960 15666062 7159924 -3625780 -7847496 -3599214 1311598 975347 -1124852 77145
12952 77145 2879170 3424366 2802725 3553906 3643636 302224 -3386756 -2149895 3123749
12943 3123749 6516815 5493072 3007299 1867787 1656151 871248 -2042477 -9145931
12935 -9145931 -19888812 -27843575 -25812130 -15393758 -6767302 -6736856 -10931991 -10912682
12927 -10912682 -5799163 -2393279 -4773683 -8476723 -6778968 214779 5948258 6092240
12919 6092240 3428575 2862887 4530650 4988386 3826965 4939648 10406524 16521157
12911 16521157 17842023 13041468 5041113 -2613288 -7605462 -9051539 -8264891 -7981233
12903 -7981233 -8611623 -6781234 -379424 6292088 6372950 -308172 -5754535 -3426073 3653377
12894 3653377 7379928 5358955 3158880 5390868 8663967 6610902 -250240 -4194697
12886 -4194697 -79760 8854201 16711127 22180067 26467404 27650869 22775361 14172814
12878 14172814 7813955 5336820 3397301 1455551 3447662 9202356 11070389 4244726
12870 4244726 -4681929 -5852679 400622 5092992 4017679 2358958 4953226 8311052
12862 8311052 5661643 -3609691 -12969210 -15917144 -12010129 -6050524 -2532018 -1565946
12854 -1565946 -715320 56746 -2017245 -7071390 -10106612 -6915441 -272431 3348536
12846 3348536 1765305 -1887215 -4836291 -6912128 -7381626 -4323342 1495371 5762164
12838 5762164 5441839 2079164 -773083 -1031781 1881568 7707412 14249001 17356636
12830 17356636 13942174 4996364 -4385738 -7790061 -2146851 8228796 13865364 9632717
12822 9632717 999999 -2772563 -542022 541351 -3455853 -7692642 -6490430 -1180306
12814 -1180306 3553264 6579244 8991528 9318253 5619763 886322 738148 5079011
12806 5079011 6529175 -573955 -12147160 -18052735 -13343213 -3720451 1054694 -2198982
12798 -2198982 -7914512 -9539588 -6150976 -299789 6633873 13406605 16492089 13829475
12790 13829475 9132376 6920583 4732574 -2993975 -13858741 -18413747 -13577676 -6979558
12782 -6979558 -5124058 -5592173 -5184205 -6830781 -11620927 -12174861 -3178479 7678269
12774 7678269 9552700 4556875 2771507 4485008 431447 -10546159 -17570111 -14675640
12766 -14675640 -9595192 -10114691 -12175417 -8970496 -3318678 -2111672 -4512119 -4907225
12758 -4907225 -3582194 -5096918 -8038782 -5534671 3815385 13318303 17634650 17872841
12750 17872841 15522339 8515104 -2677235 -10850571 -9829070 -3269187 230952 -570667
12742 -570667 1610420 10635858 19880315 20910469 15363675 12734217 17195089 21938348
12734 21938348 18376047 7275517 -2232456 -3067483 3003635 8449925 7882248 2554426
12726 2554426 -2247690 -3574625 -3160360 -2556356 1241586 11106137 22144051 25021980
12718 25021980 18036787 9433121 5129603 1235788 -6430204 -12483805 -9341799 463247
12710 463247 7866785 9885264 10130556 9662735 6936972 4980688 7960264 10829950 3499676
12701 3499676 -13146424 -26106712 -27601086 -23016993 -18643199 -13099946 -5923834 -2991370
12693 -2991370 -6087150 -7349259 -2184714 2027596 -1007662 -4696048 -1628334 1885957
12685 1885957 -3379584 -11678626 -10254729 -376561 5334583 4114130 5301107 11277400
12677 11277400 12674632 6113152 1611701 6113369 12281722 11120181 5287313 1969854
12669 1969854 1203570 -635465 -2853762 -3889537 -6721560 -12901195 -15995828 -8915473
12661 -8915473 5330612 16866116 20221227 16717585 9056865 194832 -4768387 -2506491
12653 -2506491 3276215 5811106 3794876 1227943 -141752 -2666704 -6886899 -9000258
12645 -9000258 -6093515 -486602 3213781 3451214 2282526 1479686 -61467 -4033267
12637 -4033267 -8630660 -9327882 -5169819 -1526786 -3119894 -6454992 -4343310 2950921
12629 2950921 7387536 4890879 962740 1856605 5772912 6775950 3457402 -165619
12621 -165619 107108 4768033 9374750 6747095 -5043873 -16404601 -14426271 846708
12613 846708 15601424 20271385 19667467 20693050 19977692 11997913 1041983 -5526314
12605 -5526314 -9696435 -16850001 -21992515 -15282079 -22818 8063364 1566923 -9604154
12597 -9604154 -13142073 -8890121 -4542968 -4661048 -8447781 -12646316 -12960938 -7300231
12589 -7300231 -53191 1562807 -2911779 -6374806 -4328582 -122934 1637570 882343
12581 882343 -882982 -3210893 -3681878 1820612 12422617 20821136 21505776 15971891
12573 15971891 8077070 37197 -5070870 -4014045 61415 -891044 -7524377 -9871605
12565 -9871605 -2072948 7210543 6649907 -1885915 -8144616 -9183464 -10311859 -13193064
12557 -13193064 -13234617 -8818602 -4844806 -6156640 -13211894 -23301714 -30034899 -24200439
12549 -24200439 -3776458 18164233 25240667 17695180 10505511 10814023 9668263 562423
12541 562423 -6987338 -2022459 9548782 13449062 7922749 3378198 4262274 4758051
12533 4758051 2946790 6003774 16858222 26459078 25970229 18740865 13107366 9871216
12525 9871216 5061587 265706 840263 5780541 8161809 5814654 4033393 6547791
12517 6547791 10384130 11454556 9619208 6386152 2666771 336496 894885 1389527
12509 1389527 -2432216 -7736003 -6895669 -673336 -2781 -9065555 -15597059 -7120363
12501 -7120363 9848948 17792928 11510029 1901898 -2103127 -3489351 -7264054 -11184740
12493 -11184740 -10772038 -6442004 -1711994 617141 -1574548 -8157075 -13752867 -12337145
12485 -12337145 -6115738 -3203903 -5351415 -6055030 -2988907 -2810404 -8994951 -14186569
12477 -14186569 -11675846 -6699698 -7839171 -13109428 -13787695 -8070028 -1777061 2117209
12469 2117209 5902205 10186906 12636550 13632762 16008249 18492296 15876410 7152839
12461 7152839 -1738517 -5019383 -3145296 -567761 -378829 -2031156 -2588404 -422898
12453 -422898 1602295 -844674 -5940964 -5564766 3724019 14369192 17753288 15865774
12445 15865774 16188890 18916501 17850798 11698493 5208747 -122723 -7049908 -13975572
12437 -13975572 -15032527 -10341144 -6460500 -4016128 4482161 19303290 26596858 16043157
12429 16043157 -1791302 -6640380 5968254 20489209 22210160 13070521 4342030 1234643
12421 1234643 214164 -2135883 -3883179 -2230896 731437 54699 -5088852 -9847230
12413 -9847230 -10270980 -8298356 -7546513 -7107586 -4066339 -507237 -2170657 -9521030 -15425430
12404 -15425430 -13689235 -6007931 1217425 3323105 -598542 -7659443 -11084235 -4807949
12396 -4807949 8511950 17900595 16291738 9187560 6863444 10565779 11922668 5572441
12388 5572441 -3119553 -5359654 -817136 1648436 -4493986 -14322453 -17093279 -10068369
12380 -10068369 -1829949 79998 -518538 4578477 14831437 21909645 21645326 17330767
12372 17330767 11989279 5739995 1125730 1908106 4734737 1439561 -7272117 -10479231
12364 -10479231 -4301550 -78190 -7613120 -19636605 -23031362 -18077663 -14854540 -15670261
12356 -15670261 -13784818 -7336496 -2217544 -963108 397764 3386209 4732817 4247806
12348 4247806 5607708 7685639 4645377 -2941975 -6750299 -3899671 -1857140 -5479006
12340 -5479006 -8881263 -6885924 -5360054 -10806253 -16813517 -12543075 -1216167 2217887
12332 2217887 -7356774 -16924763 -12937791 705245 8617441 3482903 -7150287 -12493062
12324 -12493062 -10496277 -6109073 -2429614 1406860 5170287 6406118 5976002 9185102
12316 9185102 17269515 22289811 16730094 5214998 -1162380 -1049251 -4053428 -14157020
12308 -14157020 -21953343 -18969773 -11370231 -10899508 -17282557 -19056364 -10182174 2605765
12300 2605765 9432681 7673142 1772518 -2118209 -658857 3074257 730359 -11479846
12292 -11479846 -24550819 -24842891 -11443768 1583890 2776263 -3850451 -7547662 -5702013
12284 -5702013 -3439222 -3202829 -2774061 -1801056 -2706705 -5046697 -5518387 -4390677 -5756272
12275 -5756272 -9829230 -11097981 -6823560 -1502281 1071688 4533818 12852357 21015939
12267 21015939 20811313 13985562 10706293 13876281 14027029 4315871 -7009259 -6828714
12259 -6828714 4322703 12664291 9297705 -362981 -6858263 -8417075 -7942598 -4794249
12251 -4794249 2877976 10393523 9325817 -967866 -10974324 -12699053 -8690956 -6146069
12243 -6146069 -6550666 -6075859 -3248355 -346771 1764296 4400192 6449875 4569020
12235 4569020 -889441 -5517452 -8067989 -12178780 -18295916 -20535818 -16115780 -11018772
12227 -11018772 -9470327 -4742069 9162748 21957748 17705496 564587 -6068751 8522508
12219 8522508 25817265 23246782 4328642 -9498789 -9217513 -4946116 -5443861 -6774169
12211 -6774169 -3632131 1241029 4141236 7062552 11495556 13192466 9049348 3282989
12203 3282989 1075530 909804 -1427763 -5596329 -8889332 -11638320 -14439923 -13387983
12195 -13387983 -5127274 4889045 6391950 -2689662 -12886439 -14530643 -8087760 -1204677
12187 -1204677 877280 -926467 -3232456 -4312078 -4360788 -3733309 -2424688 -1047049 -622429
12178 -622429 -221486 3551783 11766077 18394955 14745223 629687 -12593932 -13715503
12170 -13715503 -4270032 4169273 3707643 -3090129 -9535594 -12875607 -14066681 -13265961
12162 -13265961 -9414512 -3592842 456544 529013 -867256 421126 4233157 5861996
12154 5861996 3170557 1150466 5794081 14964639 20367206 18711356 15012036 12767694
12146 12767694 7570646 -4206397 -15938202 -18279683 -13617581 -13317446 -19691977 -20772143
12138 -20772143 -8119476 8446634 12615414 3581906 -3983184 -1553438 2200771 -3802227
12130 -3802227 -15799576 -20730429 -14488520 -5542717 -1478387 -954813 -537606 -678858
12122 -678858 -642283 4675328 16141410 24541976 21378988 11377313 5661025 5886871
12114 5886871 5218807 2729327 4327393 8701759 6172185 -3874810 -7932478 960031
12106 960031 9642673 3766269 -9216638 -10789374 392764 7206704 269642 -9915779
12098 -9915779 -10340032 -2264377 4945072 7056300 5894818 4051571 3972744 6799596 8367931
12089 8367931 2379630 -8998834 -14665677 -9239216 -1295821 -1381040 -8243680 -13571659
12081 -13571659 -14534608 -13842302 -12036580 -8336734 -6010580 -8229110 -10683012 -7200287
12073 -7200287 -1459140 -3355922 -13013731 -18423112 -12384779 -2952887 -1417893 -6646511
12065 -6646511 -8398566 -2258801 5894289 9112027 7149150 4308688 3382332 3217979
12057 3217979 934287 -3868850 -7110570 -4097122 3914624 9650767 8171498 2676630
12049 2676630 -544157 -159657 798165 916646 622298 -2080378 -9569496 -17499413 -16376280
12040 -16376280 -3780117 9712117 11386724 626407 -11437612 -14340495 -6919326
12033 -6919326 4103793 10045428 6458696 -2328837 -6039922 221413 9083569 10030164
12025 10030164 3489493 -622604 2433422 6946893 7385857 5868683 5315856 2991874
12017 2991874 -3102232 -7500000 -4246922 3280340 6706773 4255602 1137229 125266
12009 125266 -1155661 -3720957 -4280450 40023 8000153 15472585 17592863 11467778
12001 11467778 344508 -7374091 -7334380 -4051382 -1926021 2817599 13006862 19071172
11993 19071172 9585049 -8656070 -15684470 -5691224 4935255 2228420 -6319772 -6121671
11985 -6121671 2681894 9365747 10360791 10037328 8628711 2518919 -4524294 -2246722
11977 -2246722 11756687 27039583 32414396 27160099 18006786 10111962 4125366 -641484
11969 -641484 -3234190 -1690521 3630543 8783407 10751849 12103899 16591282 20723271
11961 20723271 16753540 5350666 -3137113 -3353982 -1481753 -1786548 2597781 16112490
11953 16112490 27978255 26171070 17049303 15566416 20142425 14953436 -2458055 -13994488
11945 -13994488 -7135786 6991893 10696218 3327277 -2722569 -1635574 1483603 2090420
11937 2090420 1990557 3849434 6849624 9029076 10005225 10177425 8938840 4519384 -3876308
11928 -3876308 -13171920 -17446365 -14282033 -8335575 -5350379 -4708043 -2152135 2377537
11920 2377537 5064847 4623474 2740719 34756 -2504690 -897226 5695700 9653357
11912 9653357 5092614 -11797 5933608 17734418 18030845 3430856 -9822090 -10579860
11904 -10579860 -7302001 -10540307 -16099546 -16048068 -13320532 -12949753 -9674929 2027285
11896 2027285 13995572 14608250 7093593 4276590 9401540 14771818 16037409 15553896
11888 15553896 13678083 8114781 941263 -3118788 -3944851 -3737267 -1069913 4350766
11880 4350766 5805067 -1645069 -11191562 -13598309 -11210500 -11088808 -10495906 -3814714
11872 -3814714 1581294 -5887458 -19993735 -22532965 -11398678 -3423824 -6675470 -10048044
11864 -10048044 -6059731 -3729268 -9286513 -12853928 -7111967 -2952862 -11306426 -22519934
11856 -22519934 -20618329 -8487835 -1778669 -4190309 -5564552 -1086652 3206372 3046329
11848 3046329 605440 -3346867 -10198172 -16406427 -16556440 -13379880 -13883948 -15678610
11840 -15678610 -9349507 3983939 10633588 4836126 -805359 6244572 18868792 20061093
11832 20061093 7156500 -5430976 -7083564 -3617918 -5248885 -10528566 -10146246 -2884312
11824 -2884312 1572474 -2849187 -9248684 -7859328 58797 5441344 5352071 5395040 8685172
11815 8685172 10876763 8263931 3508140 13583 -3079380 -6460559 -6973942 -2872082
11807 -2872082 2009652 3683296 3324019 3317666 2926567 2288657 5374726 13223988 18902989
11798 18902989 15767599 7246730 1973371 2186224 3380896 2778455 1506243 492592
11790 492592 635003 5004226 14219751 21406997 18763640 8099949 -1752419 -6709252
11782 -6709252 -9420835 -10668906 -7373133 -224649 4595013 3879111 1500333 1819519
11774 1819519 4318862 6586759 7405279 5225936 -988219 -7439926 -7472224 -409558 6499978
11765 6499978 7565553 5239096 4343059 4661649 3404374 1387918 2254323 7365385 14670622
11756 14670622 21033681 23277465 18927393 8718387 -2650436 -10098855 -11721421 -8418713
11748 -8418713 -2376120 3019746 4422036 1550604 -2732296 -6158835 -8229041 -7002985
11740 -7002985 751873 13063980 20358776 14855576 787914 -10137655 -13288191 -15276422
11732 -15276422 -21838002 -27770671 -24482833 -13913864 -7221033 -9527117 -13714319 -12379958
11724 -12379958 -8619853 -8926493 -11339877 -9340161 -4001825 -2102590 -3210693 261867
11716 261867 8680547 12258022 6446856 -727902 -2509533 -3516691 -7745630 -7328906
11708 -7328906 4631815 17993118 16601930 1463944 -10740978 -10626860 -4803607 -1954286
11700 -1954286 -2600695 -4166727 -5310907 -3267672 3566351 9235669 6026241 -2821749
11692 -2821749 -6850807 -5313597 -7724893 -15417154 -16995676 -7929036 -718479 -6223473
11684 -6223473 -16216503 -15844446 -5364409 2199434 -12881 -6806810 -10941544 -9721547
11676 -9721547 -3216400 6372413 14156157 16712138 15598053 13223975 8614828 1535340
11668 1535340 -3203132 -910754 6514104 13808528 18681795 20844132 19100833 14418348
11660 14418348 11677926 13062928 13802614 9916235 5715724 7250230 12272412 13705079
11652 13705079 10048715 5463704 1987022 -1495080 -4265751 -4172149 -2036074 -673409
11644 -673409 -912463 -2421146 -5499058 -7999720 -4924898 3600893 8965375 5385364
11636 5385364 -353199 1576815 9403106 13865239 12906764 11538805 9886542 3675579
11628 3675579 -3767598 -2761186 7039962 13812293 10761480 5969947 9321286 18195057
11620 18195057 23220308 21916231 19030840 17056091 13503955 6556017 -1555427 -6946438
11612 -6946438 -7420760 -3902308 163802 1871713 2010568 3796544 8242762 12531011
11604 12531011 13137982 9092473 2574806 -2371560 -3164138 -2408085 -5878728 -14393831
11596 -14393831 -21090333 -20454544 -16076838 -14084740 -12948262 -7401443 317448 2453897
11588 2453897 -1413490 -2772357 3060645 10981423 15266014 16673772 17066552 14653843
11580 14653843 9508432 7474433 12632300 20156029 22458001 19702427 18761319 22894646
11572 22894646 27288007 25643752 18314076 11911850 11030192 12188237 8492916 -197890
11564 -197890 -6379514 -5916808 -4293127 -7473154 -12085620 -11451133 -6856972 -4567383 -4957689
11555 -4957689 -3726367 -1316174 -1071488 39116 7477434 16754640 17753471 12346859
11547 12346859 13745484 24720153 30793975 21857948 7385895 872765 423245 -3978611
11539 -3978611 -12506206 -16823466 -13923142 -7915538 -1928339 2572762 2242182 -3631117
11531 -3631117 -8774351 -8321877 -7248766 -11661204 -16553233 -13084028 -4463895 -2070677
11523 -2070677 -6724836 -6805946 2891020 12466284 11913515 4930058 1140036 1936374 1912328
11514 1912328 -13426 837310 6038219 10587997 10155452 7350549 7635295 11279752 13237416
11505 13237416 10802666 7315423 6487489 6812474 4958726 1391663 -1969235 -6420271
11497 -6420271 -12341912 -13129099 -2243021 13923808 20068904 11167218 -1352535 -5622461
11489 -5622461 -2388304 1752610 4324051 4533677 245352 -5784516 -5389646 2174258
11481 2174258 6131541 916233 -3455290 1719580 7332508 1160175 -9827806 -9258356
11473 -9258356 1975202 7642530 2844265 -562895 3195020 4734258 -1037750 -3781160
11465 -3781160 4687658 15443695 15869120 7862869 2119762 2054988 3682399 5618640
11457 5618640 9057055 11145625 7245126 -1558843 -9516281 -13418601 -14034081 -12461756
11449 -12461756 -9573823 -7264095 -6492783 -5869325 -4717049 -4485951 -4494803 -618131 7642640
11440 7642640 13032884 9301468 1375482 290827 8641410 17196608 17167378 10733314
11432 10733314 6542318 8099030 10714849 9300753 5106156 2713845 3099099 3401900
11424 3401900 2446025 1737567 664117 -3661476 -9726617 -10892980 -5256914 -240229
11416 -240229 -1796171 -4800193 -1472220 5782794 8957893 7917170 9004201 12627319
11408 12627319 13301772 11154960 11871569 14610570 11638649 1965463 -6049296 -8429810
11400 -8429810 -10322141 -13375485 -10694461 -141495 9063846 10403494 9917382 13670278
11392 13670278 15846263 9632975 1046066 224157 5582948 8285373 7190423 7491506
11384 7491506 8427351 4591262 -2374262 -4890198 -1988538 -647297 -4161722 -8145478
11376 -8145478 -8926637 -8015101 -7314362 -6634609 -6173577 -5368114 -553654 9101391 15240822
11367 15240822 9088683 -3974541 -8814308 -930288 7790337 6887738 815751 -1026976
11359 -1026976 856829 -894453 -7947035 -14765893 -17229854 -16214674 -13674656 -10453002
11351 -10453002 -7692630 -6292202 -5060863 -2810767 -1978175 -6317794 -14117703 -17245528
11343 -17245528 -9550525 5319711 16995440 18826341 13021011 5660324 84184 -3042866
11335 -3042866 -2641470 1552993 6138200 6907779 4214491 1330665 -1748665 -7194024
11327 -7194024 -11917348 -8544848 3366490 13749038 14248177 8770880 6733250 10154876
11319 10154876 13090315 10844523 4518242 -1592770 -3357262 -151937 2421172 -2501487
11311 -2501487 -12200411 -14553609 -4093154 8614248 10585471 3289893 -2610421 -3755030
11303 -3755030 -4824984 -6732525 -5754793 -2878441 -2731823 -3572732 737800 8538223 11192133
11294 11192133 6979243 2675693 -345053 -8691528 -21398256 -24873258 -11473238 7020095
11286 7020095 13929740 8359123 1889396 161512 -1970783 -8910822 -16778142 -18540979
11278 -18540979 -12097190 -2707178 865304 -5510026 -15462488 -17502859 -8190498 3641251
11270 3641251 7655872 2733718 -5064362 -10064307 -9583234 -4272091 466132 -1568022
11262 -1568022 -8143804 -8737670 1345002 12363853 11811435 535290 -9530347 -11077196
11254 -11077196 -8177413 -8233976 -12744822 -16762615 -14850691 -7626559 -2585213 -5626930
11246 -5626930 -12066404 -11865314 -4730524 -1716284 -8174516 -14564569 -11350703 -4236601
11238 -4236601 -4230323 -9095429 -7093030 4105607 14708456 18152761 17530030 16125447
11230 16125447 12706069 8191072 6609248 6559941 1602878 -7409437 -10656951 -5146621
11222 -5146621 -1912859 -9398764 -18189715 -13143423 4042693 15978757 12562410 2352388
11214 2352388 -1487278 2003303 4155897 582691 -4529293 -6691469 -7147096 -8576512
11206 -8576512 -9442483 -6707640 -1625766 2199923 5461291 11695575 18435984 17222947
11198 17222947 6537083 -2008174 2563161 14954093 19706217 10473619 -4956417 -17202725
11190 -17202725 -23419385 -22682362 -13685655 -839218 5812081 2168042 -4396712 -5718750
11182 -5718750 -3253040 -2718657 -4079010 -3581315 -1870162 -2813979 -5881604 -6022687 -1073978
11173 -1073978 5308410 8378313 7036035 4220760 4440871 9426920 14811946 13999439
11165 13999439 7065587 1584810 1822805 2457831 -2273573 -8820156 -10666844 -9658485
11157 -9658485 -12014081 -16109789 -14588665 -7732093 -3687687 -4126853 -1186594 7435640
11149 7435640 11823703 5492067 -2107695 1210399 11484541 14466205 6684003 -1485965
11141 -1485965 -3309333 -4062243 -8577412 -11055524 -4384681 6993450 11681961 6201904
11133 6201904 -1524523 -2963770 2351864 9575609 15090718 17855546 17189885 12617638
11125 12617638 5711834 59360 -1357095 1832425 7987753 14930856 20158187 20929180
11117 20929180 16276497 8976022 3445245 1031560 -612475 -2819134 -3614652 -2099777
11109 -2099777 -1780895 -5809358 -11434537 -13909036 -13944171 -15284146 -15903162 -9345567 3718292
11100 3718292 13289030 13316202 9991454 11140534 13875725 10709257 3202450 -219302
11092 -219302 1640997 598227 -7966268 -18323425 -22798795 -19967531 -12089474 -1232266
11084 -1232266 8768296 12847712 11363202 10764188 13493571 13029702 4527397 -5039515
11076 -5039515 -5089192 3241177 8330561 4283580 -1950129 -1992426 1493037 -1535347 -14347029
11067 -14347029 -27022914 -25915846 -9161570 9155109 12722157 387220 -13532253
11060 -13532253 -16379728 -9593623 -2380818 637712 713165 -586820 -1338859 2601708
11052 2601708 11731309 17594528 11765506 -914967 -7004162 -2720447 1896559 -749571
11044 -749571 -5265303 -4137799 -642350 -3067274 -11142683 -16170375 -12569651 -3260141
11036 -3260141 4959839 6592383 -103946 -10831082 -16688235 -12516536 -3052934 2909286
11028 2909286 2944189 1522097 1990949 3214464 3465134 2527679 -106263 -4439454 -7304663
11019 -7304663 -5463278 -1827113 -3087419 -9516587 -12748388 -7114190 1406974 2467853
11011 2467853 -4806628 -10327332 -5348631 7488891 17634832 18041774 11500392 6061494
11003 6061494 5618234 6601564 4395064 772584 1959998 9693717 17784242 19172118
10995 19172118 13983181 8440098 7169224 8732815 8448950 4204209 -874164 -1597223
10987 -1597223 3062323 7857386 7095225 1703345 -2433237 -2708292 -1967183 -1527569 2324668
10978 2324668 11021631 17778959 15480689 8169029 7123763 14934492 20744466 14677393
10970 14677393 1380033 -6043635 -2584170 3828590 3561425 -3422557 -8944747 -6358471
10962 -6358471 3024045 11988262 14540740 11509646 9664350 14627877 24291864 30393630
10954 30393630 27625216 19972087 15738398 16432778 14019580 1719487 -14987901 -22930962
10946 -22930962 -16927186 -5837198 -694227 -1675620 -1509998 1991662 4014421 2631034
10938 2631034 2932913 8525271 14597997 13757610 5500915 -3978428 -9313255 -10005656 -8485853
10929 -8485853 -6996750 -5751061 -2985921 1701153 4130641 -512067 -9586649 -14169153
10921 -14169153 -10950697 -7109264 -9065546 -12728989 -11410218 -7289861 -5962839 -4557711
10913 -4557711 3097786 12160329 11182445 1425135 -2457179 5091948 11540911 7045629
10905 7045629 672226 4523250 12758595 11313704 1658300 -1710892 4617503 7788441
10897 7788441 173827 -8287579 -5537299 5228868 11091848 5638266 -6691242 -17418321
10889 -17418321 -19658201 -11183002 2781338 12627467 14105308 11979536 11125199 8926717
10881 8926717 1483125 -7215726 -9580029 -5966946 -4486897 -8702823 -12157785 -8037441
10873 -8037441 415392 3555266 -2331417 -10557844 -12727338 -8823053 -5623272 -6018980
10865 -6018980 -4547860 3685506 13382716 14225408 5028661 -3742591 -3528861 2200008
10857 2200008 5082737 3774966 3002666 4460574 5763427 7016401 10966938 15751625
10849 15751625 14459766 5013724 -4703937 -5492280 2849279 13070272 18593761 16176483
10841 16176483 4804268 -11288712 -20764563 -14884740 -96798 7340717 2364391 -2059422
10833 -2059422 4707713 12835952 5948003 -12257978 -21084163 -13303481 -5978115 -13830205
10825 -13830205 -26798741 -26765948 -15418623 -8829495 -10497663 -8580533 476973 4385428
10817 4385428 -3626373 -12045660 -8891004 28466 1597634 -4712514 -8839893 -6198688
10809 -6198688 -914010 3392614 6317388 6538446 3621475 2169374 6340478 11938593
10801 11938593 11536550 5888877 2566359 4279919 6093343 3863763 -1342202 -6842281
10793 -6842281 -10243848 -8891859 -3414947 288161 -863344 -394158 8091422 18337904
10785 18337904 19348607 13023950 10829309 14005354 12295488 4057148 1052759 7702011
10777 7702011 11812790 4994622 -2494339 899275 8567552 7595846 -88537 -3587286
10769 -3587286 -2288849 -3352962 -5465782 -1578533 5151957 4485465 -2700223 -5004495
10761 -5004495 125049 3062714 192854 126286 7478399 14739514 16269427 17422403
10753 17422403 22610447 25883493 21375137 13230078 7520639 3680429 1302386 5267822
10745 5267822 15304360 20371002 13847759 5355217 6011854 10474796 7172091 -717558
10737 -717558 -490107 7536707 9227022 -1404121 -14186098 -18855798 -16002329 -9153450
10729 -9153450 1274497 11427752 12806583 3911147 -5474809 -7062150 -3563836 -1050796
10721 -1050796 737 930628 162661 -1787886 317710 7870852 13615386 11560426
10713 11560426 5634751 2431122 1743143 1147675 3536490 11673144 20229015 21989401
10705 21989401 18411238 15934254 15328336 13029340 9721391 8550857 7286177 1586451
10697 1586451 -5527821 -6790131 -2301352 1175898 1734550 3382893 5878041 4200012
10689 4200012 -642143 -1184563 3565361 5600334 1996156 403660 4865844 7026791
10681 7026791 -332509 -10066410 -10766374 -3429483 2102869 2526872 2532938 3902121 3598601
10672 3598601 2082314 4118513 10092488 13943766 11522991 5472110 689606 -233819
10664 -233819 3372582 10095904 14984294 12960222 5164643 -1478472 -1771839 3411724
10656 3411724 9644606 12173013 7569567 -2971800 -11703172 -10310765 977824 13572257
10648 13572257 20000323 19559663 14721115 6914812 -2348186 -9907282 -12953974 -11243850
10640 -11243850 -6951778 -3591263 -3603935 -4549548 -5885 11833003 22980676 24446008
10632 24446008 18016785 12669575 11057201 7955916 1679174 -2901219 -4647499 -9240634
10624 -9240634 -17705331 -21545575 -15671269 -7575686 -5707228 -6169127 -684541 7770683
10616 7770683 8477737 -268362 -8591921 -9413134 -6401630 -6247508 -10462433 -16578487 -21175300
10607 -21175300 -20094542 -11500453 -583776 4053681 657847 -3740375 -3335994 -539312
10599 -539312 -464499 -2895212 -3301357 694021 6856508 11174792 11613086 9872317 9570452
10590 9570452 11539271 12033216 7772018 1046166 -3559211 -5662749 -7650070 -8344960
10582 -8344960 -4436179 1803518 3223116 -1784616 -5857459 -2882218 3599904 6001188
10574 6001188 2425215 -3306094 -8043157 -11395953 -13299570 -13103365 -10391725 -4937214
10566 -4937214 2805456 10079502 12980299 10868509 7859067 8590181 13706399 19708570
10558 19708570 21891761 18408466 13354507 13519780 19060333 21338377 15446988 9893492
10550 9893492 14522230 22745029 19023048 3489708 -6235098 -1305534 6095030 4136460
10542 4136460 -385269 3223409 9584769 7009783 -1643620 -3622884 3337764 9805681
10534 9805681 10616892 8921441 6753831 3794122 3264773 7338747 9179588 1562184
10526 1562184 -8982586 -9141856 1962684 13178166 19215016 24769512 31470145 34148702
10518 34148702 30875999 25173551 18590470 11745637 9762090 14386520 15421559 4879271
10510 4879271 -5967269 -1780374 10279081 10918020 844890 -2996259 -151296 -5824601
10502 -5824601 -17364811 -15021422 -190300 3127926 -7599859 -7497430 6781067 7750922
10494 7750922 -5820210 4666267 45036318 61786131 36966660 48996789 160314769
10487 160314769 286184668 276002567 117939693 -36576744 -69721436 -25938576 -7344361
10480 -7344361 -27793662 -35825652 -20528184 -15530432 -27167457 -29435171 -19747392 -21737152
10472 -21737152 -35794734 -36115955 -18069807 -5864295 -9631059 -12819147 -7321633 -6081929
10464 -6081929 -13207240 -13638675 -3001496 489565 -13401725 -27977172 -24679238 -8435224
10456 -8435224 4456948 8273319 6351503 601849 -6800398 -10696919 -9738931 -8296408
10448 -8296408 -7741073 -4851422 -1076174 -2295009 -6637072 -4479423 5482870 11631506
10440 11631506 5632362 -6762607 -15274539 -16152581 -10477376 -1018543 6058909 5623750
10432 5623750 2269030 5238574 13031977 13742729 3031613 -9460943 -14877541 -15378088
10424 -15378088 -15986142 -16934728 -18288394 -22117848 -25952838 -23591940 -16038123 -12144164
10416 -12144164 -15204297 -18487911 -16672449 -11656416 -5171440 3049290 7964377 2790911
10408 2790911 -7908460 -12364543 -10836159 -14655658 -23122664 -20897109 -5428185 3888619
10400 3888619 -4146899 -13075533 -5623625 7469464 5520220 -8515273 -14808474 -8848851
10392 -8848851 -4597063 -8689289 -11772705 -6405155 2608413 7825429 6892141 -99903
10384 -99903 -10569970 -17176839 -15019226 -9690775 -9546767 -13004523 -12611879 -7636822 -2533392
10375 -2533392 2645261 9173846 11375883 3556952 -8291346 -13787694 -13590181 -15179631
10367 -15179631 -17470027 -13819237 -7099860 -6356615 -10264163 -9621124 -5203924 -6451614
10359 -6451614 -12254184 -10954297 -2000797 531996 -8653053 -16065836 -10186818 2508051
10351 2508051 10057915 10134078 4974898 -5403536 -15996728 -15215115 -634036 13885376
10343 13885376 16094198 10490572 6689861 3536416 -4135263 -12365148 -14204034 -12237222
10335 -12237222 -13200965 -15383620 -12337454 -4746431 1520411 5224108 8286397 8652133
10327 8652133 3951743 -1535276 -2653609 -2304816 -5686204 -9892485 -9119857 -6262162
10319 -6262162 -8249405 -12441002 -9304356 2051324 12034972 14735424 13724854 12600207
10311 12600207 9660836 4463359 868302 223986 -1282120 -5327199 -7866232 -5927929
10303 -5927929 -2425452 -1232515 -2407853 -5062955 -10162217 -17027489 -20743603 -16850233
10295 -16850233 -7018796 2332730 6304652 5505575 4724393 7988944 14470255 19691126
10287 19691126 20479417 16775853 9375574 417462 -3787805 2507585 14182811 17498409
10279 17498409 7788853 -2863675 -2566235 3844499 4670192 174686 -925857 1668705
10271 1668705 849974 -2731607 -1280374 5055955 8464287 9182185 15194826 24177320
10263 24177320 22885224 9989950 2607001 11285647 23754471 24521803 16999252 13287800
10255 13287800 13921274 12589668 11558681 16260661 20894546 15531503 3902744 -989092
10247 -989092 3213972 6995064 6091119 5285659 5201129 150256 -8582655 -11190123 -5091104
10238 -5091104 161608 -1316864 -2473105 3852874 12774380 15598482 12727819 10749871
10230 10749871 11745426 11962891 7787367 -1264217 -12125839 -18165760 -14210894 -4004496
10222 -4004496 2574247 1836534 -493954 -670277 -3338880 -11762394 -19416630 -18412721
10214 -18412721 -10824698 -4634965 -2650129 -2110381 -1705457 -2259952 -2869247 -2120147 -1080980
10205 -1080980 -525137 1738591 6100344 7640110 3093410 -2469385 -2540179 556538 -217974
10196 -217974 -4650047 -5867252 -2386992 -1201871 -6989983 -14706096 -15731052 -7466896
10188 -7466896 4897146 13225589 12456948 4667048 -2625164 -4311095 -2765115 -2781617
10180 -2781617 -4003831 -2449663 2428588 6930216 8216803 6090302 1144380 -4603986
10172 -4603986 -6990107 -4201925 -218666 836879 1243687 5049203 9806614 10212269
10164 10212269 8089847 10300479 16748097 18877783 11856418 1136406 -5295327 -5111026
10156 -5111026 -112423 7539261 14785785 17862824 15683369 10666842 5941223 3938588
10148 3938588 5568335 7236510 2587741 -7322050 -10795975 -743225 12144687 12703068
10140 12703068 3218661 -2116056 -1394463 -5740412 -15555757 -16548372 -5293909 1457851
10132 1457851 -6415250 -14621378 -7593872 6390697 10056161 4105057 555682 -721658
10124 -721658 -8063744 -17076262 -15392678 -6267283 -6428281 -18965806 -27909715 -23926295
10116 -23926295 -17206635 -17867374 -19817744 -13995486 -4900382 -2623521 -6989060 -10193779
10108 -10193779 -9457467 -7668791 -5340201 -408077 5724670 8627036 6900020 3455071
10100 3455071 1181229 235534 -832944 -2898481 -4680507 -3425818 1198295 4920495
10092 4920495 3715115 -113834 -862614 2137064 3993488 2387535 929056 3077388
10084 3077388 7357018 10318785 10460025 7912410 3819032 1099113 2494501 7003452
10076 7003452 11042904 12959764 13226033 11104750 5286257 -2692931 -9631802 -14330178
10068 -14330178 -16298715 -13163903 -4603580 3670644 6348164 6508399 9625210 12207051
10060 12207051 6224815 -6237986 -14000589 -13502468 -12936582 -16751922 -17910498 -11272864
10052 -11272864 -3986383 -4480530 -9173398 -8829772 -2633286 2251006 1643179 -1949535
10044 -1949535 -4344905 -3457624 -90476 1988664 -382393 -4441822 -4307751 -448552
10036 -448552 148812 -4391487 -6793035 -2286789 3480706 3729421 654447 -5390 1893115
10027 1893115 3822399 6730307 11146528 12245789 6083045 -3129617 -8181820 -7462054
10019 -7462054 -3347429 2878920 9056897 10646210 6805332 2210404 -1815349 -9580780
10011 -9580780 -18568901 -16092195 1164590 15176432 8610679 -9453605 -16248462 -7658985
10003 -7658985 459174 -110103 -1136566 2411151 3742500 13709 -1050656 2989507
9995 2989507 3050325 -3864786 -6520579 843617 5482821 -3743825 -15481779 -11370557
9987 -11370557 5370342 13837146 4808927 -9311939 -14104538 -9254131 -2638968 621814
9979 621814 -776740 -5914311 -10089035 -7666751 174125 5599806 4759143 3239395 7565493
9970 7565493 15582799 19439965 15444569 7047882 -465069 -4703792 -5905167 -4739555
9962 -4739555 -1332484 4258556 10771794 15120543 14320738 8830878 2865437 219529
9954 219529 517227 678761 -768972 -2346632 -1926677 1394859 7196377 13211288 15303970
9945 15303970 11389643 6054523 6995628 14557147 19538397 15809484 10295295 12867845
9937 12867845 19472669 16011134 16918 -12820630 -9095519 4638652 12116075 7786510
9929 7786510 -1922942 -11492068 -19252367 -20891184 -12340280 438981 5238713 -823524
9921 -823524 -8564922 -11284873 -12171620 -13933380 -11582552 -2208419 6473649 5815818 -1016273
9912 -1016273 -4313108 -2039847 -607173 -3841606 -9249327 -14284163 -18636608 -20080446
9904 -20080446 -15441904 -7366753 -3654783 -7233886 -12188410 -12629527 -10282093 -9367549
9896 -9367549 -8819454 -5234081 -394449 663385 -2189743 -4569584 -6105249 -11207469
9888 -11207469 -19212053 -21544543 -14023237 -5460735 -6054985 -11705384 -10093248 -739278
9880 -739278 3052548 -4991060 -13140134 -8639913 3697843 9944209 7813044 6963044
9872 6963044 11061972 12351586 6224501 62598 1748601 7005992 5445152 -4636514
9864 -4636514 -14133996 -14653302 -7100415 1536418 6342441 7833389 8795701 10006151 10321426
9855 10321426 10129105 11674105 14584160 14388660 8763869 2282711 56028 -899484 -6898184
9846 -6898184 -14837525 -13209371 821660 13545952 10709523 -3908233 -14068449 -12501047
9838 -12501047 -7562786 -7899908 -9887109 -5627494 2923450 5862051 -426881 -8395898
9830 -8395898 -9732822 -4403762 3011664 9926103 14419041 12941188 6049469 2432706
9822 2432706 8782114 17731037 15609177 2236981 -7719882 -5561167 651244 1346097
9814 1346097 -55797 3121926 6563960 2871643 -2807999 1044756 13284827 20683462
9806 20683462 17457829 11823690 11287895 12711983 10484702 5148301 -85200 -3715329
9798 -3715329 -3600057 2420133 10431917 12134954 5929163 -178983 501825 6153529 12414599
9789 12414599 17763731 19781362 14274481 2873213 -5719442 -7037979 -6601814 -9315295
9781 -9315295 -10439410 -3941070 6129460 10369401 6442154 -99088 -4840241 -8288104
9773 -8288104 -11989048 -15437318 -16404086 -12677597 -5394053 -521793 -2557389 -6950274
9765 -6950274 -5384394 1170514 3378939 -1131103 -4048018 -1475566 -843954 -6623470
9757 -6623470 -11288782 -9118085 -7145316 -11592123 -14927865 -9672851 -4185877 -8608887
9749 -8608887 -14672919 -8798038 1898579 -718349 -13304520 -13227066 4281633 16531783
9741 16531783 9337382 -1302161 2472258 11163959 6466517 -6320981 -7522977 3306006
9733 3306006 6588826 -5261804 -16121776 -11251591 2509529 9430526 5668605 -1518394
9725 -1518394 -6960448 -10510142 -11144420 -6739660 866947 6252432 6570734 4429316 4196501
9716 4196501 6838529 8558510 4774617 -3427339 -7975865 -2306380 9059307 14195713
9708 14195713 8537550 824124 1082721 7733763 11838820 9985573 5953037 2164851
9700 2164851 -2210131 -5228886 -3230983 549979 -2452297 -12407025 -17843164 -11622711
9692 -11622711 -1649414 1600088 -206813 -757225 -3314113 -13787100 -24406936 -20375169
9684 -20375169 -2526548 12190261 15015763 14564038 17358107 15915612 5370838 -3039858
9676 -3039858 1691578 11541164 11352683 1650127 -5003694 -4605977 -3521517 -3184099 1548522
9667 1548522 9295465 11732328 7680029 4956995 6212119 4966606 -1516829 -7155052
9659 -7155052 -8621577 -10958414 -16971389 -21402395 -21060010 -20789018 -22938629 -20401024 -8164838
9650 -8164838 6184459 12349850 11266466 10000775 8220152 400845 -11140345 -16108353
9642 -16108353 -9966852 42053 4236959 263045 -7449294 -12973010 -12440392 -6416204
9634 -6416204 69225 2788234 3738875 8026230 15462147 19483557 15706349 7952770
9626 7952770 3484071 4491356 6791022 6000374 2722119 1105624 3426894 7298912
9618 7298912 8496427 5574083 616241 -3932640 -7331994 -9285302 -8639066 -4555495
9610 -4555495 1927283 8229582 11532227 9927953 3840164 -3281623 -7092084 -5839214
9602 -5839214 -1037226 4869965 9874943 11894499 9507596 4014102 -1006650 -2825585
9594 -2825585 -1037700 3555759 9158357 12365530 10596643 5929490 3602354 5637179
9586 5637179 8641503 8889320 6514071 3380678 294303 -1515303 438117 6047526
9578 6047526 10551333 9938663 6540872 5464401 6964908 6902607 4333104 3379503 5877510
9569 5877510 6974937 2022042 -5114811 -5996625 540301 6128409 4601304 730192
9561 730192 2279719 7000528 5185188 -5033434 -13304082 -11303198 -3970386 -459538
9553 -459538 290279 6264597 17389353 23571701 18831045 9172405 3306157 2253118
9545 2253118 2548854 4353434 10221771 18153675 21726746 17660703 9716222 4105275
9537 4105275 3241122 5085486 6928853 7659300 6493675 2301058 -3610406 -6193654 -2327104
9528 -2327104 3046515 2117660 -3725001 -4267437 3799652 9584998 3178875 -9015107
9520 -9015107 -13815653 -10895787 -10861680 -16120829 -17083577 -8787951 1328380 6134670 8124365
9511 8124365 10870441 11262252 6652115 1133672 -1949545 -5992420 -13045291 -17603127
9503 -17603127 -15841526 -13356497 -15301978 -16348166 -10509231 -4246769 -7681399 -17206188
9495 -17206188 -19895730 -13347110 -8176431 -10487825 -14434122 -14643670 -14334352 -16563688
9487 -16563688 -17484036 -14187788 -11104537 -12148121 -13156857 -9103946 -3690920 -4332441
9479 -4332441 -10747989 -15608148 -14909964 -11243308 -7262581 -2143707 4273845 8904990
9471 8904990 9423085 7585840 6239230 5531149 4590714 4712556 7328194 9942423 8470953
9462 8470953 4169049 3596779 9420385 15827047 17131723 16443164 19129759 21008469 12679168
9453 12679168 -4370288 -16703367 -17433757 -15236829 -18368527 -20031659 -10633370 2957750
9445 2957750 4975740 -4821036 -9276075 1369991 16396630 21882239 19035237 16231082
9437 16231082 12105682 -674573 -18324908 -25607656 -15169578 1828964 9331070 5058978
9429 5058978 -133215 1357051 4910536 2341369 -5759418 -10968723 -8769037 -4267208
9421 -4267208 -4564342 -9114872 -11030968 -6355547 1308088 5281792 2693494 -3177916
9413 -3177916 -6261513 -4092982 -1412431 -4946188 -13179800 -15348250 -4670916 10871201
9405 10871201 17065451 10944768 2838186 1533413 5284548 8915317 11362455 12136371
9397 12136371 7968396 -759511 -6175696 -2923847 2320571 -420068 -9097840 -12478495
9389 -12478495 -7623497 -4247191 -8920414 -14344307 -10218525 2026467 12490095 16262123
9381 16262123 16009887 13865631 9018458 3125902 353492 422793 -1727235 -7101223 -9941219
9372 -9941219 -7036396 -3151029 -2447889 -1117805 4291064 6873861 -2150141 -17457387
9364 -17457387 -23458476 -15157719 -4388101 -1835318 -3506026 -1535937 1322628 -1666993
9356 -1666993 -6428687 -2331897 10317460 18629905 14689716 4980142 -1158334 -3843352
9348 -3843352 -7995539 -13151728 -15002986 -13259996 -11174694 -9276660 -5943043 -3136345
9340 -3136345 -4847938 -9062262 -7800647 1785567 11359792 10791526 576582 -9536262
9332 -9536262 -12302460 -8653303 -2822955 2621400 6131313 6655869 5863958 6918504 9065229
9323 9065229 7705865 2340946 -556944 3244497 8369891 7419703 2063011 -462075
9315 -462075 812615 382525 -3246471 -5493773 -4600949 -4196456 -5517760 -5325785 -3558985
9306 -3558985 -4308010 -6326714 -2338855 7356077 10715328 1036779 -10645758 -10022680
9298 -10022680 418798 6630362 3477663 -1671525 -3364466 -4316413 -6868830 -8223244
9290 -8223244 -6169746 -2251342 1847010 4870875 3542787 -3317598 -8954199 -5020470
9282 -5020470 6282130 14532937 15410330 13616099 11262132 4241558 -6935184 -13349809
9274 -13349809 -10018859 -3356601 -771295 -777863 489162 618341 -3663781 -8335376 -7207502
9265 -7207502 -1216350 4149230 6934157 7768163 4699900 -3660793 -12325654 -14504683
9257 -14504683 -11018357 -9133422 -12612759 -17977572 -20113494 -17366609 -11839353 -8028830
9249 -8028830 -9656121 -14866369 -17157121 -14090422 -11006426 -11928087 -12093592 -6178150 938926
9240 938926 551844 -5895711 -9273955 -7615639 -7313472 -9020047 -4686455 7245748 15069082
9231 15069082 9448304 -2811670 -8842242 -6758631 -3694087 -2241035 719577 4489658
9223 4489658 4768183 3357558 7238720 15570817 17286482 6767300 -5822506 -7009679
9215 -7009679 2203960 9089851 7414773 4376799 8096750 15378966 16389948 8034807
9207 8034807 -2050102 -4513309 1681877 9114274 10473106 5975688 1768624 1697828
9199 1697828 2831636 441038 -4738359 -7362649 -4744999 447672 4918846 8075034
9191 8075034 9503476 7666813 3895878 3600490 9328875 15666274 16005666 12299300 12286786
9182 12286786 17711074 21543482 18199051 10943180 6413998 6024860 6155253 4002936
9174 4002936 -8925 -3807965 -5014071 -2265342 2526761 4732332 1882780 -3511818
9166 -3511818 -7863740 -11024612 -14086963 -14729661 -9086634 1773408 11158678 13985791
9158 13985791 12119328 10807596 11650092 11314604 6722135 -463853 -5329066 -4985616 -1345726
9149 -1345726 1700283 3063668 5146776 9781021 15222763 18353105 18495896 17085675
9141 17085675 14323199 9001353 2310501 -1089170 1752021 7331943 9147794 5666431
9133 5666431 1903817 2495977 6337768 9817015 12342195 15431565 18191392 17754557 14050841
9124 14050841 10655325 10213382 11495823 11370973 7679263 714681 -5530558 -4946064 3563464
9115 3563464 11408167 8673981 -2284367 -8333939 -2831890 5783266 6854247 1923885
9107 1923885 -313747 1960100 2892623 -748033 -6473167 -12004068 -17116558 -20093881
9099 -20093881 -18974314 -16243854 -16065200 -16763566 -12335325 -2112174 7079417 9794910
9091 9794910 8006036 7057612 9876324 15691195 20287016 17826988 7365520 -2912029
9083 -2912029 -3694874 3236286 6832107 1043729 -9034415 -15582067 -15602803 -9270406 1399333
9074 1399333 9973396 9305827 1229483 -3941666 -794337 4662843 5007161 1180265 -1621016
9065 -1621016 -1327083 2058811 8570883 14432250 12080433 -208448 -13348200 -17421948
9057 -17421948 -12854951 -7421056 -6310794 -9140569 -12414534 -11236305 -3281560 5638972
9049 5638972 5562348 -4680647 -14824228 -16851130 -13509915 -8998764 -1023294 10571941
9041 10571941 16849206 11503779 2035173 -1329262 -1040203 -5049752 -10587439 -8728920
9033 -8728920 -1262048 1160482 -3776237 -8035959 -7910140 -7477746 -6881445 -843132 8405874
9024 8405874 9771610 -154514 -10224017 -10379735 -5202621 -5523003 -13344833 -21045794
9016 -21045794 -21057805 -12421315 -1424822 2609213 -3534514 -11948303 -12964930 -7943803
9008 -7943803 -5180022 -5284436 -1498788 5914329 8548595 5163326 4493181 8615951 7817819
8999 7817819 -1188429 -6443546 -82896 7111367 3544514 -2700274 2553326 14329535
8991 14329535 15750408 6378886 3485752 13725559 22003337 14898815 505261 -4289708
8983 -4289708 3748556 14060446 18127897 16273217 11965170 7415174 4465064 4375255
8975 4375255 5883952 6212812 4316574 1890553 1629886 4995612 10486328 13889505 12072015
8966 12072015 6791666 2587176 772429 -1409127 -4864508 -5759619 -1366925 3923667
8958 3923667 2666223 -5683720 -12303753 -8218749 5467720 18460681 22357295 19114440
8950 19114440 17182085 20418116 23716110 20365943 10697829 728202 -5598837 -8525860
8942 -8525860 -7404281 671920 13886289 21737950 14626186 -2650790 -13290650 -7702866
8934 -7702866 4129567 4675398 -9367388 -23956269 -26073048 -17634274 -8351873 -2127336
8926 -2127336 3234787 7787047 9052366 8245030 9456472 12489347 12879964 9878944 8598793
8917 8598793 12695738 19618354 24286583 23423719 16377324 6683847 2121048 6538451
8909 6538451 11997979 7426151 -4309546 -8355811 243360 8484896 5696358 79146
8901 79146 4270922 13836239 14187525 3781834 -4388597 -3242356 343408 -404575 -2444102
8892 -2444102 -1301942 824982 416834 -1430995 -3057607 -6042464 -10757267 -13401399
8884 -13401399 -11343110 -7175081 -4722841 -5118334 -8248740 -12774881 -13414380 -4956600
8876 -4956600 8538401 15551031 11446907 4006161 861009 -691578 -5788436 -11710079
8868 -11710079 -13104279 -11200422 -9372249 -4774868 6074657 16991884 17487745 7140838
8860 7140838 -4107087 -9050439 -8457468 -4550485 1551228 5808543 3575187 -3031140
8852 -3031140 -7739548 -9975583 -13370053 -14944693 -7129455 7535862 15773133 11996972
8844 11996972 5908115 6098132 7940422 5488690 3352585 5941429 5815311 -3481755
8836 -3481755 -11598287 -4412734 12525030 20432045 14417715 6867491 4432679 575155
8828 575155 -5663078 -2825445 12387089 24082177 18434095 3311489 -5739965 -8201455
8820 -8201455 -13030706 -18820043 -15986737 -5517161 -177880 -6224337 -15842471 -19511570
8812 -19511570 -16099089 -8814428 153646 8248155 12374236 12338231 9896312 4602023
8804 4602023 -3982879 -11049009 -10358249 -3088313 3662381 6627871 7722565 6837334 2018316
8795 2018316 -3087628 -1506425 5622109 9130960 5850526 3063926 5362636 6952244
8787 6952244 2717418 -2315121 -2247613 -1293473 -6138193 -12595098 -10045900 2706508 14807175
8778 14807175 16788582 10133400 2793225 335094 2729550 6404967 8015177 7231007
8770 7231007 5724077 3759515 478923 -2133876 114446 7093460 12686849 12393690
8762 12393690 8782509 6690462 7020610 8139137 9059315 8103955 3172698 -3099882 -3785292
8753 -3785292 2250094 6249197 1306863 -6937742 -8213473 -1943431 3947231 5335344
8745 5335344 4944640 4960267 4576988 4463580 6580871 9165936 7775418 1939176 -3730641
8736 -3730641 -5123444 -1994787 2859145 4683388 -62824 -7897251 -9684841 -2379291
8728 -2379291 5494508 5557879 716988 -2384641 -4599190 -7960565 -5761187 7160597
8720 7160597 19792782 17300793 5193192 2470726 10546917 10119774 -5766811 -17257894
8712 -17257894 -7862414 9480073 12462460 1531976 -6061015 -4514246 -2410732 -2470880
8704 -2470880 2240448 11585000 14563420 6289531 -3631413 -4491660 2769064 10308522
8696 10308522 13562972 12712995 9445544 5848019 3436251 1859998 911018 2640881
8688 2640881 7717223 11702898 10254724 6307579 5940220 8414570 7409572 1939813
8680 1939813 -1432422 1359853 6228864 7392247 3957066 -2036958 -9128461 -15500306
8672 -15500306 -18361068 -16424133 -10627455 -2187455 7139784 13857862 16014041 16631387
8664 16631387 18887282 19212347 11712148 -949660 -8527657 -6164615 684545 5891671
8656 5891671 9837028 14156631 16260263 13138661 5638306 -3835922 -12898859 -17107947
8648 -17107947 -13352280 -7481797 -10014605 -20240705 -23825802 -12649269 1826293 3863410
8640 3863410 -5113545 -10927270 -7396197 -1188427 1438374 1219207 -620248 -4972458
8632 -4972458 -9460647 -9264915 -5177049 -3059037 -3765439 -1734530 4107416 6417839 472604
8623 472604 -7880111 -10110090 -5442330 973339 5364748 6325980 3047165 -2478904 -4917583
8614 -4917583 -1916105 1752181 348390 -5360913 -10682734 -13934695 -16221548 -16885644
8606 -16885644 -14315925 -9889566 -6535663 -4449600 -2390601 -1850311 -5027623 -9201211
8598 -9201211 -8289474 -955831 6865823 8783634 4268090 -2639542 -8018668 -10461499
8590 -10461499 -11080551 -11903770 -12738293 -10384422 -3667446 1920480 -684782 -9770167 -14686169
8581 -14686169 -8722189 1776638 4840704 -3030238 -13942958 -18364948 -14223191 -6871857
8573 -6871857 -3367475 -7027080 -14874473 -19707863 -16679796 -8370504 -1573352 971629
8565 971629 2804179 6782366 9544934 6296350 -1262055 -6836110 -9165467 -13832917
8557 -13832917 -22713653 -27146466 -17988105 -144810 10584708 6473492 -3034132 -4705458
8549 -4705458 1598319 5116119 -59474 -8150928 -10237683 -3995168 6112864 13954382
8541 13954382 15526472 11182827 5864420 4543440 6146434 4472644 -3754521 -14357737
8533 -14357737 -20394085 -18755424 -11056027 -1354557 4871597 2885151 -6369875 -14929969
8525 -14929969 -14826282 -6267317 3166388 6817375 4579477 1080041 395284 2530588
8517 2530588 3971501 1906315 -2105704 -4336510 -4763061 -7320453 -12798083 -15737570
8509 -15737570 -12071094 -6104512 -4419247 -5308943 -1192826 8880353 16522559 15659903
8501 15659903 10236338 6866949 5674744 3391559 989333 1910044 5047864 5745686
8493 5745686 3174692 1243851 1925515 2641652 1236800 -816246 -1486555 -621353 1874030
8484 1874030 6223993 9657127 7715707 1341257 -1895122 2438997 8575854 8180571
8476 8180571 1886541 -2677819 -2305606 -1002137 -2016451 -3938111 -5365131 -6712098
8468 -6712098 -5932264 443659 9337941 11606166 4831080 -1511628 453825 5382737
8460 5382737 4661460 1617753 5530597 13842442 13534242 1290164 -10059781 -9536849
8452 -9536849 -2116576 1195420 -1132166 -2960103 -1552401 758930 1838244 275619
8444 275619 -5404075 -12206093 -12150889 -3330133 3442169 -1895664 -12185905 -11038108 3700251
8435 3700251 16131385 14221519 4717852 1053615 5109510 8280688 5302544 -435028
8427 -435028 -3292389 -1679189 1505571 2110620 -320414 -113603 8416387 21327997 27006335
8418 27006335 20632037 10777019 7057753 7459769 4947964 1247505 3969650 12065466
8410 12065466 15094207 8772363 1732634 2656024 8314244 9937736 5685573 376190
8402 376190 -3294814 -6363338 -8140932 -5719158 520615 5676115 5932571 2570514 -159750
8393 -159750 936755 5479042 8490126 3394063 -9921269 -21184378 -19559752 -7893089
8385 -7893089 -844646 -6541251 -16642740 -19001234 -13723539 -9358636 -7891809 -3628385
8377 -3628385 3871197 6293343 -795590 -10202165 -13079544 -10365011 -8468679 -8580097
8369 -8580097 -7226376 -4508918 -4451939 -7651183 -9655493 -7408332 -2905845 93576 -513414
8360 -513414 -4810531 -10107654 -10845652 -3418837 8709914 18431046 23130925 25048568
8352 25048568 24192982 17223099 4993077 -4717515 -5440973 818922 7268922 9586409
8344 9586409 7303063 1945613 -3445585 -6378629 -8656922 -14116204 -20855309 -21428916
8336 -21428916 -14038755 -6929259 -6099657 -5081546 4821858 18826455 23405739 15040208
8328 15040208 3980273 -1287850 -3374373 -7097999 -10609384 -10658899 -9681370 -11248649
8320 -11248649 -12985950 -10123199 -3351448 2092579 3348866 1716871 -518900 -841170
8312 -841170 3915119 13558757 20731059 16536003 1738360 -11269543 -10445715 3057218
8304 3057218 15792731 15732951 4173052 -6655393 -7437974 -1323194 1774940 -1915411
8296 -1915411 -6822097 -6967948 -2568457 3918515 12456740 21781319 25706763 19617661
8288 19617661 8791413 3615985 6294542 8417677 3568549 -3227492 -2571645 6258558
8280 6258558 14237561 13813798 6916077 604245 -1871494 -2553774 -2876016 -913725 3773000
8271 3773000 6566049 3272291 -3093412 -6359550 -6924387 -10550850 -16649427 -16100264 -4984310
8262 -4984310 7290855 10655941 8911962 12314495 19872861 20433641 10746288 965378
8254 965378 -484898 2420050 2160236 -1292728 -3937868 -5351564 -6535554 -5511047 -1349511
8245 -1349511 1783798 790325 -173424 3727819 8797076 7788055 1980087 164859 5743350
8236 5743350 12462669 14469450 13890547 15491912 18971015 20443932 18640455 16037871
8228 16037871 14945677 14940682 14164411 11880264 8959640 5667640 456532 -6389174 -8699375
8219 -8699375 601290 18144455 29439560 24730784 11193450 2794963 1742751 -1102478
8211 -1102478 -8883120 -12625596 -5440129 6155727 10847223 6791437 1585929 1579666 6258250
8202 6258250 11089697 12013485 8589595 5122839 6509373 11241470 12024362 5711073 -1660080
8193 -1660080 -3388217 -1368987 -1739614 -4790785 -5560228 -2523381 922832 2886276 4197294
8184 4197294 3147472 -3521986 -12399524 -13738928 -4476883 5459107 6101918 1564839
8176 1564839 2952013 10456894 13314698 8202338 5820534 13383478 20868837 14996635
8168 14996635 155115 -7645133 -5025589 -4837330 -13562701 -20002064 -13741834 -2248388
8160 -2248388 1541108 -640659 2013331 9458386 11006333 3574570 -4177290 -6787974
8152 -6787974 -8259161 -10836568 -9694686 -3445576 644578 -2242722 -6900771 -7252004
8144 -7252004 -4944737 -3074215 592227 7446928 12388332 11437876 8546600 7951608 6566170
8135 6566170 1601558 -1360881 2699858 7502611 4536648 -1902439 -872209 6661145
8127 6661145 8224297 -940583 -10926766 -11941200 -6031407 -605426 1290577 202084
8119 202084 -3233065 -6716041 -6468648 -2592812 -20892 -1508590 -3879484 -3632066 -2253663
8110 -2253663 -3382943 -7697720 -12426218 -13677402 -9194327 -1849161 670148 -5520919
8102 -5520919 -12947242 -10065865 3353491 14772395 14570274 6679014 777772 248415
8094 248415 2242148 4583205 7047890 8338363 6386855 813519 -7190851 -15847826
8086 -15847826 -22235220 -23355402 -19691233 -15381703 -13170025 -11499947 -8059845 -3567164
8078 -3567164 -287200 912871 451111 -1009555 -2362359 -2800515 -3289209 -4879293 -5407737
8069 -5407737 -1288851 6477507 11554139 9334890 2389819 -2613653 -1779198 2797616
8061 2797616 5194613 1416228 -5514839 -7894828 -2922740 3168004 4280139 3480462
8053 3480462 6337963 9235622 4141776 -6311289 -9804078 -2182946 6493003 7517468
8045 7517468 4742921 4529040 4171662 -1567017 -9631902 -13112851 -11625728 -9367521 -6845807
8036 -6845807 -2250834 2028554 1751586 -2179538 -5380337 -6914697 -8981988 -11537572
8028 -11537572 -12482610 -11388805 -8348788 -1643225 8376666 15783455 15174114 9273441
8020 9273441 5045119 4259004 3420995 1031925 -1050619 -2074107 -2466227 -650132 4551953
8011 4551953 9281260 7990027 925837 -6587234 -11295281 -13490922 -12951224 -9390771
8003 -9390771 -6137299 -7204397 -10820275 -11662103 -9425874 -9050247 -11910799 -13034946 -8666351
7994 -8666351 -1214228 5180057 9257378 10905917 9152406 4284805 -934473 -3672016
7986 -3672016 -2525433 2829732 9803393 11587667 3451613 -8719365 -12262374 -2977233
7978 -2977233 8614004 10217926 2836225 -2280116 677664 5485463 3464080 -5515808
7970 -5515808 -14441027 -18298059 -17574686 -13887463 -7510714 -815794 1219374 -1777533
7962 -1777533 -2224246 5236182 13399118 10603149 -2264564 -12509552 -13717094 -12095239
7954 -12095239 -12186901 -8661257 1333762 9347253 8419732 4805989 6398406 8689934 4713812
7945 4713812 534850 5687530 14309118 12806937 3026282 -296431 5157225 5305407
7937 5305407 -5603799 -14321881 -9866442 -29368 2816516 88691 911307 6951306
7929 6951306 13084582 16337125 16144529 11839090 6365968 5828413 9472807 7994016 -1539932
7920 -1539932 -7782996 -960005 10926081 12187438 750186 -10855245 -12844412 -7420627
7912 -7420627 -2198532 -1784994 -5225362 -7184219 -3701810 484575 -4341488 -18080243
7904 -18080243 -27241634 -22411482 -11368499 -6198038 -5032894 1818426 13052809 17206303
7896 17206303 10703664 2608024 429352 1593084 912006 -2077891 -5531286 -8469506
7888 -8469506 -9930395 -9631522 -8977704 -7156619 549738 14488829 25097046 24021359
7880 24021359 16516835 12705435 10981957 3196175 -6704602 -5449564 7252878 15851890
7872 15851890 12629096 8078922 10700314 12240735 3733268 -7403822 -9760987 -7011514
7864 -7011514 -9817374 -16118810 -15250108 -7666708 -4677493 -8909799 -9817572 -1519702 7487592
7855 7487592 7828605 3069225 3485296 11669919 20146472 20666704 12446474 2790416 696245
7846 696245 7823840 16160232 17560542 14042575 13737764 18122184 20509102 17770553 15280088
7837 15280088 16805497 17067753 10242406 341440 -4025795 -2077804 -647611 -2581595
7829 -2581595 -2677453 3140532 10387810 11492839 5841403 544303 1552531 6753918 9224316
7820 9224316 6184036 2366360 3458142 8450367 11655093 11146769 10309842 10227350 6515241
7811 6515241 -2609913 -10507272 -10330106 -5104927 -2251374 -1144953 4118520 10493358
7803 10493358 6826367 -7352074 -16128205 -8743034 3180629 1898881 -9905033 -13693258
7795 -13693258 -3732711 5018616 618814 -9221222 -11565941 -7171761 -4668340 -4485865
7787 -4485865 -518748 6782487 10401819 8155499 4468969 1688491 -1376154 -2667154
7779 -2667154 2035684 10197733 13528424 10064128 7090251 9182350 11420418 8725315
7771 8725315 4588020 4796374 7934721 7991887 2747659 -5097898 -11704143 -13230886 -7415083
7762 -7415083 1946212 6510857 3526255 -555221 -971570 -2522413 -9815688 -16512306
7754 -16512306 -14208803 -7185072 -6549257 -12026551 -12201325 -3251346 5141649 5440913 2140179
7745 2140179 1362581 1216454 -1295640 -3004251 -1215137 411132 -270756 1879898 9081197
7736 9081197 12616951 5264384 -4850241 -4730371 3750591 7633926 3970695 2901241
7728 2901241 8698465 11807754 4655489 -6152275 -10247988 -7368086 -3568292 -515067
7720 -515067 3506573 6449190 4228917 -2274183 -7903880 -9840107 -8968941 -5843659 71606
7711 71606 6834602 9190754 3217410 -8480617 -17223792 -15996513 -7821018 -3326400
7703 -3326400 -7163855 -11202953 -6939911 145968 -1526479 -10165991 -12148653 -4103298
7695 -4103298 1119161 -4121003 -9310281 -3852737 4537554 2478907 -7515342 -12632966
7687 -12632966 -10186988 -7024555 -2926269 8640321 23733600 28071949 17101017 2792476
7679 2792476 -3418885 -3025437 -1894072 -397121 2630591 5251710 7111770 11388240
7671 11388240 17930258 21462881 19739375 16118474 11792164 4264014 -3802920 -4441173
7663 -4441173 2687373 7474261 4679566 1537213 3692006 4556851 -2582476 -11693715
7655 -11693715 -13356951 -8798387 -4432566 -372058 4519588 3882065 -6596304 -16607415
7647 -16607415 -12434886 2374911 11175199 7321661 -20373 -2269296 -293080 3778930
7639 3778930 10654862 17359150 17917100 13280377 10577416 10658106 6814427 -2364666 -10134009
7630 -10134009 -13837174 -17823375 -20858031 -14184254 1801274 12197538 7646942 -1766853
7622 -1766853 -2446999 3689810 7582142 10284948 17250460 22486958 15246697 172617
7614 172617 -5576056 3016997 11485989 7649659 -1655795 -2753879 5053236 10561226
7606 10561226 6683032 -2663066 -10054870 -12519762 -11254975 -7699484 -2465732 2757708
7598 2757708 4617958 1411945 -3311661 -3291905 2879554 9152494 8832634 1611379 -8047920
7589 -8047920 -16313516 -21057951 -21065881 -17876703 -15372967 -14209737 -10809022 -5627301 -5989434
7580 -5989434 -13853842 -17567354 -6552115 10463813 14991145 4496033 -5826568 -7132581
7572 -7132581 -6467359 -8439338 -4831058 8190674 17738259 12223940 271464 -2560769
7564 -2560769 3254894 6729783 7201542 12334041 19671279 18384301 8718297 2458528
7556 2458528 2714192 107221 -7777013 -10255273 -2913532 2936411 -1142591 -6692513
7548 -6692513 -3221476 4960530 7984020 6245657 5349563 4123831 -395774 -3916678
7540 -3916678 -2854625 -3595557 -10859356 -14686276 -4477522 10373714 11762743 1186947
7532 1186947 -2642468 5776984 11225417 4823952 -1462443 3582580 11618767 10087746
7524 10087746 3125154 2996336 9786658 13789090 12354312 11070302 11442280 9475606
7516 9475606 5125767 2679322 2263884 235503 -2368908 -919685 2871631 1386176
7508 1386176 -6330502 -10905646 -5693121 3019248 4070711 -4395642 -13960590 -16968892
7500 -16968892 -13755001 -9143168 -5807472 -2966791 168728 2154944 989105 -3384399
7492 -3384399 -9254457 -14834973 -18535634 -18711494 -15238941 -10774762 -8305465 -7801959 -7128550
7483 -7128550 -5236552 -2301304 1456489 4034710 1422441 -6059219 -9899668 -2917603
7475 -2917603 8734966 11364321 1610519 -10328521 -16173405 -17835396 -17515597 -11475249
7467 -11475249 -102675 6747568 3521916 -998527 2394608 7664055 3971829 -4872403
7459 -4872403 -5917500 1406734 4612590 -970188 -5726527 -3652056 -2809653 -10640281
7451 -10640281 -19525298 -16876061 -3903813 5234309 1661072 -8026948 -11095765 -4011744
7443 -4011744 4395908 4478210 -2418955 -6762403 -4408299 -1541362 -3759503 -6865802 -4467096
7434 -4467096 521361 207326 -5376239 -8486373 -5708338 -1312944 1264907 2869610
7426 2869610 2824517 -1771173 -8875695 -11587988 -8554195 -7336026 -13520100 -22175169 -24354330
7417 -24354330 -17995192 -8800857 -3329775 -3820694 -7524749 -9631448 -8489284 -7406564
7409 -7406564 -9054216 -10530979 -8103088 -3804737 -1561275 -81065 2884231 2718071
7401 2718071 -5489860 -14727776 -12599819 -270611 8013920 6396124 4632553 9199167
7393 9199167 11193881 1511082 -13373708 -20671380 -17640700 -9571086 364409 9661115
7385 9661115 12375582 6777376 1238741 2955443 6669430 4221507 -1108963 -1019664 2740466
7376 2740466 2477910 -163085 3228727 11419153 13439179 6213448 20652 3219987
7368 3219987 11496006 15766936 12768900 5187219 -1436779 -375019 9907713 19726436
7360 19726436 17191024 5136489 -526531 7233397 16317630 13116851 1332159 -5282699
7352 -5282699 -2638714 1015884 -584602 -3975056 -3344838 882438 3327957 255151
7344 255151 -7007664 -13891972 -16849006 -15935394 -13209738 -9518889 -4634988 40102 1918064
7335 1918064 975836 244912 1500316 3092567 3391059 3840488 6660887 11175168 14290882
7326 14290882 14036204 11759387 10999911 13683294 16922109 15427267 8729082 3300329
7318 3300329 4293213 8215941 8958199 8196886 11932357 17617654 14834287 1773422 -8676462
7309 -8676462 -5733161 3970008 6203850 -1069839 -7391413 -6587984 -3561888 -3712769 -4830318
7300 -4830318 -2704203 2144925 7174719 11784585 14603571 11803135 3187001 -3744167
7292 -3744167 -1721092 6179054 10165471 6892604 3078421 4964498 9890510 11518262
7284 11518262 9116275 6962451 6675072 5364691 1757730 -272199 3278535 10253588
7276 10253588 13935140 10799250 4777020 2886500 7301090 12845043 12637989 5335660
7268 5335660 -4050956 -9578462 -8861829 -2864701 5644043 12474224 13990129 10932412
7260 10932412 7929919 7043787 4758012 -1451618 -7046233 -6195725 -1106473 1292942
7252 1292942 989129 4999440 14594279 21272901 19673924 16215391 17872847 19110033
7244 19110033 9871696 -6698326 -15576083 -9905448 -154636 607342 -6873752 -12060362
7236 -12060362 -10010100 -5628589 -4252257 -4944690 -4824210 -4959307 -8097078 -12871684 -14712497
7227 -14712497 -12565729 -10456268 -10257272 -6709080 5644739 21992897 29479023 21481181
7219 21481181 5354391 -6495400 -9542583 -7933176 -5770948 -2833381 1547335 4933099
7211 4933099 4048218 -986996 -5935896 -6030375 -650315 5698210 8246331 7490084 7671253
7202 7671253 10000164 11061321 8896351 6281117 5501394 4133435 -345901 -5563428
7194 -5563428 -8294035 -9992223 -12852982 -13352182 -6571855 4396814 10706500 9756539
7186 9756539 7916161 9770897 11729995 9693493 6834191 8521205 13599182 16374223
7178 16374223 15033649 12671959 10882927 7704781 2736831 -317123 1359840 5110807
7170 5110807 6222153 4417240 3597835 5113175 4708368 -1818110 -12045561 -18942655
7162 -18942655 -18806419 -14356733 -9785121 -5669690 -62345 7538865 14846463 18172776
7154 18172776 14635553 4975191 -5147931 -9223338 -6638719 -3119484 -3325679 -6014927
7146 -6014927 -8286471 -10856175 -15482855 -19747958 -18791291 -11439022 -1354428 7034702
7138 7034702 10794023 7930707 -1527982 -13646162 -22556185 -24936637 -21359981 -14249730
7130 -14249730 -6434114 -555337 2508040 4179374 5818558 7318648 9433927 14764266
7122 14764266 23610746 31282107 33087176 30215265 27060566 24432543 19488287 11251017
7114 11251017 2166446 -5093411 -8869981 -7915906 -3636229 -1521822 -5352298 -10622789
7106 -10622789 -9226143 -1087731 4458650 778278 -7264048 -9498593 -2417353 7854892
7098 7854892 12877728 9976361 3666724 420715 2437295 6831149 10136839 11048563
7090 11048563 8417004 999298 -7811134 -9392861 376493 13095253 15703121 5873918
7082 5873918 -6084590 -10893831 -10053696 -10231875 -13073737 -14292140 -10609070 -4259138
7074 -4259138 -307927 -679391 -1937814 152250 4903981 8023834 7906385 6519628 4115669
7065 4115669 -1073902 -6479667 -5519521 2497241 9828632 11617401 11787876 12668143 8634093
7056 8634093 -1737059 -7408562 -499588 8667427 6281260 -2616916 -3063085 4174033
7048 4174033 5036430 -2315571 -5381364 -1788869 -4167503 -15426069 -20420825 -11386652
7040 -11386652 -2126404 -4600575 -8708430 -508777 13275965 15484571 3559964 -10751486
7032 -10751486 -18973998 -19555316 -11657322 860497 6161932 -1027392 -8003570 -1127842
7024 -1127842 12301314 14700305 5153979 -1510270 581381 2553095 -642430 -3342051
7016 -3342051 -2965966 -4391709 -6914602 -2337123 8619052 12607001 3650638 -6115497
7008 -6115497 -4613951 2250582 1253563 -7781856 -13572747 -10809930 -5709589 -5549533 -10512242
6999 -10512242 -16018800 -17754514 -13994145 -6606594 -274965 1258672 -1490762 -4388171
6991 -4388171 -3029364 3538933 10668725 11430070 5062757 -260573 2306448 7864283
6983 7864283 6357323 -2060125 -6937528 -3305199 1969115 2526576 1858497 4973200 9034974
6974 9034974 9715246 10313246 15512195 20258517 15100282 1858265 -5784329 33924
6966 33924 10633609 12433897 4354194 -2382323 -28309 6235539 6328365 -1640790 -10365619
6957 -10365619 -13691564 -13043705 -12540592 -12233281 -9525890 -4475319 509479 5038028 10768924
6948 10768924 17222173 21068659 20038864 14814514 6870544 -2701210 -11678911 -16739334
6940 -16739334 -16315791 -12111429 -7228708 -3731612 -1973079 -1413914 -2172421 -5477011 -10903142
6931 -10903142 -13648768 -8532307 2041127 8801999 7070473 2575255 1856232 2366581
6923 2366581 -1538018 -7433221 -8021056 -2912066 1621102 3730989 7932316 15337803
6915 15337803 20359748 19018293 13368436 6025549 -2469740 -8970964 -8190326 -1043475
6907 -1043475 4461474 4274908 3599885 7036242 9952852 5258689 -5859686 -15316861
6899 -15316861 -17164077 -11447500 -2408774 3814858 3301651 -547614 546445 9517092
6891 9517092 20150705 25800240 26590116 24725932 18867555 8512860 -1315779 -6319712
6883 -6319712 -10060862 -18089367 -27594518 -29900630 -22326556 -11481305 -4698020 -2956079
6875 -2956079 -2522976 187067 5650947 10555337 10714235 6723863 4833335 9415877 16624235
6866 16624235 18832122 13679572 5511442 -388027 -1639155 1399047 5946790 7927148
6858 7927148 5728929 1943406 -543103 -2054198 -3641011 -4237400 -3403285 -3759066 -6941084
6849 -6941084 -10144912 -10811169 -11521789 -15119669 -17792436 -13258155 -2466760 7051924
6841 7051924 11240484 13172198 16113890 18123076 15243135 6754839 -3902032 -11321904
6833 -11321904 -11430843 -4871921 3315779 8845478 11207060 10324919 4454118 -5083658
6825 -5083658 -11655230 -11246777 -8709060 -9735860 -10684624 -4808204 4366161 6361220 130879
6816 130879 -3702777 736829 5962375 3211923 -5341606 -11891828 -13696215 -12706142 -9895132
6807 -9895132 -5754883 -2616577 -1652195 -769437 987120 979846 -1628921 -2896369 -787584
6798 -787584 224824 -3394631 -6951799 -4263789 1935928 3694591 -45561 -2344399
6790 -2344399 1041206 6188515 6946053 1571261 -7068735 -14117916 -15670736 -12504602
6782 -12504602 -10060468 -11433427 -12470810 -8330631 -2352983 -1926438 -6917319 -9799385
6774 -9799385 -7503634 -5130097 -6063238 -6621685 -4463785 -4698794 -11368551 -18365144 -16296692
6765 -16296692 -5575516 4351371 7718248 8000596 10460099 14705159 16522623 13444251
6757 13444251 6455364 -1725665 -8518150 -12652983 -14224417 -13374799 -9726231 -3921237
6749 -3921237 1627763 4916356 5971693 5187421 2357493 -834442 -583210 3431346 5362266
6740 5362266 857901 -5350341 -5652795 -1215678 514912 -654291 3534650 14887932
6732 14887932 22760921 19071283 10894285 9790444 15166620 18231506 17797876 20308009
6724 20308009 25699804 25640534 17694201 9970671 7702917 5607115 -373166 -3297037
6716 -3297037 3874232 14454546 15677695 6843983 -515586 90944 2520618 -299171
6708 -299171 -5340335 -4595409 3702952 13260402 16675879 11652671 2312465 -4032282 -3465251
6699 -3465251 114896 -519666 -6473277 -11137866 -9266654 -3554049 584751 3023620
6691 3023620 7263151 12943485 15364915 12695635 8992686 8075864 7723949 3102607 -5471603
6682 -5471603 -11550195 -9924124 -2770498 2908527 2717389 -1765435 -6031031 -6743835 -2848107
6673 -2848107 4707015 12809314 17342827 16231375 10830152 3993720 -1557869 -2826019
6665 -2826019 1829496 8453814 8822522 300990 -8598788 -8144917 -859308 2036993 -2651165
6656 -2651165 -5287083 1973146 13506449 18372127 14223215 6856937 428970 -4643435
6648 -4643435 -6811202 -4239447 -30218 236515 -3212064 -4339822 -435040 4206536
6640 4206536 4892563 1661004 -3436833 -8759189 -11094521 -7141488 203989 2810431
6632 2810431 -1558141 -4700078 174485 7277140 6237223 -2171747 -7081841 -3700684
6624 -3700684 421245 -2438516 -9399392 -12953038 -12138425 -11707399 -13007035 -12051931 -6728674
6615 -6728674 -819143 1156632 38690 314249 3523571 5975133 3521199 -3101430
6607 -3101430 -9033685 -10547841 -7839664 -2993615 2210063 5567348 4506197 -387678
6599 -387678 -3807030 -1253779 4607440 6804331 3151624 -1532304 -2939924 -2430277 -2518992
6590 -2518992 -1613610 2777888 8489075 11034595 10208570 9851006 11323786 11537854 8181188
6581 8181188 3107549 -813129 -2912515 -3090537 -141409 5643831 10511752 11028648 8615531
6572 8615531 7340727 7931108 7218057 3680080 255306 301056 3254129 6113524 7312529
6563 7312529 7054062 5515264 3484853 3629152 7562135 11753118 10495321 4391326 1620678
6554 1620678 7271846 14711757 12929051 1336953 -8730003 -8397728 -1379845 3346290
6546 3346290 3696723 3591434 3102848 -2689685 -14061775 -22670521 -21093368 -12192403 -4791930
6537 -4791930 -3180891 -5777395 -11501723 -20231972 -26742735 -22361332 -6940526 6994169
6529 6994169 8376214 1651653 -891883 2028973 -430401 -12744345 -24047226 -22761948
6521 -22761948 -11712559 -1519906 4273097 8682207 11060989 8081795 2695966 1267043
6513 1267043 1978469 -2962850 -12231660 -14318302 -5763613 1128976 -3728859 -12423667
6505 -12423667 -11278640 -1571027 3737888 -8502 -4449603 -2715443 2089134 4213625
6497 4213625 2303024 -2546948 -8073950 -8847814 -1037168 8860543 8612252 -2942779
6489 -2942779 -12023676 -7880404 3203320 8638692 7219392 6846321 9126952 7310572
6481 7310572 -652582 -7105742 -5914185 -1299276 -932609 -5281585 -8976734 -9829578 -11018309
6472 -11018309 -14652928 -17685307 -16129164 -11203621 -8650959 -11317026 -13898376 -7721797
6464 -7721797 7949137 21780752 21292686 7551256 -5509348 -7716385 -3471869 -2389834
6456 -2389834 -4644068 -3349641 1162067 96765 -8277218 -11987331 -1341186 15639664
6448 15639664 23284291 19741793 17625627 23901267 30163272 26063092 13299821 1038798
6440 1038798 -5812087 -7967220 -6657924 -3549837 -2619496 -6295446 -11197045 -11823196 -7034362
6431 -7034362 -18324 5753331 7750601 4764485 -590232 -2877582 -669143 1022861
6423 1022861 -1635028 -5567978 -6694092 -6606933 -7955547 -7902516 -2960856 3319144 4696576
6414 4696576 1597000 -661440 -363279 517491 1508006 1598536 -4247252 -17547436 -28323523
6405 -28323523 -25167682 -12041217 -4455705 -8950279 -16678096 -17920449 -12470443 -4218470
6397 -4218470 4121017 8577707 5972870 733994 461520 3381118 610803 -7850641
6389 -7850641 -11692833 -7442295 -3668165 -4742391 -3525765 3186189 6071807 -819927
6381 -819927 -8426138 -7274125 -2069049 -742670 -260205 4506235 8524281 6603755 5508121
6372 5508121 11484642 15545688 7966326 -1309426 3728686 17279729 18970386 6487883
6364 6487883 -1438995 3666798 7986225 977653 -7124093 -3974081 4410765 4337752 -5047228
6355 -5047228 -13564130 -15320353 -12671369 -9732858 -9074864 -10956959 -11372598 -5581942 3577087
6346 3577087 7425174 4275230 2451831 6494081 9156344 3340276 -5616839 -7077530
6338 -7077530 614703 9567816 12217243 6665095 -4132763 -14251481 -19099228 -20213761
6330 -20213761 -21771888 -22200767 -16674223 -8616490 -8146988 -15652208 -18625896 -10971736
6322 -10971736 -3270369 -4799794 -7499659 -840246 7453226 2174596 -13557936 -21030251
6314 -21030251 -13389251 -3647757 -3131617 -7493830 -9461347 -11702925 -18328971 -23595833
6306 -23595833 -19478765 -9337990 -4707656 -9935677 -16676160 -14027363 -589863 13763368
6298 13763368 16808217 5836478 -8638929 -13081320 -5305061 4283120 6307435 2804633
6290 2804633 1582009 4689499 7505020 7340222 7220688 9763586 11392836 6168283 -5627016
6281 -5627016 -16039998 -17788573 -11961355 -5433990 -2324354 -1242055 -157846 648364
6273 648364 1657171 5412930 11786085 15753520 13858281 10023542 10449477 14585083 15730848
6264 15730848 9648297 -1437979 -12443156 -19093200 -19147689 -14348439 -10405383 -10664811
6256 -10664811 -10635885 -3731141 8204528 15810791 13869544 6248208 -1323415 -6833227
6248 -6833227 -8871874 -5384851 866990 2437321 -2187148 -4161402 3304227 13462588
6240 13462588 14802719 7468807 1712640 1548836 39681 -7442018 -14448290 -12615005
6232 -12615005 -3360168 4614533 5407652 -733441 -10414941 -18872022 -21417454 -17467527
6224 -17467527 -11532732 -7389900 -4005778 81 2370912 2508431 5882789 15607182
6216 15607182 23126714 17117444 776560 -10455756 -10002169 -7756723 -12297224 -17109539
6208 -17109539 -13184565 -5889012 -7019278 -15023654 -16246774 -5340877 7084199 9333433
6200 9333433 2014344 -6358781 -9596224 -6511864 47294 3460041 -1604266 -10903772
6192 -10903772 -12679132 -1769345 12863193 18470156 12366806 1937248 -4984742 -5333777
6184 -5333777 213010 8254119 13637696 13000114 7318298 4463 -5810715 -7719503
6176 -7719503 -5140591 -1177892 196646 -91968 2295796 6573247 5702063 -3066084 -12451736
6167 -12451736 -14653731 -11501780 -9667870 -10314257 -10013060 -8576167 -8779303 -9847956 -7841025
6158 -7841025 -2388208 2032049 1657469 -3000066 -7963854 -7579915 1266796 13097846
6150 13097846 16431591 7754438 -1797491 -639754 7254327 9692458 5238831 2672550
6142 2672550 3434753 -669525 -9724274 -10662559 2473417 15574750 12550148 -2230372
6134 -2230372 -11519163 -9676056 -6689462 -9631831 -13020079 -10284151 -4547504 -2571394
6126 -2571394 -4473882 -5224079 -2704476 785669 3147263 4235389 3612071 201765 -5159308
6117 -5159308 -9207269 -9367512 -6172415 -1849632 2386033 6540285 10005813 11003237 8207853
6108 8207853 2153961 -5199072 -11541209 -14741754 -13494681 -8244095 -1002591 5958509
6100 5958509 10670507 11461117 8561134 5713830 7121132 11663977 13482434 10313774
6092 10313774 7464644 9941832 14305611 13851322 9481124 8408474 12334081 14544999
6084 14544999 11093364 7764286 10919514 16379936 14103970 2310064 -9159689 -10516975
6076 -10516975 -2921662 4145231 3803683 -2297718 -7888979 -9156386 -6802387 -2925431
6068 -2925431 1110492 3356487 1247965 -4574732 -8783521 -7134674 -2175127 705638
6060 705638 1571139 5028703 11110783 13480031 9258958 4862111 7294730 13556433 14521192
6051 14521192 7645179 -120529 -2535868 -1934734 -4282517 -9722847 -12083392 -7578642
6043 -7578642 -698439 769366 -4585280 -9978802 -8956726 -2924674 1887529 2350923
6035 2350923 -291027 -5202025 -12790254 -20675214 -24243827 -23010289 -21563777 -21628203 -18212936
6026 -18212936 -7964014 2896981 5121211 -955368 -5559544 -2239873 5170727 9706707
6018 9706707 10302665 10600110 12038448 11995654 7975803 1081350 -4605998 -4871644 1532972
6009 1532972 10966692 16823241 15648406 11404075 11232971 16120139 18445936 11289946
6001 11289946 -1714659 -9619498 -7077963 -21655 2749190 -407359 -5083510 -8387326
5993 -8387326 -10895291 -12592032 -11418410 -6159598 2016348 10532061 15590032 13202407
5985 13202407 4019859 -4160693 -3717608 3117944 6835477 2929772 -3993421 -8996269
5977 -8996269 -12907690 -16995589 -18078669 -13639308 -7044513 -2713844 139559 3991846
5969 3991846 6721761 4626699 -423597 -2584061 135860 4524854 7839968 9978589
5961 9978589 10377547 7735261 3531442 1556335 2591030 2880982 -525043 -5352603 -6718269
5952 -6718269 -2988993 2159848 3510495 110787 -3250394 -1820036 2474920 3236825
$$ [...]
##END NTUPLES=NMR SPECTRUM
##END=
