##TITLE=31Pdec_SR114K
 CDCl3, 128 sc
 12.12.2022
##JCAMPDX= 6.0         $$ Bruker NMR JCAMP-DX V2.0
##DATA TYPE= NMR SPECTRUM
##DATA CLASS= NTUPLES
##ORIGIN= UXNMR, Bruker Analytische Messtechnik GmbH
##OWNER= root
$$ XWIN-NMR		Version 3.5
$$ Mon Dec 12 15:47:31 2022 Russian Standard Time (UT+4h)  she@DPX200
##.OBSERVE FREQUENCY= 81.013821
##.OBSERVE NUCLEUS= ^31P
##.ACQUISITION MODE= SIMULTANEOUS
##.ACQUISITION SCHEME= undefined
##.AVERAGES= 128
##.DIGITISER RES= 16
##SPECTROMETER/DATA SYSTEM= spect
##.PULSE SEQUENCE= zgpg30
##.SOLVENT NAME= CDCl3
##.SHIFT REFERENCE= (INTERNAL, CDCl3, 0, 248.564)
##AUDIT TRAIL= $$ (NUMBER, WHEN, WHO, WHERE, WHAT)
$$ ##TITLE= Audit trail, XWIN-NMR		Version 3.5
$$ ##JCAMPDX= 5.01
$$ ##ORIGIN= Bruker BioSpin GmbH
$$ ##OWNER= she
$$ F:/spectra/data/she/nmr/P31/1/pdata/1/auditp.txt
$$ ##AUDIT TRAIL=  $$ (NUMBER, WHEN, WHO, WHERE, WHAT)
(   1,<2022-12-12 15:45:16.42 +0400>,<she>,<DPX200>,
      <created by zg, POWCHK disabled, PULCHK disabled
       configuration hash MD5:
       00 E9 B6 7A A2 85 ED C7 34 08 36 98 17 FE 4E 26
       data hash MD5: 32K
       3B E2 78 6B 87 82 F2 B8 21 29 F1 4D 77 63 26 1E>)
(   2,<2022-12-12 15:45:43.60 +0400>,<she>,<DPX200>,
      <Start of raw data processing
       efp BC_mod = 2 LB = 1 FT_mod = 6 PKNL = 1 PHC0 = -10671.17 PHC1 = 211.4555 SI = 64K 
       data hash MD5: 64K
       26 0C DF 8E 5C 04 7E 38 B2 13 2E FB 3E B3 87 DD>)
(   3,<2022-12-12 15:46:15.06 +0400>,<she>,<DPX200>,
      <pk PHC0 = 62.48328 PHC1 = -278.7997 
       data hash MD5: 64K
       A4 81 08 95 B7 77 F4 54 91 37 F3 5F A3 EE 80 39>)
(   4,<2022-12-12 15:46:17.95 +0400>,<she>,<DPX200>,
      <abs ABSG = 5 
       data hash MD5: 64K
       C8 4C DE 2E 1F 23 7B 2A AB AC D8 74 41 CF 34 B2>)
$$ ##END=
$$ 
$$ hash MD5
$$ 39 63 C1 CD 79 5D 8A 1B 49 CF 64 CD 15 D5 AF 0A
##$RELAX= 
##$RELAX= 
##$RELAX= 
##$RELAX= 
##$RELAX= 
##$RELAX= 
##$RELAX= 
##$RELAX= 
##$RELAX= 
$$ Bruker specific parameters
$$ --------------------------
##$DU= <F:/spectra>
##$EXPNO= 1
##$NAME= <P31>
##$PROCNO= 1
##$TYPE= <nmr>
##$USER= <she>
##$AMP= (0..31)
100 100 100 100 100 100 100 100 100 100 100 100 100 100 100 100 100 100 
100 100 100 100 100 100 100 100 100 100 100 100 100 100 
##$AQSEQ= 0
##$AQ_mod= 1
##$AUNM= <au_zg>
##$AUTOPOS= <>
##$BF1= 81.014009
##$BF2= 200.13
##$BF3= 200.13
##$BF4= 200.13
##$BF5= 200.13
##$BF6= 200.13
##$BF7= 200.13
##$BF8= 200.13
##$BYTORDA= 1
##$CFDGTYP= 0
##$CFRGTYP= 5
##$CHEMSTR= <none>
##$CNST= (0..31)
1 1 145 1 1 1 1 1 1 1 1 1 1 1 1 1 1 1 1 1 1 1 1 1 1 1 1 1 1 1 1 1 
##$CPDPRG= <waltz16>
##$CPDPRG1= <>
##$CPDPRG2= <waltz16>
##$CPDPRG3= <>
##$CPDPRG4= <mlev>
##$CPDPRG5= <mlev>
##$CPDPRG6= <mlev>
##$CPDPRG7= <mlev>
##$CPDPRG8= <mlev>
##$CPDPRGB= <>
##$CPDPRGT= <>
##$D= (0..31)
0 1 0 0 0 0 0 0 0 0 0 0.03 2e-05 3e-06 0 0 0 0 0 0 0 0 0 0 0 0 0 0 0 0 
0 0 
##$DATE= 1670845515
##$DBL= (0..7)
120 120 120 11 120 120 24 19 
##$DBP= (0..7)
150 150 150 150 150 150 150 150 
##$DBP07= 0
##$DBPNAM0= <>
##$DBPNAM1= <>
$$ [...]
##$SUBNAM3= <"">
##$SUBNAM4= <"">
##$SUBNAM5= <"">
##$SUBNAM6= <"">
##$SUBNAM7= <"">
##$SUBNAM8= <"">
##$SUBNAM9= <"">
##$SW= 501.771253377433
##$SWIBOX= (0..15)
0 1 3 0 0 0 0 0 0 0 0 0 0 0 0 0 
##$SW_h= 40650.406504065
##$TD= 32768
##$TD0= 1
##$TE= 0
##$TE2= 300
##$TE3= 300
##$TEG= 300
##$TL= (0..7)
0 120 53 12 22 120 120 120 
##$TP= (0..7)
150 150 150 150 150 150 150 150 
##$TP07= 0
##$TPNAME0= <>
##$TPNAME1= <>
##$TPNAME2= <>
##$TPNAME3= <>
##$TPNAME4= <>
##$TPNAME5= <>
##$TPNAME6= <>
##$TPNAME7= <>
##$TPOAL= (0..7)
0.5 0.5 0.5 0.5 0.5 0.5 0.5 0.5 
##$TPOFFS= (0..7)
0 0 0 0 0 0 0 0 
##$TUNHIN= 0
##$TUNHOUT= 0
##$TUNXOUT= 0
##$USERA1= <user>
##$USERA2= <user>
##$USERA3= <user>
##$USERA4= <user>
##$USERA5= <user>
##$V9= 5
##$VALIST= <valist>
##$VCLIST= <CCCCCCCCCCCCCCC>
##$VD= 0
##$VDLIST= <DDDDDDDDDDDDDDD>
##$VPLIST= <PPPPPPPPPPPPPPP>
##$VTLIST= <TTTTTTTTTTTTTTT>
##$WBST= 1024
##$WBSW= 4
##$XGAIN= (0..3)
0 0 0 0 
##$XL= 0
##$YL= 0
##$YMAX_a= 2123
##$YMIN_a= -2571
##$ZGOPTNS= <>
##$ZL1= 120
##$ZL2= 120
##$ZL3= 120
##$ZL4= 120
##$ABSF1= 248.5645
##$ABSF2= -253.2056
##$ABSG= 5
##$ABSL= 3
##$ALPHA= 0
##$AQORDER= 0
##$ASSFAC= 0
##$ASSFACI= 0
##$ASSFACX= 0
##$ASSWID= 0
##$AUNMP= <proc_1d>
##$AZFE= 0.1
##$AZFW= 0.5
##$BCFW= 0
##$BC_mod= 2
##$BYTORDP= 0
##$COROFFS= 0
##$CY= -3
##$DATMOD= 1
##$DC= 0
##$DFILT= <>
##$DTYPP= 0
##$F1P= 0
##$F2P= 0
##$FCOR= 1
##$FTSIZE= 65536
##$FT_mod= 6
##$GAMMA= 0
##$GB= 0
##$INTBC= 1
##$INTSCL= 6.047779e-11
##$ISEN= 30
##$LB= 1
##$LEV0= 0
##$LPBIN= 0
##$MAXI= 10000
##$MC2= 0
##$MEAN= 0
##$ME_mod= 0
##$MI= 50
##$NCOEF= 0
##$NC_proc= -8
##$NLEV= 6
##$NOISF1= 182.463
##$NOISF2= 159.3651
##$NSP= 0
##$NTH_PI= 0
##$NZP= 0
##$OFFSET= 248.5645
##$PC= 4
##$PHC0= -10608.69
##$PHC1= -67.34421
##$PH_mod= 1
##$PKNL= yes
##$PPARMOD= 0
##$PSCAL= 0
##$PSIGN= 0
##$REVERSE= no
##$SF= 81.0140089999694
##$SI= 65536
##$SIGF1= 159.3651
##$SIGF2= -187.1042
##$SINO= 113.3802
##$SIOLD= 16384
##$SREGLST= <1H.CDCl3>
##$SSB= 0
##$STSI= 65536
##$STSR= 0
##$SW_p= 40650.406504065
##$SYMM= 0
##$S_DEV= 0
##$TDeff= 32768
##$TDoff= 0
##$TI= <>
##$TILT= no
##$TM1= 0
##$TM2= 0
##$TOPLEV= 0
##$USERP1= <user>
##$USERP2= <user>
##$USERP3= <user>
##$USERP4= <user>
##$USERP5= <user>
##$WDW= 1
##$XDIM= 65536
##$YMAX_p= 407215112
##$YMIN_p= -270721932
$$ End of Bruker specific parameters
$$ ---------------------------------
##NTUPLES= NMR SPECTRUM
##VAR_NAME=  FREQUENCY,     SPECTRUM/REAL,   SPECTRUM/IMAG
##SYMBOL=    X,             R,               I
##VAR_TYPE=  INDEPENDENT,   DEPENDENT,       DEPENDENT
##VAR_FORM=  AFFN,          ASDF,            ASDF
##VAR_DIM=   65536,         65536,           65536
##UNITS=     HZ,            ARBITRARY UNITS, ARBITRARY UNITS
##FACTOR=    0.620285442955139, 1,           1
##FIRST=     20137.2065510682, 0,            0
##LAST=      -20513.1999529968, 0,           0
##MIN=       -20513.1999529968, -270721932,  0
##MAX=       20137.2065510682, 407215112,    0
$$ Real data points
##PAGE= N=1
##DATA TABLE= (X++(R..R)), XYDATA
$$ [...]
14905 -955851 -850037 6872390 15059313 13362806 2445890 -5605749 -3542119 1601998
14897 1601998 -477050 -8479209 -11437979 -3195673 10102273 17082349 12788725 2594993
14889 2594993 -4218278 -4087638 -1864535 -3345391 -6853296 -5894856 -266298 1045945
14881 1045945 -7887342 -18924503 -18104401 -4172069 8690182 8694755 -360671 -8189516
14873 -8189516 -12923150 -18596628 -22690823 -17537823 -3899643 7615421 11070133 11321971
14865 11321971 12143772 8860697 -435224 -6038351 923900 13556640 17281960 8799215
14857 8799215 -2967214 -10984608 -14019499 -9407295 4717703 19589807 21581981 11188132
14849 11188132 4101908 8212582 11319076 134762 -17973284 -23496679 -10506153 6686345
14841 6686345 12042456 5235727 -722004 5293787 21148783 33707660 32518839 21104913
14833 21104913 12183226 11928567 13703240 8667114 -2886015 -13698053 -18144732 -15192249
14825 -15192249 -7185618 530855 2479170 -1246299 -5671505 -9066358 -14543155 -20934165
14817 -20934165 -19978275 -8385710 4288250 7214936 2008263 -2838042 -5318994 -8172449
14809 -8172449 -8713059 -2082942 7358714 9443604 3137456 -2328298 -2003268 -589155
14801 -589155 -1636400 -1939700 -265573 -2013077 -9966652 -18040142 -19631975 -16306477
14793 -16306477 -13673260 -13994119 -16547146 -19769975 -19794478 -12999692 -3296912 50114
14785 50114 -4349555 -6712656 -839915 6301414 6450942 2976702 2843601 3105616 -3225259
14776 -3225259 -12783031 -15534316 -10407899 -5382054 -2989153 2151558 10366128 13475644
14768 13475644 7973135 1730755 2731612 8631283 11751528 8158247 -1136937 -11277562
14760 -11277562 -13652268 -3239519 10875880 11714900 -3682979 -17957166 -15917257 -3899346
14752 -3899346 2541535 1175160 560137 1408674 -3803757 -13889151 -16849154 -7715240
14744 -7715240 3951413 8644597 8028509 6453657 2160867 -5700129 -10520471 -7880342
14736 -7880342 -4694440 -8667220 -14007152 -9073499 4603332 13131092 10210504 4367530
14728 4367530 3501414 3855458 465509 -1725312 3094982 8464408 3472400 -9001718
14720 -9001718 -14103004 -6197468 3078043 2182491 -5027370 -8474962 -7926921 -9683953
14712 -9683953 -12426792 -8579829 1067914 6047603 1983615 -3043410 -2410484 -1024348
14704 -1024348 -4482054 -7602852 -4110244 -704557 -8243236 -21847521 -24092800 -9594229
14696 -9594229 6841620 11512510 9445756 12508481 19092734 17066356 3190942 -11162908
14688 -11162908 -14232363 -6396095 2961240 5914948 1663365 -4787345 -7932346 -7005933
14680 -7005933 -5770418 -6597658 -7266040 -5343382 -2131631 1119806 7097890 17265651
14672 17265651 25661322 24426735 14626519 5352183 2140145 2295026 2103494 2279192
14664 2279192 4416931 7568102 10680105 13847675 15234512 11623823 4461326 754802
14656 754802 5128938 14801251 24393265 30932674 31833182 24141595 10489537 648060
14648 648060 1242123 7347375 9834331 7850228 7872864 12691080 17796588 17824482 11205787
14639 11205787 -404825 -12022515 -16244896 -10483390 -2349597 -1445966 -6669250 -8917037
14631 -8917037 -5743609 -4059522 -6719351 -6772220 -153671 4983898 -577723 -12964750
14623 -12964750 -20541632 -18824370 -11513658 -512391 14637702 28416059 31432341 23434504
14615 23434504 15240452 14023865 14886180 11968271 9572348 13979108 20236515 17869887
14607 17869887 7700028 1899708 5833754 10234425 6014776 -2206789 -4787335 -2343668
14599 -2343668 -2587290 -5711649 -4088900 3550102 8538267 5945457 2252766 4193980
14591 4193980 8169864 7559664 3516785 112761 -5422153 -17149232 -28455465 -27260269
14583 -27260269 -13245870 660498 5615513 5752205 7282117 9227721 10003292 13458359
14575 13458359 20857650 24497404 18118907 8314505 6353599 11944381 14278278 8067158
14567 8067158 251542 -46732 7785049 16192987 16627023 6858412 -5769408 -10747947
14559 -10747947 -7517801 -7560102 -17414105 -25268313 -15034889 8870653 23754540 17620197
14551 17620197 3776380 1027911 9476484 14302553 6692869 -8379383 -21713142 -28102900
14543 -28102900 -25482084 -13902998 1630496 11806386 10664154 2347215 -2129299 3579546
14535 3579546 13533159 16023308 8159167 -258536 -211318 4373809 4280481 698820 3447963
14526 3447963 14046141 21306477 17051328 6920390 497854 -1221553 -2067529 -1240794
14518 -1240794 4364557 12463275 17430800 17747186 15578053 11495471 5367105 133242
14510 133242 -1306964 -1411524 -4489568 -8865921 -8056884 147538 10141881 14537156 10978239
14501 10978239 3339856 -1625744 173020 6034380 9160973 6591286 1996653 -342543
14493 -342543 -665261 -1465126 -4269098 -9831795 -16454558 -17642576 -9046295 1145502
14485 1145502 -497862 -11211331 -11145575 7839550 26327252 23770323 8693581 4322442
14477 4322442 12577830 14422679 3174454 -6051199 -3559755 245223 -4185747 -8695041
14469 -8695041 -3243865 6301080 9495213 9096334 13603794 20046255 18148576 7243782
14461 7243782 -3221501 -7823994 -9620567 -11757115 -13232382 -12605686 -9403027 -2716601
14453 -2716601 6297360 12302616 11311336 6439184 3542234 3520776 3357880 1639341 -1928488
14444 -1928488 -9033637 -18808727 -24206594 -19120874 -8031238 -2484686 -7887925 -18260472
14436 -18260472 -23984895 -21063381 -12751658 -4861021 90403 4302154 9078430 9774192
14428 9774192 1765318 -9387746 -12274965 -5929994 -1836169 -5436377 -7062080 706012
14420 706012 8133943 3410047 -6132039 -3431169 12518849 26501649 30491207 30202530
14412 30202530 27666881 15821107 -3437735 -12617949 -1150450 17189101 21481213
14405 21481213 10240470 -1264919 -4481191 -5094958 -8789591 -12271853 -11530777 -9635742
14397 -9635742 -10838534 -12263421 -7232949 4973040 17063549 21416303 16901276 7649038
14389 7649038 -1944222 -8820682 -10136584 -4742059 3763311 9060321 8639480 5389748
14381 5389748 1894550 -2213216 -5116023 -1204568 10077041 18920523 16223129 6858594
14373 6858594 3623106 9585670 15435205 14415357 10442136 9087935 9330545 8556482
14365 8556482 8615792 11668052 15118977 15431280 13022747 9689815 5223139 -15875 -3340871
14356 -3340871 -3843304 -3912623 -3693399 613583 9107501 14789275 13010909 8595715 7227161
14347 7227161 5516893 -1892066 -9761681 -7217318 6043240 18383073 21543472 18266031
14339 18266031 13533166 7959985 3279196 5082797 14047408 21442850 20221761 15173848
14331 15173848 14757963 17506992 15692148 10123730 10490808 18873266 22665822 10461333
14323 10461333 -10491067 -20542469 -10460764 8182573 16981793 10789379 661525
14316 661525 -1461833 3083390 2914535 -7730232 -20561748 -22707858 -12102169 834152
14308 834152 6429480 5379623 3096337 -21493 -7045285 -16008319 -19858258 -15551200
14300 -15551200 -7712155 -1550718 3046483 7790937 10858423 9755155 6801431 7237564
14292 7237564 12364448 17836579 18836548 14787479 9238405 6961019 10449084 16916446
14284 16916446 19087714 11763863 -1415927 -9587146 -4557878 11177559 26738223 32605457
14276 32605457 27586068 17006599 6375641 -1347737 -3873739 396439 8540068 13230533
14268 13230533 10642068 5602125 4205268 3830347 -2763318 -14306006 -20245248 -15143859
14260 -15143859 -6256527 -2898296 -4853685 -6269599 -5254948 -3540177 -999194 3043121
14252 3043121 5969542 5070019 2095389 -338611 -3664782 -9159946 -12348745 -8415141
14244 -8415141 -704521 3231550 2238312 1069977 958424 -1301265 -5231468 -5840555 -2076033
14235 -2076033 1079602 592985 -908942 -891727 -139506 1355843 5456694 10835057 12944057
14226 12944057 11332922 11078090 14312307 16192595 12496498 5731450 65281 -4612798
14218 -4612798 -9244998 -10708801 -5501365 4193140 12187658 14322054 10260470 1997812
14210 1997812 -6274282 -9063684 -3827613 6214389 14954716 18006252 14432444 6942236
14202 6942236 1351608 2499653 8841416 13627138 12780395 8973487 6911724 7811902
14194 7811902 10060728 12301012 13980370 14932098 15451104 15001846 11294999 3559785 -4235834
14185 -4235834 -7655446 -8497394 -11972377 -17631395 -19640625 -16825145 -15196670 -18151074
14177 -18151074 -21124213 -19453976 -15144662 -11666634 -7984350 -2603773 1734639 2768012
14169 2768012 3584301 7072525 9202249 4068357 -6282939 -12496180 -7952977 4870521
14161 4870521 16799368 18729396 8745102 -4920368 -10638087 -5385912 2641857 4669111
14153 4669111 336668 -5633027 -10148852 -11629681 -8364419 -1556032 3854882 5240119
14145 5240119 5298094 5985545 4648107 69170 -3421474 -2907371 -2316029 -5154743 -7399367
14136 -7399367 -4242593 1353388 4198199 5837163 9548999 11080261 4400885 -6250875
14128 -6250875 -10580259 -7119795 -3547025 -2667975 789072 7935162 11517394 8059276
14120 8059276 4399485 6166277 7781201 1490163 -9268056 -14005605 -10138444 -5609522
14112 -5609522 -6231235 -7537047 -2548708 7026602 12713392 11212383 8818999 11829247
14104 11829247 17295340 18196209 14697131 13003369 13314177 7491115 -7673175 -22158016
14096 -22158016 -23966589 -14119995 -3737957 970116 3578127 7854361 10285113 5304225
14088 5304225 -5000624 -10083076 -1643891 15031293 23773214 14984466 -2398309 -11985887
14080 -11985887 -10238109 -6962814 -7010314 -4032035 4518848 9605880 5434724 543045
14072 543045 4053522 10386118 9095499 2109187 -1295730 -609440 -2171629 -5507486
14064 -5507486 -4608193 -185688 1427609 -607649 -2959155 -7601354 -17687527 -26558224
14056 -26558224 -24207282 -13407963 -6184239 -5263245 -2863211 2705705 4421158 1568981
14048 1568981 1911630 6110252 5014583 -3754419 -11194560 -13038791 -15388387 -19438632
14040 -19438632 -16933928 -7735389 -4828074 -11987619 -13358276 1370808 16804904 13795432
14032 13795432 -424378 -3246266 9803703 22218663 23515776 19879341 17788454 15145492
14024 15145492 12449686 16704783 26972725 28716133 12177616 -11679539 -23275095
14017 -23275095 -17987396 -8758634 -7133937 -10556700 -10321884 -4980813 -551382 -811718
14009 -811718 -3496688 -5641845 -6823259 -5978619 -1213827 4416332 3473425 -4781562 -10352694
14000 -10352694 -6067292 1299647 1971114 -1165854 878060 6166170 5291289 -921686
13992 -921686 -2577822 673419 -1633820 -11123985 -15882351 -10162174 -3454209 -3762782
13984 -3762782 -6478472 -6812389 -8639887 -12900306 -11818317 -3977636 -686203 -6969695
13976 -6969695 -10873608 -3478579 5337579 4819041 1989173 6079193 8676699 -1054235
13968 -1054235 -13493319 -12796236 -4678196 -6551470 -16224855 -15126888 -414509 10474290
13960 10474290 8648825 4666332 7141498 11025236 11919627 13030108 12551331 2524734
13952 2524734 -13433215 -19132765 -10230570 -2790729 -8559615 -17742916 -17129420 -10744555
13944 -10744555 -9452317 -11421936 -7077634 3408545 10072538 7261662 -882678 -6483758
13936 -6483758 -4222764 4850085 12617652 11892151 6682752 7558371 15748775 20974390
13928 20974390 16686043 6873463 -4342335 -17314892 -27412164 -24880748 -10382882
13921 -10382882 2602665 7587942 12918533 21900104 22014600 7012067 -6106911 -143856
13913 -143856 14065849 12836298 -4192539 -14232438 -5409283 9251397 13894148 9062419
13905 9062419 4120535 3087103 3484558 1500048 -4392573 -9496479 -4381346 12367738
13897 12367738 26782169 25190467 13539015 8344953 11311735 8779943 -3299934 -11334068
13889 -11334068 -5933246 4095704 7378086 5693366 4583478 972057 -7530394 -11057175
13881 -11057175 -188588 15067950 14082685 -6995127 -29072152 -33416121 -21266516
13874 -21266516 -6937656 359395 2488525 5217492 10931032 17467843 20767819 18280674
13866 18280674 10914796 1956199 -5608220 -10408264 -12566576 -13664575 -15815377 -18788653
13858 -18788653 -18652493 -11689401 5230 8919260 9207154 2350232 -4969943 -7702571
13850 -7702571 -6204303 -3878288 -2713388 -2201105 -1980311 -3367064 -6751020 -8978238
13842 -8978238 -6542561 -1723034 -1669368 -8658347 -14590967 -10408606 313509 4190553
13834 4190553 -3605756 -11296460 -6890621 3253152 2304968 -12312336 -23820212 -18929110
13826 -18929110 -4853425 3632272 4802588 6652406 8968335 2690456 -13047635 -25955225
13818 -25955225 -26067794 -16351130 -4232129 7603404 16632041 16469697 6030592 -3995267
13810 -3995267 -3131019 4678860 7639155 3343281 -215949 1127764 3124527 3414759
13802 3414759 5843040 10841013 10963023 2638029 -4620765 274231 12391905 14382390
13794 14382390 -976278 -19937722 -24226070 -12893283 -892045 1598079 -461705
13787 -461705 823113 2698672 -2102204 -10635745 -11213319 162320 13470812 17768268
13779 17768268 14003060 10729750 12096301 14804893 13967243 8070379 37073 -4482600
13771 -4482600 -2466961 1642969 624367 -4660184 -5019315 3526058 12818561 14281028
13763 14281028 10802691 9560035 8813664 1763877 -9536560 -15045958 -11731903 -7780280
13755 -7780280 -9404967 -12074232 -9184594 -2854619 -558062 -4874165 -11652340 -16271861
13747 -16271861 -17250412 -14383775 -7575831 923281 5802904 3681755 -1032776 792089
13739 792089 11092545 19286555 14775561 2613709 -2036585 4339081 8213485 -1198
13731 -1198 -10763716 -10460254 -2554210 -971442 -7890362 -12407427 -9548916 -6278492 -7026279
13722 -7026279 -6468267 -871577 4555952 4993946 3422643 3326451 2447662 -438612 -543406
13713 -543406 4495767 8381383 5857632 2416039 5735937 12132776 11144113 1461487
13705 1461487 -7159619 -8222158 -6407411 -8806769 -14681097 -17709194 -14507347 -7319512
13697 -7319512 -610557 1827185 -1867455 -9472702 -14220070 -10802691 -3356669 -2949184
13689 -2949184 -13067394 -21664540 -15153824 1288402 7772449 -3190255 -14853804 -9369923
13681 -9369923 6956993 13902385 6660851 -411593 1778413 5123495 1284859 -3497231
13673 -3497231 488762 9981386 13703692 8875435 3613362 4598400 9403080 11252076
13665 11252076 7034655 -38894 -3899774 -1873182 2369343 3389815 455097 -3395421
13657 -3395421 -7064553 -11372309 -14320821 -12383196 -6768382 -2528314 -871465 1754888
13649 1754888 6397285 9552417 9012554 5794500 427405 -5995885 -8066174 -1720304
13641 -1720304 7197210 9692387 7823870 10087381 13235584 4603735 -14239216 -23617920
13633 -23617920 -13437248 1317132 3527604 -2173495 -1649128 5240137 8642881 6687246
13625 6687246 4051094 -133664 -8311725 -14827601 -14357018 -13710398 -20770102 -28040212
13617 -28040212 -23041013 -9578387 -1629647 -367340 4390844 12341264 11846089 1516747
13609 1516747 -6028645 -4537850 -873742 1607813 8582861 18614596 18883621 4766749
13601 4766749 -10933135 -15821819 -11599611 -3517561 8894345 22144958 24784662 14230659
13593 14230659 4832857 7388778 12406606 6629570 -4900203 -8559844 -5320927 -7270822
13585 -7270822 -15714590 -19530765 -14290235 -7801180 -5134530 -1615999 5468492 9300970
13577 9300970 3425713 -8025640 -15255038 -13510326 -5431045 3481678 8731517 9077669
13569 9077669 7560217 8606733 12685721 15388101 12724232 5779313 -865355 -4312196
13561 -4312196 -6073012 -9889713 -17133714 -24390262 -25717972 -17492466 -1840433 13347215
13553 13347215 18500646 10042294 -4508605 -12737412 -11171884 -8822372 -13353870 -19178818
13545 -19178818 -16199567 -6302061 -1896410 -9007640 -20456220 -26370649 -24054500 -17034725
13537 -17034725 -11456992 -13520000 -23338952 -31828150 -31071906 -25862534 -25556093 -27219171
13529 -27219171 -20102709 -6305106 -1105812 -9377851 -17479492 -14726544 -7736369 -5382184
13521 -5382184 -4533649 -1365793 -2773475 -13339168 -22704660 -20096873 -11444150 -7617041
13513 -7617041 -5325767 3930771 14155236 12665995 2573143 -1526597 1931916 163693
13505 163693 -10360842 -17544717 -14474132 -9772841 -11194147 -13302855 -8980126 -1476461
13497 -1476461 2851698 4477593 5983682 5163001 -132427 -6327746 -9234119 -9599808
13489 -9599808 -8976649 -5833620 -595845 1259123 -3134608 -7894383 -5849857 1022270
13481 1022270 4092496 -874057 -9623565 -15148404 -13965485 -7541535 -545328 2207412
13473 2207412 -1118869 -8500784 -15829294 -19082670 -16101572 -8421240 -1102430 1182433
13465 1182433 -1773634 -5979310 -6622239 -1166474 8296162 15078673 13816568 7718203
13457 7718203 5700725 10516830 15091457 13563199 9702364 9632096 12157184 12248037 8897473
13448 8897473 3496117 -4120507 -11624826 -12510374 -6114062 -2723363 -9509525 -17896743
13440 -17896743 -15698918 -5522912 1616474 5313825 13048011 21852411 19990836 7571682
13432 7571682 -842331 2516319 9002685 9014367 3946579 -1309110 -5203415 -4640220 4300726
13423 4300726 16048167 18090010 8825443 955018 2270652 5891844 5135552 3926610
13415 3926610 4471813 -1250848 -16733546 -29697152 -28097838 -18134318 -14011886 -17295404
13407 -17295404 -18470372 -13005613 -4390696 4075423 10154906 9657182 2258986 -3400365
13399 -3400365 812405 11270775 17759965 15378003 5250117 -9713271 -22275095 -21934939
13391 -21934939 -7972990 5644301 7987985 5806630 9376354 12901251 4503836 -10567102
13383 -10567102 -14699861 -4166956 6566635 8095484 7796589 14390457 24289419 28869655
13375 28869655 25036909 13797461 -2573811 -17308397 -21070500 -11986592 1643859
13368 1643859 10982966 13425041 9387206 274101 -8526794 -10336555 -5547476 -1065424
13360 -1065424 -242805 -368134 -610350 -3453127 -6395249 -2138129 9004711 16265226
13352 16265226 13453034 8348745 10281953 15668764 14348928 5456356 -1874509 -1564671
13344 -1564671 3449705 8190911 12010548 15966799 17858680 13207551 1264318 -11402874
13336 -11402874 -15604247 -9305399 -654724 1710727 -675064 168310 5679269 8200431
13328 8200431 2663946 -5648820 -8517517 -5256340 -1595248 -999054 -1188140 1646429
13320 1646429 7820633 13380822 13802340 9012742 3989098 2909236 4284662 4370303 3054531
13311 3054531 2133061 -67151 -6164871 -12521111 -11632847 -3098121 4296910 4027405 -211406
13302 -211406 -1221614 1632935 2818319 -1759193 -10249446 -16156997 -13536252 -3592501
13294 -3592501 4481649 3371584 -2879070 -5199209 -3714516 -6327241 -12516533 -10782536
13286 -10782536 2126633 11107789 2177712 -16093490 -23136624 -13915090 -2700283 -430948
13278 -430948 -1832231 1580508 7270158 7419939 1504485 -4397558 -6769318 -6615080 -4879479
13269 -4879479 -2045976 -912052 -3718941 -6534930 -2480207 7682103 13532712 7200121
13261 7200121 -6189499 -14705456 -13607426 -7851932 -2297642 3539412 9734469 11979250
13253 11979250 7550185 428329 -4187893 -6579870 -8830827 -8569071 -3102053 3125141
13245 3125141 3463772 688014 4843739 17759869 28113007 26038635 15792538 8302165
13237 8302165 6352317 4118112 -1259574 -5173116 -3646066 -494888 -2867628 -11176747
13229 -11176747 -16704040 -10986356 3246848 13334107 10185862 -2252569 -13571686
13222 -13571686 -19489814 -22696845 -23498525 -17497511 -4118643 9321761 15540648 14575286
13214 14575286 10048164 2813604 -7511715 -18069305 -24294162 -24448436 -19916996 -12991362
13206 -12991362 -6802666 -4976810 -7989822 -11005089 -8193620 576696 8359563 6975891
13198 6975891 -4188795 -14552271 -11466415 3507947 12697568 4015777 -10589392 -10349023
13190 -10349023 3661071 9850292 263478 -6445505 4035769 16923303 11977344 -2887024
13182 -2887024 -4523634 7523198 12048996 3500643 1075242 14234810 24233596 13514579
13174 13514579 -6221515 -12468720 -4161142 2892287 2676016 1702667 1027434 -4769081
13166 -4769081 -12032138 -9805745 957293 6335777 1232952 -3223453 432393 3910960
13158 3910960 -457748 -5173744 -1381497 4074715 320554 -6467781 -757085 16246227
13150 16246227 25531582 17618218 5339575 3437935 9112340 12200479 13619987 20881331
13142 20881331 31539663 34873418 28590893 21603845 18976963 15431906 7566352 2197870
13134 2197870 5511369 11219575 8138814 -4288580 -16037255 -19854935 -16899031 -10354808
13126 -10354808 -1969722 4293277 3919266 381608 3944211 16600721 25442220 18943640
13118 18943640 4632037 455980 10575918 20666047 18837857 10704557 8333509 12383713
13110 12383713 13223671 5899695 -3478546 -5601118 2369377 14343440 19885522 13346515
13102 13346515 889372 -4739908 1008487 9616706 12897947 14445334 20510045 25768769
13094 25768769 19436456 3237923 -8444793 -7205184 890705 6947833 8981252 7247272
13086 7247272 602097 -7243514 -7182579 2942533 12798324 12737667 5926701 1182770 514775
13077 514775 894610 2199799 5217686 6354529 2271677 -3620469 -6040718 -5486040 -4898004
13068 -4898004 -3735399 -2541266 -7600208 -21409972 -32949086 -28749622 -12016009 114512
13060 114512 -1395854 -7830577 -6330070 5217741 18780078 24937724 19478202 6738838
13052 6738838 -2755767 -2293959 4126513 8730094 10388090 12273659 13405647 10871463
13044 10871463 7277676 6877367 7018576 3173038 -379649 3884293 12665072 15813008
13036 15813008 13055460 12865764 14720269 8357738 -6295487 -14691926 -9313173 -780758
13028 -780758 757876 1134272 8315593 15320257 10417227 -3366306 -11757023 -7951528
13020 -7951528 2301452 10683949 12789397 7971918 119838 -4353410 -4513794 -6287709
13012 -6287709 -11328370 -11717251 -2416870 8490688 10718967 6768767 6517964 11487952
13004 11487952 14090931 9727081 1431957 -5435266 -7114128 -3389959 -349669 -5427961
12996 -5427961 -14704707 -13850926 627833 11451944 3677148 -11642090 -12408113 2421751
12988 2421751 13369296 10022122 1561325 -2774229 -5302295 -7801018 -4827061 3430871
12980 3430871 5759203 -3591421 -14196556 -14363422 -7441812 -4048226 -5937212 -7319844
12972 -7319844 -6123721 -4074428 326004 9462712 19360252 22747902 18241628 10214098
12964 10214098 1441525 -7375458 -12311067 -8293195 2464526 10427108 9312221 2389146
12956 2389146 -3235806 -4423834 -2440448 216054 931273 -1573973 -4202360 -1375854
12948 -1375854 6610445 10891144 5048991 -4056823 -3958130 5768755 12608803 9851393
12940 9851393 6038472 9732908 14604481 10106656 113080 -2345474 4185621 8183030
12932 8183030 4305690 -484661 -2405927 -7511153 -17041054 -20495191 -12662947 -5306408
12924 -5306408 -10186821 -20190377 -20383605 -10536520 -2768644 -1637251 -850648 2357227
12916 2357227 3580847 2750886 6960657 18537724 29312904 30368189 21746178 10775169
12908 10775169 5177660 7517504 12184470 9829958 -663240 -8452526 -4832224 4132722
12900 4132722 7185782 4516572 3857622 4339645 -2164006 -14734662 -22213818 -19860067
12892 -19860067 -15000425 -13945824 -14972724 -16712411 -21238004 -25027440 -19256548 -4783399
12884 -4783399 4731916 1838451 -3183825 1421720 10426030 10464060 1296986 -3831352
12876 -3831352 2427213 12315137 15507228 13676473 17294182 29647438 39380603 33275789
12868 33275789 15012471 3609032 9494692 20152130 17809341 4411613 -3570750
12861 -3570750 -1053018 803122 -3795296 -5394454 3286135 14254600 16912675 12514825
12853 12514825 7150235 384991 -8970715 -14128240 -8865193 386752 1858344 -5020712
12845 -5020712 -9880820 -6678603 -312002 2090202 4348 -1603428 1228859 6775045
12837 6775045 8852672 4342680 -1371582 -966610 3635284 3946110 -604291 -404012 8544963
12828 8544963 16264254 12511798 767057 -8552078 -11675919 -10645033 -5515728 3586821
12820 3586821 11004851 10715704 4680398 -13648 527736 6007935 14466783 20949503
12812 20949503 19408782 11286284 5750097 5984669 3744174 -5203870 -10499914 -3262741
12804 -3262741 6717274 4714685 -4848963 -5547286 3025330 3571014 -10582374 -23764697
12796 -23764697 -21397805 -10140685 -4982632 -7549685 -8720500 -5890514 -5718601 -11432930
12788 -11432930 -16834361 -14819421 -6654014 -18902 525249 -1232260 1171833 6975714
12780 6975714 8016489 403893 -8331382 -8594126 -1649599 3019190 802495 -4534286
12772 -4534286 -8843126 -11427968 -11152595 -6273566 1071231 6897676 12164531 20324926
12764 20324926 28037602 27203172 17979168 10383224 9500074 8542216 1908676 -4167097
12756 -4167097 -1924080 4570787 6175342 3715892 5637750 13087777 18064286 16457479
12748 16457479 12831301 10429651 6335532 687459 1280562 11601837 21368572 18809599
12740 18809599 8720739 7353314 19173458 29427075 23808900 6805618 -5919545
12733 -5919545 -7136167 -2508509 485202 -40373 -2565793 -4646249 -3378478 1178965
12725 1178965 3948509 1254357 -2972969 -3737274 -4619404 -11969096 -21677930 -23105699
12717 -23105699 -16268362 -12384667 -14681559 -12364135 186956 11371576 9075078 -1156699
12709 -1156699 -5495579 -869796 6613928 14661836 23520818 27352140 20451722 9373926
12701 9373926 6508549 13029983 19269935 20298550 19628939 18429908 13064019 4223271
12693 4223271 -2249493 -5006876 -8074922 -11376155 -10092404 -4174983 1360152 6054172
12685 6054172 13176616 18659075 13364702 -695796 -8933372 -3930622 4772053 6412347
12677 6412347 3341634 2232017 1431460 -3115142 -7020073 -3090581 6445040 12272465
12669 12272465 10113447 3868674 -946689 -1578427 1551744 4540225 3158710 -574739
12661 -574739 413123 7280014 11680102 7808054 1436310 702351 4048896 4810397 2410122
12652 2410122 490986 -1707123 -6603046 -9757047 -4208907 7230336 13376546 9350131
12644 9350131 1723574 -2529963 -4398478 -7229067 -9587415 -8160164 -3392505 1941915
12636 1941915 6962632 11915021 15085138 13748147 7718747 201671 -4310313 -2129536
12628 -2129536 7768466 21433392 30130321 26384334 12075507 -1241489 -3159844 4809350
12620 4809350 12295986 13182388 10444361 7337377 1965677 -4350255 -1906531 13922644
12612 13922644 29733824 27946956 11647695 1022245 4066520 7068296 -632329 -9309454
12604 -9309454 -6953845 -358354 -3300704 -13459323 -17000402 -10054626 -326667 8066877
12596 8066877 15505811 15793337 1743763 -17550180 -22082370 -7550202 8178621 10235050
12588 10235050 4284422 2027147 2398496 -2707337 -13078312 -20519966 -19183132 -8985282
12580 -8985282 5510077 14758669 10407900 -2726335 -9324845 -4291208 -905495 -10084269
12572 -10084269 -22278079 -22061894 -11759553 -5624068 -6438072 -4507547 2261860 4311819
12564 4311819 -1559841 -5410711 -495917 5875371 4295710 -3117767 -7239587 -3165638
12556 -3165638 7802005 20916312 28582555 24525761 11674031 814843 -1401745 2229659
12548 2229659 7294638 13044407 17484385 16045904 9371535 4307733 2890255 -977871
12540 -977871 -9095381 -13119884 -7970806 -1289289 -893913 -2146199 1621132 4613923
12532 4613923 -2398111 -14300043 -16734761 -6442444 5793363 10926713 9158063 3429358
12524 3429358 -2993058 -3373845 6386436 18183522 18875627 7518563 -4148954 -7766358
12516 -7766358 -4722645 2045774 10646889 15133433 10446250 2689764 1729488 4026040
12508 4026040 -2055942 -13500947 -13524985 766447 10840931 4949342 -4497363 -3181255
12500 -3181255 2335982 -1203001 -10527284 -13435333 -9733363 -8137267 -9359808 -7977730
12492 -7977730 -6142918 -10616411 -19060952 -22054272 -16606061 -7278889 2693276 11320132
12484 11320132 13149811 5371508 -4706332 -7778881 -4423623 -840634 1152109 1143556
12476 1143556 -4727338 -14923001 -17761461 -8399653 -1276783 -10266851 -25483830 -28067583
12468 -28067583 -20068336 -18216453 -23457641 -20898666 -8881907 -3186233 -8925412 -11663270
12460 -11663270 -2918262 6648126 7407627 4821821 4706982 2452198 -3862884 -6588619
12452 -6588619 -4122067 -6537476 -15495502 -15824848 247845 16385466 14272987 -644507
12444 -644507 -10113842 -8310302 -1750675 5554657 11943305 11615128 2710537 -4860368
12436 -4860368 -2225647 4641329 5265060 601830 -3438120 -9452451 -21376946 -31256608
12428 -31256608 -28111847 -14999163 -4047771 374572 1434920 -372924 -3882137 -1045908
12420 -1045908 10989189 18810948 10415897 -2942719 -1930357 9134193 8130931 -8691515
12412 -8691515 -20351328 -14665400 -5152320 -6149987 -11520972 -10047649 -5200262 -5386214
12404 -5386214 -7181180 -3357328 831287 -5860553 -22124475 -34506209 -34658140 -26397496
12396 -26397496 -16464698 -6814113 3098783 12620726 20200810 24249644 23502978 18831908
12388 18831908 14048658 12606480 13785070 13704517 9964680 4467495 1485877 2584432
12380 2584432 3779276 -114794 -7800706 -11712304 -7778175 -599909 4309419 8179929
12372 8179929 13586911 16713092 12744232 5246450 1456844 814650 -2421565 -6970788
12364 -6970788 -5833537 -108912 -152576 -9762807 -19101200 -18183892 -9578090 -2627348 -1524452
12355 -1524452 -4235485 -8020862 -10843403 -10736436 -7848915 -4941168 -3801685 -3630465
12347 -3630465 -3715367 -4556331 -6179572 -8611003 -12924649 -17820018 -17741313 -10258830 -2116097
12338 -2116097 -71634 595035 7596250 14778827 8644076 -7716447 -14121319 -2172649
12330 -2172649 11539125 10213593 153350 -3012888 1015237 1678920 -1856722 -1261597
12322 -1261597 3776174 4411107 -2052703 -8754888 -11436683 -12491599 -12334943 -7971350
12314 -7971350 -1950739 -2268964 -10180419 -17023113 -16776864 -13987689 -15161031 -18969444
12306 -18969444 -19641861 -15227518 -8401145 -2617351 -467322 -2587947 -5763745 -5155798
12298 -5155798 -395968 3525872 3135187 1087702 1836054 5122349 5904396 -215751 -11926831
12289 -11926831 -21573927 -20915741 -10069537 703251 1504235 -6363517 -13878956 -16272554
12281 -16272554 -15582109 -12922949 -6351596 2436998 7103847 5182139 938779 -2875187
12273 -2875187 -8501200 -14541131 -12644480 -170096 11010846 8159954 -4126598 -9745029
12265 -9745029 -3173299 4996413 5177336 866464 2179 3003121 5134910 4956746 4572886
12256 4572886 5069857 6471053 9338899 12307412 10901341 3222383 -5337889 -7323810
12248 -7323810 -1747662 5999799 10893367 11352811 7700010 1964528 -1924722 -1790814
12240 -1790814 -73646 494862 2123384 8051167 14874639 14593578 4481227 -9801191
12232 -9801191 -20581875 -22932654 -14663697 1283723 14628718 16157437 9943640 9107870
12224 9107870 17373076 24357140 23045277 20773932 24813866 27287907 16780101 -1522339
12216 -1522339 -11473144 -9341503 -7314241 -12568044 -16573052 -10284475 1237471 7038368
12208 7038368 5516596 3266267 3050459 666744 -7354632 -18250007 -25389967 -23845930
12200 -23845930 -14598997 -4413081 556470 1749768 5569076 13095735 17416309 13562870
12192 13562870 5801140 891656 -1096234 -3411105 -3561989 4782255 20866725 34253152
12184 34253152 35554017 26307019 16170454 12364894 13367412 11920739 3274966 -9581290
12176 -9581290 -19353337 -22880222 -23870923 -26108541 -27085926 -21779111 -10787436 -409707
12168 -409707 4914592 6104196 5180440 2002060 -2992940 -6547122 -6046048 -3057107 -719547
12159 -719547 676851 2536329 3670449 1157989 -3868882 -5035687 1873312 12126728
12151 12126728 16212822 11164599 4616194 5438705 12325541 15253882 8426975 -1986747
12143 -1986747 -5440060 126604 6730272 7012919 2337706 -1089791 -658840 1034479
12135 1034479 1111507 -273506 -1025787 879493 5872129 10955575 10523522 2441656 -7260101
12126 -7260101 -10085802 -5813926 -2556416 -4660270 -6534222 -2300319 4309046 6328320
12118 6328320 5735296 10481528 20298912 24796702 18374342 9213761 8248198 14452546
12110 14452546 17427533 12142138 4755980 3278232 7198221 8992087 3926187 -4494724
12102 -4494724 -9143660 -7169251 -1533780 3739163 6457100 4913956 -1321478 -7689196
12094 -7689196 -7183352 10516 4907023 2414801 -416056 4339272 12020319 12732323
12086 12732323 7389472 4757398 5528157 2811920 -2311928 -596079 7914468 11103567
12078 11103567 3958443 -3790325 -5081949 -5993371 -10939438 -12288151 -5671701 -1930355
12070 -1930355 -10109560 -19934846 -16419711 -3057818 5037555 3942894 1287783 -125244
12062 -125244 -2999400 -4385605 188834 4929907 1789227 -3179956 1852809 12504752
12054 12504752 12582220 -320282 -12162874 -16138970 -19597453 -24244074 -19510696 -2573401
12046 -2573401 13117523 18118299 19635321 24306202 24020578 11241269 -4364006 -8190574
12038 -8190574 -480662 8295332 13967648 18811831 21769604 20413922 18551507 21574866
12030 21574866 26935845 27415651 21319698 12931146 5972210 2196400 2652245 4997839
12022 4997839 3522049 -3249545 -9013702 -7902566 -1719407 4471470 8440117 9068173
12014 9068173 4922289 -1657730 -5526614 -6980695 -11445778 -18032412 -18203095 -10341935
12006 -10341935 -4682155 -7086539 -9048001 -2613786 5200669 3687265 -4377071 -8078035
11998 -8078035 -4208388 2617722 9373118 14260417 13488370 8259654 8080270 17084905
11990 17084905 24839896 21763603 14952934 15485916 18960239 15108143 9401033 15456401
11982 15456401 29473696 33004841 21981037 13143852 17395364 24855196 23395440 16413811
11974 16413811 13172625 13791702 13419174 12213113 12391575 12057142 9112161 5805160 3951974
11965 3951974 1273453 -2776885 -3555573 1197908 5572996 2646316 -6199770 -13162030
11957 -13162030 -12195108 -3005226 9178424 15937260 12479095 4320955 2466903 9841044
11949 9841044 17541871 16874473 9698476 3658909 2178670 3298088 4758603 5923396
11941 5923396 6346380 5317410 2313559 -2420707 -6415322 -5604249 313795 5061768
11933 5061768 3436797 164142 4044264 13390262 15840479 5441045 -8086946 -12246482
11925 -12246482 -7563879 -3870695 -5234694 -6764832 -5362438 -5244710 -9387562 -11330594
11917 -11330594 -2205309 15245383 26699258 23103966 11664749 4711127 2979445 -1078840
11909 -1078840 -6789833 -4879754 5076630 10374985 3971630 -4694991 -5519680 -2734184
11901 -2734184 -4204144 -7077201 -6612231 -8766075 -18597918 -25109779 -15835049 -80028
11893 -80028 2687661 -6043218 -6603181 5163843 11163146 3259538 -1689379 9589693
11885 9589693 23578529 21026352 6121583 -2420106 923489 6490686 8726372 11445202
11877 11445202 16098578 17972145 14480966 8319538 2467044 -1560787 -2112573 239919
11869 239919 1096450 -1831619 -4266525 -2035473 1358152 -507530 -7763944 -15179804
11861 -15179804 -19240919 -19146103 -13997003 -4710543 3484360 5580340 2488705 -1085972
11853 -1085972 -2191719 -514936 2715666 3800976 -1412977 -11324720 -18392411 -18149060
11845 -18149060 -13937325 -9971923 -5556907 -132777 2203578 -1053876 -4864664 -2743944
11837 -2743944 4692083 11895292 15382615 14578663 9959338 4284865 1205787 -667359
11829 -667359 -6649785 -15561064 -17792793 -9011154 1592685 3289076 -2674170 -8275207
11821 -8275207 -10336256 -9282493 -3702285 4501095 6204289 -3118234 -13375122 -13029744
11813 -13029744 -7161223 -9371979 -19128536 -21662303 -10273911 4901139 12272702 10810809
11805 10810809 4263045 -4719651 -10823918 -7736714 878911 1880461 -9369693 -20092132
11797 -20092132 -16827137 -4103380 2626307 -1560932 -6198934 -1490005 8675166 12292695
11789 12292695 3644101 -10648560 -18564596 -13948010 -962851 11291137 16727296 14547303
11781 14547303 6745293 -3023446 -9081741 -6768416 2261194 10031548 9596472 2072226
11773 2072226 -4276749 -2021638 7801360 15811058 13258592 1558309 -8449371 -7266611
11765 -7266611 4798944 19650551 28490006 26314011 14157404 -210936 -7609678 -6835172
11757 -6835172 -5491809 -8538826 -10739205 -5491195 3398398 6341039 2262693 -21660
11749 -21660 4729938 11196593 12990473 12623375 16409987 22892252 23229615 13924194 3380474
11740 3380474 1399276 5427751 4467654 -3026710 -4454078 7948207 22016229 20821150
11732 20821150 7891667 2619886 11074852 17969545 12220054 3729911 4843350 9837322
11724 9837322 7052141 47080 -426178 1971152 -5279269 -19016023 -20839881 -4870926
11716 -4870926 11884054 13182110 3823459 -1850940 -806073 -686999 -5245954 -10512895
11708 -10512895 -12914066 -13297832 -13088099 -11900818 -9997614 -9807081 -13073286 -17189823
11700 -17189823 -16295309 -7948105 2021990 4922110 -12724 -5145746 -6495251 -9466404
11692 -9466404 -17893821 -24589198 -21062774 -11574188 -7699204 -11892013 -16747723 -19006105
11684 -19006105 -22885820 -28382396 -27441677 -16233028 -3091160 910980 -5801779 -15918203
11676 -15918203 -21501140 -18925776 -9989011 -1142911 1173125 -3631456 -10682709 -15369129
11668 -15369129 -16271522 -13976359 -10303500 -6930905 -1922419 8560026 21145209 23935103
11660 23935103 11687957 -3269357 -5157951 4536814 11779814 11826018 12524618 16840031
11652 16840031 17415419 11421129 6608375 7349713 7239383 2068633 -1178431 3980149
11644 3980149 12350515 15662803 14430566 13368280 12033476 8224420 5029592 6393571
11636 6393571 9665548 9467274 5538295 779905 -4903419 -12531136 -18274121 -15757829
11628 -15757829 -3907380 10650050 18638608 15073951 3714893 -4941239 -3243276 5884568
11620 5884568 13703537 16259151 15556917 13070267 9121138 6302282 5437088 1085528
11612 1085528 -9116357 -14514805 -4325101 12205491 15495102 5513426 2080361 11281567
11604 11281567 13861997 -2248740 -18910864 -14272831 3731520 10404936 483897 -8994763
11596 -8994763 -6716872 1003403 5579028 7740915 11293976 15529192 16405353 10728522
11588 10728522 454225 -5421863 131269 9045035 5192785 -10621904 -17295407 -4102209
11580 -4102209 11230080 8987134 -3205688 -5491760 2925864 8667012 9920019 14047428
11572 14047428 16797890 8456634 -3407366 -2160547 8643341 9132512 -3638693 -12089184
11564 -12089184 -10387763 -13408809 -26586862 -33145256 -22754196 -9523373 -7651823 -9803023
11556 -9803023 -5005093 371261 -3492775 -10409287 -10117427 -7038870 -9889592 -13319183
11548 -13319183 -7320430 3498250 6902235 2749870 64153 274323 -1105553 -1046747
11540 -1046747 6714197 16794325 16961478 7068337 -531089 322971 2865634 198119
11532 198119 -6351975 -12973773 -17591569 -16964865 -8610165 2634633 7707385 4512433
11524 4512433 -507709 -2421424 -2645159 -3240823 -3269919 -2325449 -2129994 -3093967 -3362169
11515 -3362169 -1943926 283935 2103602 2000194 -1049512 -4129494 -1640258 6177980
11507 6177980 10814773 6715248 -259226 -1879081 447136 404806 -2006373 -3408368
11499 -3408368 -6324529 -14304043 -21046579 -16760956 -4327297 3143769 1475584 361376
11491 361376 7264256 17419969 22751704 20830361 12162884 -1632705 -13609862 -14704880
11483 -14704880 -4751674 7682108 17777540 26529148 29400280 17479726 -4506627
11476 -4506627 -16202177 -7553836 5720163 4424219 -7369328 -12087451 -6217525 -1108392
11468 -1108392 -1169348 534418 5058125 3286107 -6881497 -13523075 -7796558 2917414
11460 2917414 6584551 2828889 -159930 1303431 4431467 6960244 8572894 7374926
11452 7374926 1253889 -7830850 -15204268 -18334987 -17394095 -13164756 -8147517 -7382044
11444 -7382044 -13084740 -19385755 -17538488 -6857736 3772334 6176366 902999 -6052325
11436 -6052325 -10441398 -11305963 -8721158 -3808576 176384 95055 -3540599 -7378918 -9645309
11427 -9645309 -11611227 -14007768 -14134318 -8655735 1250287 9733253 12292801 10764731
11419 10764731 10625385 13653485 15575673 12269963 6333264 4484316 8558737 12371116
11411 12371116 9375816 1161779 -4746857 -4826102 -3706796 -7086506 -13434146 -16079235
11403 -16079235 -12723275 -8797476 -9543838 -12074270 -9447219 -1338026 4839802 4767391
11395 4767391 3422984 6388858 10077803 7698966 1956992 2379077 9530909 11969363
11387 11969363 2953054 -9000435 -12949821 -10991655 -11823511 -15099157 -13665353 -8068089
11379 -8068089 -6204244 -8720496 -7367839 -336885 2830695 -3712226 -13267180 -18884149
11371 -18884149 -23676357 -30546712 -31813198 -20618223 -5402823 -44411 -3834083 -4339975
11363 -4339975 2083128 6361594 3677474 791410 2905811 5217614 3139256 856772
11355 856772 2942034 5755283 4687471 3224299 6814871 12926708 15354548 14423638
11347 14423638 14513267 14365030 8964141 23679 -4678068 -3665578 -4942697 -13407033
11339 -13407033 -22035645 -20758235 -9748197 1377182 5189895 2629266 -1002300 -1653001
11331 -1653001 1750873 7183606 10116178 7235949 1060597 -1323838 4129896 13304448
11323 13304448 17697433 12505024 509082 -10386117 -12901907 -6373009 1332014 757524
11315 757524 -7935209 -14305935 -11709860 -7089269 -9795092 -15229841 -11129880 815086
11307 815086 4094416 -7215254 -16606272 -8740838 7319288 12663032 7316512 7004082
11299 7004082 15741043 21080084 17422604 14909935 19497615 21272605 11726432 -1437542
11291 -1437542 -7571391 -9612263 -15638694 -23350754 -25299795 -22129211 -18346501 -11464604
11283 -11464604 1707706 13436143 13693799 6771134 5069030 8810960 7206904 -704089
11275 -704089 -2882989 5006438 11490539 8169475 3008488 6325168 14774933 19054195
11267 19054195 18801820 19462990 20612557 17864350 12792328 11547617 15096034 18158390
11259 18158390 17044905 13198504 10244832 11504817 17803122 23956151 21590768 10486266
11251 10486266 2488195 7497885 19627381 25061770 20202831 12674764 6579589 -1680364
11243 -1680364 -11513937 -13780422 -4202587 7283824 8415045 1061131 -2013521 5115974
11235 5115974 14372464 15182427 7607604 943299 1958556 8220610 13189017 14648351
11227 14648351 15043165 14573708 9003420 -2829212 -13258165 -13221688 -4448070 1861531
11219 1861531 -225265 -3865086 -300848 7510554 8200378 -2510245 -15675096 -20064955
11211 -20064955 -14963958 -9017361 -8734206 -11939759 -12382816 -7218984 1713095 11355544
11203 11355544 19169742 22789334 21759156 19891770 22083642 27294078 28339797 21212622
11195 21212622 11043458 4925363 2045593 -3255746 -10441168 -12448515 -7715293 -4920898
11187 -4920898 -11084005 -20422243 -21499996 -12628737 -3455394 -2078805 -7222735 -14005994
11179 -14005994 -20537280 -25182191 -23152652 -12481116 -1023361 -119381 -9977222 -17399281
11171 -17399281 -11619794 1909288 8628256 3350279 -4708938 -5685142 -1230283 671623
11163 671623 -1985020 -4193912 -3162827 -1845997 -2468345 -2642004 -884583 -902995 -5461546
11154 -5461546 -9330527 -4803131 6304117 12573262 6906994 -4533062 -10582541 -8275990
11146 -8275990 -3386367 -572146 1238636 3897298 5952545 5453461 3080188 43912
11138 43912 -4513590 -11344822 -17797125 -19177995 -13331178 -3036477 5721149 8289032
11130 8289032 5960463 5569508 11542349 18762380 17936405 8654730 921305 1024404 3025585
11121 3025585 -104554 -3909284 -246872 7044179 6257664 -3051007 -7402758 888819
11113 888819 12160818 13342020 4784458 -3827123 -7473575 -7745645 -5692046 -1140060
11105 -1140060 3174207 3916799 2471072 2557618 4079351 4115079 2021717 -1045309 -4959055
11096 -4959055 -8004253 -5090052 4805089 12628722 8760356 -3397303 -11869620 -12900706
11088 -12900706 -13526579 -17033103 -16928191 -9324724 -1632760 -2509156 -10014118 -16282101
11080 -16282101 -18575335 -18979532 -17379072 -12201541 -6212195 -4832142 -8755497 -13112257
11072 -13112257 -14057182 -12145804 -8831889 -3348429 5106270 13571485 15709677 7770927
11064 7770927 -4965664 -10452216 -2813402 8351531 7874147 -5315199 -16073683 -13325910
11056 -13325910 -3818307 344418 -540337 1606848 6198163 5073805 -1476274 -3264607
11048 -3264607 2398235 3985860 -7325324 -23520819 -30599682 -26642115 -20071033 -14741803
11040 -14741803 -7035042 3703680 11800322 14090828 14389005 16091072 16263276 10803703
11032 10803703 1207781 -7563803 -13021017 -15695818 -16068597 -13918216 -9253664 -2152809
11024 -2152809 6145153 10766223 5823697 -7382877 -18569847 -19266921 -12409415 -6351357
11016 -6351357 -2728901 2683989 9097778 9843140 3764424 -1144960 623976 4078526
11008 4078526 2735975 -448264 1505704 6881367 6277607 -3655541 -14258011 -15013323
11000 -15013323 -5804221 3486608 3878832 -4111161 -12482786 -15000986 -12796445 -10237533
10992 -10237533 -8130988 -4679364 -1310966 -1781633 -5296191 -6637633 -4449400 -3076506
10984 -3076506 -4335803 -4542518 -2305848 -1148752 -767822 4557665 13073810 12380311 -1079873
10975 -1079873 -10205034 971156 21628497 27087459 12973505 -1556249 -3627931 -730616
10967 -730616 -1822815 -2615021 2437086 7798776 5991151 -961425 -6829240 -9255492
10959 -9255492 -6857030 2149607 12625354 13728160 3566521 -7249277 -12258666 -17627538
10951 -17627538 -26963082 -30842378 -22009662 -9445427 -5250852 -7449589 -8044342 -8238443
10943 -8238443 -11916428 -13191121 -5754025 3093094 3539063 904698 4814060 7950947
10935 7950947 -3459577 -22059499 -25448501 -10264120 3005981 3031660 1857932 8052618
10927 8052618 9146222 -4553770 -18024345 -12581459 4088472 9192871 -1193907 -9140491
10919 -9140491 -3391802 7446976 12521248 13970974 18147988 22379134 18881532 6712176
10911 6712176 -7115805 -16293925 -19681543 -17928645 -11056174 -1658836 3346869 -904966
10903 -904966 -9859271 -13775526 -10251091 -6671422 -7863263 -8696185 -4391400 -657557
10895 -657557 -4655578 -11709337 -12075676 -7023146 -5763138 -8689096 -7472039 -1510956
10887 -1510956 546955 -2507673 -1820254 3435991 1710839 -9904191 -16288756 -6561661
10879 -6561661 8421731 13590899 11993564 14410271 17240571 9062750 -6321037 -11662840
10871 -11662840 -430353 15490834 22681106 18727927 8261787 -1941082 -4210904
10864 -4210904 2607419 7787099 1934172 -6322400 -640957 16364446 22886350 8231170
10856 8231170 -11925345 -17752525 -9613496 -1081697 1321893 191658 -3303467 -10004139
10848 -10004139 -16128566 -16043743 -10755186 -6549817 -6166296 -7183113 -7994318 -9507760 -10888803
10839 -10888803 -8466021 -95796 11722523 21314306 23340368 16340482 4717789 -3836380
10831 -3836380 -4498679 1478313 9414553 15023893 15916636 12538070 8222987 5465952
10823 5465952 2146419 -4988111 -13439623 -16466218 -11946051 -4562999 1301463 4578779
10815 4578779 2732977 -7391274 -20337647 -22482976 -8498564 9225926 15078728 8696999
10807 8696999 1016154 -2835384 -6405011 -10432427 -9826678 -3244338 3510494 6214941
10799 6214941 7267072 9652444 12296900 13993937 15946098 17262917 13390418 3098780
10791 3098780 -6894916 -8433916 -1046786 7892229 10256138 3334767 -8087370 -14521503
10783 -14521503 -9980565 942914 7169323 3297100 -5888458 -13463230 -17314383 -17106633
10775 -17106633 -11001528 -225287 8282852 9642064 7646066 7839437 7973586 2792046
10767 2792046 -4558115 -5156723 1611789 5719847 895975 -6354773 -6335604 1407354 10245428
10758 10245428 16033854 18503813 16607380 9512794 1382967 -1285650 1739893 3543945
10750 3543945 -173440 -4760737 -3568287 1547081 1600491 -7388532 -17947272 -19600844
10742 -19600844 -11471033 -2675115 -721106 -3928246 -6785894 -8081485 -9476220 -9333221
10734 -9333221 -4366536 2947008 5056671 -444259 -6331045 -4639215 3571139 10431379
10726 10431379 10219951 3257982 -5860010 -10532746 -6020521 4491608 10374073 5129402
10718 5129402 -4578503 -7027568 -953262 3659518 -123204 -8651597 -15997137 -21903306
10710 -21903306 -27283763 -28709180 -24009721 -18809749 -19735433 -23238434 -19260953 -6319904
10702 -6319904 4820873 5204152 -1137407 -4439574 -2480065 -535161 -1163151 -1274392
10694 -1274392 699623 1494013 -775968 -2319434 763082 6169730 8614478 6943144
10686 6943144 4041109 1371795 -2054399 -5893094 -7699030 -6208534 -2461476 2004823
10678 2004823 5194173 4034902 -2189206 -8400277 -8358469 -2853848 1232505 118439
10670 118439 -3443242 -5692522 -5001122 279730 9543273 14765079 7121991 -7993002
10662 -7993002 -12698335 716279 18436622 24077749 19219075 14557889 10042912 -1016868
10654 -1016868 -13390660 -12946536 1214767 12817619 9788885 -3042094 -15873501 -25916636
10646 -25916636 -32428445 -31480596 -22681104 -12321710 -4198957 4037520 10883066 8510510
10638 8510510 -2597291 -8026943 1266350 13723600 13346107 3200800 -983572 4903026
10630 4903026 10595556 10414033 9460644 10055308 6655398 -1874428 -7635353 -6796556 -6300710
10621 -6300710 -10857802 -13187395 -5888662 4652520 6347193 -1180385 -7453594 -7565066
10613 -7565066 -7868314 -14055949 -21782621 -22979310 -16587181 -8988603 -6033102 -7474371
10605 -7474371 -8298120 -4025425 4591942 11702217 12246888 7497009 2867022 833107
10597 833107 -541854 -1697320 994231 8943829 16415161 16521358 10110378 4076668
10589 4076668 2176997 2419785 2765933 3696308 4368414 1652524 -4967929 -11545745 -14270466
10580 -14270466 -12476424 -6897466 272742 3574253 -933569 -7986243 -7534752 1270626
10572 1270626 8730134 9706897 9979080 13002379 12137299 4311910 -58295 7373425 16890598
10563 16890598 14243918 2807932 -3152786 -1736792 -2789280 -6986137 -3934133 7683849
10555 7683849 15054829 10195035 -171808 -7533643 -11446338 -12673530 -8765244 -851171
10547 -851171 5329523 7681051 7514678 1937616 -11068749 -21661871 -18006054 -6627778
10539 -6627778 -5226992 -14923221 -19802596 -15520377 -14803646 -19921283 -15886803 -370960
10531 -370960 6493341 -3900203 -11071136 746 11697279 3747685 -11475644 -9700515
10523 -9700515 6616590 17464012 19224109 22135363 24558059 16952334 4388199 253985
10515 253985 3157668 2049799 -2438695 -2793773 -2397986 -7210122 -9242566 -522106 7160193
10506 7160193 133463 -10892758 -7433523 6252852 15442109 22838232 34608351 35720499
10498 35720499 14369923 -6317035 -942984 12391124 5179970 -4443278 13413835
10491 13413835 31027503 9114864 1614662 109220666 303827553 407215112 307104006
10484 307104006 108509551 -7725513 -6014339 16266347 5101697 -948568 20944596
10477 20944596 32797088 15229827 3745755 18633946 28680847 13407225 762755
10470 762755 11406071 18771660 -495919 -21946146 -16410824 234252 -1139022 -12128751
10462 -12128751 -7157714 8491645 9793984 -3996748 -11826309 -7764866 -4060392 -3449450
10454 -3449450 3092001 13651266 15540028 8191249 4788326 9864484 13467352 9859234
10446 9859234 6305250 9458476 15146081 15940250 10635055 3193070 -2272940 -4319915
10438 -4319915 -5589754 -10194634 -16576978 -16388714 -4899447 10838133 18973488 15378213
10430 15378213 5542573 -2733078 -4914038 -1309391 3344173 4296003 2660825 3782699
10422 3782699 9020915 13705050 14085809 11254107 7443258 3727889 1524620 761050
10414 761050 -2354777 -8964135 -11525239 -3716812 6191621 4670769 -5201520 -6523409
10406 -6523409 4816842 13202016 8555806 1527751 3969213 9641944 6907319 -1794949
10398 -1794949 -6817272 -7794621 -9502781 -9356910 -3083917 3384645 1584671 -4476601
10390 -4476601 -4222122 2187318 5544982 4197972 5816633 12895154 18445338 17481957
10382 17481957 12923538 8429402 3661354 -1734491 -6232678 -9529792 -12042542 -11770036
10374 -11770036 -7233857 -2225191 -1527316 -3479484 -3247823 -1531088 -2464823 -4307824
10366 -4307824 -951251 6740176 9389154 1400240 -11246010 -17938804 -14043404 -3658727
10358 -3658727 4211312 2282791 -7723046 -14688033 -9694971 2684697 10122386 8508793
10350 8508793 4817046 3453286 -1222249 -13990938 -27389922 -28915453 -17078733 -3292786
10342 -3292786 2350706 1136721 -537900 -1928169 -6774642 -13653258 -14976058 -7858624
10334 -7858624 350900 2272269 1113371 3956293 7998057 3192352 -11360264 -23435655
10326 -23435655 -23106336 -14021626 -5460227 -875035 315681 -3501296 -12981185 -21986210
10318 -21986210 -21771041 -10535957 4264243 11866581 5880007 -9996326 -23093534 -23678589
10310 -23678589 -16294190 -12860788 -15006308 -13529121 -6710354 -5062878 -11566992 -12103586
10302 -12103586 2409281 16852623 11138648 -9321237 -20004420 -10452481 6044134
10295 6044134 14957125 15804697 12913481 7056611 1871017 5290482 17146588 25223036
10287 25223036 20810897 10384702 5276043 6544931 6896739 2578705 -3088949 -5141134
10279 -5141134 -1513323 5395661 9272629 5461696 -2247346 -4997693 -981967 1521939
10271 1521939 -3531883 -10531345 -10223032 -2592393 4372991 6083783 5271672 5351815 5697609
10262 5697609 4796283 3795303 4238955 4533417 1841365 -2775483 -4348289 -996310 1693468
10253 1693468 -2701318 -11345082 -13914395 -5613157 6726477 13623745 12380290 4566555
10245 4566555 -8656711 -22478462 -26429939 -16035228 -2718409 -1605490 -10954927 -14684092
10237 -14684092 -5896706 3787378 2289581 -6081958 -8965016 -3766344 1344376 599610
10229 599610 -3200780 -5209702 -5171218 -5997306 -8991000 -12385203 -13695768 -12256178 -8931960
10220 -8931960 -4102437 2028371 6793221 6065722 199960 -4208600 -2063633 3361417
10212 3361417 5281006 2351750 -2045726 -6484776 -10996790 -11999495 -5561228 4271956
10204 4271956 7843574 1797042 -7675235 -14196295 -16990799 -16387297 -11503650 -5172456
10196 -5172456 -3575495 -6777432 -6251268 3136192 14389151 17474679 12762612 9049387
10188 9049387 10882224 14162781 13656279 9653717 6290647 6287937 8313455 8442579 4433981
10179 4433981 -951320 -2138251 2932315 9967497 12632641 8516449 286705 -7725374
10171 -7725374 -13251090 -16876155 -19338737 -18778986 -12995484 -4803175 -1255493 -5194776
10163 -5194776 -11410843 -14229749 -14283848 -13527211 -9453058 -1476558 2236009 -5714178 -18648006
10154 -18648006 -22907546 -16818671 -10856154 -9023104 -3546234 8659799 17615307 15097681
10146 15097681 6976948 2918727 2981887 3030218 5300572 13307232 21639528 21247246 12534886
10137 12534886 4833932 4186360 8152892 11205463 9654151 2962062 -4856901 -7254555
10129 -7254555 -3170251 -343102 -5668879 -15073523 -18633062 -13671020 -6811865 -3819187
10121 -3819187 -2911691 832524 7662162 11240256 4846210 -9436489 -19597682 -16221447
10113 -16221447 -4819646 1168331 -1009848 -1680155 2979429 3835569 -3841462 -8943602
10105 -8943602 -1369316 10354528 12113714 6863009 8103531 15351319 14000917 -11777
10097 -11777 -12357073 -11578892 -4139663 -1649060 -4453118 -5986044 -5144428 -5630972 -7438103
10088 -7438103 -6020138 1723718 14088625 25136257 27579737 19152168 7271699 2632572
10080 2632572 6852047 11513751 10449440 6717952 5462066 6533857 7494315 7992957
10072 7992957 7566491 4527314 518436 605844 5216630 8007188 6060409 5670740 12034745
10063 12034745 19177313 17702983 8232312 -834080 -5721538 -9122715 -11817739 -11426049
10055 -11426049 -9217068 -9564374 -11557276 -9206398 -1965068 2852764 1343597 -911939
10047 -911939 1272471 3770988 645996 -5082732 -6356907 -4226091 -5793076 -10899189
10039 -10899189 -10442712 -261699 11537592 15460841 12430148 9437086 8583185 6979100
10031 6979100 4300877 3458992 5018249 7294896 11430339 19847412 29163842 31381775
10023 31381775 24392246 15585634 12080787 12447435 11551001 8686324 6306340 4657900
10015 4657900 2994997 3211331 6563646 8730205 4327353 -4127537 -7793992 -2940559
10007 -2940559 4489916 7424213 6013836 4899010 6065875 7673170 7179567 2439641
9999 2439641 -7777391 -20433350 -27178356 -21666575 -8237419 1130545 28386 -5995277
9991 -5995277 -8180392 -5277859 -1382450 3193293 11760882 22222678 25629248 17130105
9983 17130105 3447329 -4544290 -3324331 2603384 7878068 9731696 7282602 2464943
9975 2464943 -12547 2102684 5261192 5755253 5471976 6965441 6735041 897146 -5224851
9966 -5224851 -2268868 9157388 18671146 20329009 17169362 11227665 615781 -10399394
9958 -10399394 -10809054 784511 9830487 4928468 -5252744 -4787083 5951705 11420457
9950 11420457 2899826 -11764627 -20423296 -19343731 -12319320 -4752787 -1139549 -3005053
9942 -3005053 -6865738 -7633388 -5043300 -3358413 -4215970 -3798261 1065658 7030749 7403657
9933 7403657 420318 -8247778 -12444722 -13095057 -15531378 -19721414 -18776853 -9965113 -1063591
9924 -1063591 107719 -3052684 -3250459 -2733194 -8278435 -16047577 -14893400 -4423005
9916 -4423005 4048474 5809492 7509208 10906335 7592744 -4469852 -14149215 -14001224
9908 -14001224 -9958030 -7233109 -1542859 7557377 10394724 3803658 -1875034 -2188916
9900 -2188916 -6993953 -18089122 -19275794 -4549949 5208323 -6131802 -22286274 -21989728
9892 -21989728 -13706994 -15367330 -19035691 -8427911 5225363 1312292 -10114500 -5709740
9884 -5709740 5972764 -159067 -16087724 -15625678 -10176920 -30999927 -59271005 -46017331
9876 -46017331 -13372453 -52095221 -178160954 -270721932 -220326888 -80658992 7386706
9869 7386706 2869265 -13947693 11581790 39182094 25848502 449050 5361581 24931824
9861 24931824 20888327 -534830 -4899922 10350047 15961059 970248 -13564385 -9944930
9853 -9944930 4065303 11904619 8640810 385640 -5310017 -4853618 -140139 3871884
9845 3871884 4546930 2426792 -2702810 -10851725 -17262884 -16445907 -10879515 -7388604 -5700223
9836 -5700223 -1064207 2684701 -3774376 -17726265 -24694614 -20029399 -15591524 -19420073
9828 -19420073 -23495067 -19479393 -12679439 -10558805 -9617225 -4601023 -232113 -2209753
9820 -2209753 -5302187 -2141021 3190515 1836437 -5143526 -9624183 -9608715 -9580210 -11142948
9811 -11142948 -12356729 -13529296 -15690911 -15959070 -11306555 -4079158 1915218 6667633
9803 6667633 9773174 6598848 -4422667 -16073608 -21270716 -22171609 -22792917 -19441643
9795 -19441643 -8760475 777003 -1754458 -12097030 -15726129 -9116111 -2494783 -568839
9787 -568839 4892486 18076457 27638285 21528714 5329624 -4151085 212856 10021272
9779 10021272 14923304 13969656 11772296 9442898 3919932 -5455183 -13924714 -16387466
9771 -16387466 -13562528 -10934588 -12143274 -15492901 -16861085 -13929739 -7623339 -1751359
9763 -1751359 -970578 -5967173 -10764447 -8770014 -1761746 2045788 -87108 -1348823
9755 -1348823 4112215 12454804 16134920 13693322 8786945 3813643 -224001 -1221994
9747 -1221994 1176065 3377564 3482966 5126004 9689517 9319818 -3584685 -22479029
9739 -22479029 -32028498 -27252410 -17918228 -12511767 -7720176 1791136 11815891 14343594
9731 14343594 10135553 7832163 11749948 16778211 16239367 10505886 5890200 7260960
9723 7260960 13677213 20290981 22507490 18031555 7099539 -6744338 -16546485 -15916265
9715 -15916265 -5108441 8068778 14641167 11064547 -12962 -12509806 -19638489 -17668326
9707 -17668326 -9659711 -3185660 -2376996 -4675835 -6702564 -9061764 -12616563 -14737899
9699 -14737899 -13635264 -12368826 -13596405 -14237603 -11054144 -7552532 -8301961 -9884273
9691 -9884273 -5947797 1199673 3682485 1564911 2488648 7099555 6516835 -2132664 -8894180
9682 -8894180 -5731559 1620586 3885402 1671476 146531 -1739143 -6175647 -7020490
9674 -7020490 2034852 13305110 12491349 -100739 -8636822 -4147330 4409501 5755314
9666 5755314 1457849 -1196789 -1469639 -1516993 1575149 9801559 15801634 11448102 1704253
9657 1704253 -1172364 4248992 7726504 4865041 3167285 7277350 10134394 5598299
9649 5598299 160875 3170534 12140724 16968949 14080071 7578041 150326 -8132995
9641 -8132995 -14785448 -17736609 -20865987 -27297733 -29499863 -17441755 3783922 16907373
9633 16907373 15127517 9508207 9817222 10714992 4255997 -5104572 -7839720 -3521584
9625 -3521584 2179342 7971327 14394839 16451117 9384581 -2070826 -10057378 -15406710
9617 -15406710 -22960171 -28875643 -24440448 -10998563 389701 3936538 3279797 1222380
9609 1222380 -3433768 -8456343 -8932542 -6390255 -5899874 -3762834 8283560 24626506
9601 24626506 27326125 11961584 -3160765 -2215706 7561069 10828680 6422843 1762711
9593 1762711 -3290770 -11418887 -15461499 -7798799 3617605 5073972 -1219689 -1882121
9585 -1882121 4374072 6337126 2228161 2589969 8737797 8064377 -2607677 -7595696
9577 -7595696 3443123 18009476 20388246 15312845 16679538 22662452 19472047 5157119
9569 5157119 -6809716 -7209388 -935866 3697172 4110396 349488 -6893577 -12450705
9561 -12450705 -9596962 -134444 5600585 2208936 -3415126 -1819184 7046399 15712753
9553 15712753 19479741 20543175 23050888 27056445 28243633 23555948 16207105 12534958
9545 12534958 13440792 13273044 9406456 7189354 10417619 12828478 7258005 -1036091
9537 -1036091 -757066 7223124 9565735 196099 -10386991 -10021643 -568205 6861096
9529 6861096 6104208 119034 -4524291 -3348752 1945770 2957487 -6745966 -20867087
9521 -20867087 -25217141 -15810716 -4112461 -445633 -1212568 1236072 5071376 4509978
9513 4509978 2047852 4444548 10177797 11036656 4627748 -3271621 -7700548 -8289616 -5442493
9504 -5442493 -373057 1928342 -2811861 -10804632 -13623249 -8440256 749304 10240246
9496 10240246 18239897 21352909 17453304 11372311 9868747 11168648 7470324 -1885358
9488 -1885358 -8011207 -4690641 4325573 11845210 14377156 11430226 4345587 -2525564
9480 -2525564 -5282772 -5962535 -9072122 -13440231 -14521188 -13544952 -15415951 -18105485 -14802470
9471 -14802470 -7540977 -6891621 -14989786 -20597782 -15869387 -6810994 -1176946 2788589
9463 2788589 7909577 9140189 2847279 -3649300 -2295366 2737873 2548017 -1990733
9455 -1990733 -3761665 -2583866 -3915679 -7517719 -7839323 -4100558 -920924 -47079 767739
9446 767739 2169079 3584695 6934928 12843531 16049832 12418480 7539854 9575994
9438 9575994 15893188 16327436 8686336 1541783 1319450 5064244 6851347 4093651 -3084006
9429 -3084006 -12199097 -18015044 -17525556 -14277684 -12322344 -9159430 -2005373 3202963
9421 3202963 -653290 -8260773 -7703069 1183559 6743170 4016165 124805 -769192 -4008427
9412 -4008427 -11320079 -14252217 -7787681 351399 1742676 -598839 15719 2102748
9404 2102748 72837 -6229211 -13193490 -18763357 -20057619 -12625482 1166083 10055735
9396 10055735 7734297 1967702 1909933 3773739 -516951 -6761561 -3533565 8810243
9388 8810243 16865835 12514068 1854814 -5905698 -8953782 -9229050 -6616056 -1591559
9380 -1591559 1822056 598255 -2736948 -3564377 -1233215 955186 458101 -2156389 -5154688
9371 -5154688 -7785478 -9285920 -7097105 545906 9106550 9358314 -854663 -10132745
9363 -10132745 -6164913 7053035 13763930 7974025 -382639 -2592314 -1759433 -1087591
9355 -1087591 4756795 16726493 22005252 11291596 -3320894 -3252548 9495994 16458005
9347 16458005 10568524 2582760 -217132 -3893938 -12300863 -17558609 -13280805 -4903746
9339 -4903746 491802 3824911 6152779 1835220 -11141722 -22548696 -21841684 -12865463
9331 -12865463 -7158742 -7218132 -6066868 -745292 3269819 1332714 -3627163 -5205478
9323 -5205478 -982315 4570539 3723936 -5951183 -16499493 -17571471 -10034630 -4833677
9315 -4833677 -6682630 -8223276 -4784477 -3917800 -11288915 -17043235 -9334238 5110055
9307 5110055 9008673 148997 -6729157 -3969572 -787611 -4552912 -7217345 708632
9299 708632 13649173 19142664 15738533 12402057 13859099 15988228 14625146 11312856
9291 11312856 9775125 11687857 16275648 20769112 21766391 18664769 14389570 10736668
9283 10736668 5847757 -900150 -5304949 -4236818 -1939093 -4545362 -10069723 -10198417
9275 -10198417 -1931596 8304998 12926345 10566676 4285137 -2500187 -6359856 -4737254
9267 -4737254 353279 2364882 -2981755 -12129552 -16613411 -10874924 2773621 15207991
9259 15207991 17280867 8916848 1100716 4206805 13858545 14503301 -237570 -17400397
9251 -17400397 -20596808 -10779068 -2734374 -3735495 -6310685 -3606205 -856132 -4945956
9243 -4945956 -10922094 -9264133 -2649017 -3462863 -13802978 -20035815 -13044852 -3522631
9235 -3522631 -6583023 -17661548 -17642338 -1151213 14813367 15262796 7269297 6190971
9227 6190971 11767342 11280067 1590846 -6747084 -7615992 -7759445 -12811675 -16584124 -11605357
9218 -11605357 -1844455 3626378 4048436 5436124 9178613 10896927 9539925 9789781
9210 9789781 14492682 20474656 23194006 21386539 16409842 10770438 7789431 9022196
9202 9022196 11245888 9201468 2027074 -5745671 -9754500 -9391609 -5865982 -429103
9194 -429103 4459266 5596884 2505016 -1738936 -4270751 -4676156 -2387367 4828144 16585333
9185 16585333 26002723 24813164 13773640 4483227 7106684 17511297 21405172 12339921
9177 12339921 149867 -2415936 3826579 8538575 8603902 10389101 15382370 15344269 6001184
9168 6001184 -4764809 -8672487 -7799768 -6418573 -1728527 7475054 11911834 4350049
9160 4350049 -5818413 -4923729 3067978 3039746 -5839051 -9280262 -3013747 328490 -5698159
9151 -5698159 -9565586 -1771037 9005923 10538184 4883107 236776 -3412077 -8155318
9143 -8155318 -8104020 771238 8983927 5834289 -3263074 -5911480 -3249254 -5954217 -13985865
9134 -13985865 -16740145 -11756820 -7087841 -4957171 658314 8249632 7223687 -3117768
9126 -3117768 -8765856 -2355260 5028614 2596291 -2776282 26084 6144090 2558785
9118 2558785 -9938868 -17344810 -13255186 -6234531 -5618040 -10760671 -16646647 -21009375
9110 -21009375 -22473754 -19250107 -14018050 -14101014 -21836391 -29225753 -27446008 -18542567
9102 -18542567 -11896176 -10782333 -9125865 -2649550 3119142 303792 -9457592 -16069636
9094 -16069636 -13161575 -4440128 2660979 5168059 4639210 3167468 2496732 4402322
9086 4402322 8539325 11558155 11220673 9759518 10354978 12189275 12421394 11452139 12198609
9077 12198609 14908015 16702155 16316553 15904610 17820135 22126977 26974797 29091367
9069 29091367 25062557 15192952 4948802 -736401 -3112993 -5786872 -7390281 -3738213
9061 -3738213 3749389 8563524 8864725 10127467 15775202 21160667 20432280 14743405 9618266
9052 9618266 7480227 6716044 6031482 6297908 8872118 13734344 18274111 17800090 9858495
9043 9858495 -1588008 -9511388 -11802032 -12042435 -11819855 -7608681 2377606 13320389
9035 13320389 19417015 20450494 19190045 16099760 10874745 5927452 3494826 1614617
9027 1614617 -2155447 -4807427 -1070620 7732006 12973811 8326226 -2799585 -10666129
9019 -10666129 -8670313 712248 8136418 5806235 -5199025 -16380518 -20769732 -18588435
9011 -18588435 -13503789 -6777058 1960087 10680231 15807660 16360749 13923887 9010272
9003 9010272 1021746 -7784330 -11845476 -7916276 501127 6340118 6163144 2684589
8995 2684589 46918 -1496040 -4213780 -7190762 -5890169 573986 5152974 238829
8987 238829 -11898375 -20570644 -18708200 -9564274 -1119682 2250267 1804673 1878348 6190570
8978 6190570 13484552 16791610 10894331 157762 -5960632 -4824226 -1986737 -974639
8970 -974639 172850 877711 -3832458 -13135980 -17737934 -13295077 -7630540 -7244979 -5878087
8961 -5878087 3184735 11435374 5335745 -12051324 -23673021 -21552623 -13854017 -8422790
8953 -8422790 -3133343 3823732 7054859 4094526 2162315 6689030 10763050 4805493
8945 4805493 -8302507 -16525665 -14611209 -8862779 -6382659 -6185794 -2905332 4654694
8937 4654694 11492749 12135307 6539391 -963839 -7843075 -15110817 -21601704 -21707511 -14025991
8928 -14025991 -7789977 -12110383 -20900269 -19118968 -4976530 5676774 1712088 -7459048
8920 -7459048 -6472172 4134518 10936139 7359454 -94447 -3213593 -537207 4747798
8912 4747798 7696991 3245632 -7650104 -14442382 -7619280 7160949 13977431 6749053
8904 6749053 -4104347 -7306987 -4154092 -2058487 -2977229 -4722402 -7371148 -10801548
8896 -10801548 -10358530 -2917743 5689442 7341213 3818807 3799618 8356132 9154121 3032862
8887 3032862 -1591799 1829907 6744234 3892600 -3144001 -3088687 5103194 10697974 8489535
8878 8489535 6640588 12471344 19674395 17726441 7986857 707402 -1309687 -5484699
8870 -5484699 -14578218 -19032321 -10186523 5046330 10892512 2772236 -6596310 -3283657
8862 -3283657 10668073 20358892 16096578 3352606 -5939416 -7249208 -5064334 -3655185
8854 -3655185 -1883088 2525516 8714514 14921554 20863912 24884037 22361483 11324133
8846 11324133 -2530329 -11033439 -12859282 -13433416 -15969129 -17075478 -12360337 -3036012
8838 -3036012 4832291 6147858 1142699 -5073759 -7419580 -5871052 -4350903 -4192920
8830 -4192920 -2009204 3838882 8793965 8472879 6057624 7609373 12360986 14071983
8822 14071983 10631122 5617656 1180318 -3466319 -6743293 -5613345 -2170312 -1195301
8814 -1195301 -382975 7484203 20222827 24572504 14029281 -996093 -7483431 -5898509
8806 -5898509 -4455256 -5346721 -6092914 -8006158 -12519911 -13628642 -5256359 6413033
8798 6413033 8994067 1164381 -6596841 -8000919 -6813783 -6112301 -3303860 980003
8790 980003 106216 -6646179 -8609593 1998771 16484603 18716463 4987314 -11919425
8782 -11919425 -17406790 -8755220 5226613 13903989 13434810 7990767 3546809 1269478
8774 1269478 -1506233 -5122193 -6627464 -5465893 -5315057 -7929722 -9326590 -5408260
8766 -5408260 1861068 7472431 9843703 10371859 8918098 4807003 1582117 5190197
8758 5190197 15417328 23045614 19170556 6106513 -4271637 -3403038 5436400 12700905
8750 12700905 13789996 11424460 8590853 4415142 -1609148 -5870569 -4337474 2459703
8742 2459703 10421019 15378972 14174951 6352284 -2726053 -5330292 -1663174 -1306612
8734 -1306612 -9247890 -16509647 -12327756 -260750 7684404 8910978 10495453 13991145
8726 13991145 13719467 10895857 14751083 25026830 27152621 12842280 -5696067 -11701774
8718 -11701774 -5424011 249246 -930563 -4179986 -4584182 -2774355 -1372271 -2680883
8710 -2680883 -8075662 -14608852 -15431462 -8305511 574430 5722572 9249946 13008159
8702 13008159 11455686 959448 -10215222 -11293526 -3711884 3158554 6080383 7372543
8694 7372543 5568297 -877202 -4584932 2254365 12930622 14268800 8001846 8052353
8686 8052353 16449574 19930084 13739408 9797267 13830052 13118686 -860743 -13852971
8678 -13852971 -8954333 6503562 11913070 3622532 -3908044 -3259075 -2024047 -5044456
8670 -5044456 -5490473 1410053 8656512 8099595 1812866 -3062342 -3725639 -567636 7068157
8661 7068157 17838512 25475461 24797039 18103976 11101374 5182197 -1330006 -6489218
8653 -6489218 -5439794 1823860 8646158 9683304 6919674 5106014 4314758 1002600
8645 1002600 -4961588 -8874388 -7401575 -2630455 1098035 1078311 -3983038 -13617128 -22606676
8636 -22606676 -23144298 -14313804 -5552422 -5481862 -10709982 -11880314 -7708106 -5113345 -6994223
8627 -6994223 -8753800 -7513541 -6152935 -6023905 -3308080 4318920 13458875 19473477
8619 19473477 19358392 9949959 -8159377 -23692447 -22475236 -6394227 5923818 3298934
8611 3298934 -3723051 -844722 8203050 9531759 1376160 -4711477 -1603729 6343345
8603 6343345 12812782 16082072 16274655 14201363 12729681 13126424 11965594 7564932 5647261
8594 5647261 11311642 19865600 24266008 26564467 31047172 30847788 15720244 -8333780
8586 -8333780 -22379790 -19516110 -12649339 -13556421 -17459150 -14789388 -7131479 -3289548
8578 -3289548 -6928385 -15001888 -22809996 -25416398 -19357837 -7305536 3534285 10032417
8570 10032417 14661703 17541265 15078322 8686032 5715768 8021935 8604307 3973554
8562 3973554 423274 2377228 3967406 -410386 -5539152 -3903668 1824137 3271530
8554 3271530 -1798115 -9538572 -16935350 -21798854 -20929808 -14885553 -9430554 -6497069
8546 -6497069 -504278 9906595 15182866 9099424 1077221 2296946 6719578 406995
8538 406995 -14745835 -22474858 -16426299 -7639163 -5790495 -6924226 -4098227 1711202
8530 1711202 6928828 11889422 16112183 14984817 7254329 -128155 -209693 5067455 8190369
8521 8190369 4757045 -3760746 -12113223 -14199313 -8046794 239564 1169891 -8309175
8513 -8309175 -22675689 -34274630 -37083817 -26658119 -4848370 15774394 21825207 15111414
8505 15111414 9483310 10073012 7236284 -4459648 -14141251 -10836285 -1399565 3951
8497 3951 -6429441 -8265364 -1269243 5579909 5507419 2329502 990019 81091 -1992957
8488 -1992957 -1964200 1538290 2491706 -4812725 -16102847 -20875239 -14209199 -804938
8480 -804938 11159685 16383728 13996915 7080307 1048911 -389197 1645873 3531547
8472 3531547 3686880 2396880 -1624734 -10114263 -19983853 -23720506 -17819867 -7689497
8464 -7689497 -1137776 241514 -164998 -649885 -1556967 -1265051 1809137 3844923 -899094
8455 -899094 -10389135 -15260981 -10671368 -1333682 6810011 12254480 12907548 5087660 -7039511
8446 -7039511 -10647522 -939556 9926294 10109338 5618982 8297752 14215448 10164526
8438 10164526 -2918908 -11108898 -10926684 -12762739 -19023784 -18724644 -9596946 -5560795
8430 -5560795 -12113797 -13347787 1981167 18236318 15506168 1586593 -439262 11245563
8422 11245563 16436143 6506524 -4284837 -4437884 -1423132 -4402143 -7687898 -2344137
8414 -2344137 7570801 11380982 6680442 -1226360 -8462821 -12954238 -10878378 -653014
8406 -653014 12755253 23175042 29178024 30219490 22753247 7235546 -5749853 -5177472
8398 -5177472 6135012 14298936 10938216 742394 -7221685 -9247066 -6770171 -2073621
8390 -2073621 2615402 4521223 1701084 -5107525 -12483061 -16245379 -14777092 -11425066
8382 -11425066 -11805868 -16963059 -20823448 -16468878 -3590435 11857419 23294299 26770688
8374 26770688 21433945 10527930 718155 -2856250 -366638 5435909 12966818 19663737
8366 19663737 19630754 9585694 -3872606 -9516468 -5212008 -761391 -4706334 -13183094
8358 -13183094 -15569169 -7896411 3572715 10629276 11019103 7919105 4724799 2459758
8350 2459758 1533634 3353348 7851642 10369572 5139914 -6262620 -13846601 -10374196
8342 -10374196 -533061 5996746 7810079 10988003 16260531 16222938 8086116 779811
8334 779811 3512792 12803680 17192913 11384782 177719 -8637003 -9842113 -2278227
8326 -2278227 8878049 13212590 5096075 -7952262 -12925089 -6986856 714128 2819180
8318 2819180 1947824 2963389 4158669 1070201 -5279330 -9399707 -8920840 -6842635 -6440034
8309 -6440034 -7077661 -6047871 -3121047 -1726373 -4733582 -9738578 -11106372 -7608554
8301 -7608554 -4616642 -6130823 -8548662 -7013030 -4217132 -5830873 -9499597 -7341959
8293 -7341959 652540 5527683 3924379 3582115 9310817 13211601 7078547 -2913294
8285 -2913294 -4097776 4374407 11462450 10843288 7886961 9429137 14812299 19137344
8277 19137344 19209032 14262105 5807486 -1635471 -4066488 -3388884 -4907978 -8625370 -8088047
8268 -8088047 182833 10792491 15938796 14496809 11728880 12057583 14616410 14916029
8260 14916029 9529268 -52674 -7726841 -7900114 -402156 10159269 18486178 20926238
8252 20926238 16687565 9970935 8326812 14386941 21151766 20735875 16040469 16834937
8244 16834937 24509832 28758709 21743027 8239217 -2290737 -7400204 -10126354 -10856615
8236 -10856615 -7493968 -1370317 3214274 4814368 5358270 5031527 1280046 -6000282
8228 -6000282 -11948063 -11681259 -6155407 -1121026 -461480 -1972113 -704973 4014063 6868282
8219 6868282 3000930 -5521888 -11939814 -12480307 -9286351 -6423736 -5841745 -6837753 -6463306
8210 -6463306 -932486 9715811 18539515 17641912 7978215 -1003071 -2612484 602942
8202 602942 3009121 3187847 2003801 -1611633 -7909882 -12429848 -10384541 -3938845 -289482
8193 -289482 -2239228 -4793390 -2654806 1968109 2171755 -3481575 -7042634 -396659 12923549
8184 12923549 20198474 15535177 7876707 8265227 14252268 15053197 9089513 5697762
8176 5697762 9014817 11734446 8972345 7407509 13149147 19416953 16235132 6419506
8168 6419506 963396 1776240 542661 -5409345 -7480354 183165 9692302 8823041 -2669791
8159 -2669791 -11863495 -7128968 9298566 23443797 23291099 10353113 -2642538 -5754291
8151 -5754291 -1729609 -251780 -4519192 -7653444 -2684941 7842144 14758898 13027936
8143 13027936 6704023 2827107 2962625 3392937 2489572 3235593 6807129 8841188 6594191
8134 6594191 5109743 9135568 12691123 6960474 -2640793 -75136 17512888 32445030
8126 32445030 29978895 17637342 11293132 12206139 11081407 7412619 8538846 12163909
8118 12163909 6542633 -9726385 -22744699 -23128695 -18217698 -17465994 -16561369 -6240235
8110 -6240235 9837958 17199605 8973583 -6167462 -14935640 -12426538 -3290435 5360003
8102 5360003 9978720 11695425 13183369 14380812 11993224 4417924 -3852531 -5572010
8094 -5572010 438684 6103767 2502059 -9254985 -19057634 -20267913 -16556398 -13607902
8086 -13607902 -9603490 -559872 8916996 9961680 3716361 639163 3980833 5313768
8078 5313768 459029 -2389801 2300074 6232416 1872444 -2284868 5032148 16993377
8070 16993377 17066528 4456659 -4853501 -1595901 7087408 11835612 10768915 3992883
8062 3992883 -7110212 -13142036 -4567926 9895002 8839572 -11237882 -26712169 -18219784
8054 -18219784 2764195 11669407 3969883 -4625155 -4137683 -524141 -1509233 -5453230
8046 -5453230 -6342585 -1652294 6267221 11818006 10040738 2695068 -2545056 -2880187 -5084765
8037 -5084765 -13457227 -19180558 -11028534 6903383 18290169 14432132 2152257 -7734978
8029 -7734978 -10976091 -8121753 -1054254 5604694 6197147 752861 -4379750 -5072080 -4340581
8020 -4340581 -6180537 -8472831 -5787030 2630025 11030807 13390755 9641150 4817940
8012 4817940 2578886 1423254 -1096678 -2308406 3159849 14429727 22483584 19736438
8004 19736438 8337224 -3247648 -8804700 -7566947 -2613899 1118050 409422 -2145180
7996 -2145180 -717887 5344831 9874193 8461891 3506358 -1416801 -5613602 -6581425
7988 -6581425 515128 12988313 18477215 10778732 768710 2053603 12034316 18295761
7980 18295761 18378078 19746377 22988777 19977725 9766769 2478511 3748343 7097428
7972 7097428 6210892 4015834 4200010 3627349 -244284 -2796728 -165722 3232795 2131848
7963 2131848 -635833 240353 3125297 2961697 5340 -2351827 -5048654 -10835507 -16465835
7954 -16465835 -15557530 -9181091 -6259670 -11628594 -19277837 -20176764 -13032066 -4189205
7946 -4189205 1019943 3231580 4859864 3949329 -3754224 -15849676 -21414328 -13454288
7938 -13454288 -615146 1389922 -9202213 -16170885 -6347973 12774658 23302092 19540981
7930 19540981 11808533 10002264 12502538 12750403 9356085 5699044 3734144 2441406
7922 2441406 942405 37209 455415 1082229 -188056 -3646708 -6432592 -5342092 -1136314
7913 -1136314 1646459 -163029 -5085919 -9397649 -10575142 -7696590 -1542147 4196064
7905 4196064 5324781 3057674 3520090 7896961 7622223 -4584198 -21959057 -29755401
7897 -29755401 -23685771 -14600731 -13079431 -16693109 -16602459 -10956614 -5726804 -4952912 -5894095
7888 -5894095 -3831617 1889801 7152588 6809115 -305897 -8901277 -11214660 -5169977
7880 -5169977 2941705 5782117 3178377 540792 858848 2024762 1902379 2275090 5998764
7871 5998764 12008491 15017071 10525352 195649 -8200127 -7763450 166194 7703965
7863 7703965 10211587 10996041 13873094 15177053 8637413 -3655123 -11461268 -8204350
7855 -8204350 2267062 11388376 13718431 8480125 -1398165 -9935300 -12280897 -9998340
7847 -9998340 -8250907 -7501772 -3957354 1202776 1462013 -3234173 -3678115 3858578 9243708
7838 9243708 3250888 -7448316 -10794308 -8155788 -9682081 -15412481 -16131863 -11958888
7830 -11958888 -13982721 -24159326 -28576183 -17800021 -1998696 3110549 -3210321 -9306803
7822 -9306803 -8377635 -4526961 -4478477 -9572185 -14933533 -14246693 -7758565 -4864864 -12615246
7813 -12615246 -22617818 -19380544 -2940622 8948844 5115251 -5786649 -12744834 -18484508
7805 -18484508 -27190669 -29793333 -17045402 2109898 11687493 11659572 13499276 18121612
7797 18121612 16202490 8115744 5374009 11315576 16746333 16706970 15983475 15484507 9134521
7788 9134521 -1423870 -4667345 2149523 6582851 494696 -7343637 -6174625 1648054
7780 1648054 9098662 15832360 21074456 16736516 36223 -15784280 -16193578 -4760905
7772 -4760905 3668474 3582346 959945 -408736 -2160432 -2897510 1949393 11256774 17677248
7763 17677248 16573648 9717185 1225396 -5289044 -8125528 -10365719 -16756026 -23498622
7755 -23498622 -19168253 -3081472 6987261 -2595661 -19419659 -21337622 -8745917 -1744047
7747 -1744047 -7069807 -9219729 1214952 11005023 6391267 -4909459 -7554401 -2421416
7739 -2421416 -1426984 -6133863 -6986048 -801346 4680926 3679363 -1236261 -6528741 -11996676
7730 -11996676 -16019769 -14789744 -8886503 -4010020 -2674174 -1012060 3652384 7673735
7722 7673735 6832911 2687079 -245781 -26697 2958319 8031515 12568338 12003406 5955355
7713 5955355 1595271 5889907 16044249 22493108 20302320 12613171 3732826 -4877468
7705 -4877468 -10969704 -10584558 -3986500 2431691 3841603 2786174 4108500 8056714
7697 8056714 11880908 13974493 12368159 4026992 -8735704 -15839578 -10568888 712384
7689 712384 7850935 11839725 20187342 30319680 30886453 20416994 10919722 8893165
7681 8893165 6106769 -3971266 -13372074 -13210021 -9256835 -11567597 -16743654 -14608787
7673 -14608787 -7426579 -7357661 -16011049 -20742823 -13294944 -308949 7901933 9103295
7665 9103295 6196734 1706239 -257271 5625383 17802737 25337531 18675800 279277
7657 279277 -17982026 -25124098 -17978073 -2497610 10225891 13372869 11011635 11753287
7649 11753287 16760010 19870185 18422774 15308114 9772157 -2835076 -17959523 -19809038
7641 -19809038 -1436815 20929705 24726403 8736985 -6480766 -5134302 6528620
7634 6528620 11936678 5744855 -1650381 1342098 12976138 19926828 12791045 -2925145
7626 -2925145 -13971472 -15550826 -15047297 -19441770 -25716146 -26800790 -21043327 -11189505
7618 -11189505 762954 11830007 15494669 8131422 -3991585 -10626021 -9475122 -6597103
7610 -6597103 -6085425 -5686293 -2938087 210526 702795 -1424214 -3385795 -2003379 3716209
7601 3716209 9899074 9560011 682532 -9430926 -12196928 -7938364 -2980892 618608
7593 618608 5285960 9688976 9054798 3930345 -291114 -3781631 -12328049 -24024943
7585 -24024943 -26881740 -16087323 -3649387 -1618535 -4068672 2294825 15291653 19465834
7577 19465834 10102079 602223 2235170 8773854 8153372 215276 -5909255 -6407851
7569 -6407851 -5624210 -6540078 -6398858 -2217428 4657706 10074367 9654189 643988 -14613023
7560 -14613023 -27409437 -29286193 -20614916 -9359100 -1421250 3885009 8721031 12050275
7552 12050275 11942178 8671714 3359276 -3281266 -8951674 -10038917 -6377141 -2595481
7544 -2595481 -2165822 -3404128 -4100507 -5889496 -9696188 -11033447 -6225422 -520148 -2227966
7535 -2227966 -9532169 -11395772 -2892586 8495852 14874822 18009635 21760341 21541733
7527 21541733 10134702 -9104840 -23599005 -26062620 -20691138 -14232427 -7802750 -86461
7519 -86461 7205246 11348195 12586786 12069348 8227264 -567707 -11013490 -17093707 -17872091
7510 -17872091 -19159770 -25090586 -30607178 -26312650 -11206557 3009700 3633276 -8033633
7502 -8033633 -17367846 -13519378 -2087955 3107404 -1496086 -5378359 -6948 7764323
7494 7764323 4408739 -10948709 -23699604 -22032671 -11438898 -5820291 -8396595 -9288571
7486 -9288571 -1953254 6232767 4226998 -7322916 -17322944 -18218158 -12163506 -4224593
7478 -4224593 3138855 7172874 3732658 -6053921 -12820123 -8712154 1959948 7246795
7470 7246795 2033375 -6794569 -9791652 -5237013 1081030 3022423 -361082 -4334860
7462 -4334860 -3054649 3252562 6156043 -2226861 -17829893 -26622350 -20673926 -8405877
7454 -8405877 -4466194 -11508391 -17377920 -10858071 4597504 15569359 14197055 5278574
7446 5278574 -1371511 -1843556 114828 -76876 -1848733 -178976 8936134 23354040
7438 23354040 34465053 33600721 20894507 6690826 1370098 4309634 6037619 860311
7430 860311 -6909116 -9991212 -6851544 -1593827 709502 -3198457 -11819268 -16549855
7422 -16549855 -8514662 8244049 17377028 10464925 -300182 1122892 11463890 14558398
7414 14558398 7217931 2584726 6433048 7266649 -2894844 -13027332 -9999950 346572
7406 346572 3002721 -2574761 -3565108 4710024 12954679 13998708 11845825 11661995 11452884
7397 11452884 8407389 5401051 5903992 7871981 7063062 2534440 -4015161 -10578180
7389 -10578180 -14434299 -13447735 -9603597 -7182772 -6082511 -1862166 5865380 10835905
7381 10835905 9014685 4683539 3499076 4189282 2453015 -128542 2954469 13954690
7373 13954690 26951933 33452605 29752063 19386587 10083293 7362610 9613636 10205944
7365 10205944 4911124 -4244712 -12174740 -14919011 -10993662 -2933406 1929397 -2422237
7357 -2422237 -11836718 -14824166 -7336133 1011477 -6231 -7407270 -10348307 -4933891
7349 -4933891 3505897 10011745 13984768 14679699 10507217 3663393 -985744 -2955033
7341 -2955033 -6452028 -12280243 -15153540 -11582239 -5505360 -2609557 -2509931 -337193 5674191
7332 5674191 11508662 12269616 8058965 4058454 4180727 5200651 107615 -11269801
7324 -11269801 -19005022 -14702148 -3255328 3150529 1070163 -1684541 287161 2410847
7316 2410847 -419909 -4563503 -3854230 107950 950644 -1888381 -2526922 1929122 7308275
7307 7308275 8699685 6284613 3339154 1911439 2187236 3388751 3430563 -64816 -6124358
7298 -6124358 -9313827 -5021433 4288335 10376864 7507039 -1987381 -10924144 -14371696
7290 -14371696 -12461476 -8066947 -4093918 -2129419 -1100860 2314955 9212256 15035815
7282 15035815 14511186 9795782 8280311 10901305 9411309 -322272 -8672642 -3479265
7274 -3479265 12781055 25621650 26875736 21531085 16033729 9583040 791147 -5466516
7266 -5466516 -4505509 -99922 503431 -2714714 -2881409 3729404 13184232 19509169 20470467
7257 20470467 16805194 9449469 57004 -7478324 -9098404 -5101458 -1013647 -2042177
7249 -2042177 -6995326 -9988477 -8533551 -6886079 -9701779 -15511988 -19279552 -18582525
7241 -18582525 -13971874 -6425009 1084112 2842501 -2565557 -6996832 -2083629 7415246
7233 7415246 8233766 -2812452 -13762602 -13663542 -5706187 -427580 -2832793 -10462855
7225 -10462855 -17848998 -18514365 -8818514 5221491 10678028 2524251 -9381481 -12897191
7217 -12897191 -7601416 -1090479 2390845 2909836 146065 -4452336 -5297905 -348780
7209 -348780 2861696 -2841687 -12016571 -13478627 -6750345 -1790619 -3593478 -7126244
7201 -7126244 -7886838 -7716721 -8238883 -7232929 -4362411 -3166322 -4484094 -4342976 -924689
7192 -924689 2591083 4501516 7297707 10825128 9346742 3197 -10908105 -14951775
7184 -14951775 -11293026 -5494573 -1982418 -1562012 -3304292 -4613325 -1410294 7757683
7176 7757683 18548116 24433408 22944093 16992675 11490509 10028219 13023246 17224345
7168 17224345 18154196 14305086 7893723 1091769 -6402528 -15080682 -23101480 -27686966
7160 -27686966 -27727356 -23872332 -17392223 -10090778 -4073775 -129030 3133990 7257538
7152 7257538 10889783 9816716 1533461 -9882594 -15758924 -12170224 -5398601 -3800675
7144 -3800675 -5583104 -1488253 9399402 15076857 6767714 -7646842 -13741855 -8943818
7136 -8943818 -2511759 -631619 -574589 1395003 4477102 6281124 5532980 2063650 -1549546
7127 -1549546 -699474 4118425 5234523 -669645 -4749342 903884 8260756 4425311
7119 4425311 -6276274 -7012255 5320954 15163368 12312457 4861722 3055499 5232595
7111 5232595 6446495 6953050 4768055 -5951712 -20389398 -21607408 -4784582 10997180
7103 10997180 8545065 -2788172 -3833940 4770021 8440325 5332691 5888562 9839120
7095 9839120 5396541 -7759494 -14547266 -7854596 1176533 2411844 1593769 7954073
7087 7954073 18402840 22796537 17515763 7067293 -2092465 -4698221 647659 8104776
7079 8104776 9046789 2454967 -4180694 -5209781 -1734325 3853508 9886990 11359038
7071 11359038 3882368 -6089718 -5838473 4982206 11719019 6746010 2400604 12351290
7063 12351290 29641333 35598071 25163583 11220991 5991652 9003885 13496613 15453164
7055 15453164 14236362 10648796 6866003 5252834 6628035 10829067 16346744 17665311
7047 17665311 8470122 -7765655 -16161795 -6910231 10835915 20206169 18420245 16891520
7039 16891520 21004296 22408334 14732449 5707210 6451499 15725702 22310457 19227409
7031 19227409 9668249 1446115 233162 5913046 11824376 10335472 2579740 -1040912
7023 -1040912 5735507 15421457 16573423 9474289 4228553 5419335 8061986 9183184
7015 9183184 13189399 21675159 26800119 21850855 12462006 9333418 13112671 14511052
7007 14511052 8185271 -1093135 -6598329 -7214097 -5068997 -1464254 1770933 1145135
6999 1145135 -4562875 -11444621 -14370462 -12516613 -9102956 -6540014 -3311926 4090931
6991 4090931 15568892 23590206 18029131 -1843353 -22537117 -28741464 -20011585 -9847150
6983 -9847150 -8290822 -11681854 -10997073 -3897996 4603003 8366526 3980921 -6945812
6975 -6945812 -16566376 -16661556 -8564132 -2347175 -3613976 -6997674 -5806344 -1136944 2961134
6966 2961134 6066061 7584494 3921149 -3719062 -6253904 414118 6875656 3749353
6958 3749353 -4200032 -8634374 -13792348 -27068802 -40250673 -38580022 -25313178 -17413296
6950 -17413296 -17300240 -10831048 3182899 5500987 -11251758 -24852162 -14124231 9778278
6942 9778278 21074163 15173309 7140636 4242470 1249130 -2198916 -323422 4213149
6934 4213149 3105534 -515249 4229071 14695893 16092324 6981630 3737128 13090725
6926 13090725 19632306 11314302 -282380 45300 5355022 -716835 -14900030 -18479455
6918 -18479455 -7390386 1641821 -2486362 -9711339 -6284551 5321129 13185869 13956971
6910 13956971 13939108 16240126 16141552 9459897 -700193 -7565399 -8180028 -5505260 -3875196
6901 -3875196 -3677360 -1679211 3325983 7632569 7535679 4759382 3014453 909137 -5722452
6892 -5722452 -14209935 -14937498 -4323008 7935736 9994724 2441467 -4208104 -4282078
6884 -4282078 -2667357 -5786586 -12682654 -17087212 -14957537 -8241714 -2949302 -3739543
6876 -3739543 -8696037 -10418655 -4825304 2799193 4458070 551706 -1241268 2291080
6868 2291080 6129445 6497277 6858837 10527270 13471942 10218698 2835109 -1782220 -871743
6859 -871743 3171471 8131791 12610544 13143151 6782740 -3632407 -11566060 -13924101
6851 -13924101 -12406316 -9353849 -6787639 -7400600 -10583611 -9448500 690913 11899178
6843 11899178 10797633 -2666754 -13255496 -10783693 -3048885 -2394866 -7697790 -8510982
6835 -8510982 -1720080 5715460 8344165 7410525 4546351 -1632400 -10615798 -17494409
6827 -17494409 -18025582 -13095428 -7097974 -4338015 -6541616 -10774960 -10832098 -4475494 2097028
6818 2097028 1761112 -3093940 -3895868 1230882 5894510 7505667 11356436 18697928 20435718
6809 20435718 10649244 -864705 86073 12121639 20541177 18299445 13533216 14418303
6801 14418303 17202772 14307804 6105104 -1716427 -6653433 -9010573 -7863359 -4025263
6793 -4025263 -3310360 -9794268 -17989326 -18137283 -7862776 6681340 18568003 22831709
6785 22831709 15183638 -2748150 -18394780 -18784491 -7001623 1577166 570134 -1244765
6777 -1244765 2090119 3157835 -3622120 -8702970 -1646959 10002333 10314919 -1389338
6769 -1389338 -10964998 -11482044 -10179080 -12465213 -13478661 -10071732 -8327261 -11686152
6761 -11686152 -11839529 -1056971 13071855 15486794 3520936 -9933187 -12900383 -6912006
6753 -6912006 -1697698 -2609119 -6508297 -7958922 -6204937 -4910630 -6226729 -7743374
6745 -7743374 -6583598 -4131352 -3892600 -6223662 -8487230 -9318404 -9185979 -7662024 -3875429
6736 -3875429 1169538 6265444 12258354 18459362 19707210 13326807 6264078 6706703
6728 6706703 10274861 5448500 -6622637 -10494663 733588 13202763 11304152 -927096
6720 -927096 -7950982 -5041674 -510950 306942 750149 2640588 1417988 -5411936 -12445308
6711 -12445308 -12812731 -6180443 2259157 7829726 9492008 8796417 7309914 5223248
6703 5223248 2807515 2056617 3955522 4788414 129019 -6934433 -7902019 -1218281 4730672
6694 4730672 4512985 3326338 6062148 7480994 2275541 -2677039 1930471 10634419
6686 10634419 9243941 -3260477 -12234065 -8505620 6820 1714592 -3751425 -9303318
6678 -9303318 -11036700 -9382365 -5506646 -1910915 -2437595 -7272875 -10998842 -8706116
6670 -8706116 -1364840 6567000 11495410 11307692 5556186 -3108459 -10507484 -14526598
6662 -14526598 -14585505 -9475732 -947975 2750797 -4892518 -17094630 -19793305 -10969471
6654 -10969471 -4023930 -8061585 -15032257 -13166687 -4210015 1764705 2137120 2221660 3866529
6645 3866529 3517411 193062 -3109961 -5296135 -6889982 -4621686 5519679 19054193
6637 19054193 24766125 18309919 7749805 2485414 2213577 827647 -3237767 -5774798
6629 -5774798 -3986698 -300775 1225605 -261533 -1742903 376321 5998835 10120245
6621 10120245 7472078 -452911 -4794068 1819589 16402623 28122425 29841518 24593571
6613 24593571 19739732 17874443 16471296 14374899 13825757 15402949 15205458 9559214
6605 9559214 35531 -8539136 -13100844 -13304532 -9804638 -4552846 -1245510 -2332800
6597 -2332800 -6221070 -9639951 -11593991 -12663488 -11815905 -6677711 3596831 17024969
6589 17024969 28608441 31098992 20818547 5312731 -853255 6761779 15230194 11232029
6581 11232029 -421061 -4880913 947213 7282016 9607456 12892244 16408469 10409412
6573 10409412 -5971373 -17859168 -14928576 -6826322 -7601362 -14682006 -15943772 -10432860
6565 -10432860 -8327262 -13961237 -21482321 -25761438 -26597839 -23111442 -14339932 -5164141
6557 -5164141 -2193936 -3937085 -3926939 -2677085 -6352019 -13599978 -15023362 -8066308 -1819427
6548 -1819427 -3088359 -7095021 -6933893 -4165628 -4537125 -9595222 -17228074 -24537242 -26431306
6539 -26431306 -18629730 -6839810 -5078008 -17938652 -31265116 -28735929 -12565815 1263255
6531 1263255 4477651 2947376 2885481 1364374 -6028560 -15212494 -16489145 -5436977
6523 -5436977 11497015 22142007 19917873 10558926 5330032 6934609 7071443 558388
6515 558388 -5279194 -2199215 4298830 2571972 -6189472 -9126184 -1883535 5699706
6507 5699706 7425237 10555647 20069808 25344810 14963034 -2894073 -9185836 -526510
6499 -526510 6719488 337766 -11467216 -12556014 361651 15348942 19778224 12909638
6491 12909638 5278627 7022757 16253021 21061348 15277124 7274213 6831380 8789021
6483 8789021 1454120 -11177603 -11253308 5349580 19113342 13826654 210249 -553725
6475 -553725 12652336 22272468 18541754 8402270 -379570 -7951083 -12945918 -8903941
6467 -8903941 3805945 13101407 9082023 -4182681 -15755269 -20338018 -19353264 -15781615
6459 -15781615 -12617665 -11583156 -9890709 -3150037 6240515 9941464 5660358 1132800
6451 1132800 2460482 6018672 6611815 5700640 5292591 1494107 -7586249 -13927074 -9191747
6442 -9191747 1877981 6971304 2417344 -4709518 -8384988 -8758934 -6802631 -2486474
6434 -2486474 1697184 2799904 2956897 6114516 9996642 8861322 3863503 2369375
6426 2369375 6176798 8826195 6602175 3926827 4349644 3723907 -2598537 -11447144 -16152304
6417 -16152304 -15312269 -12221192 -8395997 -2801780 3586125 6931381 5058254 433539
6409 433539 -2636530 -3107536 -4068338 -7417845 -9100325 -3515511 6681337 10552582 2293293
6400 2293293 -10000859 -14247629 -9157672 -2841853 -232015 294736 109841 -1141267
6392 -1141267 -1235149 1679475 2545556 -4579726 -14122495 -13811820 -3547713 2753087 -1902066
6383 -1902066 -7647413 -5725637 -3646681 -11191480 -21285798 -19353059 -6830021 -700100
6375 -700100 -9696194 -23083542 -25669594 -15130589 -1390236 4833412 222147 -9654682
6367 -9654682 -14985880 -10899695 -2437210 2055628 800647 -1717700 -2265142 -746410
6359 -746410 3227585 9265084 12922387 10189095 4584381 2873599 4257009 1956825
6351 1956825 -3802662 -3805440 5752507 15568139 15743968 9298132 6360396 9797601 14033737
6342 14033737 14971301 13177667 8368745 -1189301 -12100318 -15309492 -6189319 8286306
6334 8286306 16207535 13068594 4739355 -731302 -1333005 -1058302 -4133735 -10386873 -15195268
6325 -15195268 -13551917 -5524547 2120286 2253386 -3389572 -4664760 4074486 14932407
6317 14932407 16093397 8272476 3277064 5820073 6943316 -101807 -7697359 -6233903
6309 -6233903 -363526 -893594 -5581776 -2290220 9781367 16949104 12131642 5070648
6301 5070648 5249031 7267293 2582438 -4578137 -4970514 -1114947 -3487926 -13208965 -20502561
6292 -20502561 -19462131 -13661275 -7184405 -666833 2528612 -3006904 -14100739 -18279405
6284 -18279405 -9057981 4988541 11706715 9850579 6396751 4735574 2578744 -1260261
6276 -1260261 -4740442 -6638699 -7829464 -8386243 -6586491 -1052247 7281003 14280155
6268 14280155 13956245 4586640 -5800941 -5990348 3579471 9380090 3345915 -4516587
6260 -4516587 -654428 11117730 15399174 9026168 4814457 9801393 14111186 7910508
6252 7910508 -2697729 -6203687 -2797481 162104 2623180 8538561 12155092 2935445
6244 2935445 -14581799 -20474006 -5363445 14476798 16962102 1623963 -13060071 -15325690
6236 -15325690 -11360379 -10619007 -11284331 -6416461 2219475 5031241 -1784897 -10519974
6228 -10519974 -11970544 -6344435 -480762 2408348 4443396 5183493 -901169 -15228065
6220 -15228065 -28354820 -28999845 -18415518 -9185186 -8695627 -10092752 -3283692 9809174
6212 9809174 16743998 9905076 -4850050 -15627908 -16593507 -10679100 -3272699 2899435
6204 2899435 6629388 5784189 -569121 -8239928 -10018292 -3843010 3670510 4941742
6196 4941742 787799 -2093802 -1883439 -3930014 -10802515 -16160025 -13073742 -4434384
6188 -4434384 701501 -685317 -2922931 -1201254 1813257 921547 -4102917 -8830294
6180 -8830294 -9611857 -5968185 861704 8502856 12469211 7759894 -5704879 -19529193
6172 -19529193 -22097050 -10466183 4129394 6764892 -4430234 -16275406 -17223307 -10826770
6164 -10826770 -7841606 -9571802 -7083711 4437752 19270341 30321663 36195400 35763157
6156 35763157 24417986 2932154 -15898427 -18699089 -7846393 1406115 -283720 -7571373
6148 -7571373 -10927699 -8460411 -4293001 -988927 1869453 4557265 6453203 7054505
6140 7054505 5723224 2066794 -2123340 -3620441 -1851794 363315 1586276 3867594
6132 3867594 7681322 8471736 2507443 -6026657 -8533620 -2138915 7388527 12610855
6124 12610855 11115741 5774982 1956445 4345758 12532888 19039878 15717671 3787937
6116 3787937 -5957822 -5337239 1732367 4934654 551565 -5321166 -6263959 -4002136 -4914377
6107 -4914377 -10163465 -13128381 -7901017 2205286 7728940 4229670 -2813363 -5132960
6099 -5132960 -600556 6743225 12416629 14194746 11565980 6423210 3058195 3984999
6091 3984999 6824371 8187092 8230458 7408375 2255384 -8812453 -18161994 -16777928 -9183130
6082 -9183130 -9612857 -20362152 -25405511 -12588443 7567221 15248014 6915386 -3575642
6074 -3575642 -5409397 -712813 4736520 9233960 11688485 9724897 4393081 -57305
6066 -57305 -3264586 -8938765 -16079757 -17521588 -10563162 -2020156 1628359 2562666 4711470
6057 4711470 4722665 -2491847 -12886027 -16554179 -11431190 -6088386 -7040588 -9769293 -6658313
6048 -6658313 488574 2460496 -3134444 -6659966 -32996 9184295 5858551 -10383778
6040 -10383778 -20738397 -10927032 8292150 13673356 -1578657 -22013079 -31602553 -29461382
6032 -29461382 -22020261 -11597219 516725 8333386 7454084 2854262 2969529 8314539
6024 8314539 11823695 8773691 1343635 -5612116 -9351558 -10464938 -11748596 -14803846
6016 -14803846 -17028099 -14959138 -10942773 -11091351 -14949480 -14173220 -5506650 2129745
6008 2129745 -49300 -7378865 -8864780 -3317886 593715 -1793026 -5987678 -6661945
6000 -6661945 -3443044 2160104 9164823 15439472 18587176 19043900 18552453 16506256 11712878
5991 11712878 5809117 509096 -5657343 -12570199 -14331567 -7119438 2147466 3703001
$$ [...]
##END NTUPLES=NMR SPECTRUM
##END=
